##TITLE=31Pdec_DPAH6-11
 CDCl3, 24 sc
 11.3.2022
##JCAMPDX= 6.0         $$ Bruker NMR JCAMP-DX V2.0
##DATA TYPE= NMR SPECTRUM
##DATA CLASS= NTUPLES
##ORIGIN= UXNMR, Bruker Analytische Messtechnik GmbH
##OWNER= root
$$ XWIN-NMR		Version 3.5
$$ Fri Mar 11 10:57:00 2022 Russian Standard Time (UT+4h)  she@DPX200
##.OBSERVE FREQUENCY= 81.013821
##.OBSERVE NUCLEUS= ^31P
##.ACQUISITION MODE= SIMULTANEOUS
##.ACQUISITION SCHEME= undefined
##.AVERAGES= 24
##.DIGITISER RES= 16
##SPECTROMETER/DATA SYSTEM= spect
##.PULSE SEQUENCE= zgpg30
##.SOLVENT NAME= CDCl3
##.SHIFT REFERENCE= (INTERNAL, CDCl3, 0, 248.564)
##AUDIT TRAIL= $$ (NUMBER, WHEN, WHO, WHERE, WHAT)
$$ ##TITLE= Audit trail, XWIN-NMR		Version 3.5
$$ ##JCAMPDX= 5.01
$$ ##ORIGIN= Bruker BioSpin GmbH
$$ ##OWNER= she
$$ F:/spectra/data/she/nmr/P31/1/pdata/1/auditp.txt
$$ ##AUDIT TRAIL=  $$ (NUMBER, WHEN, WHO, WHERE, WHAT)
(   1,<2022-03-11 10:55:14.48 +0400>,<she>,<DPX200>,
      <created by zg, POWCHK disabled, PULCHK disabled
       configuration hash MD5:
       00 E9 B6 7A A2 85 ED C7 34 08 36 98 17 FE 4E 26
       data hash MD5: 32K
       5A 33 08 47 A1 39 5C 78 5B 8B 9D E2 B4 63 33 4B>)
(   2,<2022-03-11 10:55:16.90 +0400>,<she>,<DPX200>,
      <Start of raw data processing
       efp BC_mod = 2 LB = 1 FT_mod = 6 PKNL = 1 PHC0 = -9175.396 PHC1 = 96.07451 SI = 64K 
       data hash MD5: 64K
       9E 16 1E 1D 35 E9 81 2E 79 21 0C 51 EE 00 13 75>)
(   3,<2022-03-11 10:55:29.76 +0400>,<she>,<DPX200>,
      <pk PHC0 = -2.949725 PHC1 = 0 
       data hash MD5: 64K
       98 6D 4D 05 44 F5 7F 98 96 41 75 9F 18 7C 59 14>)
(   4,<2022-03-11 10:55:43.14 +0400>,<she>,<DPX200>,
      <abs ABSG = 5 
       data hash MD5: 64K
       43 38 43 8C 03 B0 AC 14 01 FF A3 D3 54 54 AC 4A>)
$$ ##END=
$$ 
$$ hash MD5
$$ 46 36 E4 97 FB 55 E0 6A BC 1E 31 CE D9 F3 EA EF
##$RELAX= 
##$RELAX= 
##$RELAX= 
##$RELAX= 
##$RELAX= 
##$RELAX= 
##$RELAX= 
##$RELAX= 
$$ Bruker specific parameters
$$ --------------------------
##$DU= <F:/spectra>
##$EXPNO= 1
##$NAME= <P31>
##$PROCNO= 1
##$TYPE= <nmr>
##$USER= <she>
##$AMP= (0..31)
100 100 100 100 100 100 100 100 100 100 100 100 100 100 100 100 100 100 
100 100 100 100 100 100 100 100 100 100 100 100 100 100 
##$AQSEQ= 0
##$AQ_mod= 1
##$AUNM= <au_zg>
##$AUTOPOS= <>
##$BF1= 81.014009
##$BF2= 200.13
##$BF3= 200.13
##$BF4= 200.13
##$BF5= 200.13
##$BF6= 200.13
##$BF7= 200.13
##$BF8= 200.13
##$BYTORDA= 1
##$CFDGTYP= 0
##$CFRGTYP= 5
##$CHEMSTR= <none>
##$CNST= (0..31)
1 1 145 1 1 1 1 1 1 1 1 1 1 1 1 1 1 1 1 1 1 1 1 1 1 1 1 1 1 1 1 1 
##$CPDPRG= <waltz16>
##$CPDPRG1= <>
##$CPDPRG2= <waltz16>
##$CPDPRG3= <>
##$CPDPRG4= <mlev>
##$CPDPRG5= <mlev>
##$CPDPRG6= <mlev>
##$CPDPRG7= <mlev>
##$CPDPRG8= <mlev>
##$CPDPRGB= <>
##$CPDPRGT= <>
##$D= (0..31)
0 1 0 0 0 0 0 0 0 0 0 0.03 2e-05 3e-06 0 0 0 0 0 0 0 0 0 0 0 0 0 0 0 0 
0 0 
##$DATE= 1646981713
##$DBL= (0..7)
120 120 120 11 120 120 24 19 
##$DBP= (0..7)
150 150 150 150 150 150 150 150 
##$DBP07= 0
##$DBPNAM0= <>
##$DBPNAM1= <>
##$DBPNAM2= <>
$$ [...]
##$SUBNAM3= <"">
##$SUBNAM4= <"">
##$SUBNAM5= <"">
##$SUBNAM6= <"">
##$SUBNAM7= <"">
##$SUBNAM8= <"">
##$SUBNAM9= <"">
##$SW= 501.771253377433
##$SWIBOX= (0..15)
0 1 3 0 0 0 0 0 0 0 0 0 0 0 0 0 
##$SW_h= 40650.406504065
##$TD= 32768
##$TD0= 1
##$TE= 0
##$TE2= 300
##$TE3= 300
##$TEG= 300
##$TL= (0..7)
0 120 53 12 22 120 120 120 
##$TP= (0..7)
150 150 150 150 150 150 150 150 
##$TP07= 0
##$TPNAME0= <>
##$TPNAME1= <>
##$TPNAME2= <>
##$TPNAME3= <>
##$TPNAME4= <>
##$TPNAME5= <>
##$TPNAME6= <>
##$TPNAME7= <>
##$TPOAL= (0..7)
0.5 0.5 0.5 0.5 0.5 0.5 0.5 0.5 
##$TPOFFS= (0..7)
0 0 0 0 0 0 0 0 
##$TUNHIN= 0
##$TUNHOUT= 0
##$TUNXOUT= 0
##$USERA1= <user>
##$USERA2= <user>
##$USERA3= <user>
##$USERA4= <user>
##$USERA5= <user>
##$V9= 5
##$VALIST= <valist>
##$VCLIST= <CCCCCCCCCCCCCCC>
##$VD= 0
##$VDLIST= <DDDDDDDDDDDDDDD>
##$VPLIST= <PPPPPPPPPPPPPPP>
##$VTLIST= <TTTTTTTTTTTTTTT>
##$WBST= 1024
##$WBSW= 4
##$XGAIN= (0..3)
0 0 0 0 
##$XL= 0
##$YL= 0
##$YMAX_a= 13157
##$YMIN_a= -14014
##$ZGOPTNS= <>
##$ZL1= 120
##$ZL2= 120
##$ZL3= 120
##$ZL4= 120
##$ABSF1= 248.5645
##$ABSF2= -253.2056
##$ABSG= 5
##$ABSL= 3
##$ALPHA= 0
##$AQORDER= 0
##$ASSFAC= 0
##$ASSFACI= 0
##$ASSFACX= 0
##$ASSWID= 0
##$AUNMP= <proc_1d>
##$AZFE= 0.1
##$AZFW= 0.5
##$BCFW= 0
##$BC_mod= 2
##$BYTORDP= 0
##$COROFFS= 0
##$CY= -3
##$DATMOD= 1
##$DC= 0
##$DFILT= <>
##$DTYPP= 0
##$F1P= 0
##$F2P= 0
##$FCOR= 1
##$FTSIZE= 65536
##$FT_mod= 6
##$GAMMA= 0
##$GB= 0
##$INTBC= 1
##$INTSCL= 5.30512e-09
##$ISEN= 30
##$LB= 1
##$LEV0= 0
##$LPBIN= 0
##$MAXI= 10000
##$MC2= 0
##$MEAN= 0
##$ME_mod= 0
##$MI= 50
##$NCOEF= 0
##$NC_proc= -5
##$NLEV= 6
##$NOISF1= 182.463
##$NOISF2= 159.3651
##$NSP= 0
##$NTH_PI= 0
##$NZP= 0
##$OFFSET= 248.5645
##$PC= 4
##$PHC0= -9178.347
##$PHC1= 96.07451
##$PH_mod= 1
##$PKNL= yes
##$PPARMOD= 0
##$PSCAL= 0
##$PSIGN= 0
##$REVERSE= no
##$SF= 81.014009
##$SI= 65536
##$SIGF1= 159.3651
##$SIGF2= -187.1042
##$SINO= 113.3802
##$SIOLD= 16384
##$SREGLST= <1H.CDCl3>
##$SSB= 0
##$STSI= 65536
##$STSR= 0
##$SW_p= 40650.406504065
##$SYMM= 0
##$S_DEV= 0
##$TDeff= 32768
##$TDoff= 0
##$TI= <>
##$TILT= no
##$TM1= 0
##$TM2= 0
##$TOPLEV= 0
##$USERP1= <user>
##$USERP2= <user>
##$USERP3= <user>
##$USERP4= <user>
##$USERP5= <user>
##$WDW= 1
##$XDIM= 65536
##$YMAX_p= 302825956
##$YMIN_p= -49884970
$$ End of Bruker specific parameters
$$ ---------------------------------
##NTUPLES= NMR SPECTRUM
##VAR_NAME=  FREQUENCY,     SPECTRUM/REAL,   SPECTRUM/IMAG
##SYMBOL=    X,             R,               I
##VAR_TYPE=  INDEPENDENT,   DEPENDENT,       DEPENDENT
##VAR_FORM=  AFFN,          ASDF,            ASDF
##VAR_DIM=   65536,         65536,           65536
##UNITS=     HZ,            ARBITRARY UNITS, ARBITRARY UNITS
##FACTOR=    0.620285442955139, 1,           1
##FIRST=     20137.2065510759, 0,            0
##LAST=      -20513.1999529892, 0,           0
##MIN=       -20513.1999529892, -49884970,   0
##MAX=       20137.2065510759, 302825956,    0
$$ Real data points
##PAGE= N=1
##DATA TABLE= (X++(R..R)), XYDATA
$$ [...]
40022a76999p7952j7483J59856J45412m2342k08922k49443r4382K58721N33546
40012B30012L89904j5358j08545K83875O19577L65723l17664q28159p56108j47365
40002b84108N43170P00182J44002m86345m17071J76540L77119j03037n07868k63933
39992a21349J63447J30936j47478p0497L41871N80434M49987J36267k49592o27116
39982E86910p00727l20335J15105J38618r9219j39137J4602Q445j49209j24191
39972f69138P1995Q3019j00806o7963K80011M86123K41459j45202k49597j22239
39962a92338o9940j25719p1771J44243L10016K53053N2499r2453j03878p5302
39952B8410j05140j44147o3772J48258L43659L68400J90519r7960l05406k32429
$$ plain form
40022 -176999 -254951 -272434 -112578 32834 -9508 -218430 -467873 -562255 -303534 230012
40012 230012 619916 604558 496013 779888 1399465 1765188 1447524 619365 -136743 -284108
40002 -284108 259062 959244 1103246 616901 199830 376370 753489 650452 142584 -121349
39992 -121349 42098 173034 25556 -44941 296930 877364 1327351 1463618 1214026 586910
39982 586910 -113817 -434152 -319047 -180429 -279648 -418785 -404183 -395738 -544947 -669138
39972 -669138 -597143 -514124 -614930 -682893 -402882 83241 324700 179498 -70099 -192338
39962 -192338 -262278 -387997 -459768 -315525 -5509 247544 300043 207590 103712 28410
39952 28410 -76730 -220877 -284649 -136391 207268 575668 766187 668227 362821 130392
39942A30392Q5023K84018O8259l43411m64265k26663m6325j45647k49363j10900
39932a018882J05129K08038L08864M51468L57894n0589k97737l2094K99710Q1813
39922D13614m34533m52450J08692M45843Q4838m48584m65138m3307K78452L11681
39912b00892K51722J72881j2213j80482m8869L28794M81845J31338l66153m44042
39902A13929o7950K55444K02962J5671N230L0392j89459m78336l95664M6366L48924
39891a12491K58811N7974K142m0653j78891k01648J629J51579O0812M473K04384
39880B08121L28924M339m90678n99727l30106j33709j00633R5669M71554N74952
39870B8706J85174l28308n26642l94906j48963J17439M00127O22407O59919M24637
$$ plain form
39942 130392 215415 499433 567692 224281 -239984 -466647 -512972 -658619 -907982 -1018882
39932 -1018882 -913753 -705715 -396851 54617 412511 361922 64185 32091 331801 413614
39922 413614 -20919 -473369 -364677 81166 166004 -282580 -747718 -791025 -512573 -200892
39912 -200892 50830 223711 211498 31016 -17853 310941 792786 924124 557971 113929
39902 113929 45979 301423 504385 520056 525286 555678 366219 -112117 -507781 -461415 -112491
39891 -112491 146320 204294 206436 165783 -13108 -214756 -213127 -61548 -736 3737 208121
39880 208121 537045 541384 50706 -549021 -879127 -1012836 -1113469 -1017800 -546246 28706
39870 28706 213880 -114428 -641070 -1035976 -1184939 -1067500 -667373 -44966 614953 1039590
39860A039590o8905n86730p41874m18237q898N8762j01650r3911P6215N8939j54199
39849i40898j57425J73090M40682L68010J91871J64081R8368k30662n65219m54197
39839i12299Q5773N41294M95871M2442l62034l27669J23244N65063N99247K87720
39829A138652J5824m8044r0040k11260k06093K4013J56535j15148n21313m91868
39819c48742L2501M41849K38287l07409n17565j74087K71785L51813J37117p808
39809A17741L2480J10740J74164K60948K14672j52809n78552n25972p784K85131
39799f9241k7119m05321k12658L12488M83410K18129Q17J0337p740r6003k2087
39788A85012J31590P591l06482k75847J85847M67890J77559k81855l72828j39761
$$ plain form
39860 1039590 970685 383955 -357919 -776156 -785054 -726292 -827942 -921853 -845638 -786699 -940898
39849 -940898 -1098323 -925233 -484551 -116541 75330 239411 337779 107117 -458102 -912299
39839 -912299 -826526 -285232 210639 253081 -108953 -436622 -313378 251685 850932 1138652
39829 1138652 1154476 1106432 1016392 805132 599039 623052 779587 664439 143126 -348742
39819 -348742 -316241 125608 363895 56486 -461079 -635166 -363381 -11568 125549 117741
39809 117741 150221 260961 435125 696073 910745 757936 179384 -346588 -354372 -69241
39799 -69241 -96360 -501681 -714339 -401851 81559 299688 300505 310842 303102 207099 185012
39788 185012 316602 324193 17711 -258136 -72289 395601 573160 291305 -81523 -221284
39778b21284R9736K98645M85332M20692n9957o05671o98824l20587P5328J61248
39768c65342L4314k1660J21442L03351K37730r0737k60613Q1174O02364N91356
39758A233379o8228o93610p15450l28011l0066J3243j01187k66800k72672Q5644
39748a143758N25922M32722j79082m55119Q2572P34921O60448J15815j18743l0154
39738F25544j31883l11146k5222N00867M42556j75755l68683J69763M59127j67290
39728A017878q84279o20644L01752P33334L79099p3668k03427k36796k75418q6297
39718E1534K33437K15438j49700k88649j8770R1104k75915n36091j44357M13449
39708d08520L23302k57986m52184k4802L72874L39343K21199K54354N9131n32004
$$ plain form
39778 -221284 -121548 177097 662429 1083121 1023164 417493 -281331 -601918 -526590 -365342
39768 -365342 -331028 -352688 -231246 72105 309835 219098 -41515 39659 642023 1233379
39758 1233379 1165151 471541 -243909 -571920 -601986 -588743 -689930 -956730 -1229402 -1143758
39748 -1143758 -617836 -185114 -364196 -819315 -736743 -1822 658626 774441 655698 625544
39738 625544 493661 182515 157293 658160 1100716 924961 556278 726041 1185168 1017878
39728 1017878 133599 -487045 -185293 548041 927140 853472 650045 413249 137831 51534
39718 51534 284971 500409 350709 62060 43290 134394 -141521 -677612 -821969 -408520
39708 -408520 -85218 -343204 -795388 -820190 -447316 -107973 113226 367580 426711 -105293
39698a05293q50925k81820O77194R76042M14650k09024k75125o646J14442J2423
39688D65918j14221j67297j42733k1423J35698J74332O5172k2143M1382J64100
39678E78785J59996l4670k79304l13756k3772L12982K58204j72556m27815j98569
39668a40475Q4951p1292m24690m22807j09483P8570J68729M90422P96972M83060
39658I33957k86494o30271l07048m4781k32457l10857P7165L64553J39108l0741
39648c27866L34098O25800K01136l66509k32045J83270q3991p31851n82435L68714
39638f11679Q13543K36953k86216Q0945N84144J71655p98998j118068m55536L55324
39628a027933N37613J70105j81038j45422J62308L03302J6743l81438l47063R8088
$$ plain form
39698 -105293 -956218 -1238038 -560844 415198 829848 620824 345699 339053 453495 465918
39688 465918 351697 184400 41667 20244 155942 330274 395446 373303 414685 578785
39678 578785 738781 704111 424807 111051 87279 400261 658465 485909 58094 -140475
39668 -140475 -55524 -126816 -551506 -974313 -1083796 -1005226 -836497 -346075 450897 933957
39658 933957 647463 17192 -289856 -334637 -567094 -877951 -800786 -436233 -297125 -327866
39648 -327866 6232 632032 833168 466659 234614 417884 333893 -397958 -980393 -611679
39638 -611679 201864 438817 152601 233546 817690 989345 190347 -927721 -1383257 -1027933
39628 -1027933 -490320 -320215 -501253 -646675 -484367 -181065 -164322 -545760 -892823 -794735
39618g94735L41374J13498o5179K65268O78552M43738l44329q33777n53476P2819
39608f76247M27582M28457L38840K24023m3394l81115m66222j78887J69082K19305
39598F1424L7325k4073J37206K57770J69603N9215J05259J50381l53j86721j35826
39587F31210N3131L7400k12209l42502j42216J52477J62167j91642n81767n43038
39577i76989N4747P19296P47537R1676m87042l98807Q94L9746k29925k33581J11540
39566e60908L05871J39555m7038k7977M2139J14540L33334N10413K21314l62527
39556F68716m74137Q1907M84872R0197n87861o74167j74180K43525K97519K31169
39546A87560J66103k187j87478j76642m4768k5749o9698N562N8202j56117m06817
$$ plain form
39618 -794735 -453361 -339863 -405042 -139774 538778 982516 638187 -195590 -749066 -676247
39608 -676247 -248665 179792 518632 742655 699261 318146 -148076 -326963 -157881 61424
39598 61424 98749 74676 211882 469652 639255 698470 803729 954110 953757 767036 631210
39587 631210 684341 721741 509532 167030 24814 177291 339458 147816 -433951 -976989
39577 -976989 -922242 -202946 544591 636267 149225 -249582 -248688 -208942 -438867 -672448 -560908
39566 -560908 -255037 -115482 -162520 -190497 -148358 -33818 299516 809929 1031243 668716
39556 668716 194579 276486 761358 851555 263694 -410473 -584653 -341128 -43609 187560
39546 187560 353663 351476 163998 -12644 -57412 -83161 -152859 -147297 -89095 -245212 -652029
39535f52029k22993K90794M78638J01423k89569j92611J36530J80717l0345p9053
39525b78498R8597J53923j2258l3433K80469M86124Q1991o57466r04519l66926
39515a151996L04458L94520M416k70514j95682R183J72016K52025J00107l06600
39505f88067n18369j21354M86488N29946M7237j68639J03085K02573j18407j61296
39495d06803L99268P13249J36963n13920k16827M92246L51389n08528p86175j94183
39485e33321J62924k07466l75242K41663P26400K14789n52095l92431M11317O43266
39475C39804J01380k86943j17212p561l16502n02806j57504K54952K24638L3695
39465d34059J47984L44036J45903k60494l03942q095P1553j54807j59549K06031
$$ plain form
39535 -652029 -875022 -584228 -105590 -4167 -293736 -486347 -349817 -169100 -199445 -278498
39525 -278498 -179901 -25978 -38236 -71669 208800 694924 776915 119449 -785070 -1151996
39515 -1151996 -847538 -453018 -448602 -719116 -914798 -905615 -733599 -481574 -381467 -688067
39505 -688067 -1206436 -1327790 -841302 -311356 -264119 -432758 -329673 -127100 -245507 -406803
39495 -406803 -7535 705714 842677 328757 111930 604176 955565 447037 -339138 -533321
39485 -533321 -370397 -577863 -953105 -711442 14958 229747 -322348 -714779 -303462 339804
39475 339804 441184 154241 37029 29468 -287034 -789840 -947344 -692392 -467754 -434059
39465 -434059 -286075 57961 203864 -56630 -360572 -368667 -297114 -451921 -611470 -405439
39455d05439L27344j74036o95370m81650K45100O48529M98205L05491L38389K69771
39445H76334n9771k43924j1769K41092O3484l29749m29385k20239q6129j15794
39435c15850l1970K34446L84276K36985q126j24436j69621k77204l49963j70358
39425e91821K45426N60821M51114j694l47193k95000r9138j86863m67995l97699
39415a130042J72308O39958M47625j22254l63052j20160J29041P7720j8036J62621
39405a24271M75980M70163o5567p99272j093781o27017K00798O67462N71345L55273
39395C1113L06163J44529k79195m56612J1367N68010L98546k95499n79607k28826
39385c80011M2979j34847k43101R0751M04019K48294j5001J14916L94072K97115
$$ plain form
39455 -405439 -78095 -252131 -947501 -1429151 -1184051 -535522 -37317 268174 606563 876334
39445 876334 816563 572639 560870 801962 865446 535697 106312 -113927 -200056 -315850
39435 -315850 -347820 -113374 270902 507887 499761 375325 205704 -71500 -421463 -591821
39425 -591821 -346395 214426 665540 663846 316653 21653 -77485 -264348 -732343 -1130042
39415 -1130042 -957734 -317776 129849 7595 -355457 -475617 -346576 -268856 -286892 -124271
39405 -124271 351709 821872 756305 -42967 -1136748 -1763765 -1562967 -895505 -324160 31113
39395 31113 337276 481805 202610 -254002 -242635 325375 723921 428422 -151185 -380011
39385 -380011 -337032 -471879 -714980 -624229 -220210 28084 13083 127999 522071 819186
39375H19186o0299j60266K8385P7878j15262j97455L925K32005K44541R6694q1054
39364H88278k51945l61673l32355k15508j38746r7621M001J35754J64180O6429
39354a39206n4481j16269o7555J33499L61452K99787j54203n88457n10868j8590
39344h54891L19597K37739N0322Q2306K05785J54697J0779O8885L34680M45542
39334A055441J35264l90841o49023m04767P8607L54032K83898J06737M1679K8949
39324F39976m5900q0430O9677K61247J83413j93007n26148n29737k99623j15938
39314f36470p1674m1147N9825J42879J04626J3002L8775K07327L26506K40385
39304C84034O4529J1454L1912j26310m47892n16889n4821O04297Q38860M39172
$$ plain form
39375 819186 758887 598621 627006 704884 589622 392167 396092 628097 872638 969332 888278
39364 888278 636333 274660 -57695 -273203 -411949 -509570 -505569 -369815 -205635 -139206
39354 -139206 -193687 -309956 -377511 -244012 117440 417227 263024 -325433 -836301 -854891
39344 -854891 -535294 -297555 -247233 -164927 40858 195555 206334 275219 609899 1055441
39334 1055441 1190705 799864 150841 -253926 -175319 178713 462611 569348 611027 639976
39324 639976 594076 513646 583323 844570 1027983 834976 308828 -220909 -520532 -636470
39314 -636470 -708144 -749291 -689466 -546587 -441961 -428959 -390184 -182857 143649 384034
39304 384034 448563 460017 491929 365619 -82273 -599162 -653983 -49686 789174 1228346
39294A228346k54323q10499j017921q01482k03372M61069P45545N47465K21626
39285A16454P4556n65j71190k29409R7351N38100M74240j76566p28468o20168
39275f25665j52138M8060r983J88084O67412P73922J84190m80864m84919o237
39265A01862K08441l3936k31708j07774l81j67220k90747l2403L47645L60126
39255A53905J2920k67340k91081k56896k89823k32371K3233L02012L79176K41655
39245b24610N042k48452m15596l21793O3250M27322L79256k4611k36534J07893
39235d88833O17803N64872j30053p06330n33853R0575M52997M14984L82917M56017
39225A121096K56517l06502p15103n54661q1153K21480K45843J20538j16969l30273
$$ plain form
39294 1228346 974023 163524 -854397 -1655879 -1859251 -1398182 -652637 -105172 116454
39285 116454 191010 190445 19255 -210154 -112803 425297 899537 722971 -5497 -625665
39275 -625665 -777803 -729743 -739726 -551642 115770 889692 1073882 593018 108099 101862
39265 101862 310303 276367 44659 -63115 -63496 -230716 -521463 -553866 -206221 153905
39255 153905 166825 -100515 -391596 -648492 -938315 -1170686 -1147453 -845441 -466265 -224610
39245 -224610 -219568 -468020 -883616 -1205409 -1142159 -714837 -335581 -360192 -596726 -488833
39235 -488833 128970 693842 563789 -142541 -676394 -585819 -132822 282162 665079 1121096
39225 1121096 1377613 1071111 356008 -198653 -279806 -58326 187517 308055 191086 -139187
39215a39187j67897L91569P18277L01044m25828o32034k77555n7481k23690k43036
39205g55818J81927M81900O1635p14478r28153l00590M87667O61873K15438j94143
39195h02742o4278L84508N37524K26717k9964J84315M63610J11852p30452j106030
39185h24940n22946L57412O37352L17355O1797J63557K86463J18861k13921m24433
39175d3443l90785j56617J23214K16541N0238q8757J27583N37400O08701J69945
39165A154020l27040m41102k96306k31792k09130J5276L13513K95976q515j11050
39155A53850J38111K21366k29314p24435n59466J00796M24206J33361j60782P654
39145d94653K65872J18613j93570j07324L29188N36207K80249p3363j73965q9079
$$ plain form
39215 -139187 -307084 84485 802762 1103806 677978 45944 -231611 -289092 -512782 -755818
39205 -755818 -573891 -91991 -30356 -744834 -1672987 -1973577 -1485910 -824037 -608599 -802742
39195 -802742 -867020 -482512 55012 281729 251765 436080 899690 1011542 281090 -824940
39185 -824940 -1347886 -990474 -353122 -35767 26030 189587 476050 594911 380990 -43443
39175 -43443 -434228 -590845 -467631 -251090 -200852 -289609 -162026 375374 984075 1154020
39165 1154020 826980 385878 89572 -142220 -351350 -336074 -22561 273415 264900 153850
39155 153850 291961 513327 284013 -440422 -999888 -899092 -474886 -341525 -502307 -494653
39145 -494653 -228781 -110168 -303738 -411062 -81874 454333 734582 661219 487254 398175
39135C98175l4331o5902j25605j38519m7625N2176p7277m22981n35558j22039
39125a119486L86180L77571N604o1929K42650L12098j3751j29901K22983M07657
39115F29676j3931m30417j66916L25886J69209m91325p06355j94683L53876M27622
39105i7358K72704K19624K07279J53937J29971Q218l98923p35127l93379L88341
39095b44713N86349p1002n19576N5350Q70807O80437l43020r29148o04902j39807
39085f59225j06303j01004K76054N93817L16829k56081m11444m6036K82809J81199
39075G0615j45724k49951M6590M78946N49655K9765o54654p60077j10980O06033
39065a39782O66150J74919j93065j05566J66582K73395J48869j25893m22262m85552
$$ plain form
39135 398175 363844 297942 172337 33818 -13807 38369 -38908 -461889 -997447 -1119486
39125 -1119486 -733306 -355735 -350131 -412060 -169410 142688 128937 -964 222019 629676
39115 629676 615745 185328 18412 344298 513507 22182 -684173 -878856 -524980 -97358
39105 -97358 175346 394970 602249 756186 886157 894375 495452 -239675 -633054 -244713
39095 -244713 341636 270634 -248942 -193592 677215 1357652 1014632 85484 -519418 -659225
39085 -659225 -765528 -866532 -590478 3339 320168 64087 -347357 -393393 -110584 70615
39075 70615 -75109 -325060 -278470 200476 750131 779896 125242 -634835 -745815 -139782
39065 -139782 526368 701287 508222 402656 569238 842633 991502 865609 443347 -42205
39055d2205j40076L27340L57635j37524n63596m12821O0812K65322J26624P4018
39045h4471K55101K73700j35588n90275n45832n4412L47486M00364L42313L41081
39035E49467J78121k63135n98669m43442m9246M0053j79086k24293L7571K20071
39025g32588J53704J31557K16540K2170m36708m32355L13847Q64133L38773n97479
39015a58406o21946K03792N45573p6379o08774k37081M15147M70617J19295k2855
39005B8983m841j29569j66487J20853K58000j86358o36787l05939M48112O25723
38995E1690J68507q5661J01337R6775k94447m03882R7924N68633M18670l1658
38985F87888j97320p9492p667n3545j09435j35958n2872K05933L70868P5339m60890
$$ plain form
39055 -42205 -182281 145059 502694 365170 -198426 -611247 -550435 -285113 -158489 -84471
39045 -84471 170630 444330 308742 -281533 -827365 -881777 -534291 -133927 208386 549467
39035 549467 727588 464453 -134216 -577658 -626904 -586851 -765937 -990230 -952659 -732588
39025 -732588 -578884 -447327 -230787 -208617 -645325 -1077680 -763833 100300 439073 -158406
39015 -158406 -780352 -576560 -30987 -107366 -716140 -953221 -538074 -67457 51838 28983
39005 28983 24142 -105427 -271914 -151061 106939 -79419 -716206 -1022145 -574033 51690
38995 51690 220197 134536 235873 332648 38201 -365681 -267757 300876 719546 687888
38985 687888 490568 411076 403409 349864 240429 104471 51599 257532 628400 703739 242849
38974B42849n93371k37723J1270o7778K0725M47700N68287K3602m86450k43831
38964c14720L51951M68585J07968j28390j10805j89556m14176m97536l68116j38249
38954a233044K45736P46149R16238M43978k58785n79900n05204l42175p2520L56694
38944b82833N40006J84940k17840r5260K49800K32774N7781J87098K47862k93644
38934H10684q01313l04992N91272L72055p77827r48734M24053J417749N48828
38925A331775q97303r01476K65620P64885Q9728n34549l20386J45456K16260J08934
38915B68944J90466L00001J61860j44230l88920m51050k76325N9389K51276O4945
38905C6356l21552n40572m47878j02017L63512O08672K77324l49986m45654J81043
$$ plain form
38974 242849 -350522 -588245 -576975 -644753 -624028 -176328 391959 415561 -70889 -314720
38964 -314720 37231 505816 613784 485394 374589 185033 -229143 -726679 -1094795 -1233044
38954 -1233044 -987308 -241159 675079 1119057 860272 280372 -224832 -567007 -639527 -282833
38944 -282833 257173 442113 224273 129013 378813 611587 669368 856466 1104328 810684
38934 810684 9371 -295621 295651 667706 -110121 -1058855 -634802 782947 1331775
38925 1331775 434472 -467004 -201384 563501 653229 118680 -201706 -56250 160010 268944
38915 268944 459410 759411 921271 777041 388121 -62929 -339254 -279865 -28589 36356
38905 36356 -285196 -825768 -1273646 -1375663 -1012151 -403479 -126155 -476141 -921795 -740752
38895g40752O36587K77880k34048n8738L58569Q1609n98484n92799J11352M49777
38885c09047J35351L1841M35500M63969k87107q28558l40033M57092M52437j72922
38875C8523m27027n8216L58466M75659M09276J88481k23114n27968m02671o4795
38865b33386M2640o2099q4648q2476k86594m97132l14252J47900M03348L53799
38855f12900K94626K64955N3865k03478j51088M7480j48614o50978o76000K2584
38845a759548O25551M25849j31448k03836J81433L55102J60686O1880K02142J74229
38835I2040j41757k45044J49263N27942L10842k39842l96727l8649K37153N3399
38825C08620k41893j71744J90623M07924K81440k82j67809j19266L5331M8147
$$ plain form
38895 -740752 -104165 173715 -60333 -119071 239498 321107 -277377 -870176 -758824 -309047
38885 -309047 -173696 -141855 293645 757614 470507 -358051 -698084 -240992 211445 38523
38875 38523 -388504 -446720 -88254 387405 796681 985162 762048 234080 -168591 -233386
38865 -233386 -190746 -252845 -337493 -419969 -706563 -1203695 -1517947 -1370047 -966699 -612900
38855 -612900 -318274 -53319 546 -202932 -354020 -306540 -455154 -1106132 -1782132 -1759548
38845 -1759548 -1133997 -708148 -839596 -1043432 -861999 -506897 -346211 -284331 -82189 92040
38835 92040 -49717 -294761 -145498 382444 693286 453444 56717 18068 255221 308620
38825 308620 66727 -105017 85606 493530 774970 774688 606879 487613 522944 571091
38815E71091k14930n09956m24207K1927K77660K717l98457l36890J20448M15264
38805d75333L30618J54337Q5258J1839p7257K1113K87503L75160J31582j39975
38795G04845j21785J19885L05883K21236k27289q58216j092853m84132N18021
38786i14405Q88352L30039l18168k81061J55493K93047Q7912m0142k2988q3895
38776I4184j55826l4060R1256q5386l14374p7162N00347O87328J82244m67329
38766D21222o23449k73247J56013L18488J69438m3634K1421L55877M58978j1286
38756I49821o17686o59141j69486J86938J47776J01115K52067K67571l2169k95348
38746A31458k62598j77368k23480j20497K87936N51242K41728l08765m36871n9254
$$ plain form
38815 571091 356161 -153795 -578002 -556075 -278415 -275698 -674155 -1011045 -890597 -475333
38805 -475333 -144715 9622 94880 106719 29462 50575 338078 713238 844820 704845
38795 704845 583060 702945 1008828 1230064 1002775 144559 -948294 -1432426 -914405
38786 -914405 -26053 303986 -14182 -295243 -139750 153297 241209 201067 178079 94184
38776 94184 -61642 -95702 -4446 -89832 -404206 -481368 18979 706307 888551 421222
38766 421222 -202227 -475474 -319461 -973 168465 124831 146252 502129 961107 949821
38756 949821 332135 -327006 -496492 -309554 -161778 -60663 191404 458975 426806 131458
38746 131458 -131140 -308508 -531988 -652485 -364549 186693 428421 119656 -317215 -376469
38736c76469L26914L65119J26117j73959l47073k48998L3322J34755j40796m77406
38726g78474m52005j05428K08790L49940M03894L61230J91893Q9231K03057K57044
38716G29172q3218n44725n06051M8678M12762J63419k55296k56757M1962J24429
38706a25625r0420k17761q2801N8815J6097l5027Q7143K15332R9377j52619k01881
38695d29370K811J42452L4916n9908J63004N56368O87683L97328p8766m64542
38685I51976o12691l81686K27740P39746M92852m56138j121231p06118L28352
38676e37198Q03513K95387m62244o57952l35037k8044P1741J78945L69839M17596
38666A16546J85840j23288k28220j07539K6480L465j36325j97175j2024L59147
$$ plain form
38736 -376469 -49555 315564 441681 267722 -79351 -328349 -295027 -160272 -301068 -778474
38726 -778474 -1230479 -1335907 -1127117 -777177 -373283 -12053 179840 269071 472128 729172
38716 729172 645954 101229 -404822 -356144 56618 220037 -35259 -292016 -250054 -125625
38706 -125625 -216045 -433806 -516607 -457792 -441695 -476722 -389579 -174247 -74870 -227489 -429370
38695 -429370 -426559 -284107 -249191 -309099 -146095 410273 1097956 1495284 1416518 951976
38685 951976 339285 -42401 185339 925085 1417937 961799 -159432 -865550 -537198
38676 -537198 266315 561702 99458 -558494 -893531 -921575 -849834 -670889 -301050 116546
38666 116546 302386 179098 -49122 -156661 -130181 -126716 -263041 -460216 -472240 -113093
38656a13093N81347L17596l35752p92155n53375J73836O55479M72241l7568k85597
38646H2959j52640J3396m4410k12511k41140k8566L29131O05362N83867K87073
38636A222521J9883K7979J76855J48471j14282l61228l78029j85810M1647R8669
38626F96676r9224l24132k05137J97781K99593j79238o46188m34455J58196L35698
38616b00430O7374J0035K63698K26150j84836k50359K39277M60425n9828n25714
38606D5792j46357N25097M98383p7780l22949j34456j53782m72926m87069j3420
38596g39467M07510M02171J62733p3668k23258q4845L77978N85299K0331p30899
38586A03885o05187K62940O03174n0629o51146l29760L10515L13324j39500k46725
$$ plain form
38656 -113093 468254 785850 450098 -342057 -895432 -721596 -66117 406124 368556 82959
38646 82959 -69681 -56285 -100695 -313206 -554346 -582912 -253781 351581 935448 1222521
38636 1222521 1242404 1270383 1447238 1595709 1481427 1120199 742170 556360 598007 696676
38626 696676 597452 273320 68183 265964 565557 386319 -259869 -694324 -536128 -200430
38616 -200430 -133056 -123021 140677 366827 181991 -68368 170909 631334 571506 45792
38606 45792 -100565 424532 922915 845135 522186 387730 233948 -238978 -726047 -739467
38596 -739467 -331957 70214 232947 159279 -63979 -148824 229154 814453 834784 103885
38586 103885 -501302 -238362 364812 314183 -336963 -666723 -356208 -42884 -182384 -429109
38576d29109N6325J97204K8719p4563J7462O4673N802K8044J29821J04432o5502
38565F3308j84358j68757r0525J0040Q4961k360k47769l58470j09709L01858N02230
38554a99551L70080K8192l51033n16626k24296L60229O48484L51166q8608j45733
38544B32304L1507k4577k81925l08382l5232J48377L1971j84529l05242l29223
38534a024951j95815K10134O96536Q09120M07182j05169k88038j68067o5489j07067
38524A68376j21129L3606K10095J46336j29511k33881P7917M80966M35998n9413
38514A009360m30411k83018J72414N34178O18046L43097k70612p86013o14722
38505B92319Q4349L92972o4138n04723k65448Q0506k20760o25452j08945R40244
$$ plain form
38576 -429109 -372784 -175580 -146861 -221424 -203962 -139289 -133487 -105443 24378 128810 63308
38565 63308 -121050 -289807 -380332 -370292 -285331 -287691 -535460 -893930 -1003639 -701781 -199551
38554 -199551 170529 198721 -152312 -668938 -893234 -533005 115479 466645 378037 232304
38544 232304 263811 239234 -42691 -351073 -386305 -237928 -205957 -390486 -695728 -1024951
38534 -1024951 -1220766 -1010632 -314096 495024 902206 797037 508999 340932 275443 168376
38524 168376 47247 80853 290948 437284 307773 73892 151809 632775 1068773 1009360
38514 1009360 578949 295931 468345 1002523 1620569 1963666 1693054 907041 292319
38505 292319 376668 769640 705502 200779 -64669 15837 -204923 -830375 -939320 924
38495I24J079714N1094p79557n25706M0584J969k60449j6870M19629L20805j24153
38484B07984j99827N5828L0313k75206k83101M4915J47167m5053M8516N16134
38474B47670O21589K2917n37114l57996J10057N0135l44096k03479N14933Q40164
38464I64780K45258n60316o93588k82803k4032m2427Q2926L87236L92800k7677
38454D42157l45898j78895J57436K20586R5807P4485P1877j44864m20287m16631
38444d44227j89018o4720p0352K9995K18049K57552J91728K60799L40519O4798
38434E95123m30240n33028j01487K68144J88161L8661J89811L17634N5615k40633
38424C47761q5436K17332N9460l45753k22723M45909P69176K83110l86583n24875
$$ plain form
38495 924 1080638 1131732 352175 -173531 -132947 -130978 -391427 -408297 11332 332137 207984
38484 207984 8157 63985 94298 -180908 -464009 -419094 -271927 -316980 -268464 247670
38474 247670 869259 892176 355062 -2934 107123 157258 -186838 -390317 124616 964780
38464 964780 1210038 649722 -43866 -326669 -350701 -393128 -310202 77034 469834 442157
38454 442157 96259 -82636 74800 295386 391193 465678 537555 392691 -27596 -444227
38444 -444227 -633245 -697965 -768317 -738322 -520273 -262721 -70993 189806 530325 595123
38434 595123 164883 -368145 -469632 -201488 -13327 25334 215145 532779 588394 347761
38424 347761 262325 479657 539117 193364 -29359 416550 1185726 1468836 1082253 557378
38414E57378k75256j33667j01061O8174K03230k1594l70788k53563L55803P58547
38404G87203M27182l39726q22752o58871p7576M04980M00417m8338m62396l82048
38394g71925J02701M48502L32931Q787r8911R5698L62644M52922K21097k91829
38384H62617p12719n70576N4838M30444R3875m20528l04818K98184M81725m6475
38374A66567n35459l50168J51613L08582J34166O2680J42970R2961q5393j20610
38364c2091J9509J20764J29130J25317J0710l10235n31298k54222L15811N12512
38354A05907J17932l58261m24138j67987Q2211K20260K59896J49027n5789j18266
38344a89208M3361J91963J24755n1986j61576k03735j89474r283L18197N11280
$$ plain form
38414 557378 282122 148455 47394 115568 318798 297204 -73584 -327147 28656 787203
38404 787203 1214385 874659 51907 -606964 -684540 -279560 120857 72519 -389877 -771925
38394 -771925 -669224 -220722 112209 120996 22085 117783 480427 933349 1154446 862617
38384 862617 149898 -420678 -365840 64604 158479 -262049 -566867 -268683 213042 166567
38374 166567 -368892 -719060 -567447 -258865 -124699 -62019 80951 173912 88519 -32091
38364 -32091 -12582 108182 237312 362629 373339 63104 -468194 -722416 -406605 105907
38354 105907 223839 -134422 -558560 -726547 -644336 -424076 -164180 -15153 -70942 -189208
38344 -189208 -145847 46116 170871 118885 -42691 -246426 -435900 -445183 -126986 384294
38334C84294L65212K9257k33260l43104l10085j22868O7530l0123l72926m51831
38324a017904J4745N52006N38516J11628o9574J64501L28574J49624m7556m2270
38314F82290j84520o98524r99082l94086P10707J078523K74466o46204n11347
38305f87777M17523R02148M47381k15712l68472k10177k09469k58605l7239K70000
38295D9601K70757P3556N4209J36873j6749k55748j21286K62359K65178j88653
38285E30097m34951j66483P4777j27518l43251p8510L47013L36530l8296k72443
38275a73035k51472k06169j25760J43019M06735L56338J56259K08350M24144L38543
38265A276952q1859l56631k78067j92597l34383m06814j05126L33572M25663P2765
$$ plain form
38334 384294 749506 778763 545503 202399 -107686 -230554 -163024 -193147 -566073 -1017904
38324 -1017904 -1003159 -451153 87363 198991 129417 293918 622492 772116 724560 682290
38314 682290 497770 -200754 -1199836 -1593922 -883215 195308 469774 -176430 -687777
38305 -687777 -270254 631894 1079275 863563 495091 284914 75445 -183160 -220399 49601
38295 49601 320358 393914 448123 584996 568247 312499 191213 453572 718750 530097
38285 530097 95146 -71337 3440 -124078 -467329 -545839 -198826 137704 99408 -173035
38275 -173035 -424507 -630676 -756436 -613417 -206682 149656 305915 514265 938409 1276952
38265 1276952 1195093 838462 560395 367798 33415 -373399 -478525 -144953 280710 353475
38255C53475l61256n02348l24460r0672j7564l0416P6057K53350K15046n4268
38245d83056j27382K45257O34206M66266j35236n21919m24225j78531p8083k5502
38235f28205Q4361J29473P6082J08096K49785K35403m0085k94337l07950k56705
38225f44082l21667l00636K3822L80374L20510o7032k03030J69121O04397N66571
38215E28348J33251j71598r2108J17323J38771k7176k22945l98439n10397l89350
38205h94320m655L00259J99029r2146r8308J57168J91761q8934j81325J51717
38195c59754M07540J46473k48228j61756K79377M39049J43751j87209k69474k40825
38185e1056k43092k14927j32101n7242N2861K45645L31882J00737k87956m71622
$$ plain form
38255 353475 -7781 -510129 -834589 -925261 -942825 -973241 -897184 -643834 -428788 -483056
38245 -483056 -610438 -365181 269025 735291 600055 78136 -346089 -524620 -602703 -628205
38235 -628205 -543844 -414371 -338289 -230193 19592 254995 214910 -79427 -387377 -644082
38225 -644082 -965749 -1266385 -1242563 -862189 -541679 -608711 -811741 -642620 -38223 528348
38215 528348 661599 490001 397893 515216 653987 626811 403866 5427 -504970 -894320
38205 -894320 -898975 -598716 -399687 -491833 -590141 -432973 -241212 -330146 -511471 -359754
38195 -359754 47786 194259 -53969 -215725 63652 502701 646452 459243 189769 -51056
38185 -51056 -294148 -509075 -641176 -698418 -645557 -399912 -68030 32707 -255249 -726871
38175g26871l62723j32704J33337L93569M40887J78136o0889O0339K90782J49244
38165C63107k69566m17090j34395J94640K77898J59518q6443l44620k59691L21922
38155a94720Q26079N60971k32986o78309n16979k51957j02673K20388O28176N47832
38145H05822o5620n31369m88174k39585R3435O95893J126123N31489p62737j219793
38135e4516l21874N14846J57507m76311j09492O70531M80401m42522o65654N3299
38125a93785N40467K35768j52225j19558n7328k13101k12580N1382J27172q0775
38115g4563p7963K53935L93810J64768M8247K02938J10555l98430o67874k67337
38105c11914K69902K97067m0201k67090l17445k84239j9811M57908O63497L04735
$$ plain form
38175 -726871 -1089594 -1222298 -1088961 -695392 -254505 -76369 -137258 -76919 213863 363107
38165 363107 93541 -323549 -457944 -263304 14594 174112 87669 -256951 -516642 -194720
38155 -194720 631359 1192330 959344 281035 -235944 -487901 -590574 -370186 257990 805822
38145 805822 740202 208833 -279341 -518926 -425491 270402 1396525 1928014 1165277 -54516
38135 -54516 -376390 138456 295963 -180348 -289840 380691 861092 418570 -247084 -193785
38125 -193785 346682 582450 430225 310667 253339 40238 -172342 -120960 6212 -74563
38115 -74563 -152526 101409 495219 659987 708234 911172 1021727 623297 -44577 -311914
38105 -311914 -42012 255055 214854 -52236 -369681 -653920 -673731 -215823 447674 752409
38095G52409j69926j94028J22004K92336J88900k60k10051m12242l78257j6201
38085b5316K78629Q9103l52329m06406J02353O22282N33590j27831o72312m80542
38075d38779K46887O18699J29078o38610p97912l90079j50396j94972J10297Q21690
38065f84097J019114K58498n22664l40699L39945L97069k02174n13025j97257
38056d45290J02965j3993j23857J38285M34652L59278J03811O0658J96375K35208
38046A048092J60546J39147J41268O316j98015k10397R560J64139K9023j97520
38036A092159j50292J79381M38231M65210N19243P36994P08290M5133q37938j108967
38026B087444o46249j41952r536Q0484L29713K82335l04645p64049m38898K07707
$$ plain form
38095 752409 582483 388455 510459 802795 991695 991435 781384 369142 -9115 -25316
38085 -25316 253313 342416 -9913 -416319 -313966 308316 841906 714075 41763 -438779
38075 -438779 -191892 426807 555885 -82725 -880637 -1270716 -1421112 -1616084 -1505787 -684097
38065 -684097 335017 593515 70851 -269848 70097 467166 264992 -248033 -445290
38056 -445290 -342325 -356318 -480175 -341890 92762 452040 555851 616509 812884 1048092
38046 1048092 1208638 1347785 1489053 1495369 1297354 1086957 1096517 1260656 1289679 1092159
38036 1092159 941867 1121248 1559479 2024689 2543932 3280926 3989216 4034349 3196411 2087444
38026 2087444 1441195 1299243 1289707 1370191 1699904 1982239 1677594 913545 474647 682354
38016F82354K55752k28863l50076J32537M36281L3607n43989n46947l5402L63951
38006A99205L23431M3373j36438n2360K01482L27342J08541k69073l78745j10305
37996B56453J68872J15813j47883k40200j2263K90744L10579m004k49754J5563
37986E03920O30263Q72415L76990l00095m13009j8598K83278L29212M10173M62075
37976C136624J00196m62008m29491L33794R13842O49591O1239r2947M7558L08
37966D258706j1118M84102J112400J071689M71102K12771N10644N62144o3955
37957H608485o89088o30033k13196q6078j90423j29479m7604l41119p85646p57470
37947D738349k30556J75824J55112L6575N7389j0866k76804l90579j53789M3185
$$ plain form
38016 682354 938106 709243 359167 491704 927985 961592 417603 -129344 -164746 199205
38006 199205 522636 566009 429571 377211 578693 906035 1014576 745503 366758 256453
37996 256453 425325 541138 393255 153055 140792 431536 742115 738111 488357 503920
37986 503920 1134183 2006598 2383588 2083493 1670484 1651886 1935164 2264376 2674549 3136624
37976 3136624 3236820 2774812 2345321 2679115 3592957 4242548 4303787 4210840 4258398 4258706
37966 4258706 4247588 4731690 5844090 6915779 7386881 7599652 8110296 8672440 8608485
37957 8608485 7919397 7289364 7076168 6990090 6799667 6670188 6622584 6281465 5495819 4738349
37947 4738349 4507793 4683617 4838729 4875304 4932693 4921827 4645023 4254444 4100655 4143840
37937D143840j67461m96183m70340k15273j92185l73342l20100k6350j0877m21030
37927A450699o59383k45495M10404N45931Q5619l34375k78468O313Q7206m8927
37917A019524j09548j2766O005j82143l18300r9383L02600L66124o4857n01037
37907D06219m56581r0991J33109J65188K41515K40291j47672o07882l79634M87121
37897i317Q79777J75070o95160n30243L56846O64443R8685l26607j9027L55183
37887I49650J61008j38893Q7714M65974K72207k53632k60178K57468L60914l47987
37877A554245j023259p50447J86310P22805L63367l65778o68506l00435L34523
37868E2825O40002L58531k04968n04700l64471j36175j41814j86193R5506N68600
$$ plain form
37937 4143840 3976379 3480196 3009856 2794583 2602398 2229056 1908956 1882606 1871729 1450699
37927 1450699 791316 545821 956225 1502156 1587775 1253400 974932 981245 1068451 1019524
37917 1019524 909976 897210 903215 721072 402772 303389 605989 972113 907256 406219
37907 406219 -50362 -141353 -8244 156944 398459 638750 491078 -116804 -496438 -9317
37897 -9317 870460 1045530 350370 -179873 176973 841416 940101 613494 594467 949650
37887 949650 1110658 971765 1059479 1525453 1797660 1544028 1283850 1541318 1902232 1554245
37877 1554245 530986 -219461 -33151 689654 1053021 687243 18737 -281698 52825
37868 52825 692827 1051358 846390 341690 -22781 -158956 -300770 -486963 -391457 177143
37858A77143O86503K60716k44780l22244j0178K93646L30038R3967k79756n10948
37848D74107l10150K01374M54308J38453l05096l00051J3318Q0250j06862m2432
37838B97219L14213L67611r2014m24798j12881M00525L75242j52276n17938l75170
37828G9733J8749K83802K68005O0364n2879J43519L71758J14385m60505m55334
37818C71597L79254R37857K68535q19264p93299K99302Q84862K09286p16060q27174
37808A94896l96956j25792L9135L63915M92235P5988l91282k77430J37609J86895
37798B99213l5925J9561K45071Q1666l13848j77777N07103P89589J89951n30352
37788A074252n23179n2191Q5513j87690k83077L753K27866J07766j7388K03648
$$ plain form
37858 177143 863646 1124362 879582 557338 547160 840806 1170844 1264811 985055 474107
37848 474107 163957 365331 819639 958092 652996 352945 366263 446513 339651 297219
37838 297219 611432 979043 887029 462231 349350 749875 1125117 972841 454903 79733
37828 79733 98482 382284 650289 710653 657774 801293 1173051 1287436 826931 371597
37818 371597 750851 1688708 1957243 1137979 344680 643982 1528844 1738130 1022070 194896
37808 194896 -202060 -327852 -288717 75198 567433 643421 252139 -25291 112318 299213
37798 299213 263288 282849 527920 609586 295738 117961 625064 1414653 1604604 1074252
37788 1074252 551073 498882 584395 396705 113628 117381 345247 453013 435625 639273
37778F39273N02686L76667r5440k93699L5922L69541J81946k29041j89930K68590
37768A566515M31382M9850k40609J9630K98953r2556q34405j006104m24165J98593
37758c2916L62780K90618K45518R9951j54413j41867K38847M43514Q1385l46777
37748A086640j22859N39324P04804N1548o59700o54008j50604Q8217j22814k51447
37738E09101L2074L30336J51593l10152m46817j21688K01690K30206K25045M12127
37728A213515N04221K10273j66042j60938Q0492O4199j90062k15967K5898R0231
37718A455820n3713J17476O51719P98847K10390l46187j82532J38124k21865q18278
37708A749801n70113L42653O26753j0219l44426L04081Q88576L79949m91277m41845
$$ plain form
37778 639273 1141959 1518626 1423186 1129487 1165409 1534950 1716896 1487855 1297925 1566515
37768 1566515 1997897 2047747 1807138 1826768 2125721 2033165 1198760 192656 -231509 -32916
37758 -32916 329864 620482 866000 965951 811538 669671 908518 1352032 1433417 1086640
37748 1086640 963781 1503105 2207909 2259457 1599757 945749 795145 883362 760548 509101
37738 509101 541175 871511 1023104 712952 266135 144447 346137 576343 801388 1213515
37728 1213515 1717736 1928009 1761967 1601029 1681521 1745720 1555658 1339691 1365589 1455820
37718 1455820 1402107 1519583 2171302 2970149 3180539 2834352 2651820 2789944 2568079 1749801
37708 1749801 1179688 1522341 2149094 2138875 1794449 2098530 2987106 3367055 2875778 2433933
37698B433933K76845M19315j19966k50099L24980N79296m9526o81041m12186L35135
37688B856686O18994L24593l7846k43568l33651k02299J16746K14221k0449j740
37678C291687O02346J086859P03223p6867k64692Q5200J22524k43471k50098K80126
37668E336837O19568M32547K51366L61198L17102j0219M151N51927P76603Q2194
37658H723274q05919q97207l19350J82257M48278O99066P18380K57706j69264
37649H837221P2212N93475N04695j11991l12406J70813N66542L88427J21310K58310
37639A1088608N05922M04406Q5362p4943q2828j54975k50702j69017Q4770K99147
37629A1735750K95555N2443k57645l50115j61413k8590k30912m67663k37311L23651
$$ plain form
37698 2433933 2710778 3130093 3010127 2760028 3085008 3664304 3614778 2933737 2521551 2856686
37688 2856686 3475680 3800273 3762427 3518859 3185208 2982909 3099655 3313876 3293427 3291687
37678 3291687 3894033 4980892 5684115 5607248 5342556 5427756 5550280 5306809 5056711 5336837
37668 5336837 5956405 6388952 6640318 7001516 7318618 7308399 7312550 7864477 8641080 8723274
37658 8723274 7917355 7020148 6700798 6883055 7331333 8030399 8748779 9006485 8837221
37649 8837221 8909433 9502908 10007603 9895612 9583206 9754019 10320561 10708988 10830298 11088608
37639 11088608 11594530 11998936 12084298 12009355 11926527 11771552 11520850 11351833 11436603 11735750
37629 11735750 12031305 12083748 11826103 11475988 11314575 11285985 11055073 10587410 10350099 10673750
37619A0673750N26313J15102l79656m26202j15491J94984L66865L68663J49431
37610A1473759r0325N8259N85806R08316O90225L98816N99832J088130J270063
37601A6982881J133768J204307J640641K026829K139619K327946K878474L486099
37593C3820564L740748L797865M045669M222003L445134J331796j319476l295163
37585D9789140m165685m359672m283283l934623l381788k985606k870111k654487
37577B1153885k072159j467543j274854j345352j260673j038132r95984j099701
37569A0599487j001424o68830m58792n41707o80966o26809l82232o5248J96473
37560F369952K62224J17998p6233k67387n78730q71278o85245l1155K97526j67854
$$ plain form
37619 10673750 11200063 11315165 10935509 10509307 10393816 10588800 10955665 11324328 11473759
37610 11473759 11383434 11441693 12027499 12935815 13626040 14024856 14624688 15712818 16982881
37601 16982881 18116649 19320956 20961597 22988426 25128045 27455991 30334465 33820564
37593 33820564 37561312 41359177 45404846 49626849 53071983 54403779 53084303 49789140
37585 49789140 45623455 41263783 36980500 33045877 29664089 26678483 23808372 21153885
37577 21153885 19081726 17614183 16339329 14993977 13733304 12695172 11699188 10599487
37569 10599487 9598063 8929233 8470441 7928734 7247768 6620959 6238727 6173479 6369952
37560 6369952 6632176 6750174 6673941 6406554 5827824 4956546 4271301 4240146 4537672 4369818
37550D369818o93846m18756K08146J58483l88662l41161L55263N69052k5009l58613
37540C434715J13147M16785j89141q38193n38795J05538l3031o66178o35761J25331
37530A294417N73071K57487k06129l06080j72457O5269M57321O94225L08047m41290
37520B523881o98455k14542L05527K53732j32750l00397j09924J91677L19339
37511B138088J28377k26181l06418Q3424M95798L94521n0618k61738j79191k21727
37501A994335m09005k95428J48831L63433J22703o8591J75356M87414L61834p9243
37491B801639l58301l38366k51803k54822k82474k43443j60183j49795k71992
37482D90460l24843J9113O36827Q12039J49270o25367m73660M50510R38063M54160
$$ plain form
37550 4369818 3675972 3257216 3465362 3623845 3235183 2894022 3249285 3818337 3793328 3434715
37540 3434715 3547862 3964647 3775506 2937313 2398518 2504056 2471025 1804847 1169086 1294417
37530 1294417 1867488 2124975 1918846 1612766 1440309 1505578 1962899 2657124 2965171 2523881
37520 2523881 1825426 1610884 1916411 2170143 2037393 1736996 1627072 1818749 2138088
37511 2138088 2266465 2040284 1733866 1817290 2313088 2707609 2656991 2395253 2216062 1994335
37501 1994335 1585330 1289902 1438733 1802166 1924869 1856278 2031634 2519048 2880882 2801639
37491 2801639 2443338 2104972 1853169 1598347 1315873 1072430 912247 762452 490460
37482 490460 165617 184730 821557 1633596 1782866 1157499 683839 1134349 2072412 2526572
37472B526572j73700j27361K26811J29994l22484m98479l07854j45892n1812K42184
37462A497979N30111K36636n68735r82685m11682O07261J092856P62663J20309
37453B884713l13308m12882k38940R4894K96930P5123l80001m61778K6795M53712
37443B025258J79411m70145o20972j19419K95891J55061j38039j21741K3251L1006
37433A239562J31815M72249N59896M1471m77455k75523K39952J65727l10152j73796
37423A613746O03002Q53980J20802n42933k93413J54584j81326q56306p51255
37414G20881P3522N15998J89353j41215N4078K98556N7980l63964l77071j4151
37404A013967K21738J13023j08838j90663r5355R4624K22607P4998l61137o82255
$$ plain form
37472 2526572 2352872 2225511 2452322 2582316 2259832 1761353 1453499 1307607 1255795 1497979
37462 1497979 2028090 2264726 1695991 713306 301624 908885 2001741 2764404 2884713
37453 2884713 2571405 2158523 1919583 2014477 2311407 2386530 2006529 1544751 1571546 2025258
37443 2025258 2204669 1734524 1113552 994133 1290024 1445085 1307046 1185305 1208556 1239562
37433 1239562 1371377 1843626 2403522 2444993 1967538 1692015 1931967 2097694 1787542 1613746
37423 1613746 2216748 3070728 3191530 2648597 2355184 2509768 2328442 1472136 720881
37414 720881 794403 1310401 1499754 1358539 1412617 1711173 1769153 1405189 1028118 1013967
37404 1013967 1235705 1348728 1239890 1049227 953872 1048496 1271103 1346101 984964 302709
37394C02709m29308K50360O18447K47379l49792l48668K73738P23027N00100J0685
37384A798677j39594L6133J58517J39018J05751j4627l03164m67153k25739J01019
37374A188838J4467k81814j43700L92632N54820O4424l67464j22449M37543O27969
37364B365266M18016K19185J42627L7639k1936J70473N34428P96981Q78441Q63026
37354F404146P65346O33802O66612Q77022Q54036K54633o10497j081307r56724
37345G807069o28645m55640l82094k38778j06681k08261n58380q59894p84240
37336C584456l57407J5961K7767j28411n4775K17074K41363j45296n29364m98672
37326B372696j87795r427r2050k32777k37547r7909N8047P0715p3869j38254J02001
$$ plain form
37394 302709 -126599 123761 742208 989587 639795 291127 564865 1287892 1787992 1798677
37384 1798677 1659083 1695216 1853733 1992751 2098502 2083875 1780711 1313558 1087819 1188838
37374 1188838 1203305 921491 777791 1170423 1725243 1789667 1422203 1299754 1737297 2365266
37364 2365266 2783282 3002467 3145094 3182733 3160797 3331270 3865698 4662679 5541120 6404146
37354 6404146 7169492 7803294 8469906 9346928 10200964 10455597 9845100 8763793 7807069
37345 7807069 7178424 6722784 6340690 6101912 5995231 5786970 5228590 4368696 3584456
37336 3584456 3227049 3243010 3270777 3142366 3087591 3304665 3546028 3400732 2871368 2372696
37326 2372696 2184901 2175474 2083424 1850647 1613100 1515191 1573238 1643953 1570084 1431830 1533831
37315A533831M79293N74397K49314k40265o37564q29988o48578k0612O27058O69712
37305A756598J42511k39834r9201J50058J02323j5677R6453K16454M2544k50255
37295A901974l82231m60108o11107n54477o6317N03155P04330O29926N62451L58453
37285B586049k04150p62557p09666n0444O21196Q56908O09462j2325p23960j006490
37275A204023o14791j3416J70192l2535j18569P2396K43964K09992R2579L6614
37265A250449J01224K97379M36422K10691k62184l72867J00312N23537L40942
37256B625905m4847K194K55153R6356l16892l17416Q1737K36878K492j30628P235
37245B498167P9584L6941K04347N00365M37274L6953p5623L34570P92896R58899
$$ plain form
37315 1533831 2013124 2587521 2836835 2596570 1959006 1129018 480440 459828 1086886 1756598
37305 1756598 1899109 1659275 1560074 1710132 1812455 1796778 1893231 2109685 2152229 1901974
37295 1901974 1519743 1059635 448528 -105949 -172266 330889 1035219 1665145 2227596 2586049
37285 2586049 2381899 1619342 909676 859232 1480428 2337336 2946798 2934473 2210513 1204023
37275 1204023 589232 575816 746008 713473 594904 667300 911264 1121256 1213835 1250449
37265 1250449 1351673 1649052 2085474 2296165 2033981 1661114 1761426 2284963 2625905
37256 2625905 2581058 2583252 2838405 2934761 2617869 2300453 2382190 2619068 2621560 2490932 2498167
37245 2498167 2577751 2614692 2819039 3319404 3756678 3793631 3718008 4052578 4845474 5804373
37235E804373J048209J233847J346731J367852J553237J918491K249028K675512
37227A9197280L455657M080336L490669J486415q42501k383136l000985l069229
37219B2414506k812654k460585k306964k232922j800368j090132p47723r37017
37211H026141j029756o63825l07708l71942n46142m76296l55113l64943k54493
37202C655923N4555J51672j09145k71706j38158j55614m54713m14219J87079N29124
37192C034798N6251m82839k49218K64627J34740l67326k95598K91749M68568L6737
37182B892489k42239l87K46417J04941j00383M2825M77402R02282J051982P38110
37172F113439P1509m43165m68809k96375l04386l02331O010K83349K8177m92646
$$ plain form
37235 5804373 6852582 8086429 9433160 10801012 12354249 14272740 16521768 19197280
37227 19197280 22652937 26733273 30223942 31710357 30867856 28484720 25483735 22414506
37219 22414506 19601852 17141267 14834303 12601381 10801013 9710881 8963158 8026141
37211 8026141 6996385 6332560 6024852 5652910 5106768 4630472 4275359 3910416 3655923
37202 3655923 3710478 3862150 3753005 3481299 3343141 3187527 2732814 2318595 2505674 3034798
37192 3034798 3091049 2608210 2358992 2623619 2758359 2391033 2095435 2387184 2855752 2892489
37182 2892489 2650250 2649863 2896280 3001221 2900838 2943663 3421065 4323347 5375329 6113439
37172 6113439 6184948 5741783 5272974 4976599 4672213 4369882 4375892 4659241 4687418 4194772
37162D194772n72068j47787J98342J79240J1256j59866l09144j80915L53609P72687
37152D340126N41707P2746J52031N89152M66672l16827q53404o85783l71894l39964
37142C594562k34911J88495M75436K95139O1305J88288L95249K80534K0965p895
37132E257167J60187K91347L53941L51894J65433j24603j55828J88257N52444
37123G040239O33856N35726M34659L40675L29958N25922P22839N73925K81054
37114A1418853M83844J285621K020711K203490K091966K114338K382231K962062
37106B6963116L954629N127844O146549P225327Q754668J0368077J1518087J2951049
37098I3009346J6148933K1179938K6807414L2683188L8506821L9973530K9504434
$$ plain form
37162 4194772 3622704 3474917 3673259 3852499 3863755 3703889 3394745 3213830 3567439 4340126
37152 4340126 4881833 4954579 5106610 5695762 6162434 5845607 4992203 4306420 3934526 3594562
37142 3594562 3359651 3548146 4023582 4318721 4380026 4568314 4963563 5244097 5265062 5257167
37132 5257167 5417354 5708701 6062642 6414536 6579969 6455366 6299538 6487795 7040239
37123 7040239 7674095 8209821 8644480 8985155 9315113 9841035 10563874 11137799 11418853
37114 11418853 11902697 13188318 15209029 17412519 19504485 21618823 24001054 26963116
37106 26963116 30917745 36045589 42192138 49417465 58172133 68540210 80058297 93009346
37098 93009346 109158279 130338217 157145631 189828819 228335640 268309170 297813604
37091B97813604N012352k3766632m2161305m4165822l6193288k7580276k1526033
37084A07432600j6556758j2341198j0154537r586335q635605o844781n641327
37077C7672059n517075n148908l695835k086721j414027j486461j597054j569042
37069A5156936j443610j093601o94575p40288j120006j025379k66163K08337k61989
37060H719662r39489q23170j85017P80l36922m17664l7969J49473j59260m30320
37050E540104k73196n9890j59450k75425q1035N9328l32535r04855q29041m198
37040B679807P34589P10250J91240j27347l5613J16753M1662j41998j75423k3985
37030C969935J26097J17948m6234k94183n72768p77050o90655j88916M56288O76399
$$ plain form
37091 297813604 302825956 279059324 236898019 192732197 156538909 128958633 107432600
37084 107432600 90875842 78534644 68380107 58793772 50158167 43313386 37672059
37077 37672059 32154984 27006076 23310241 21223520 19809493 18323032 16725978 15156936
37069 15156936 13713326 12619725 11925150 11184862 10064856 9039477 8773314 8981651 8719662
37060 8719662 7780173 6957003 6771986 6772766 6435844 6018180 5980211 6129684 5970424 5540104
37050 5540104 5266908 5207018 5047568 4772143 4691108 4750436 4417901 3513046 2684005 2679807
37040 2679807 3414396 4124646 4315886 4188539 4152926 4269679 4311341 4169343 3993920 3969935
37030 3969935 4096032 4213980 4167746 3873563 3300795 2523745 1833090 1644174 2100462 2776861
37020B776861K11001m67131n81847L8769P11341P12997J70238j45000J49865N81900
37010D158994N36863R8727j81098j54486k14540n37791p15741m01690R3113K34896
37000B917247J0376j86552j95919j59338r5842Q9901K43755J08424j90226l04861
36990B236965k78195m07043n10289q1603O75883Q09630O789p75253o52496p1276
36980I53112K8411l07975l37618K8677J97086L8645M5943L23123L78110Q2013
36970A429527n3261J81539L00479L1040j59292Q0369K88576m7174n62551n22612
36960I66640O4186M76451K84029j97329m13508j60473L08593N21737K17093l03288
36950A764131m35308n4323K55566J5899m24256l91172J12811M12535J27048l24504
$$ plain form
37020 2776861 2987862 2520731 1938884 1977653 2688994 3401991 3572229 3427229 3577094 4158994
37010 4158994 4695857 4794584 4613486 4459000 4244460 3706669 2990928 2589238 2682351 2917247
37000 2917247 2927623 2741071 2545152 2385814 2289972 2379873 2623628 2732052 2541826 2236965
36990 2236965 1958770 1551727 1041438 959835 1635718 2445348 2452137 1676884 1024388 953112
36980 953112 981523 673548 335930 364607 561693 600338 646281 969404 1347514 1429527
36970 1429527 1376266 1557805 1858284 1889324 1730032 1810401 2098977 2051803 1489252 966640
36960 966640 1030826 1507277 1791306 1593977 1180469 1019996 1328589 1850326 2067419 1764131
36950 1764131 1328823 1274500 1530066 1545965 1121709 730537 843348 1255883 1382931 1058427
36940A058427l16791J76157N65808L50723k93558o84367m07472J94143M73388
36931A116458L04040J26995K06501K87345J16221j52670l10117m16368m67046
36922H11359j81313M43314P66105K65410n91706q57218l53902J94895K66894J42151
36912I05989K47382M43955K98985k35144p22236p23872k27315L52987N62260L46271
36902A249262O0602q373M0935K1018J2473J48382K68727J60548k8883k9672N4011
36891A949030m2159j69344J1648K96649J31135l62164l27669N01479J153950O92870
36881C835425l96710q36649k70065M46246N83462L69882K97979L17714J54899
36872D502183n7231k4222Q1958j72423o89528q20514l04455K66260K50821j55964
$$ plain form
36940 1058427 741636 917793 1483601 1834324 1540766 856399 448927 643070 1116458
36931 1116458 1420498 1547493 1753994 2041339 2157560 2004890 1694773 1278405 811359
36922 811359 630046 1073360 1839465 2104875 1513169 655951 302049 496944 763838 905989
36912 905989 1153371 1597326 1896311 1661167 938931 215059 -12256 340731 902991 1249262
36902 1249262 1309864 1301491 1342426 1363444 1375917 1524299 1793026 1953574 1924691 1895019 1949030
36891 1949030 1906871 1737527 1749175 2045824 2176959 1814795 1487126 1988605 3142555 3835425
36881 3835425 3438715 2602066 2332001 2778247 3361709 3731591 4029570 4347284 4502183
36872 4502183 4444952 4420730 4502688 4330265 3640737 2820223 2515768 2782028 3032849 2876885
36862B876885l08242j04259Q243p8988M3830M48670N57969P7284l97977k80324
36852B843091L7722j53170o38634o00404L871L59696J49057l198K85875M79871
36842B763777J42188k09326J3845L85572J24366n72808p61600j59983N03069N75888
36832B804988K22676m8649k6449K05363M70721N56582L94063K39106L61564N92921
36822E772886N59722K94383J45994J37909j7962k44035q7970M34632O42148J73448
36812G811155l77700k52152M57207J022686J034685P43118O32598R43895J479607
36803A3495099J774632J680698J723907K421053L339051L610581L421291L921193
36795C5387505N347273O508897O831254P554568R852052J3226635J7243485K2928288
$$ plain form
36862 2876885 2568643 2464384 2472627 2393639 2437469 2886139 3444108 3521392 3123415 2843091
36852 2843091 2880813 2727643 2089009 1488605 1492476 1852172 2001229 1998031 2283906 2763777
36842 2763777 2905965 2696639 2710484 3096056 3220422 2647614 1886014 1726031 2229100 2804988
36832 2804988 3027664 2979015 2952566 3157929 3628650 4185232 4579295 4818401 5179965 5772886
36822 5772886 6332608 6626991 6772985 6910894 6892932 6648897 6560927 6995559 7637707 7811155
36812 7811155 7433455 7181303 7638510 8661196 9695881 10438999 11071597 12015492 13495099
36803 13495099 15269731 16950429 18674336 21095389 24434440 28045021 31466312 35387505
36795 35387505 40734778 47243675 54074929 61629497 71481549 84708184 101951669 124879957
36787A24879957K9493964L0903469K0235384j080086k1808910l1213962k8854579
36780A22555237k2168048j6842920j3014439r464708o945617o233067o100061
36773D1786377n144567l867200l369247l305175k631697j481474q70014j043679
36765B0073324j295222j135513p14281k67259J17541L41408M61258Q01517J448502
36756A9831275J943117J933085J785390K074356K804585L612667M375970N129896
36748D3490341N758671O314213P322318R242066J1863355J4537409J6421086J6045313
36740A30994772J1604951K936771p100849j4449338j7199903j6439619j4116896
36733G6229889j1315472q660907o907470o254142n900889n093375m105349l551782
$$ plain form
36787 124879957 154373921 185277390 205512774 204432688 182623778 151409816 122555237
36780 122555237 100387189 83544269 70529830 61065122 54119505 47886438 41786377
36773 41786377 36641810 32774610 29405363 26100188 23468491 21987017 21117003 20073324
36765 20073324 18778102 17642589 16928308 16661049 16778590 17119998 17581256 18382773 19831275
36756 19831275 21774392 23707477 25492867 27567223 30371808 33984475 38360445 43490341
36748 43490341 49249012 55563225 62885543 72127609 83990964 98528373 114949459 130994772
36740 130994772 142599723 145536494 138435645 123986307 106786404 90346785 76229889
36733 76229889 64914417 56253510 49346040 43091898 37191009 32097634 27992285 24440503
36725B4440503l248266k543939j507481r51365j232487j697347j573566r60801
36717A0725251n61691o53661p77538n04487j01536j00769m47459n85899l61847
36708F630364k41248m53017n50698k24812N9824j54218m21495p0272O02953P36766
36698E914147K97962O8689K65153K27178l17499p20786n60855l77091o69272r66283
36688C161343o21444P3254L50901J31293m5682J2497k0235k82608m65141k99317
36678A994861R4200L67507K30088k99369p30059m58429M25901J004388N80683
36669C209771m06209r47182p01302j86562R6590J91581L27916M80134M30093P9625
36659B574455l63206n02681k02887J13791l7602m00711k33077M69527P40268P8204
$$ plain form
36725 24440503 21192237 18648298 17140817 16189452 14956965 13259618 11686052 10725251
36717 10725251 10163560 9509899 8732361 8227874 8126338 8025569 7578110 6992211 6630364
36708 6630364 6389116 5936099 5385401 5160589 5220413 5066195 4644700 4574428 5177381 5914147
36698 5914147 6212109 6280798 6545951 6773129 6455630 5734844 5173989 4796898 4127626 3161343
36688 3161343 2539899 2613153 2964054 3095347 3049665 3062162 3041927 2759319 2294178 1994861
36678 1994861 2089061 2456568 2686656 2387287 1657228 1198799 1624700 2629088 3209771
36669 3209771 2803562 1856380 1155078 968516 1065106 1256687 1584603 2064737 2494830 2574455
36659 2574455 2211249 1708568 1505681 1619472 1581870 1181159 948082 1417609 2157877 2236081
36649B236081o41224m28811K92373L89918k03647n38589k54391M2472K8722J15057
36639A037961L99637K89966l67327p65596l59263K23606J87410k09823k24648
36630B11923J26269K43633K8525o3707Q6668R9507j49300k64837J1823L61995
36620F92499L16845j42775n65976m97247N1982N44978M62822m0665l00183o5345
36610D56935J61173j1536j74698J58965N79680L09459m93148q34493l44863K23170
36600C0644K18479Q322J87792N34223M22017j25447m99213m27992j99727l5891
36590A13207J48807L20281K22173j37675l59618k22616K383L0082j9046M9572
36580A47550J03902k5010j42338n111J77257M0206k74807k92728O792J64151O9031
$$ plain form
36649 2236081 1594857 1166046 1458419 1848337 1644690 1106101 851710 894182 922904 1037961
36639 1037961 1437598 1727564 1360237 594641 235378 458984 646394 436571 211923
36630 211923 338192 581825 610350 546643 633311 732818 583518 318681 330504 692499
36620 692499 1009344 866569 300593 -196654 -144672 400306 863128 822463 522280 456935
36610 456935 618108 606572 431874 590839 1170519 1479978 986830 152337 -192526 30644
36600 30644 249123 257445 445237 979460 1401477 1276030 776817 348825 149098 113207
36590 113207 262014 582295 804468 666793 307175 84559 86942 117024 97978 147550
36580 147550 251452 226442 84104 78993 256250 296456 21649 -271079 -264287 -100136 -31105
36569c1105J60888N57615O53957P1204n53492m01887K68887M82005o292m30527
36559G71253k56658R6061O6021j86715j88087M8624J49839L7836k4438Q3255K06463
36548H03454K13000J19666l4304j95351k23536k5649K74205M54262M23262K12642
36538B021651j26537m63819n75530l92606j55376j35269k93868l70006j96566
36529f87926J85931N65716O04437J09401n66121p20660j78643L73644K98820j02148
36519a17549j33957J72940J96901j52547k52801J76845N90438M82359J05405p1415
36509I96619r1068k17324l27135j37472K00539K55198k9472k59858j64698Q6430
36499C11759J65214k8348k74356k25132K28449P08529O55492J1844o20081o79109
$$ plain form
36569 -31105 129783 687398 1341355 1412559 859067 457180 726067 1208072 1201780 771253
36559 771253 514595 610656 676677 489962 301875 350499 500338 538174 513736 596991 803454
36548 803454 1016454 1136120 1101816 906465 682929 657280 931485 1385747 1809009 2021651
36538 2021651 1895114 1431295 855765 463159 307783 172514 -121354 -491360 -687926
36529 -687926 -501995 63721 668158 777559 211438 -509222 -687865 -314221 -15401 -117549
36519 -117549 -251506 -78566 118335 -34212 -287013 -110168 480270 962629 1068034 996619
36509 996619 905551 688227 361092 223620 424159 679357 649885 390027 225329 311759
36499 311759 476973 448625 174269 -50863 177586 886115 1541607 1553451 933370 254261
36489B54261k71777J00531J69309j1474l17286n34367l34565K94559P64895N09934
36479F24020j97666n38157k30241J81165J84594o2704j51987l9585M8865M7959
36469a33737R2050K56546M39319M24475M7408n29690p58814k64003N11324O52283
36459G37161n9623p74746o80304n4510K54083P9513L1422M10409P00667L68099
36449A012171l28741o95393m98238j31838p379j15708k06833j28995R6933L47694
36439f56327M40086K59412l7642r8738J82219M35401K60963j90623l98527k18820
36429b2596o5225k21220l84634j95126J32880J45772r9235j36377J31401K93895
36419d20465J30092p5541q4415q8253k60843l44985p5566K83692K63644j11686
$$ plain form
36489 254261 -17516 83015 252324 240850 -76436 -610803 -945368 -650809 114086 624020
36479 624020 426354 -111803 -342044 -160879 23715 -38989 -190976 -230561 -181696 -133737
36469 -133737 -41687 214859 654178 1078653 1126061 596371 -162443 -426446 84878 737161
36459 737161 677538 -97208 -777512 -832022 -577939 -498426 -467004 -56595 644072 1012171
36449 1012171 683430 -11963 -510201 -642039 -649418 -765126 -971959 -1100954 -1004021 -656327
36439 -656327 -216241 43171 5529 -93209 89010 524411 785374 594751 196224 -22596
36429 -22596 -87821 -309041 -693675 -888801 -755921 -610149 -709384 -845761 -714360 -420465
36419 -420465 -290373 -365914 -450329 -538582 -799425 -1144410 -1219976 -936284 -672640 -784326
36409g84326l60010k02996J66041M42099M97903L16350k9211k76640j78509R6917
36399c12382P9230l28878n95290k52657L80305N53954Q8523l90083k97574K04160
36389h70692N64926N84067M43686K33130r5107l66061k83947K9530Q7549j97402
36379A29679k97373R7715N23962M38738K6649k10910k67216l95564m15923l4000
36369d04243L85772K49755j77523r5316M06805L56142m19122p99865j39640O00730
36359c6505L48775l91529m46967J23874K95307j41175l57260M929L09423J03506
36349a87622k07340j96786q7968j82705k86993j17137K23050M94811O12742M53241
36339E17293j22469p92132q45145r6506P06518P81830K62923j33487q5370J12031
$$ plain form
36409 -784326 -1144336 -1347332 -1181291 -739192 -241289 75061 45850 -230790 -409299 -312382
36399 -312382 -233152 -562030 -1157320 -1409977 -1029672 -475718 -387195 -777278 -1074852 -870692
36389 -870692 -305766 278301 721987 955117 860010 493949 210002 239532 327081 129679
36379 129679 -167694 -69979 453983 892721 919370 708460 441244 45680 -370243 -404243
36369 -404243 -18471 231284 53761 -41555 365250 721392 302270 -497595 -637235 -36505
36359 -36505 312270 -79259 -526226 -402352 -107045 -248220 -605480 -600551 -291128 -187622
36349 -187622 -394962 -591748 -679716 -862421 -1149414 -1266551 -1043501 -548690 64052 517293
36339 517293 394824 -397308 -1242453 -1338959 -632441 149389 412312 278825 193455 305486
36329C05486J17760n8811j96713j45830L4747J31108K3755j29992j21886m4433
36319h4809j35308k98989j71410K62524N25698L02294j22907l04028k09353j02566
36309c38854q1527j519K46371N39394N68007J19490n40035p36665j82447M66396
36299E8611L64411k96685m99450Q4076N81252K55356m07712n28768j55216q254
36289e52379k56228l24010J25929O59930O58083O3674n74617o45587o3586O06434
36279c02357P21853K79704j74683l29549l56166l25577j2131M49110M06480k87157
36269F9527p24646j32650Q67784J024472J81507o32674p12875l87322j71306m8671
36259f66854J50066L00532K38189L7833j72602l37690l26311l3882L15891L72303
$$ plain form
36329 305486 423246 364435 167722 21892 56639 187747 211502 81510 -40376 -84809
36319 -84809 -220117 -519106 -690516 -427992 97706 400000 277093 -26935 -236288 -338854
36309 -338854 -420381 -421900 -175529 363865 931872 1051362 511327 -225338 -407785 58611
36299 58611 423022 126337 -373113 -289037 292215 547571 139859 -388909 -544125 -552379
36289 -552379 -808607 -1132617 -1006688 -346758 311325 374999 -199618 -845205 -908791 -302357
36279 -302357 419496 699200 524517 194968 -161198 -486775 -498906 -49796 356684 69527
36269 69527 -655119 -787769 80015 1104487 1285994 653320 -59555 -446877 -618183 -666854
36259 -666854 -516788 -216256 21933 59766 -112836 -450526 -776837 -810719 -494828 -122525
36249a22525J84275Q6926P2578j70017n28544m32264K17631O98358M32410j93664
36239B45164m26532j65790J11725J58590J38471J24360n1476l80727n18207k13723
36229i78145L24952O66335O18717L11218q5735m89477p21375m78647K31346P90042
36219A89231N48587k47351o14369j38202M02800J65921m79537m98321K49335Q14102
36209C92196N49040q0506l21138j29125L1359n7865k16376k19148j9452K23736
36199A52721K24332j09527m12029k55752J70748K45592j31191l30078P812L47678
36189h9694R1069m45799m82205P1210N28623M27630O3763m8282J67768L87602
36179F71685L31591K3854k83269l65315k31901o7247J5365M8777N6552J7287O088
$$ plain form
36249 -122525 61750 148676 221254 51237 -477307 -909571 -691940 6418 438828 245164
36239 245164 -181368 -347158 -235433 -76843 61628 185988 134512 -246215 -764422 -978145
36229 -978145 -653193 13142 631859 943077 857342 367865 -353510 -832157 -600811 189231
36219 189231 737818 490467 -123902 -262104 140696 306617 -172920 -671241 -421906 392196
36209 392196 941236 860730 539592 410467 441826 383961 167585 -51563 -71015 152721
36199 152721 377053 267526 -144503 -400255 -229507 16085 -115106 -445184 -437372 -89694
36189 -89694 1375 -444424 -926629 -855419 -326796 100834 164597 116315 284083 671685
36179 671685 1003276 1027130 743861 378546 146645 79398 94763 143540 200092 217379 223467
36168B23467J24563K34089O1037l21749m64607j79715J49774J61094M1132J02668
36158A31753J89031J153k39634n7673M42435O21818K50159j59885j35200J35191
36148A179148K22554Q7014n7389j94185m26950o28156n49611k23494O1542J61690
36138c67837J78555J73701P7525p6530j15709k1478O279j00102j39211k1284K6779
36127c79312r7927n9335L70834P29114M15771k95661n10157l1480L29728K8753
36117E00328m10330l63243j52278l58659o31017j70862Q03503J112367K76635
36108F06444p38825p92921M3012P64785O87722M4489m45452l49969N5348J35994
36098A0627k30769l94277J13266P06636M94627l19054o46152j29357L93209K61328
$$ plain form
36168 223467 348030 582119 643156 321407 -143200 -322915 -173141 -12047 29085 131753
36158 131753 320784 321937 82303 24630 467065 1088883 1339042 1179157 1043957 1179148
36148 1179148 1401702 1488716 1431327 1237142 810192 182036 -367575 -591069 -529527 -367837
36138 -367837 -189282 -15581 61944 -14586 -130295 -151773 -145494 -245596 -384807 -406091 -379312
36127 -379312 -477239 -536574 -165740 563374 979145 683484 173327 141847 471575 500328
36117 500328 89998 -273245 -425523 -784182 -1415199 -1586061 -782558 329809 606444
36108 606444 -132381 -925302 -882290 -117505 570217 614706 169254 -180715 -125367 10627
36098 10627 -220142 -614419 -501153 205483 700110 381056 -265096 -394453 -1244 260084
36088B60084j08096j23506M3325J4861l0731J59798K76517O003k82586j49530
36078F6139P2735j58709n75687n06318m6905Q6733k15684k89173J68088O11308
36068g87473N37258J80750J7255Q6717J34282O3637k4512k2539R8592K15707P8978
36057E78652l31125n65120k20855L56040M00742j72290n60290k07899L59278K73345
36047h9522m30741q46363m11373L86834O85221L02180j77422k41678p317J46245
36037f83936J41618J15899L2492j89715l02780n524M35789M32237K3823p6210
36027g6307L68805O30279J32814n76047o10746j6928M54887M88841L65924K22408
36017A383930p3964l83796l50870l0010J37292O408j43326j59566j57251j09456
$$ plain form
36088 260084 151988 28482 71807 86668 55937 215735 492252 498255 215669 66139
36078 66139 138874 -19835 -595522 -1101840 -1148745 -1062012 -1277696 -1566869 -1398781 -787473
36068 -787473 -250215 -69465 -52210 34507 168789 232426 207914 185375 283967 499674 578652
36057 578652 247527 -317593 -538448 -182408 218334 46044 -514246 -722145 -362867 -89522
36047 -89522 -520263 -1366626 -1777999 -1391165 -705944 -403764 -581186 -822864 -830181 -683936
36037 -683936 -542318 -426419 -393927 -583642 -886422 -891946 -456157 -23920 -97 -76307
36027 -76307 292498 922777 1055591 479544 -131202 -148130 306757 795598 1161522 1383930
36017 1383930 1309966 926170 575300 545290 682582 688990 545664 386098 228847 119391
36007A19391J48361M59313M17195j3071l93835l94432q8283K96500N12695K81544
35997A345378l65269q34458o05891j9006J67825j09500k45333l6922P7171o8484
35987f94489m0111L70892P29255O54858L18537l382k66671l65659j59699L7111
35977E80642k64337p70412o00339K65524P28012K58599k01515J95795P34114L05980
35967A232063o99520r80273l76170J8022k76018m50188J04015P57796O62640K5417
35957A7784k98879l5329L21193L54774K28970K86510M90771M69395M1657m81143
35947A395703o44246m15281j90863k42762m26229n03547m39995k37327J69489
35938a535058O03706N93492k841n96386n30166L7063L67422J72509p2245J11550
$$ plain form
36007 119391 267752 727065 1144260 1131189 737354 342922 254639 551139 1063834 1345378
35997 1345378 980109 145651 -460240 -479246 -311421 -420921 -666254 -703176 -626005 -694489
35987 -694489 -734600 -363708 365547 1020405 1338942 1335560 1068889 703230 543531 580642
35977 580642 316305 -454107 -1054446 -788922 -60910 197689 -3826 191969 926083 1232063
35967 1232063 532543 -447730 -823900 -805878 -1081896 -1532084 -1428069 -670273 -7633 17784
35957 17784 -281095 -316424 4769 359543 588513 875023 1365794 1835189 1876846 1395703
35947 1395703 751457 336176 145313 -97449 -523678 -1027225 -1467220 -1704547 -1535058
35938 -1535058 -931352 -337860 -340701 -937087 -1467253 -1430190 -1062768 -890259 -962504 -850954
35928h50954N44716O71693K70606k92542m54881m7918M93366N77443J34347l06161
35918G39715k85566M6154K23628R3954r1076r9367N174K498j97469m09524l15652
35907b87531J42664N57316M61099o1106m44370l46463L7933L75732M94517K39558
35897A169349m22701r78042o57428M62756J213486P17143m22386r12876m16192
35888b46891K61450M04669J19612j34482j33857P7832L04233K76456m9065l04093
35878E75864j58500J38306Q1944k90599m16258o0884L11789J97595k66669m97193
35868c84605j62317M59742P62284M37586j49024l42746k3218K17253q6945n70859
35858A57151n43866K1820M61062L00507k35852o10306n27827q2182L91510N76047
$$ plain form
35928 -850954 -306238 365455 636061 343519 -111362 -159280 334086 911529 1045876 739715
35918 739715 454149 500303 723931 817885 726809 627442 632616 635114 437645 28121 -287531
35907 -287531 -144867 412449 873548 812442 368072 21609 59542 435274 929791 1169349
35897 1169349 746648 -231394 -888822 -426066 787420 1504563 1082177 169301 -246891
35888 -246891 14559 419228 538840 404358 270501 348333 652566 929022 879957 575864
35878 575864 417364 555670 637614 347015 -69243 -130127 181662 379257 112588 -384605
35868 -384605 -546922 -87180 675104 1112690 963666 620920 597702 814955 728010 157151
35858 157151 -386715 -364895 96167 396674 160822 -449484 -977311 -1059493 -667983 -91936
35848i1936M39371K04978j0774l12869o47262o56586k20567J89571J17175j78389
35838a167288j02323L75329O99948N24949O6571k97105l87944k13977P6259K58086
35828a67495K80417L21436M16074L26356L5287n3210J99968K60651k49497p80622
35818E89365o14316j035K67946J03053K9007R1861j36488n38553m77531O8236
35808f18455L82898J98505N3001K28347K76266n8714l36452k52782j52110k70526
35798e50022k53257R3060L15194R8948j59823r5531J0587q5677n667M83114P76259
35787F27185K99338m65808o50684k87889q8012k27444k27224P8526K66744Q2341
35777e92927j65218j08424K02159M45026L92966J04045j19089o3179N6648j16664
$$ plain form
35848 -91936 347435 552413 541639 228770 -418492 -1075078 -1295645 -1106074 -988899 -1167288
35838 -1167288 -1269611 -894282 -194334 330615 397186 100081 -287863 -501840 -425581 -167495
35828 -167495 112922 434358 850432 1176788 1212075 1158865 1358833 1619484 1369987 589365
35818 589365 -24951 -25986 241960 345013 374020 465881 329393 -209160 -686691 -618455
35808 -618455 -235557 -37052 15949 244296 520562 461848 125396 -127386 -279496 -550022
35798 -550022 -803279 -710219 -395025 -296077 -455900 -551431 -540844 -626521 -632188 -149074 627185
35787 627185 926523 460715 -189969 -477858 -565870 -793314 -1020538 -942012 -675268 -592927
35777 -592927 -758145 -866569 -664410 -219384 173582 277627 158538 95359 152007 35343
35767C5343m11705k52470L63435O45430J55492m60839m30643M5179K97873K59191
35757B46286K63128K41327k9688k31257M7344M22640K11827l72400m99683r4527
35747B04997J05679j14846j48225K11844L34865o7676l46759n3648K33886q5769
35737B74348n76160n02812m0158J16766p3418q4380J66828K40766J9934j29552
35727e87838m5607O0413J55520M35034P28368N43927q1883m43545j99586P8314
35717F43117j56811n14072l19616K42832M13214O2770j93995q1793l2762k73413
35707b10529l33326J07061N33687L53563j41831k33743J11301K88008O1817j72227
35697C63781j49559r8966j97762k21890J7611L03746L28885R6934j61393k46019
$$ plain form
35767 35343 -376362 -628832 -265397 380033 535525 74686 -355957 -310778 -12905 246286
35757 246286 509414 750741 721053 489796 537140 959780 1171607 799207 299524 204997
35747 204997 310676 195830 47605 259449 594314 526638 179879 126231 360117 274348
35737 274348 -301812 -804624 -844782 -728016 -801434 -885814 -718986 -478220 -458286 -587838
35727 -587838 -633445 -573032 -417512 17522 745890 1289817 1207934 764389 564803 643117
35717 643117 486306 -27766 -347382 -104550 308664 371434 177439 95646 62884 -210529
35707 -210529 -543855 -436794 96893 450456 308625 74882 186183 474191 536008 363781
35697 363781 214222 115256 -82506 -304396 -286785 16961 345846 442780 281387 35368
35687C5368q5280J76553J85391k25327o76388o56600k46430L2649M5621J34313
35677a280130L54213L25153K6550J133M16152O32233K03767l28074k54912K14775
35667C10860L78873J38463o1388j03087k57775n12613n37130k99245j18448r5859
35657a157349j8320J53666J92237L6314j06196j15948m6401J16762L80086M75810
35647h9339J24311m33454o18226k79071J40125K60997J83894J55163K25968L65108
35637C5476N35634N23809P3006o20569r07733m58859K35075M47511J21190j54434
35627a69894J93K88990K47335o7124j73412J23951M39685L25515j60302n86735
35617B68202o61260l90499O8156M29929L66844n9989k60850J20516N25128J98157
$$ plain form
35687 35368 -49912 126641 312032 86705 -589683 -1246283 -1492713 -1460064 -1414443 -1280130
35677 -1280130 -925917 -600764 -574214 -573081 -156929 475304 679071 350997 96085 310860
35667 310860 689733 828196 766808 663721 405946 -106667 -643797 -943042 -1061490 -1157349
35657 -1157349 -1175669 -1022003 -829766 -793452 -899648 -1015596 -1061997 -945235 -565149 -89339
35647 -89339 34972 -398482 -1016708 -1295779 -1155654 -894657 -710763 -555600 -329632 35476
35637 35476 571110 1094919 1167925 547356 -360377 -819236 -584161 -136650 -15460 -169894
35627 -169894 -169701 119289 366624 299500 126088 250039 689724 1015239 854937 268202
35617 268202 -393058 -783557 -715401 -285472 81372 21383 -239467 -118951 406177 604334
35607F04334n65089p22448n9465M81829K98807k3060J47446M14685J58807l25054
35597D10792l49624J5384J67393r141j31658p0740j4560R25K8551o8262k89700
35586c10640k37163K58621O47963M21901o5927k10245j25614k46866m23270k75344
35576e66584m1810j46195k93772J8996M40037K63428k91268m15231r8669r243
35566a140311j45780J26488P22467Q04219K29296j82590l0116J70573Q1486P548
35556F43280K9445k04422n56085l85541K58724N49143K48062J4129Q0487j08288
35546E68934n97712o14207k5492K66832l6615m3453N66378O93904k73611j132748
35536f27790o70743M08313P02750K39050j6132P5022k6228k41491r9777K04919
$$ plain form
35607 604334 39245 -683203 -742668 -260839 37968 14908 162354 577039 735846 410792
35597 410792 61168 76552 243945 234804 103146 32406 17846 18771 47322 -20940 -310640
35586 -310640 -547803 -289182 358781 780682 714755 504510 378896 132030 -291240 -566584
35576 -566584 -608394 -754589 -1048361 -1029365 -589328 -325900 -617168 -1032399 -1131068 -1140311
35566 -1140311 -1286091 -1159603 -437136 367083 596379 413789 383673 554246 635732 643280
35556 643280 672725 468303 -87782 -473323 -214599 334544 582606 596735 677222 568934
35546 568934 -28778 -642985 -668477 -401645 -438260 -481713 84665 778569 504958 -627790
35536 -627790 -1298533 -890220 -187470 51580 35448 110470 84242 -157249 -257026 -52107
35526e2107J91273Q4885L19210N31469J81231l21808k61074R1814O171l40642
35516D30422k61098Q0638j0222l93911l51210L6227N9849k36103j53112K84759
35506e13761L49983k0930j53238N0804j2626l83096m07081j5113J15511j37176
35496a126723j18590K77698L28216j33098l02903J50634M41089L3614m60429m10254
35486a320746j45710j00010M3151N36180P86327K98381l20092k36043K93609M21785
35476B56832Q3577r1796L6703r956l36820m25399m0617L05336J11137l48340m01443
35465h60786Q2629N23683M39064R6023P0776L44112L44281o1119k62260O2038
35455G78441K72142k36282r18232q23372p8479L59404K26236J59048M05521M32204
$$ plain form
35526 -52107 139166 224051 543261 1074730 1255961 934153 673079 764893 771064 430422
35516 430422 169324 249962 239740 -154171 -505381 -469154 -409305 -645408 -798520 -513761
35506 -513761 -163778 -184708 -337946 -287142 -299768 -682864 -1089945 -1105058 -989547 -1126723
35496 -1126723 -1245313 -967615 -639399 -772497 -1075400 -924766 -483677 -450063 -910492 -1320746
35486 -1320746 -1466456 -1566466 -1523315 -987135 -200808 97573 -222519 -458562 -164953 256832
35476 256832 340409 248613 285316 275360 -61460 -486859 -527476 -222140 -111003 -459343 -860786
35465 -860786 -778157 -254474 184590 280613 351389 695501 1039782 978663 716403 778441
35455 778441 1050583 814301 -103931 -927303 -1005782 -646378 -420142 -261094 144427 576631
35445E76631P887l50338l15326k03225j81058L9485L66081J80458m87873o46302
35435a013580J47589Q94750N94569k38197m55189l3129J29493k01723l27071J07697
35425c94791N17326L03939k58975m07394J32916P94796P82196j4404q36923r42988
35415c24302m68686n5273J32140L78851N74621K71822l38028m58468L6724L17942
35405F7343k8378l36965r8979J66597j4011j35884K42994M75061o6177o77991
35395d06390l95110L07243K84773k84514k26575N19728P24975p1241q24780o97126
35385a069017j77850L5399R9951L02344K91525j63344m55074l1084N91669N51760
35375b3721l6668l21015k5053K67561J01804k58066l52267j43612R2653J89858
$$ plain form
35445 576631 584518 234180 -81146 -284371 -465429 -425944 -59863 120595 -367278 -1013580
35435 -1013580 -865991 28759 623328 385131 -70058 -103187 26306 -175417 -502488 -394791
35425 -394791 122535 426474 167499 -239895 -106979 687817 1470013 1455609 618686 -324302
35415 -324302 -792988 -848261 -716121 -337270 237351 509173 171145 -287323 -250599 67343
35405 67343 38965 -298000 -396979 -230382 -244393 -380277 -137283 337778 271601 -406390
35395 -406390 -801500 -494257 -209484 -493998 -720573 -200845 524130 452889 -371891 -1069017
35385 -1069017 -1246867 -1211468 -1111517 -809173 -517648 -680992 -1136066 -1167150 -575481 -23721
35375 -23721 -60389 -381404 -406457 -138896 -37092 -295158 -647425 -791037 -698384 -508526
35365e08526J87741J48717M9427j34903l02881k64660L6505L98266N48420M09985
35355E68091Q8584k90257n73242n49871j89270J84136K47217J44717K54470N21169
35345D05744M63969m7712m72250l14510J74874L70474J25658j40514j31234l6598
35335C97901j11852k29091j09311J72342K39405k8327k98585k71588q1931J0906
35325c10131P6523K95553M61627J86392m04354o75839l22078K25210M06496J75706
35315A15105j56377l48473k94282k3717J67230l0088l89428l37193J15277K49668
35305i32278j99855m70989N4435P55462O56506p8509m59858j80945J48173J46666
35295e61192Q6229J36523P5859j03596r2987O9061j3986k71731j28433M44788
$$ plain form
35365 -508526 -320785 -172068 -122641 -257544 -560425 -825085 -788580 -390314 158106 568091
35355 568091 656675 366418 -206824 -756695 -945965 -761829 -514612 -369895 -115425 405744
35345 405744 869713 822001 349751 35241 210115 580589 706247 565733 434499 397901
35335 397901 286049 56958 -52353 119989 359394 331067 32482 -239106 -321037 -310131
35325 -310131 -233608 61945 523572 709964 305610 -370229 -692307 -467097 -60601 115105
35315 115105 -41272 -389745 -684027 -707744 -540514 -570602 -960030 -1297223 -1181946 -932278
35305 -932278 -1132133 -1603122 -1548687 -793225 -136719 -215228 -675086 -856031 -707858 -561192
35295 -561192 -474963 -338440 -262581 -366177 -459164 -390103 -404089 -675820 -804253 -359465
35285c59465O50076O1217o21140n62817L2175L50708J44335j52687k13996j34223
35275h05817m9254P3535K46945L73786L69663K20711k1925k04228j59518N2836
35265I6734J46110m6351l52564m65656k48525J71986M72455L56327q4931l40735
35255b95150r0290K99097K64574j06240k32329L5199K50010J63773M1715N5921
35245C86280Q781j25467k2091L40523M56971P0962l87137m88345l61569k05111
35235c26203J19429N47198N28600j06993o03281k93085L55390M70415R4560q3249
35225G02781M4418j7430l43225m68456k62079q7063p2230J2708J42740N9767p5114
35214c63183J49899N29743M06460j72306l83623K4607K77548j05352m77874j95754
$$ plain form
35285 -359465 290611 351828 -269312 -832129 -799954 -449246 -304911 -457598 -671594 -805817
35275 -805817 -855071 -781536 -534591 -160805 208858 429569 407644 203416 43898 96734
35265 96734 242844 196493 -156071 -621727 -870252 -698266 -225811 130516 45585 -295150
35255 -295150 -385440 -86343 178231 71991 -160338 -125139 124871 288644 330359 386280
35245 386280 395061 269594 247503 588026 1044997 1115959 728822 240477 -121092 -326203
35235 -326203 -206774 340424 869024 762031 158750 -134335 221055 691470 786030 702781
35225 702781 747199 729769 386544 -81912 -343991 -431054 -503284 -490576 -347836 -288069 -363183
35214 -363183 -213284 316459 722919 550613 166990 191597 469145 363793 -114081 -309835
35204c09835K64250J47218k69747j69330M11156O59393K92716j31516k10937j77207
35194E06161k44099k03315O6285K59644J35594p0040l3282J49507J26804k05309
35184D87950n69410n95951j85012L35297M75924J66919q4853J13419M10611K31796
35174G86690k47177l07062J34346L29448p7562m34018j62959K59283J12787l45985
35164D7791l46990O5787J47378k12324k68950K89211P45096M44450k34108n12305
35154A65036k93872p0361r1789j55269n2726J73306L41722K69049p3811l98248
35144a86963l18008J28646M59018L84119J21376o9122k12779k78016m1196L73662
35134C60737L82870j70089n69295k40933L22672L48351j1682r7995N6046p4491
$$ plain form
35204 -309835 -45585 101633 -168114 -337444 73712 733105 1025821 894305 683368 506161
35194 506161 262062 58747 125032 384676 520270 450230 416948 566455 693259 487950
35184 487950 -81460 -677411 -862423 -527126 -51202 115717 30864 144283 554894 786690
35174 786690 539513 232451 366797 696245 618683 184665 21706 280989 393776 47791
35164 47791 -299199 -233412 -86034 -298358 -567308 -278097 466999 911449 677341 165036
35154 165036 -128836 -199197 -290986 -446255 -498981 -325675 16047 285096 211285 -186963
35144 -186963 -504971 -376325 82693 466812 588188 519066 306287 28271 -12925 360737
35134 360737 743607 573518 4223 -236710 85962 434313 422631 324636 380682 306191
35124C06191l89792l26020K490m7293l58093j20887O26039P81249p1166q85801
35114d83083p41575j15291J69547K38654M99541N91090Q3709m75162l48411J10964
35104d70017J17902r5146K33057P92148N24342m87597r06638j95751N48289L41505
35094D02094k75443l05553J62810L54655J02676j30897j35580q2821j1757J56327
35084B36511K46274M3287k29717j61664J81669L06580J76m09803n44708l97913
35074g29308j88692l0120J43606M01449O16469M97957l8868n74596n49447n135
35064d56685L70437J19231l98058n48087k47160J01073K37915K34350K07400K10574
35054a69010K87418L41050J29416l03144m53542m7182L72249J30146m76992m98904
$$ plain form
35124 306191 -83601 -409621 -407131 -454424 -812517 -933404 -307365 473884 402718 -483083
35114 -483083 -1224658 -1339949 -1170402 -931748 -432207 158883 242592 -232570 -580981 -470017
35104 -470017 -352115 -447261 -214204 577944 1102286 614689 -291949 -487700 60589 402094
35094 402094 126651 -178902 -16092 338563 441239 310342 174762 91941 80184 236511
35084 236511 482785 526072 296355 134691 316360 622940 623116 213313 -331395 -729308
35074 -729308 -918000 -948120 -804514 -403065 213404 711361 672493 97897 -451550 -456685
35064 -456685 -86248 32983 -365075 -913162 -1160322 -1059249 -821334 -586984 -379584 -169010
35054 -169010 118408 459458 588874 285730 -167812 -214994 157255 287401 -189591 -688495
35044f88495K32603P74700M37958k47430l99750m4735J18220j41790l58304j88621
35034e05644J26785K18768Q4865k9744K257Q3253M0529j54628k71610l1733M54837
35023A7935O53000K46896l36683l94469J18997N05993K43972l58933o05101k57315
35013a65708K75211M73265K30263j34087k58371j06352M2535l8630k50593l38598
35003b71065k29788m9565J07608K25367K52393J68496J03522J36204N7289l18117
34993A82344o58015m13151L12747P32705M60580Q4385K34793N73072L46683l54077
34983A502066o73218k88934J28319l1141m58526n14049j83698N6576M0755L4437
34973c87413J52481J65253l0187j52070M8537L73116M20753J17396k18364k88330
$$ plain form
35044 -688495 -455892 318808 756766 509336 109586 64851 183071 41281 -317023 -505644
35034 -505644 -378859 -160091 -75226 -104970 -102713 -19460 21069 -133559 -405169 -436902 17935
35023 17935 670935 917831 581148 186679 305676 811669 1055641 696708 91607 -165708
35013 -165708 109503 582768 813031 678944 420573 314221 356756 318126 67533 -271065
35003 -271065 -500853 -550418 -442810 -217443 34950 203446 306968 443172 500461 182344
34993 182344 -475671 -888822 -576075 156630 617210 701595 936388 1509460 1856143 1502066
34983 1502066 828848 539914 668233 637092 178566 -335483 -519181 -462605 -421850 -387413
34973 -387413 -234932 -69679 -99866 -251936 -203399 169717 590470 707866 489502 201172
34963B01172j11631P9578Q2676j44746m40410m97149j40478L83669N75477K51546
34953B39704k15952l67524j73906J05278L49604N38685M71405r854n53407n63336
34943a79303l5187L50696J64943k01911j95622J03365K40216J15464j2363m7336
34933C02962j08616j59162j4450K83572M44792L07714k444k65959l21303j20599
34923C46507J54866J65396j65788m57853l60072n1314O0640m4536n8588J16573
34913b94169K83252L17435K57900J01853j41515k76683j36351J19888K20721J50134
34903F02465J4320k07320m34971l50545O8364K71814m8029l28058m9050K34306
34893b26704k12287q13123m05577P23574J040118J65301n00992o7829M88115J19339
$$ plain form
34963 201172 89541 169119 251795 107049 -333361 -830510 -970988 -587319 -11842 239704
34953 239704 23752 -343772 -517678 -412400 -62796 475889 947294 937440 384033 -179303
34943 -179303 -214490 136206 301149 99238 -96384 6981 247197 362661 350298 302962
34933 302962 194346 35184 20734 304306 749098 1056812 1054368 788409 467106 346507
34923 346507 501373 666769 500981 43128 -316944 -368258 -307618 -352154 -410742 -294169
34913 -294169 -10917 306518 564418 666271 524756 248073 111722 231610 452331 602465
34903 602465 616785 409465 -25506 -376051 -307687 -35873 -83902 -411960 -461010 -226704
34893 -226704 -438991 -1252114 -1657691 -934117 106001 271302 -229690 -297519 190596 309935
34883C09935n37990m00028J80294J46236m03160m96538J6837L78531K84226J46236
34873c75421J24089k4502j88334N827L70409L37693o8095l05288k82218l40045
34863g45885l58891Q9198O75600N17261l41030p34843p7520P32064O56941m5296
34853C67599l98019j04752K98962L11042p2768n14386n83899j08872M82634N09779
34843A87320m8618m14276p0675M76879M03814l02710q51046o21525J86669Q06028
34833b48140O45893j00784n81166k28914M86145O33772P8995l93798k62301Q7861
34823A17563J35908P3L1696J56019R9757q8744j84272j72034j45754r5299o4947
34812b10034j86892l18486q5038M29456N63055N2681m20992k02810L42941M61539
$$ plain form
34883 309935 -228055 -628083 -447789 -301553 -704713 -1201251 -1184414 -805883 -521657 -375421
34873 -375421 -251332 -275834 -464168 -458341 -87932 249761 181666 -123622 -405840 -745885
34863 -745885 -1104776 -1015578 -339978 177283 -163747 -898590 -976110 -244046 412895 367599
34853 367599 -30420 -135172 163790 474832 402064 -112322 -696221 -805093 -322459 187320
34843 187320 138702 -275574 -346249 130630 534444 231734 -619312 -1240837 -1054168 -248140
34833 -248140 397753 296969 -284197 -513111 -26966 606806 685801 292003 29702 117563
34823 117563 253471 253544 285240 441259 541016 452272 268000 95966 -49788 -145087 -210034
34812 -210034 -396926 -715412 -800450 -370994 192061 244742 -176250 -379060 -36119 425420
34802D25420J62057l1963r8679l76893o46794l59726K43676K77236l52322o60726
34792a418714j22224M66502K73459k48262j78861L27234L50712k07864m35198
34783a193216J08162O90012N78731J10543m636J59978M5550k92307k48060K23173
34773A77930M14624M610l73831j29919L36180K74903k57443n67020l98234j39206
34763f57406m4297N7527K31261K55701J19021J17612K75837K25614j02345k36135
34753B42390O0289L14847R1846k77457k57125j1659r8981m88769n87715k11300
34743a223634J35439Q8413m2507J42674M68767N14225L31273L48486O00885N50793
34733A914814j07028q31341q49139k27428J95720O648k47739k3581L07048J09723
$$ plain form
34802 425420 587477 555514 456835 79942 -566852 -926578 -682902 -405666 -757988 -1418714
34792 -1418714 -1540938 -1074436 -800977 -1049239 -1228100 -900866 -550154 -758018 -1193216
34783 -1193216 -1085054 -395042 183689 294232 289596 449574 495124 202817 -45243 177930
34773 177930 592554 597164 223333 93414 429594 704497 447054 -119966 -518200 -657406
34763 -657406 -701703 -644176 -412915 -157214 -38193 79419 355256 580870 478525 242390
34753 242390 302679 617526 709372 431915 174790 163131 64150 -424619 -1012334 -1223634
34743 -1223634 -1088195 -999782 -1042289 -899615 -430848 83377 414650 763136 1364021 1914814
34733 1914814 1807786 976445 127306 -100122 95598 102246 -145493 -169074 137974 247697
34723B47697l74581l70211J30103L22623o2808k98675J24154O42029N09090j06084
34713G63337n10882m72803k15872J39859N13933N84039J95767k06015j46150J20422
34703G65635J4228m19494o00965l11969J18042M19646N68266M46408l6617n05287
34693D57893m42074N17J37805k05274m35104j67355J61199N381m49800n85576
34683a522388j91304L69754O81918O62081M68022K26388o9553l85055m55736l1107
34673b46980O09741P56484J71741m64399m45190k7064N3263k39203k93954K8831
34663i6730J72470j42132m99505n48853m63248l77606n7464N21924Q86517P54298
34653A49671M79215M16349L60878L2572l67562n19212m61383l10311K6609M34970
$$ plain form
34723 247697 -126884 -497095 -366992 -44369 -107177 -405852 -281698 360331 869421 763337
34713 763337 252455 -220348 -436220 -296361 217572 801611 997378 791363 645213 765635
34703 765635 779863 360369 -240596 -552565 -434523 -14877 553389 999797 963180 457893
34693 457893 15819 16336 154141 -51133 -486237 -653592 -492393 -487012 -936812 -1522388
34683 -1522388 -1713692 -1343938 -662020 61 468083 694471 624918 239863 -215873 -246980
34673 -246980 362761 1119245 1290986 826587 381397 354333 407596 168393 -125561 -96730
34663 -96730 75740 -66392 -565897 -1114750 -1577998 -1955604 -2013068 -1491144 -604627 149671
34653 149671 628886 1045235 1406113 1438685 1071123 551911 90528 -219783 -193174 241796
34643B41796M20087j31268n30511k35103K71506K49562j02386p0653K92304K90984
34633F96318j32174k62219J21366L07931j64748p01203n29051J87385O59207N26908
34623G09720J01817k18773l34840l28153k85156k40266j64379n4309l4168j87687
34613a036194l03966r3670K92553L45188m5287l18239k9281M48295M29194j07822
34603d19229n27007m27828n3849K19842L45013L77960K05379j88211m44431k30095
34593a142456J82537J73847l01914m94075J29310R69148R37515m2450p91645l87281
34583g67464O03058R13105K77116l56703k78583O1992r1605o11757p23770j74529
34573a149140M36051N07976J52099j08403j9657K28149L14455R5058k87296m78482
$$ plain form
34643 241796 661883 530615 104 -234999 36507 286069 183683 113030 405334 696318
34633 696318 564144 301925 423291 731222 566474 -134729 -663780 -476395 182812 709720
34623 709720 811537 592764 257924 -70229 -355385 -595651 -760030 -814339 -848507 -1036194
34613 -1036194 -1340160 -1433830 -1141277 -796089 -841376 -1159615 -1188896 -740601 -311407 -419229
34603 -419229 -946236 -1374064 -1427913 -1208071 -863058 -485098 -279719 -467930 -912361 -1142456
34593 -1142456 -959919 -786072 -1087986 -1582061 -1452751 -483603 453912 411462 -380183 -767464
34583 -767464 -164406 748699 1025815 669112 390529 452521 360916 -250841 -974611 -1149140
34573 -1149140 -713089 -205113 -53014 -161417 -181074 47075 361530 456588 169292 -309190
34563c09190k29585K50367M25896Q5506l18377k39625J91295L38979j5901l69336
34553a89971k62175P3296J67230P0462J72118M39154M10883j7339l48813k15306
34543B99539J01984J58771k2302j46015j61146j91846j78919q268J51473O6642
34533F9913r4063M9104M40000N68567J82822l52032n28401k38979K42829N49044
34523H88804M25778n0192m17344l08694J253o2995m56315m79730J41901P39581
34513D22047O33414O0430l24546m12513m89583m90881j42801L39910M54246K50267
34503B99990K31512L90505J37409o14084j066119o34880J95738N79914L64876
34494a15139l1759l40289m91970l16455K22416P04752O97079L54414J20794L8779
$$ plain form
34563 -309190 -538775 -288408 137488 222994 -95383 -335008 -143713 195266 179365 -189971
34553 -189971 -452146 -378850 -211620 -141158 30960 470114 880997 863658 514845 299539
34543 299539 401523 560294 537992 391977 230831 38985 -139934 -148202 3271 69913
34533 69913 -24150 24954 464954 1033521 1216343 864311 335910 96931 339760 888804
34523 888804 1314582 1264390 847046 538352 539605 476610 20295 -459435 -317534 422047
34513 422047 1055461 1115891 791345 378832 -110751 -601632 -744433 -404523 49723 299990
34503 299990 531502 922007 1059416 445332 -620787 -1255667 -1059929 -480015 -115139
34494 -115139 -146898 -487187 -979157 -1295612 -1073196 -368444 328635 683049 803843 842622
34484H42622j32777l21775k68955j25962k73377n65866m37673J47717N23195L00566
34474c12285q9307j30483O2817J30596Q2810J09067J54093R6172L3769K7867j04941
34463F0175l68341l47395J33247N04843K20587k92363j96633M10044N67721o6453
34453F25432o68328m85505J14168L29726J03124p187K03026L70425K14479j24819
34443F74541m06485n27449m01534J9315M89206N52289P3636n09157o48284k84366
34433i68288J69726L52857K82311J68634R1049k3631j79299k37728j18043N6432
34423d05980J28815J47496K66330M25680L44478p8038n21234n66015j80806K65745
34413a73529M38907L36948J55714N417j51024l38081m43342l01035R5358N02518
$$ plain form
34484 842622 709845 388070 119115 -6847 -280224 -846090 -1283763 -1136046 -612851 -312285
34474 -312285 -401592 -532075 -469258 -338662 -255852 -146785 7308 103480 137249 165116 60175
34463 60175 -308166 -655561 -522314 -17471 203116 -89247 -285880 124164 691885 625432
34453 625432 -42896 -528401 -414233 -84507 18617 11430 214456 584881 799360 674541
34443 674541 268056 -259393 -660927 -641612 -152406 399883 473519 -35638 -683922 -968288
34433 -968288 -798562 -445705 -163394 5240 96289 72658 -106641 -344369 -462412 -405980
34423 -405980 -277165 -129669 136661 562341 906819 828781 307547 -258468 -439274 -173529
34413 -173529 265378 602326 758040 763457 612433 274352 -168990 -470025 -374667 127851
34403A27851O18129L81166K5946j81522j82590o9196Q5570K17569J84782j09440
34393A098265m90773n99028l02403R3291J80173p2633l16061k74955m4963J16986
34383f12101J53871K13397L46564L88673K16580q889k3219J43907J41129k30528
34373G29384o51218n95875j0110N42776N29770Q4243k09331q9278R7513m7282
34363C80592l83693m26273k6184L92570L41525j36134m98267l11340K55528O02419
34353A90743L61432k02071n30110m13896j05556J50565L75731N55372M47409j9433
34343H10186m25310l28341R1149K61235J7801k53286k61786j44677p0964L4093
34333b69900J90830J87591n8127k75090k12890J7632J74478J92022Q9844j23325
$$ plain form
34403 127851 745980 1127146 1153092 971570 788980 719784 805354 1022923 1207705 1098265
34393 1098265 607492 8464 -293939 -200648 -20475 -93108 -409169 -684124 -729087 -612101
34383 -612101 -458230 -244833 101731 490404 706984 698095 674876 818783 959912 729384
34373 729384 78166 -517709 -527819 14957 544727 628970 419639 330361 427874 380592
34363 380592 -3101 -429374 -455558 -62988 278537 142403 -355864 -667204 -411676 190743
34353 190743 552175 350104 -180006 -593902 -699458 -548893 -173162 382210 829619 810186
34343 810186 384876 56535 147684 408919 426720 173434 -88352 -233029 -303993 -269900
34333 -269900 -79070 108521 50394 -224696 -437586 -419954 -245476 -53454 36390 -86935
34323h6935k78073j19971K41703L48296R1778n6636J55886K58426j52684o06500
34313b04710m17402J98012M31388J17351j33471R379J74717J9365k83231m31986
34303e20588l36439J1985M84583O34779J76566l80103k89222K32853K39922l90158
34293a35822o53990m7108N57696L10662k78252k87267R2979M1223l94224m08831
34283a202934J64371O35176O08485M14635L04092O9681l35443n41058l72146j18676
34273c73817J7842J85828L90580L12127j05428l87260j81949K11283K84697j6661
34263C37242l45098m12035j92689J15524K18246L1710j19327O8622K93395q475
34253a2885o94069r25233l66635K83829L50117J30244K23826M55755K45556k68060
$$ plain form
34323 -86935 -365008 -484979 -243276 105020 196798 140162 296048 554474 401790 -204710
34313 -204710 -622112 -424100 7288 124639 -8832 547 175264 194629 -88602 -520588
34303 -520588 -857027 -845042 -360459 274320 450886 70783 -218439 14414 254336 -135822
34293 -135822 -789812 -836920 -279224 31438 -246814 -534081 -441102 -399879 -794103 -1202934
34283 -1202934 -1038563 -403387 205098 619733 923825 993506 658063 117005 -255141 -373817
34273 -373817 -355975 -170147 220433 532560 427132 39872 -142077 69206 353903 337242
34263 337242 -7856 -419891 -612580 -497056 -278810 -247100 -366427 -297805 -4410 -12885
34253 -12885 -706954 -1632187 -1998822 -1714993 -1364876 -1234632 -1010806 -555051 -309495 -577555
34243e77555l35314K05941O27183L78817j78887m03033k24832j4965N0273P2516
34233c99856O5666q6151l11211l11368K8311L68159K54959k68034n80854j81827
34223a422206O14176R26912L37226n73582q92921m05465K90806N72492L87354
34214a65208P8753p5023k8659J19532K31176K21678J32858O5250L0497l6128j10909
34203D63817o1162J50810L46017L03322K0800k61807l05775j15970P8303R5416
34193G13771Q682M455P7454L5449j66464l08045k32356q4921n2105o4235J950
34182f6365J9690j61899l34228j80531J47004J66789j58660k79797J08892N52326
34172a86779M93102Q9659p1589J26692K18172r0221m89754n25819j80824J72660
$$ plain form
34243 -577555 -912869 -706928 -79745 299072 120185 -282848 -507680 -522645 -472372 -399856
34233 -399856 -334190 -420341 -731552 -1042920 -1014609 -646450 -391491 -659525 -1240379 -1422206
34223 -1422206 -808030 118882 456108 -117474 -1010395 -1415860 -1125054 -552562 -165208
34214 -165208 -86455 -161478 -190137 -70605 160571 382249 515107 580357 610854 574726 463817
34203 463817 402655 553465 899482 1202804 1223604 961797 656022 540052 618355 713771
34193 713771 722453 726908 804362 839811 673347 365302 132946 48025 -4080 -68315 -66365
34182 -66365 -46675 -208574 -542802 -723333 -576329 -409540 -568200 -847997 -739105 -186779
34172 -186779 306323 395982 324393 451085 669257 579036 89282 -436537 -617361 -444701
34162d44701K33757M2386j33637r0592J05951K02447P8558q1767m7977J06138
34152b9437J00974j14061k58803j42256L1857k8485k29200j99842J14116K69280
$$ plain form
34162 -444701 -210944 -168558 -302195 -392787 -286836 -84389 -5831 -87598 -135575 -29437
34152 -29437 71537 -42524 -301327 -443583 -411726 -440211 -669411 -869253 -755137 -485857
$$ [...]
##END NTUPLES=NMR SPECTRUM
##END=
