##TITLE=31Pdec_DPAH47-2
 CDCl3, 124 sc
 6.4.2022
##JCAMPDX= 6.0         $$ Bruker NMR JCAMP-DX V2.0
##DATA TYPE= NMR SPECTRUM
##DATA CLASS= NTUPLES
##ORIGIN= UXNMR, Bruker Analytische Messtechnik GmbH
##OWNER= root
$$ XWIN-NMR		Version 3.5
$$ Wed Apr  6 11:14:20 2022 Russian Standard Time (UT+4h)  she@DPX200
##.OBSERVE FREQUENCY= 81.013821
##.OBSERVE NUCLEUS= ^31P
##.ACQUISITION MODE= SIMULTANEOUS
##.ACQUISITION SCHEME= undefined
##.AVERAGES= 124
##.DIGITISER RES= 16
##SPECTROMETER/DATA SYSTEM= spect
##.PULSE SEQUENCE= zgpg30
##.SOLVENT NAME= CDCl3
##.SHIFT REFERENCE= (INTERNAL, CDCl3, 0, 248.564)
##AUDIT TRAIL= $$ (NUMBER, WHEN, WHO, WHERE, WHAT)
$$ ##TITLE= Audit trail, XWIN-NMR		Version 3.5
$$ ##JCAMPDX= 5.01
$$ ##ORIGIN= Bruker BioSpin GmbH
$$ ##OWNER= she
$$ F:/spectra/data/she/nmr/P31/1/pdata/1/auditp.txt
$$ ##AUDIT TRAIL=  $$ (NUMBER, WHEN, WHO, WHERE, WHAT)
(   1,<2022-04-06 11:13:24.48 +0400>,<she>,<DPX200>,
      <continue with go, POWCHK disabled, PULCHK disabled
       configuration hash MD5:
       00 E9 B6 7A A2 85 ED C7 34 08 36 98 17 FE 4E 26
       data hash MD5: 32K
       88 87 1E 6D ED 70 8B 25 F8 A3 97 40 35 10 C1 68>)
(   2,<2022-04-06 11:13:26.48 +0400>,<she>,<DPX200>,
      <Start of raw data processing
       efp BC_mod = 2 LB = 1 FT_mod = 6 PKNL = 1 PHC0 = -9548.301 PHC1 = 125.8756 SI = 64K 
       data hash MD5: 64K
       A5 A5 05 8A 1C 55 9D 0E 31 C5 86 F7 65 57 04 BA>)
(   3,<2022-04-06 11:13:46.79 +0400>,<she>,<DPX200>,
      <pk PHC0 = 4.221427 PHC1 = 0 
       data hash MD5: 64K
       F5 8A D4 77 4E 5A BF 12 1B FE 6B 03 CF C1 76 15>)
(   4,<2022-04-06 11:13:52.50 +0400>,<she>,<DPX200>,
      <abs ABSG = 5 
       data hash MD5: 64K
       71 AA D1 60 DD 1E 85 2A 75 62 FD 75 10 12 AD AB>)
$$ ##END=
$$ 
$$ hash MD5
$$ 30 DD 69 C4 95 14 C6 76 AC B4 17 FB C1 4A 88 4E
##$RELAX= 
##$RELAX= 
##$RELAX= 
##$RELAX= 
##$RELAX= 
##$RELAX= 
##$RELAX= 
##$RELAX= 
$$ Bruker specific parameters
$$ --------------------------
##$DU= <F:/spectra>
##$EXPNO= 1
##$NAME= <P31>
##$PROCNO= 1
##$TYPE= <nmr>
##$USER= <she>
##$AMP= (0..31)
100 100 100 100 100 100 100 100 100 100 100 100 100 100 100 100 100 100 
100 100 100 100 100 100 100 100 100 100 100 100 100 100 
##$AQSEQ= 0
##$AQ_mod= 1
##$AUNM= <au_zg>
##$AUTOPOS= <>
##$BF1= 81.014009
##$BF2= 200.13
##$BF3= 200.13
##$BF4= 200.13
##$BF5= 200.13
##$BF6= 200.13
##$BF7= 200.13
##$BF8= 200.13
##$BYTORDA= 1
##$CFDGTYP= 0
##$CFRGTYP= 5
##$CHEMSTR= <none>
##$CNST= (0..31)
1 1 145 1 1 1 1 1 1 1 1 1 1 1 1 1 1 1 1 1 1 1 1 1 1 1 1 1 1 1 1 1 
##$CPDPRG= <waltz16>
##$CPDPRG1= <>
##$CPDPRG2= <waltz16>
##$CPDPRG3= <>
##$CPDPRG4= <mlev>
##$CPDPRG5= <mlev>
##$CPDPRG6= <mlev>
##$CPDPRG7= <mlev>
##$CPDPRG8= <mlev>
##$CPDPRGB= <>
##$CPDPRGT= <>
##$D= (0..31)
0 1 0 0 0 0 0 0 0 0 0 0.03 2e-05 3e-06 0 0 0 0 0 0 0 0 0 0 0 0 0 0 0 0 
0 0 
##$DATE= 1649229024
##$DBL= (0..7)
120 120 120 11 120 120 24 19 
##$DBP= (0..7)
150 150 150 150 150 150 150 150 
##$DBP07= 0
##$DBPNAM0= <>
##$DBPNAM1= <>
##$DBPNAM2= <>
$$ [...]
##$SUBNAM3= <"">
##$SUBNAM4= <"">
##$SUBNAM5= <"">
##$SUBNAM6= <"">
##$SUBNAM7= <"">
##$SUBNAM8= <"">
##$SUBNAM9= <"">
##$SW= 501.771253377433
##$SWIBOX= (0..15)
0 1 3 0 0 0 0 0 0 0 0 0 0 0 0 0 
##$SW_h= 40650.406504065
##$TD= 32768
##$TD0= 1
##$TE= 0
##$TE2= 300
##$TE3= 300
##$TEG= 300
##$TL= (0..7)
0 120 53 12 22 120 120 120 
##$TP= (0..7)
150 150 150 150 150 150 150 150 
##$TP07= 0
##$TPNAME0= <>
##$TPNAME1= <>
##$TPNAME2= <>
##$TPNAME3= <>
##$TPNAME4= <>
##$TPNAME5= <>
##$TPNAME6= <>
##$TPNAME7= <>
##$TPOAL= (0..7)
0.5 0.5 0.5 0.5 0.5 0.5 0.5 0.5 
##$TPOFFS= (0..7)
0 0 0 0 0 0 0 0 
##$TUNHIN= 0
##$TUNHOUT= 0
##$TUNXOUT= 0
##$USERA1= <user>
##$USERA2= <user>
##$USERA3= <user>
##$USERA4= <user>
##$USERA5= <user>
##$V9= 5
##$VALIST= <valist>
##$VCLIST= <CCCCCCCCCCCCCCC>
##$VD= 0
##$VDLIST= <DDDDDDDDDDDDDDD>
##$VPLIST= <PPPPPPPPPPPPPPP>
##$VTLIST= <TTTTTTTTTTTTTTT>
##$WBST= 1024
##$WBSW= 4
##$XGAIN= (0..3)
0 0 0 0 
##$XL= 0
##$YL= 0
##$YMAX_a= 4491
##$YMIN_a= -9561
##$ZGOPTNS= <>
##$ZL1= 120
##$ZL2= 120
##$ZL3= 120
##$ZL4= 120
##$ABSF1= 248.5645
##$ABSF2= -253.2056
##$ABSG= 5
##$ABSL= 3
##$ALPHA= 0
##$AQORDER= 0
##$ASSFAC= 0
##$ASSFACI= 0
##$ASSFACX= 0
##$ASSWID= 0
##$AUNMP= <proc_1d>
##$AZFE= 0.1
##$AZFW= 0.5
##$BCFW= 0
##$BC_mod= 2
##$BYTORDP= 0
##$COROFFS= 0
##$CY= -3
##$DATMOD= 1
##$DC= 0
##$DFILT= <>
##$DTYPP= 0
##$F1P= 0
##$F2P= 0
##$FCOR= 1
##$FTSIZE= 65536
##$FT_mod= 6
##$GAMMA= 0
##$GB= 0
##$INTBC= 1
##$INTSCL= 5.30512e-09
##$ISEN= 30
##$LB= 1
##$LEV0= 0
##$LPBIN= 0
##$MAXI= 10000
##$MC2= 0
##$MEAN= 0
##$ME_mod= 0
##$MI= 50
##$NCOEF= 0
##$NC_proc= -7
##$NLEV= 6
##$NOISF1= 182.463
##$NOISF2= 159.3651
##$NSP= 0
##$NTH_PI= 0
##$NZP= 0
##$OFFSET= 248.5645
##$PC= 4
##$PHC0= -9544.079
##$PHC1= 125.8756
##$PH_mod= 1
##$PKNL= yes
##$PPARMOD= 0
##$PSCAL= 0
##$PSIGN= 0
##$REVERSE= no
##$SF= 81.014009
##$SI= 65536
##$SIGF1= 159.3651
##$SIGF2= -187.1042
##$SINO= 113.3802
##$SIOLD= 16384
##$SREGLST= <1H.CDCl3>
##$SSB= 0
##$STSI= 65536
##$STSR= 0
##$SW_p= 40650.406504065
##$SYMM= 0
##$S_DEV= 0
##$TDeff= 32768
##$TDoff= 0
##$TI= <>
##$TILT= no
##$TM1= 0
##$TM2= 0
##$TOPLEV= 0
##$USERP1= <user>
##$USERP2= <user>
##$USERP3= <user>
##$USERP4= <user>
##$USERP5= <user>
##$WDW= 1
##$XDIM= 65536
##$YMAX_p= 312594412
##$YMIN_p= -57335398
$$ End of Bruker specific parameters
$$ ---------------------------------
##NTUPLES= NMR SPECTRUM
##VAR_NAME=  FREQUENCY,     SPECTRUM/REAL,   SPECTRUM/IMAG
##SYMBOL=    X,             R,               I
##VAR_TYPE=  INDEPENDENT,   DEPENDENT,       DEPENDENT
##VAR_FORM=  AFFN,          ASDF,            ASDF
##VAR_DIM=   65536,         65536,           65536
##UNITS=     HZ,            ARBITRARY UNITS, ARBITRARY UNITS
##FACTOR=    0.620285442955139, 1,           1
##FIRST=     20137.2065510759, 0,            0
##LAST=      -20513.1999529892, 0,           0
##MIN=       -20513.1999529892, -57335398,   0
##MAX=       20137.2065510759, 312594412,    0
$$ Real data points
##PAGE= N=1
##DATA TABLE= (X++(R..R)), XYDATA
$$ [...]
##PAGE= N=2
##DATA TABLE= (X++(I..I)), XYDATA
13015F352916K03237m875751l028789Q99467J554298M30791Q76383J397190q18306
13006B991436l589248k796759N57822J974308O81619j94690K71531O4630p88225
12997h27576j5769J902791J909402J3779o86394k79001k239009n910684n467509
12988a1599970O20567N481058L598781q87545j036923K363398L359463O26491
12980B525320j867095k071604j495563p40249P60938J308762r65874l129862p56186
12971f431413L844091L551725k270801n634735j851415L314586K898455q71669
12963c451176j483885R81372J033209k358157m204362j706443K078414L765999
12955e345029L776683L423206K170017k16739k123980k566771k489949k241383
$$ plain form
13015 6352916 6556153 1680402 -1348387 -448920 1105378 1536169 2412552 3809742 2991436
13006 2991436 -597812 -3394571 -2836749 -862441 -180822 -375512 -103981 -39351 -827576
12997 -827576 -843345 1059446 2968848 2982627 2296233 2017232 -221777 -6132461 -11599970
12988 -11599970 -10979403 -5498345 -1899564 -2787109 -3824032 -1460634 1898829 2525320
12980 2525320 658225 -1413379 -2908942 -3649191 -2888253 -1579491 -2545365 -5675227 -6431413
12971 -6431413 -2587322 964403 -1306398 -6941133 -8792548 -5477962 -2579507 -3451176
12963 -3451176 -4935061 -3953689 -2920480 -5278637 -9482999 -11189442 -9111028 -5345029
12955 -5345029 -1568346 1854860 4024877 3808138 1684158 -882613 -3372562 -5613945
12947e613945o91757J709136K252857K68831j121338J32944J685190J227032Q11439
12938F60389K728012M102073R14053m412272n433887j331418J937107R58707p27692
12929f04928K85322J592613J11761j875214o54223K248963K504238N5216j381404
12920B282344q85864j347771l761561n005593k481825K236815N520463N238771
12912A795779J888676j679699j905608J647986M649049L074632r29873k053282
12904F487660O9065P18376j749309l399848j996395q28078k197427k748272K27581
12895e416647K789404M45655l452853k074096M173561P962254N470574L26753
12887A0224605l044560m186263l775143j455143J650160K625102R05273o89606
$$ plain form
12947 -5613945 -6305702 -4596566 -2343709 -2074878 -3196216 -3063272 -1378082 -151050 660389
12938 660389 3388401 7490474 8404527 3992255 -1441632 -2773050 -835943 122764 -604928
12929 -604928 -319606 1273007 1384768 -490446 -1144669 1104294 3608532 3663748 2282344
12920 2282344 1396480 48709 -3712852 -8718445 -11200270 -8963455 -3442992 1795779
12912 1795779 3684455 2004756 99148 1747134 6396183 9470815 8540942 6487660
12904 6487660 6556725 7275101 5525792 2125944 129549 -698529 -2895956 -5644228 -5416647
12895 -5416647 -2627243 -2181588 -5634441 -7708537 -3534976 4427278 9897852 10224605
12887 10224605 7180045 2993782 -781361 -2236504 -586344 2038758 2944031 2254425
12879B254425l49826O48041J050881J079724J56621k476777m142052r36348M959808
12870B244497O027971J78457n105281l318922J887411L120881m387k462820k326396
12861B41411j351662j6027J672611R68630l372703n998686j519748N557660N823503
12852B004989o21541l842722N82344N165316K866691k582543l985217j548532
12844a961215j63028o02496Q0325K180085L056629J818672J27379n07484N38113
12835D566980L030309M415581J295069n106593q510749n660816q58827J153579
12827e675467K161025N205454O915899K256956n724630q570396m082521J585424
12819e928256L465446K764414J649628m05334l096651l594826j002235J504232
$$ plain form
12879 2254425 1904599 2552640 3603521 4683245 4839866 2363089 -1778963 -2715311 2244497
12870 2244497 8272468 8450925 3345644 26722 1914133 5035014 5030627 2567807 241411
12861 241411 -1110251 -1126278 546333 1514963 -1857740 -7856426 -9376174 -3818514 2004989
12852 2004989 1383448 -2459274 -1876930 3288386 6155077 3572534 -412683 -1961215
12844 -1961215 -2124243 -2726739 -2646414 -466329 2590300 4408972 4536351 4028867 4566980
12835 4566980 7597289 12012870 13307939 8201346 -309403 -5970219 -6829046 -5675467
12827 -5675467 -3514442 1691012 8606911 10863867 5139237 -3431159 -7513680 -5928256
12819 -5928256 -2462810 301604 1951232 1545898 -1550753 -5145579 -6147814 -4643582
12811d643582J212478o29108j426023m42549J640086L525819L172335m2912k911282
12802e44738j725133K005819L337481J407747J59334R29122J04381l770120o117227
12793d213334k974436K769285N381411L302081q65256m257087m747516j146226
12785f751078M429407O917893L972593q85075l044555k243754j028112n48732
12777H18587m30017m46841j26395J088452J875663K18649k365688j906685J242755
12768c1520J838228j693864l951744j367337J778649R48284j133417n66956J18793
12759d060884k047697k535023L260487R072949N416491m120488o403338J172315
12751b45188O533974J879104m981336m058585J868225L633812N7057k574689j356649
$$ plain form
12811 -4643582 -3431104 -4060212 -5486235 -5928784 -4288698 -762879 2409456 2366544 -544738
12802 -544738 -2269871 -264052 3073429 4481176 4640510 5569632 5674013 1903893 -4213334
12793 -4213334 -7187770 -4418485 962926 4265007 3399751 -857336 -5604852 -6751078
12785 -6751078 -2321671 4596222 8568815 7683740 4639185 2395431 1367319 818587
12777 818587 388570 -58271 -184666 903786 2779449 2998098 632410 -1274275 -31520
12768 -31520 1806708 112844 -3838900 -5206237 -3427588 -2479304 -3612721 -4179677 -4060884
12759 -4060884 -6108581 -8643604 -5383117 3689832 9106323 4985835 -1417503 -245188
12751 -245188 6288786 8167890 3186554 -872031 996194 4630006 4687063 2112374 755725
12742G55725N94952M66030j270315l138777l688633j639879J722541K539887o9430
12733c727899j511569J382683M393316J967197l575754n038098j050946K648952
12725d512118K450942J023776J141733J308547j8590p89686P32133K129416N39109
12716D005262k406529l029810j268321k21976r53151j331520n6778J374308J384613
12707b503902M05555n56385j120169n44525J816939L940565K176652k934711n184119
12698d504100o61689N563999N699954L21147k961269j335727J31242j306906j037931
12689i1280L373642N285129j052335r113761p770037K313446R188317O155239
12681H288360r16491m040352k792242p37354Q69486J835605O85352k397055m024463
$$ plain form
12742 755725 1350677 1816707 546392 -2592385 -6281018 -7920897 -6198356 -3658469 -3727899
12733 -3727899 -5239468 -3856785 536531 2503728 -1072026 -6110124 -7161070 -4512118
12725 -4512118 -2061176 -1037400 104333 1412880 1394290 604604 1336737 3466153 4005262
12716 4005262 1598733 -1431077 -2699398 -2921374 -3874525 -5206045 -5262823 -3888515 -2503902
12707 -2503902 -2098347 -2654732 -3774901 -4319426 -2502487 1438078 3614730 680019 -4504100
12698 -4504100 -5165789 398210 6098164 6419311 3458042 2122315 2253557 946651 -91280
12689 -91280 3282362 8567491 7515156 -1598605 -9368642 -7055196 2133121 8288360
12681 8288360 7371869 3331517 539275 -198079 671407 2507012 3192364 795309 -3229154
12672c229154k237527O02978K021459K886417M164530M065416J415178j518871
12664H170426k530804k684966l331239l212076j415184N9200k42816k82057J807391
12655c662125L942846L098120l72354l901456n496942l574199K096824P189659
12647f79627N563485j701534n561952j470354L467959J537716l497091l253643
12639e595041J254630K143423j542223k861630N77079L054479J108131j248162
12631c109314k61809K032694K965632L345493L348582M65194m838490o943212
12623b995230k792431K634959K930210j005048l051295m23947L727426N140016
12615D164660K897099o57941k778213k882948k332634j703485q7604J774162P68976
$$ plain form
12672 -3229154 -5466681 -4863703 -2842244 44173 4208703 8274119 9689297 8170426
12664 8170426 5639622 2954656 -376583 -3588659 -5003843 -4944643 -5187459 -5469516 -3662125
12655 -3662125 280721 3378841 3006487 -894969 -6391911 -9966110 -7869286 -679627
12647 -679627 4883858 3182324 -2379628 -3849982 -382023 1155693 -2341398 -5595041
12639 -5595041 -4340411 -2196988 -3739211 -6600841 -6023762 -2969283 -1861152 -3109314
12631 -3109314 -3371123 -1338429 1627203 4972696 8321278 8786472 3947982 -2995230
12623 -2995230 -5787661 -3152702 -222492 -1227540 -4278835 -4702782 -975356 4164660
12615 4164660 7061759 6403818 3625605 742657 -1589977 -3293462 -3381066 -1606904 -837928
12606h37928l259500m941101p32274M552648M606022J702394K037581L825743
12598F953585L14365o268889n837244K515289O954140J112482n850275m309584
12590d416131J414459K472136q0524n21946k93737l195211m952796J59721O742308
12581b671721N133349j896259k668899L944345O385391l41004o622124m338445
12573c075367O42488m82554m734413k785287N744642J1145468O736389l041207
12565A0150159q553722n823830j09713R72950k882993m293545J063921P158468
12557b318305N689361j642124n728071l401165k69715l2404M84915L302892M424462
12548E09846J208907k021915p90933K195207J657431j985212l730381j092515
$$ plain form
12606 -837928 -4097428 -9038529 -9770803 -5218155 -612133 1090261 3127842 6953585
12598 6953585 7267950 999061 -4838183 -2322894 4631246 5743728 -106547 -4416131
12590 -4416131 -3001672 -529536 -610060 -1132006 -1425743 -4620954 -9573750 -9414029 -2671721
12581 -2671721 2461628 565369 -2103530 1840815 8226206 7885202 1263078 -3075367
12573 -3075367 -2432879 -2915433 -7649846 -10435133 -4690491 6454977 13191366 10150159
12565 10150159 1596437 -4227393 -4337106 -3364156 -6247149 -10540694 -9476773 -2318305
12557 -2318305 3371056 1728932 -3999139 -7400304 -7670019 -7702423 -7217508 -3914616 509846
12548 509846 1718753 -303162 -1094095 1101112 2758543 773331 -2957050 -4049565
12540d049565L398712N180910J563506n007316p452759j830224N760482N943079
12532C506825m05123l460266l26539P34804m213226o496535L16029P627150M682267
12523A965386l685461m751814J891697N260961J636060j200673J259178L647215
12515F022549J474422j903827k568252j862925j675313j081337l37479j522093
12507c454255l196680j223309L482998N227446K973970J574820K065345j28715
12499G321620m847778n237961k15131J699489l091294n581886Q50699P880602
12491a221640N239021k154759k566900L221546M695242Q8165k292110l39863j330022
12482C338680o766128p683195q4153O624106L727613l417138m275832J246633
$$ plain form
12540 -4049565 -650853 4530057 6093563 1086247 -6366512 -8196736 -2436254 3506825
12532 3506825 3101702 -358564 -685103 49701 -4163525 -10660060 -10344031 -2716881 1965386
12523 1965386 -1720075 -6471889 -4580192 680769 2316829 1116156 2375334 6022549
12515 6022549 7496971 5593144 3024892 1161967 -513346 -1594683 -1932162 -3454255
12507 -3454255 -6650935 -7874244 -4391246 836200 3810170 5384990 7450335 7321620
12499 7321620 2473842 -2764119 -2979250 -1279761 -4371055 -9952941 -9102242 -1221640
12491 -1221640 4017381 1862622 -704278 2517268 7212510 7300675 5008565 4668702 3338680
12482 3338680 -3427448 -11110643 -11194796 -4570690 -843077 -4260215 -8536047 -7289414
12474g289414M705104K514060r21362j810463j446623j747202j714419K37948
12466g472371L487431N769393N079334J150844l766140o280792n114020k136142
12458i282463M40641K262281L427156L152537J467781K65638P45574J415540N05880
12449D400565j173917j784804j457177j546637j947936j420600j7350R18289J020267
12440c009300J365756K450277L000914J350702k396222n756921n674601j568895
12432a0238290L478823N470627L501207K49937j261969l26976J605065K317094
12424D795518M74896k600666l524794j008486J771189J495992j45077N87116K684883
12415D530571J748662k073477l534871q54492J392777K59456r98334K72817J075943
$$ plain form
12474 -7289414 -2584310 -70250 -991612 -2802075 -4248698 -5995900 -7710319 -7472371
12466 -7472371 -3984940 1784453 6863787 8014631 4248491 -2032301 -7146321 -9282463
12458 -9282463 -8841822 -6579541 -3152385 152 1467933 1733571 2479145 3894685 4400565
12449 4400565 3226648 1441844 -15333 -1561970 -3509906 -4930506 -4947856 -4029567 -3009300
12440 -3009300 -1643544 806733 3807647 5158349 2762127 -2994794 -8669395 -10238290
12432 -10238290 -6759467 -1288840 2212367 2462304 1200335 873359 2478424 4795518
12424 4795518 5270414 2669748 -855046 -1863532 -92343 1403649 1258572 1845688 4530571
12415 4530571 6279233 4205756 670885 -183607 1209170 1468626 470292 743109 1819052
12406A819052q03422j438417K090073M723453J089153m388225l797371R29699
12398B23995Q46423m897740p124916j362376N059582M429475n42998k278455Q72775
12389d774235M326849M116435J55764m573856n529785l48885O934499Q952092
12381I258878M122170j337954k397748j269941j612696k010626J26282K375627
12373G253992O23616l802939n510567k452825K089194M156284K624143r60219
12365D020679l545984k845131l01326K49408j562511j536705J975190M218435
12357F72055J346367k574636j404239L312166M736078J135019k457054k312374
12349B453382J57195K499419L626477K063729k712237o784350n106427Q67227
$$ plain form
12406 1819052 1015630 -422787 1667286 6390739 7479892 3091667 -705704 223995
12398 223995 1070418 -3827322 -10952238 -12314614 -7255032 -2825557 -3368555 -5647010 -4774235
12389 -4774235 -447386 3669049 3824813 -749043 -6278828 -6627713 306786 9258878
12381 9258878 13381048 12043094 9645346 8375405 6762709 4752083 4878365 7253992
12373 7253992 7877608 4074669 -1435898 -3888723 -1799529 2356755 4980898 4020679
12365 4020679 474695 -2370436 -2671762 -2422354 -3984865 -5521570 -3546380 672055
12357 672055 2018422 -556214 -1960453 1351713 6087791 7222810 4765756 2453382
12349 2453382 2610577 5109996 8736473 10800202 8087965 1303615 -3802812 -2935585
12341b935585M133475J753749j788011k169051o45664J71515N91098J073811j0248
12332A75089k696436l747815j769198J97716L51694J681522N667039P243388J993929
12323I096928n130419n288103J616048O731066M675440m47348k742468k117607
12315F393537j464457j283442q41096j055089k216650j488581L021236P438341
12307H503799O098884j45589m371018l025693k29314o62651k703599k338945l56371
12298G69503n08216k406037j991785J175007K893696J593070Q84231K640592L190512
12289H240573J2755k981082j780707M89219j303033n194155m982654l04439L236820
12280d566703L304219L010984L495558J612757l053645n476945k555110K058072
$$ plain form
12341 -2935585 1197890 2951639 1163628 -1005423 -1651087 -1479572 -888474 185337 175089
12332 175089 -2521347 -6269162 -8038360 -7840644 -7488950 -5807428 -140389 7102999 9096928
12323 9096928 3966509 -1321594 294454 7025520 11700960 11253612 8511144 6393537
12315 6393537 4929080 3645638 2804542 1749453 -467197 -1955778 1065458 8503799
12307 8503799 14602683 14457094 10086076 7060383 6831069 6168418 3464819 1125874 769503
12298 769503 261287 -2144750 -4136535 -2961528 -67832 1525238 2409469 5050061 8240573
12289 8240573 8253328 5272246 3491539 3980758 2677725 -2516430 -7499084 -7803523 -4566703
12280 -4566703 -1262484 1748500 5244058 6856815 3803170 -1673775 -4228885 -2170813
12272b170813L609929K275721N98173r35249k683333l729277l642706l265152
12264i942707k092778J203192M326827K727421k416450l721551J407388N731076
12256b777582L094637j860636j581264K127628J932325k431266m251842j137292
12248f885292K177397K451808J939397K747203L544254L229875K555607J143052
12240A2903301k094892n020767m082725o61501P1299k408491k803050R79552L956985
12231H39711K242262q17069q28081L71838j145581l645706k115853L122020N875047
12222C898588K743578j983029k110907K125533M233300P6281n925945n777003
12214b719604J196312O278337K586749n224358p196387j816093K745573J146428
$$ plain form
12272 -2170813 1439116 3714837 4313010 3377761 694428 -3034849 -6677555 -9942707
12264 -9942707 -12035485 -10832293 -6505466 -3778045 -6194495 -9916046 -8508658 -2777582
12256 -2777582 317055 -1543581 -3124845 -997217 935108 -1496158 -5748000 -6885292
12248 -6885292 -4707895 -2256087 -316690 2430513 5974767 9204642 11760249 12903301
12240 12903301 10808409 5787642 1704917 1043416 1114715 -1293776 -4096826 -3117274 839711
12231 839711 3081973 2264904 1436823 1808661 663080 -2982626 -5098479 -1976459 3898588
12222 3898588 6642166 4659137 2548230 4673763 8907063 8983344 3057399 -2719604
12214 -2719604 -1523292 4755045 7341794 2117436 -5078951 -6895044 -4149471 -3003043
12206c003043k106943p38684L738889M959998J084347l203834l147424P32836
12198a683858L862009K766807j217056l554778k209050k16764q47512k376004
12190e476206j179152J788047K487252Q22171M94729J827692R36899k766809m467750
12181e533127j519910K502456L714931K516328J57689l287688n124906j100378
12173g674605O261575P679524J96804p070333o133807j650617j689665m005872
12165a4086996j250646N231576P546476M288642J067326k58772k667117n146065
12157e275576l087537K109384L676707Q26899r8451K587050K820614j763765m957517
12148c162192k627521O14120K76049o27201J310553K759684N2350l441324k936721
$$ plain form
12206 -3003043 -5109986 -5848670 -2109781 2850217 3934564 730730 -2416694 -1683858
12198 -1683858 2178151 4944958 3727902 173124 -2035926 -2252690 -3100202 -5476206
12190 -5476206 -6655358 -4867311 -2380059 -1557888 -1063159 764533 1701432 -1065377 -5533127
12181 -5533127 -7053037 -4550581 -835650 1680678 1838367 -1449321 -6574227 -7674605
12173 -7674605 -1413030 6266494 6463298 -607035 -6740842 -8391459 -10081124 -14086996
12165 -14086996 -15337642 -10106066 -2559590 1729052 2796378 2537606 -129511 -5275576
12157 -5275576 -8363113 -6253729 -2577022 -1750123 -1848574 738476 3559090 1795325 -3162192
12148 -3162192 -5789713 -5175593 -4899544 -5526745 -4216192 -1456508 -1404158 -4845482 -7782203
12139g782203j93352M70247l37310K74229J407961J038359J009732L328536M966534
12130D182733K531132j115694j215350R05862P37343j268899j349438J5366o40887
12121B782168k601896k244865k16608n7451p68984J417159M509768K642163l065805
12112B395649m610138J13814L707580J538839j386660l49948J018703j120795
12104A307044k505787J368248N429092K466133l963392m263258J703662M331125
12096E872867k70548m687570k764457J276737J109372j473121r70036J919580
12088A2824J757867k349798n236302l342574J009031L804051L983553K585524
12080B224176J87080k824137m921983m220239n61551L667849M987905J847406
$$ plain form
12139 -7782203 -7975555 -7505308 -7842618 -7568389 -6160428 -5122069 -4112337 -783801 4182733
12130 4182733 6713865 5598171 4382821 5288683 6026026 4757127 3407689 3423055 2782168
12121 2782168 180272 -2064593 -2281201 -2338652 -3107636 -1690477 2819291 5461454 2395649
12112 2395649 -2214489 -2100675 1606905 3145744 1759084 1409136 2427839 1307044
12104 1307044 -1198743 169505 5598597 8064730 4101338 -161920 1541742 5872867
12096 5872867 5602319 914749 -1849708 -572971 536401 -936720 -1906756 12824
12088 12824 1770691 -579107 -5815409 -9157983 -8148952 -4344901 -361348 2224176
12080 2224176 2411256 -412881 -5334864 -9555103 -10116654 -6448805 -1460900 386506
12072C86506l081431m603669n49940M953038N745677J107474l289885k560588
12064a892818J533005L546400J577783q92960j91432K721616L767921J185402
12056A1354917k117693k268894L93131J482675j712264o441489p920180n111715
12048a2341512q11422K896004N910845P105264M298810j285301m507005k889466
12040a623783l31780r65219k539441m93873L712383M025057r50923n597397n019725
12031i784701n00815L955549O191435N487354J861850k053048k243226J127601
12023D041999K882019J59051k999685j754425K022662K585452j285037n022334
12015F29702m764525j590259P95336K80870j798980j978057J304654M711739L562893
$$ plain form
12072 386506 -2694925 -7298594 -7848534 -2895496 2850181 3957655 667770 -1892818
12064 -1892818 -359813 3186587 4764370 3871410 3679978 6401594 10169515 11354917
12056 11354917 9237224 6968330 7361461 8844136 7131872 690383 -7229797 -12341512
12048 -12341512 -13152934 -10256930 -4346085 2759179 7057989 5772688 1265683 -1623783
12040 -1623783 -1955563 -2920782 -5460223 -5954096 -2241713 1783344 832421 -4764976 -9784701
12031 -9784701 -10285516 -6329967 -138532 5348822 7210672 5157624 2914398 4041999
12023 4041999 6924018 7083069 4083384 2328959 4351621 6937073 5652036 629702
12015 629702 -4134823 -5725082 -4929746 -4648876 -6447856 -8425913 -7121259 -2409520 1153373
12006A153373j059680k885718R0218K044377j018607l777001j42469N456558M036723
11997C897774l216678o045154j011202L630531J448769k990976l027461j14265
11989g428662R27884P09051K368097M180548K318139j464309j809579J522127
11981A323296L078855K0871m209672n344146l162948J82528L168787M761671L953689
11972C772931J113722j622710k361198j138815N13024R28362m63526k430012k953933
11963d642155j634186j47105L55414Q19529K156370L187893K299389j62998k515149
11954b82998l404278j922622J816090N058778M256887L56291j150486J831230
11946F558892L847504j13179o026109o033542j8338M600046L864415J301283M07944
$$ plain form
12006 1153373 93693 -2792025 -2701807 -657430 -1676037 -5453038 -5595507 -138949 3897774
11997 3897774 681096 -5364058 -6375260 -2744729 -1295960 -4286936 -7314397 -7428662
11989 -7428662 -6500778 -5791727 -3423630 756918 3075057 1610748 -198831 1323296
11981 1323296 4402151 4423022 213350 -5130796 -8293744 -8111216 -4942429 -180758 3772931
11972 3772931 4886653 3263943 902745 -236070 276954 1205316 741790 -1688222 -4642155
11963 -4642155 -6276341 -6423446 -6068032 -5248503 -3092133 95760 2395149 2232151 -282998
11954 -282998 -3687276 -5609898 -3793808 1264970 5521857 5878148 4727662 6558892
11946 6558892 10406396 10293217 4267108 -1766434 -1784772 2815274 6679689 7980972 8388916
11937H388916j56084j880934k915366k200268k020667l156547k139784K683043
11929c397691O335056L269209m231010q347989n162136J976575P401825P918988
11921E762827L541797k870207o711927n364646j199178J178487M24280r10462
11913f149029p29869K94900R11997J214353J561606J514167Q41564K66886L44313
11904G0888N41589R7162r50963k063009k824346k819616j532766R42464L303084
11895e235513L796313J945986o02672j451406L6488J984519K214724O90726r97566
11886B381599j932611k316033k018053n20237J429519J911225L71307j318235
11878b011519j152459P64274K813123L466948J915544j302209l706549k789204
$$ plain form
11937 8388916 8232832 6351898 3436532 1236264 -784403 -3940950 -6080734 -3397691
11929 -3397691 2937365 6206574 1975564 -6372425 -11534561 -9557986 -2156161 5762827
11921 5762827 9304624 6434417 -277510 -5642156 -6841334 -5662847 -5238567 -6149029
11913 -6149029 -6878898 -6583998 -5672001 -4457648 -2896042 -1381875 -540311 -273425 70888
11904 70888 612477 709639 -241324 -2304333 -5128679 -7948295 -9481061 -8538597 -5235513
11895 -5235513 -1439200 506786 -95886 -1547292 -1510804 473715 2688439 3379165 2381599
11886 2381599 448988 -1867045 -3885098 -4405335 -2975816 -1064591 -693284 -2011519
11878 -2011519 -3163978 -2399704 413419 3880367 5795911 4493702 787153 -2002051
11870b002051N48157K406477R26417j214647r94485N43744N83387o63897p81104
11861f48002K10318k07943k193644k232020J675004O064827N670611m302n882763
11852B452086p044823l699267J06825J559562J452351J618408J809788O18268
11844a126802j420461j865409J85896K582397K852418R74286j376515k900438
11836b094628l127944k239770j325391j358691j219654J242792N194290O498448
11828A569452L270672r73070k406332k414802m182748n987211l202017L478695
11820a0847361P433094N081233N75767q50269Q9893j77594j437643p50749J612140
11811G28511K234124M57253m10632Q95577N96603m093754q851687o643235K266573
$$ plain form
11870 -2002051 -1453894 952583 1879000 664353 -330132 213612 796999 133102 -648002
11861 -648002 -437684 -645627 -2839271 -5071291 -3396287 2668540 8339151 8334849 2452086
11852 2452086 -4592737 -8292004 -8185179 -6625617 -5173266 -3554858 -1745070 -1126802
11844 -1126802 -2547263 -4412672 -4226776 -1644379 1208039 2182325 805810 -2094628
11836 -2094628 -5222572 -7462342 -8787733 -10146424 -11366078 -10123286 -4928996 1569452
11828 1569452 4840124 3867054 1460722 -954080 -5136828 -11124039 -14326056 -10847361
11820 -10847361 -3414267 1666966 2242733 1392464 1482357 1304763 -132880 -883629 728511
11811 728511 2962635 3419888 3009256 3904833 4501436 407682 -8444005 -15087240 -12820667
11802a2820667R105979P016835n53447m598324j619127L460252M669058J632390
11794F292949j857075k910582j592704K64425Q57693O5782j75081J531345L219316
11785E696068J705315k359596m804742l998778k678645k226104J01908M969229
11777c595345O761203J004363p217780q626656k105986M457487N187661J992581
11769b142472r02759k030481j084771J903708L943532J138507m435951n479627
11761i090314J09287N247941L849674o10199j640920K75805M73902j127260j132126
11752c644210N8267n92771j849255Q3628L602509L268880l39855o61006L196653
11743C122840L570900l018252q526421n030863K998828N794614K639055L40101
$$ plain form
11802 -12820667 -3714688 3302147 2748700 -1849624 -3468751 -8499 4660559 6292949
11794 6292949 4435874 1525292 -67412 197013 1054706 1120488 945407 2476752 5696068
11785 5696068 7401383 5041787 237045 -3761733 -6440378 -8666482 -8564574 -3595345
11777 -3595345 3165858 4170221 -3047559 -11674215 -13780201 -9322714 -4135053 -2142472
11769 -2142472 -3045231 -5075712 -6160483 -4256775 -313243 825264 -3610687 -9090314
11761 -9090314 -8981027 -3733086 116588 -493611 -2134531 -1858726 -1384824 -2512084 -3644210
11752 -3644210 -3585943 -4178714 -6027969 -5944341 -2341832 927048 587193 -73813 3122840
11743 3122840 6693740 3675488 -4850933 -9881796 -6882968 -1088354 1550701 1890802
11735A890802N98391j287176n748401o743577k099211K432650K633924J838928
11727f483670L415175M183678Q31678k854457j659148K326774L299833R95681
11719D055544l62858k7743o32577j613699r93K638015J328468l622481o030252
11710d268576l256288M07275J503391J875220K998534K593824J82976l95161K049055
11701C690250K765462p56830l514060j330986J575779O4792k457551k23011L606444
11692C420289J444361n155068o584335j25291N678297L969896j166371k235674
11684g53896J073576L404249J888759j426757l299959k502755k66418J102800
11676g80401O75649k10763m47631r29323j916640j186217J876809L236679N2999
$$ plain form
11735 1890802 2489193 1202017 -4546384 -11289961 -13389172 -10956522 -8322598 -6483670
11727 -6483670 -3068495 1115183 1946861 -907596 -2566744 -239970 3059863 4055544
11719 4055544 3692686 3664943 3032366 1418667 1417674 4055689 5384157 1761676 -4268576
11710 -4268576 -7524864 -7117589 -5614198 -3738978 -740444 1853380 2036356 1641195 3690250
11701 3690250 6455712 5698882 2184822 853836 2429615 2494407 36856 -186155 3420289
11692 3420289 4864650 -290418 -6874753 -7000044 -1321747 2648149 1481778 -753896
11684 -753896 319680 3723929 5612688 4185931 885972 -1616783 -1883201 -780401
11676 -780401 -104752 -315515 -763146 -1692469 -3609109 -4795326 -2918517 318162 371161
11667C71161l150106m66565N166424N318559q78884n259170l231451M20270Q04357
11658i05405j1863R24660J431555q81608l416447l176784j649023p23070J171998
11649g235987M251725M113563j033475m837472j265624N211003N261295j812433
11641B652595p539692o258817q50759L481724M968256L909567Q97894j966761
11633g05993k072275l1901O00983j631561m072650l802566j036832K102303M031855
11624f618637M205737L033402J918927J831752J541482r97122n009732o495262
11616f589453k793510L398746O225602L071836k567639n523609m904380l441880
11608a3124287j958558J318178N168722M568044j082801m157104R84024Q283693
$$ plain form
11667 371161 -2778945 -3245510 1920914 7239473 6360589 1101419 -2130032 -1709762 -905405
11658 -905405 -917268 7392 1438947 557339 -2859108 -6035892 -7684915 -8407985 -7235987
11649 -7235987 -2984262 1129301 95826 -4741646 -6007270 -796267 4465028 2652595
11641 2652595 -4887097 -11145914 -11996673 -8514949 -3546693 362874 1260768 -705993
11633 -705993 -2778268 -2810169 -2209186 -3840747 -7913397 -11715963 -12752795 -10650492 -6618637
11624 -6618637 -2412900 620502 2539429 4371181 5912663 4915541 -94191 -6589453
11616 -6589453 -9382963 -5984217 241385 3313221 745582 -4778027 -9682407 -13124287
11608 -13124287 -15082845 -13764667 -8595945 -4027901 -5110702 -9267806 -8283782 -89
11600h9Q092362J849528o79391K479806K886713l445578r271362q004311k875332
11591h967654P11756L304487O153922N846512P83426l767383l519389j714052
11583a168375j870836j133824K461216L758196m10828l427531M03043M535827
11575C146888N58522o424660n406274K094900M837301N88316j881607Q62659K242724
11566F18769r90258l255621j111371J186041O27457K80355J724266J657281n75584
11557A61335o66361K165421K853758j9603j079110J677532K352618k357681o388157
11548a300248l872620J517504K961232N02801j246998q11754R1906N25906J38630
11539a493641j617321l105281j264080K958859M565252J923050j021303j695400
$$ plain form
11600 -89 8092273 9941801 9262410 11742216 14628929 11183351 1911989 -6092322 -8967654
11591 -8967654 -8255898 -4951411 1202511 7049023 7832449 4065066 545677 -1168375
11583 -1168375 -3039211 -4173035 -1711819 2046377 1635549 -1791982 -1388939 3146888
11575 3146888 3705410 -2719250 -8125524 -6030624 -1193323 -605007 -2486614 -1623955 618769
11566 618769 -371489 -3627110 -4738481 -3552440 -2924983 -2644628 -920362 736919 161335
11557 161335 -505026 1660395 4514153 4494550 3415440 5092972 7445590 5087909 -1300248
11548 -1300248 -5172868 -3655364 -694132 -191331 -1438329 -2250083 -2158177 -1632271 -1493641
11539 -1493641 -3110962 -6216243 -7480323 -4521464 43788 1966838 945535 -749865
11531g49865j843220j665616J464284N563936L667220m652331r620424m920714
11523a2756730K671463M070650J081965P88875K840016J593920k832419m630312
11515g172572j746421J973691L089689J523446j346390l134431j244487K963909
11507e093566M117486O75062j762329N39644K770160j2547l511221j136112M304222
11498H90799M819794K2937l474916l499972l874238n191872l180680K619450O353003
11489d515695M131404r39206l627533k087045J988826M866095L081617j985008
11481I13455l840953M15217M337813J114981n207636n486825J63433L259111J119143
11472c212261j17652K525205M089784J535277r83440m05492K5457j965994k935455
$$ plain form
11531 -749865 -2593085 -4258701 -2794417 2769519 6436739 1784408 -7836016 -12756730
11523 -12756730 -10085267 -6014617 -4932652 -4143777 -1303761 290159 -2542260 -7172572
11515 -7172572 -8918993 -6945302 -3855613 -2332167 -3678557 -6812988 -8057475 -5093566
11507 -5093566 -976080 -301018 -2063347 -1523703 1246457 1233910 -2277311 -3413423 890799
11498 890799 5710593 5733530 2258614 -1241358 -5115596 -10307468 -13488148 -10868698 -4515695
11489 -4515695 -384291 -1323497 -4951030 -7038075 -5049249 -183154 2898463 913455
11481 913455 -2927498 -2512281 1825532 2940513 -2267123 -7753948 -7590515 -4331404 -3212261
11472 -3212261 -3329913 -804708 3285076 4820353 3836913 3431421 3456878 1490884 -1444571
11463a444571q21578N67060p67205j35077M901042P636333K070837n793633n556546
11454F56662J845635N395955K97081n850537m912457J071717M608268L051975
11446F164299k74801k493941m049778n394571m557224q7836N080140N517866p9957
11437a75803o094150n799611Q22430P155197P470803K286843l599845o021494
11429c955630m048497r616K288227J042263j401961j429820R94622K545278J472892
11420b502242m43954j250036j157308p08467M37609J645022J106617q87056j257708
11411e017523J265098L435218J919972j621189k792646m88491K250521K800779
11403A751739J658852N16002o8119l77094m05362J26707J181103K186660K221960
$$ plain form
11463 -1444571 -2266149 -1699089 -2466294 -2601371 2299671 9936004 12006841 6213208 656662
11454 656662 2502297 7898252 8195333 2344796 -2567661 -1495944 3112324 6164299
11446 6164299 5889498 3395557 -654221 -6048792 -10606016 -10693852 -5613712 -95846 -175803
11437 -175803 -6269953 -12069564 -11247134 -4091937 3378866 5665709 2065864 -3955630
11429 -3955630 -8004127 -8013743 -5725516 -4683253 -6085214 -7515034 -6520412 -3975134 -2502242
11420 -2502242 -2946196 -4196232 -5353540 -6062007 -5624398 -3979376 -2872759 -3759815 -5017523
11411 -5017523 -3752425 -317207 1602765 -18424 -2811070 -3299561 -1049040 1751739
11403 1751739 3410591 3926593 3858474 3481380 3076018 3202725 4383828 6570488 8792448
11394H792448O42336k043151m202845m534919l313771j727836k76898J395084
11386e269552L055429L312853J385976j107732j645175l36643j08880k126983
11378b840707l143516j65483L800404K975465k230014m571183k53534N054150
11370a374418M324748o79600k676030R7340K232472K14879k760709k586359j61226
11361c368903J088935M58139q2422O01444J705901K015184Q46752j900116n210511
11352c845597o737352m467077Q43798N551584O438397M180714K214837J649243
11344E828547l63524n035984p468097k479669O349676R671909N014493l04996
11336A1212355r74137q74983m191018o849679l743945J540811K529312P95929
$$ plain form
11394 8792448 9434784 7391633 3188788 -1346131 -4659902 -6387738 -6664636 -5269552
11386 -5269552 -2214123 1098730 2484706 1376974 -268201 -604844 -713724 -2840707
11378 -2840707 -5984223 -6149706 -2349302 626163 -1603851 -6175034 -6428568 -1374418
11370 -1374418 2950330 2270730 -405300 -307960 1924512 2139391 -621318 -3207677 -3368903
11361 -3368903 -2279968 -1821829 -1904251 -1302807 403094 2418278 3265030 1364914 -3845597
11352 -3845597 -10582949 -15050026 -14206228 -8654644 -2216247 1964467 4179304 5828547
11344 5828547 5465023 429039 -7039058 -9518727 -3169051 6502858 11517351 11212355
11336 11212355 10238218 9363235 5172217 -1677462 -5421407 -3880596 -1351284 -555355
11328e55355J941128M132725J051971n411113o489562j013538K373331k96166
11320d266579k212275J691252N880740L918412r55258j943952O12002J794263
11312D518605R09114P62352J174465k52544k617279k586325M6058K054859J462785
11303E472090p76929k969093l925138l072059j368671p49733j188541m04277K109493
11294f872858L510737J831964j021159k283098j505260O99301L630863M829700
11286B820190J733703l093222l335715J816930N194930K069437k626433k497643
11278B082177L17966o7512k778280k174289J940618L846856J212775j850056j691951
11269H38304K94381J046544j93256k048332k450753k02625K826248K811119l79448
$$ plain form
11328 -555355 1385773 5518498 6570469 1159356 -5330206 -6343744 -3970413 -4266579
11320 -4266579 -6478854 -4787602 1093138 5011550 4056292 2112340 2724342 4518605
11312 4518605 5427719 6190071 7364536 7111992 4494713 1908388 1954446 4009305 5472090
11303 5472090 4695161 1726068 -2199070 -5271129 -6639800 -7389533 -8578074 -8982351 -6872858
11294 -6872858 -3362121 -1530157 -2551316 -4834414 -6339674 -5640373 -2009510 2820190
11286 2820190 4553893 1460671 -1875044 -58114 5136816 7206253 4579820 2082177
11278 2082177 2400143 2332631 -445649 -2619938 -679320 3167536 4380311 2530255 838304
11269 838304 1132685 2179229 1985973 -62359 -2513112 -2715737 110511 2921630 2542182
11260B542182j785124R74046K718589j327969o606786n440081O90457L537813
11252d696873J412082Q35745M327103O026206K347361j595181p69081J639039
11244I526401L90501l002738l698878j875127j458913k693452j844826K109354
11236b547678N303121M301623L76057k722532l309029k701141k324938j446671
11228e071188J109263L772931L413533M88388l77819K611461M502269Q74093m334396
11219F988535m337597m30889K20923l159268l750181N46530K819244j079785m992975
11210g175463k416102L079285M264204J503300O6432M17426q13624k797743j413121
11201e285406K845716M973586L291093J017144N3931j032330k609015k910366
$$ plain form
11260 2542182 757058 1731104 4449693 3121724 -3485062 -8925143 -8234686 -4696873
11252 -4696873 -3284791 -2449046 1878057 7904263 10251624 8656443 7887362 9526401
11244 9526401 9916902 6914164 3215286 1340159 -118754 -2812206 -4657032 -2547678
11236 -2547678 2755443 7057066 7433123 4710591 1401562 -1299579 -3624517 -5071188
11228 -5071188 -3961925 -188994 3224539 3712927 3335108 5946569 10448838 11322931 6988535
11219 6988535 2650938 2220049 2440972 -718296 -4468477 -3921947 -1102703 -2182488 -7175463
11210 -7175463 -9591565 -6512280 -2248076 -744776 -678344 -260918 -1074542 -3872285 -5285406
11201 -5285406 -2439690 2533896 5824989 6842133 6896064 5863734 3254719 344353
11193C44353j752660n77760J029579L910520N064765Q55441n505560o412887r87514
11184d031723L044964Q29743k924533k223493J222375J965733o54689k777359
11176e548982j872377J488995N145468N850713J625067l714176k767099N034093
11168E241702J0044469M620671n629691r365828n013063j037911k232775m039797
11160g412223j645027K534738L487272P76950k116782k624123r55376R05302J043451
11151f005818L8070R62135M505381N796670N55356o755410o998156Q93103P619178
11142F10509N989393m13116m216516m158274l418318k702393o19377J770269K120417
11133e037406J132056J353528K674296K778758J172894o29396j998315l090366
$$ plain form
11193 344353 -1408307 -1986067 -956488 2954032 8018797 8874238 3368678 -3044209 -4031723
11184 -4031723 -986759 -157016 -3081549 -5305042 -4082667 -2116934 -2771623 -5548982
11176 -5548982 -7421359 -5932364 -786896 5063817 6688884 2974708 207609 5241702
11168 5241702 15286171 19906842 14277151 4911323 -101740 -1139651 -3372426 -7412223
11160 -7412223 -9057250 -6522512 -3035240 -2258290 -4375072 -6999195 -7954571 -7049269 -6005818
11151 -6005818 -5967748 -5005613 -500232 5296438 5851794 -903616 -7901772 -7008669 610509
11142 610509 6599902 6186786 1970270 -2188004 -5606322 -8308715 -8928092 -7157823 -5037406
11133 -5037406 -3905350 -2551822 122474 2901232 4074126 3444730 1446415 -1643951
11125a643951k928555q56145J063648M80885j213888q27283J216582J243964j653297
11116e118040l722559j880939J989848L810821K508474O61970O94411J876760
11108H20746J597860p78967k544833j304794J051622O31755k427533l685801j047904
11099g687849K120580K469436J479125J908590K821676J744314q85986k957300
11091A012586l914433l524463n28754L680128L694657k543245q405207o673510
11083a7202241o4112L312858K514579L362548O622630O235696P06715l076208
11075B412465q38656K391190J180499j723646j259836J123459O91884k368722
11067A608637l854916k267090K48169J873593K112869O07476j719794k313559
$$ plain form
11125 -1643951 -4572506 -5428651 -4365003 -3884118 -5098006 -5925289 -4708707 -3464743 -5118040
11116 -5118040 -8840599 -10721538 -8731690 -4920869 -2412395 -1750425 -1056014 820746
11108 820746 2418606 1639639 -905194 -2209988 -1158366 -526611 -2954144 -6639945 -7687849
11099 -7687849 -5567269 -3097833 -1618708 289882 3111558 4855872 3969886 1012586
11091 1012586 -2901847 -6426310 -6955064 -3274936 419721 -2123524 -10528731 -17202241
11083 -17202241 -17266353 -13953495 -11438916 -8076368 -1453738 4781958 5488673 2412465
11075 2412465 1573809 3964999 5145498 3421852 2162016 3285475 3977359 1608637
11067 1608637 -2246279 -4513369 -4265200 -2391607 -278738 328738 -1391056 -3704615
11059c704615o17762M17878q20093j489657O79548K870397J984947M99495K175772
11050A995910M682653K721353k943650n972129l782963m54064K79896o32425j354114
11041e459533j992057j881839R39208N114352N481802M19629m336769l045873
11033d761080K140815M863837L430737J101820n88783k990403n118301l343934
11025e265292K074271N411434L212303p39332j523553j90718n40090k190881k091761
11016a843619n83420k64156m06953J380155L047598O33767l434561k562618K596156
11007a437651L919921m01360j775121L953013P633485J171735p859737o996260
10999a791975J736557N577331R13619l292825j337553K102517K214231O82874
$$ plain form
11059 -3704615 -4322377 -3904499 -4724592 -6214249 -5534701 -2664304 -679357 -179862 1995910
11050 1995910 6678563 9399916 6456266 484137 -3298826 -3752890 -3472994 -4105419 -5459533
11041 -5459533 -7451590 -9333429 -8394221 -3279869 2201933 2621562 -1715207 -4761080
11033 -4761080 -2620265 2243572 5674309 6776129 6187346 3196943 -1921358 -5265292
11025 -5265292 -3191021 2220413 5432716 4693384 3169831 2979113 2439023 248142 -1843619
11016 -1843619 -2427039 -2691195 -3098148 -1717993 1329605 1963372 -1471189 -4033807 -1437651
11007 -1437651 2482270 2080910 305789 4258802 11892287 13064022 5204285 -1791975
10999 -1791975 -55418 5521913 6435532 3142707 1805154 3907671 6121902 6804776
10991F804776n48474k823768n239942m002020M0989J307895p92214o04365K898906
10982b958217L427724r42788l191684O07169M125440J837008j579421j27272L073068
10973D271027K186632j193671k364498k049255k638703j595198K990096N586483
10965E192913J054876n241327m691811Q25363K353363j575325l896242j346407
10957g324597J883404K770092K767298J954258j665972n810655m719938J724416
10949h421694O429886M722630k31271l349336l506050j710611J491258M603478
10941B8290N069265K380553j304971l846618l827520j2159N982462Q233954K903277
10932A5606533n093665p346589l018948J155098J131517p02268j815780k548867
$$ plain form
10991 6804776 6256302 3432534 -1807408 -5809428 -5768439 -4460544 -5252758 -5857123 -2958217
10982 -2958217 469507 -473281 -3664965 -3057796 1067644 2904652 1325231 1197959 4271027
10973 4271027 6457659 5263988 2899490 850235 -1788468 -3383666 -393570 5192913
10965 5192913 6247789 1006462 -3685349 -2859986 -506623 -2081948 -5978190 -7324597
10957 -7324597 -5441193 -2671101 96197 2050455 384483 -5426172 -10146110 -8421694
10949 -8421694 -1991808 2730822 2499551 -849785 -4355835 -6066446 -4575188 28290
10941 28290 5097555 7478108 6173137 2326519 -1501001 -1513160 4469302 12703256 15606533
10932 15606533 10512868 3166279 147331 1302429 2433946 1731678 -84102 -2632969
10924b632969k186255R19231L983982J724968m260330n395437J219536P050312
10916D23038L910235m257901p298965k564286L467121N099157L023642L57461
10908B159502j884061l835169m289419j540647L541742O670437L864855l457745
10900A229495q618496o530558N59529N890853N637399J593038k158467k626355
10892e023562Q15302N488230O532951J976879l945245n362342j861605J831844
10884D52452K218547p0961k703349l658598j705814J983543L743472J835893p55180
10875A340005j004375o03172j960486k674725L71955M127266L271507q74989k482065
10866d89079q38219j56397p74035Q14593L260280J209250l909977l969786K157641
$$ plain form
10924 -2632969 -4819224 -3899993 83989 1808957 -2451373 -7846810 -6627274 423038
10916 423038 4333273 75372 -7223593 -9787879 -6320758 -1221601 1802041 2159502
10908 2159502 275441 -3559728 -7849147 -9389794 -5848052 822385 4687240 1229495
10900 1229495 -7389001 -13919559 -13360030 -7469177 -1831778 -238740 -2397207 -5023562
10892 -5023562 -4208260 1279970 7812921 9789800 5844555 482213 -1379392 452452
10884 452452 2670999 2600038 -103311 -3761909 -5467723 -3484180 259292 2095185 1340005
10875 1340005 335630 -267542 -2228028 -4902753 -4530798 -403532 2867975 1992986 -489079
10866 -489079 -1327298 -1483695 -2257730 -1443137 1817143 3026393 -883584 -4853370 -2695729
10857b695729N212421N60417l436756R10543P364083N310359l759144r282970
10849A83224p297574l246362j039571J077101L485452K761714j449274l969885
10841i495175j631439J875877K043232L37810J073735M247490N760324L689658
10833G901512L30093k168249m355160o160768m644281J445987P103719N889647
10825E342500r45962n202664k704945J621844K014291j54457p31568k47695j380367
10816b389023k601121q18196K002385J519577j118551p99693K823201M744558
10808C363137K765073n5194j430765k261650k531247p87984J637191J701030L31136
10799B730727R95514K495518J97038m878107n951703j307752K523633J198656
$$ plain form
10857 -2695729 2516692 3077109 -359647 550896 7914979 13225338 9466194 183224
10849 183224 -7114350 -10360712 -11400283 -10323182 -6837730 -4076016 -5525290 -9495175
10841 -9495175 -11126614 -9250737 -7207505 -6869695 -5795960 -1548470 4211854 7901512
10833 7901512 8231605 6063356 1708196 -4452572 -9096853 -7650866 -547147 5342500
10825 5342500 4396538 -806126 -3511071 -1889227 125064 -29393 -760961 -1008656 -2389023
10816 -2389023 -4990144 -5808340 -3805955 -2286378 -3404929 -4204622 -1381421 3363137
10808 3363137 6128210 6073016 4642251 2380601 -150646 -938630 698561 2399591 2730727
10799 2730727 3726241 6221759 6418797 1540690 -4411013 -5718765 -3195132 -1996476
10791a996476j220692p9998K609470K884111J028206q37765k180307j885573J831004
10782A51980O401473N805040l65987n068727m271907k256437k742194k605271
10774d952030M33774J862398j254024l369687L65909M764316L121375q98574K36070
10765C09527M246282K789651l768643o443463k044341K753368K819389Q81520
10757A543290L24717j95213j863279k174632P8568J487416o82553l714237l238692
10748h434615Q20062M674559N239656K568633q45993k204647r27998Q00151J034619
10739B724427O66822J238776J569508n00480l740256m242318p57314L448172M672826
10730E080163K634205k52718j714272j163910M50778J831702K518859K549814
$$ plain form
10791 -1996476 -3217168 -3297166 -687696 2196415 3224621 2386856 206549 -1679024 151980
10782 151980 6553453 12358493 11992506 6923779 2651872 395435 -2346759 -4952030
10774 -4952030 -4518256 -2655858 -3909882 -7279569 -6913660 -2149344 972031 73457 309527
10765 309527 4555809 7345460 3576817 -2866646 -4910987 -2157619 661770 1543290
10757 1543290 1868007 1672794 -190485 -2365117 -2286549 -799133 -1481686 -5195923 -8434615
10748 -8434615 -7614553 -2939994 2299662 4868295 4022302 1817655 889657 1689808 2724427
10739 2724427 3391249 4630025 6199533 5699053 1958797 -2283521 -3040835 407337 5080163
10730 5080163 7714368 7461650 5747378 4583468 5034246 6865948 9384807 11934621
10722A1934621J301216j655487m468421m261552j300054P77986J17354r28899
10714A516764k26355N72858n58321k118295j802074n14279p8972P81348M037356
10705A610030P434631O429283P34261m897380o642893n105339k523928J80896
10697b780439K329326K207954p36617l485112j798684M111166P994195M161001
10689A2002790m432970q123125k491953N057898M699016k454170o232220j935034
10681c909768L814827L545819q67011k384692R27930M400922L782230P9157k520207
10672F869207j686982N57963N72189j725650k509651k40360J260495o40928j721852
10663G34431K400208P262529N149451k210202n704052l240427j958275m543003
$$ plain form
10722 11934621 13235837 11580350 7111929 2850377 1550323 2328309 2445663 1516764
10714 1516764 1290409 1863267 1304946 -813349 -2615423 -3129702 -3208674 -2427326 1610030
10705 1610030 9044661 15473944 16208205 11310825 4667932 -437407 -2961335 -2780439
10697 -2780439 -451113 1756841 1020224 -2464888 -4263572 -152406 7841789 12002790
10689 12002790 7569820 -553305 -3045258 2012640 6711656 4257486 -1974734 -3909768
10681 -3909768 -94941 3450878 2583867 199175 1127105 5528027 9310257 9389414 6869207
10672 6869207 5182225 5740188 6312377 4586727 2077076 1836716 3097211 2456283 734431
10663 734431 3134639 10397168 15546619 13336417 7632365 4391938 2433663 -2109340
10655b109340m190403K474014P426820K932995o216633r353864l786542M136376
10647h686577P880568N673063P9222l551572j624613K431667J900432k918523
10639A183667m582386n03415K882939J180515j165553K75352K460071J793959
10631C525149Q10395J924505J777606j921129m783131l203898p40310j024305
10623c635118j264565J157443K916381J681554J077856K601775J319302l716919
10615B137709m737581J039967L875994k293500p350127j261034P696313O128787
10607E236528j808585k104208M854755N921852j817464p430212n282286j597334
10599d026954o36402R25775L647907K698045j720893l127482k82137J061138l35913
$$ plain form
10655 -2109340 -6299743 -3825729 3601091 6534086 317453 -9036411 -12822953 -8686577
10647 -8686577 -806009 4867054 4946276 1394704 -229909 2201758 4102190 1183667
10639 1183667 -3398719 -3902134 -1019195 161320 -1004233 -728881 1731190 3525149
10631 3525149 4335544 6260049 8037655 6116526 1333395 -1870503 -2610813 -3635118
10623 -3635118 -4899683 -3742240 -825859 855695 1933551 4535326 5854628 2137709
10615 2137709 -2599872 -1559905 2316089 22589 -7327538 -8588572 -892259 5236528
10607 5236528 3427943 1323735 6178490 12100342 10282878 2852666 -2429620 -4026954
10599 -4026954 -4663356 -3737581 -89674 2608371 887478 -2240004 -2522141 -1461003 -1796916
10590a796916P94742M623797M114185k174024n848969j630596M531708M914259
10582G528186K99551l345269k760437J098864M930697M958670Q47505k596171
10574A0961596j746391o2763k398452o377227o062115j424853K880272N276367
10566A046434O555331M843615q32441n416811m330035j266018j367237j659302
10558b426464K351400O198126L627677j056923m4998L480514J223516m092692
10550I260156k949991L547154N316585O85404k352928j219555r72147k207733
10542I106945n62141K330389Q01495k870652j707034K324906J536714k680591
10534H280031k540601R81856N73194k369707o79432L314523J767816k321628J35924
$$ plain form
10590 -1796916 -1002174 3621623 7735808 5561784 -287185 -1917781 2613927 7528186
10582 7528186 7827737 4482468 1722031 2820895 7751592 12710262 13557767 10961596
10574 10961596 9215205 9152442 6753990 376763 -5685352 -7110205 -4229933 1046434
10566 1046434 7601765 12445380 11612939 6196128 1866093 600075 -767162 -2426464
10558 -2426464 -75064 6123062 9750739 8693816 8648818 12129332 13352848 9260156
10550 9260156 6310165 9857319 15173904 15859308 13506380 12286825 11314678 9106945
10542 9106945 8544804 10875193 11676688 8806036 7099002 9423908 10960622 8280031
10534 8280031 5739430 6721286 7294480 4924773 4245341 7559864 9327680 7006052 7141976
10525G141976O218877N527685m19238j937424l65650l566486o986050j254712
10517D358978O269030J976392o814695k229736J0794511J1360142p2337l585294
10509B2056991K438062M66614q860301o153769P154536Q097368m303621o275369
10501A4620511M210536L288260q978996m713340J5108691J5756989m365795m530522
10493C0396334J9253340J8350235j2016107m074419N7755340P0355457l9255664
10486A40764516j68158015j57217606j8366041Q2365024N8999810l157357q358021
10479g3127690J9164154J6131667p493406p930644P818309P039294l318689K213983
10471c9503022J3634664O565107q289739n045937R011011Q859336k260108l038290
$$ plain form
10525 7141976 13360853 18888538 18469300 16531876 16166226 12599740 5613690 4358978
10517 4358978 10628008 12604400 5789705 3559969 14354480 25714622 25642285 22056991
10509 22056991 24495053 24961667 16101366 9947597 17102133 25199501 20895880 14620511
10501 14620511 18831047 22119307 13140311 8426971 23535662 39292651 34926856 30396334
10493 30396334 49649674 67999909 55983802 51909383 109664723 180020180 140764516
10486 140764516 -27393499 -184611105 -202977146 -120612122 -61612312 -64769669 -73127690
10479 -73127690 -53963536 -37831869 -45325275 -53255919 -45437610 -38398316 -41717005 -39503022
10471 -39503022 -25868358 -19303251 -27592990 -32638927 -23627916 -14768580 -17028688 -20066978
10463b0066978M606442K684092o369373n824428K274136K578672l350468k169414
10455b5637319L826435K656372j707907K740986R764864M260394p928065p403161
10447a9427401N168790J0008544J602595m793430j235517K392043n16526k874086
10439i674988L00169L215625J542251q67236j194134j583658j907787M78555L283724
10430f407479J924355j258245o23859K012462Q37260k574923k502858n79091k301551
10421a1473929n190710k757441K513429K831624o48012j58542M022144M383468
10413f477969M37022r16208J240879R28202k156757j651767L052508N200598K688434
10404B344942P07960J236923M32690k314388k878066j107693j340715l313014
$$ plain form
10463 -20066978 -15460536 -12776444 -19145817 -24970245 -22696109 -20117437 -23467905 -25637319
10455 -25637319 -21810884 -19154512 -20862419 -18121433 -8356569 -4096175 -12024240 -19427401
10447 -19427401 -14258611 -4250067 -2647472 -7440902 -8676419 -6284376 -6800902 -9674988
10439 -9674988 -9374819 -6159194 -4616943 -5484179 -6678313 -8261971 -10169758 -9691203 -6407479
10430 -6407479 -4483124 -5741369 -6365228 -4352766 -3515506 -6090429 -8593287 -9172378 -11473929
10421 -11473929 -16664639 -19422080 -16908651 -14077027 -14725039 -14883581 -10861437 -6477969
10413 -6477969 -6040947 -6957155 -5716276 -4788074 -6944831 -8596598 -5544090 -343492 2344942
10404 2344942 3052902 4289825 4722515 2408127 -469939 -1577632 -2918347 -6231361
10396f231361k202124J396580J266928l399810o042970l200035J538916M778939
10388a2094937O237682M582955p28206m057558Q2181N958748L106989o120776
10380c032922q267308Q2217O444564K343876l962333k086752M171299M599586
10372B92227j130007m871654l228908m72495j19926o21015N73405L074699M348171
10363b155503K745623l01686j497701k36237r2912l076060n214904k544858J468240
10354a0905998J070387j637463l2481M796273M958229l91038k633783J819726
10346b956148M889359J00526o453231n698947O70445M105494K246214m7167j13358
10337c256813k24135j445789j344789J019842K558807O31279k712228l141594
$$ plain form
10396 -6231361 -8433485 -7036905 -5769977 -9169787 -15212757 -18412792 -16873876 -12094937
10388 -12094937 -5857255 -1274300 -2002506 -6060064 -5977883 -19135 3087854 -3032922
10380 -3032922 -11300230 -11218013 -4773449 -2429573 -6391906 -8478658 -4307359 292227
10372 292227 -837780 -5709434 -8938342 -9410837 -9530763 -10151778 -9578373 -6503674 -2155503
10363 -2155503 590120 288434 -1209267 -1445504 -1538416 -4614476 -9829380 -12374238 -10905998
10354 -10905998 -9835611 -11473074 -11505555 -6709282 -1751053 -2142091 -4775874 -2956148
10346 -2956148 1933211 2033737 -4419494 -10118441 -9447996 -5342502 -3096288 -3143455 -3256813
10337 -3256813 -3480948 -4926737 -6271526 -5251684 -2692877 -2061598 -4773826 -7915420
10329g915420K52085L495092K620136j087780k781571r67721N01308j072962k614395
10320i571228o83940K110900J403971r14878M75890M817837N792506J723034j940064
10311C214028j704508o55201j567057j975573K82313K218099P05337k008670k176297
10302c667529n22319n0470m91720P60703L618229M931324K804320j136433l657781
10293B588324k892398J09427K272472J693216k58473j253001j457834k398065
10285a596332l343981k105913Q47394K489280J650341K01429l05357j73981J25532
10276b211588K09874j009378l166561k948590J058056L968388Q03719m521926
10268g818006l799581K425610N131666J314667j438282J636307M262967N72841
$$ plain form
10329 -7915420 -7663335 -4168243 -1548107 -2635887 -5417458 -6385179 -5883871 -6956833 -9571228
10320 -9571228 -10255168 -8144268 -6740297 -7655175 -7179285 -2361448 3431058 5154092 3214028
10311 3214028 1509520 854319 -712738 -2688311 -2405998 -187899 517438 -1491232 -3667529
10302 -3667529 -4189848 -4240318 -4732038 -3971335 -353106 4578218 7382538 6246105 2588324
10293 2588324 -304074 -194647 2077825 3771041 3512568 2259567 801733 -1596332
10285 -1596332 -4940313 -7046226 -6198832 -3709552 -2059211 -1857782 -2163139 -2337120 -2211588
10276 -2211588 -2001714 -3011092 -6177653 -9126243 -8068187 -4099799 -3296080 -7818006
10268 -7818006 -11617587 -9191977 -4060311 -2745644 -4183926 -2547619 1715348 2288189
10260B288189l881734j277591M646886M126155k686697n881036j509230K657199
10252a517859m57449o832524p735037j657117M805900N795914K057653j617446
10244g157965k144890m88770O64296K20317q74990j527214j251525N94933M129888
10235g835920P113219O198935J144781m188837o109041m416842o99297L886600
10227d906402P454318O954763J820630l776932n300438l390327k250009l257468
10219f651865l334139j28997L859912M129503J27872l583233k762426J214156
10211g129217L286331J513777q19188p17760K80915k26911r17107L52401J786622
10202b590137O64957j062640P3270J964429j58812m400193l725611K273568N533559
$$ plain form
10260 2288189 -1593545 -2871136 1775750 5901905 3215208 -2665828 -4175058 -1517859
10252 -1517859 -1975308 -8807832 -16542869 -18199986 -13394086 -7598172 -5540519 -7157965
10244 -7157965 -9302855 -9791625 -9127329 -8907012 -9782002 -11309216 -12560741 -11965808 -7835920
10235 -7835920 -722701 5476234 6621015 2432178 -3676863 -8093705 -8793002 -4906402
10227 -4906402 2547916 9502679 11323309 7546377 2245939 -1144388 -3394397 -6651865
10219 -6651865 -9986004 -10115001 -6255089 -2125586 -1997714 -5580947 -8343373 -7129217
10211 -7129217 -3842886 -2329109 -3148297 -3866057 -3585142 -3812053 -4729160 -4376759 -2590137
10202 -2590137 -1925180 -2987820 -2914550 -950121 -1108933 -5509126 -9234737 -6961169 -1427610
10193a427610K088122j716601J97305M381964M648423J603231o69481j841700
10185G263653k981529k109456J374152K727625q42190l901800j319000K134028
10177B345483k65018m455832j855728M953690N498246n78475k429699L154089
10169F366756N634137j325047q493409n978529Q21169O62046n305348o314387
10161a3932612M95791O383652M648404r92871l384636r35259K474723K599081
10153b643727j360527n478036m180067K612669P246441L438919m163077n241476
10145i768881J880698P660013M531320l335255o689823l012446K463145M639730
10137a631499L187911M61009j592460k229833j808645j420991j865762k974071
$$ plain form
10193 -1427610 660512 -1056089 -858784 3523180 8171603 9774834 9105353 7263653
10185 7263653 4282124 2172668 3546820 6274445 5432255 1530455 211455 2345483
10177 2345483 2080465 -2375367 -4231095 722595 6220841 5642366 3212667 6366756
10169 6366756 12000893 10675846 2182437 -3796092 -2974923 -2312877 -7618225 -13932612
10161 -13932612 -13436821 -7053169 -2404765 -3397636 -6782272 -7717531 -5242808 -2643727
10153 -2643727 -4004254 -9482290 -13662357 -11049688 -3803247 -364328 -4527405 -9768881
10145 -9768881 -7888183 -228170 4303150 967895 -5721928 -8734374 -6271229 -1631499
10137 -1631499 1556412 2017421 424961 -1804872 -3613517 -5034508 -6900270 -9874341
10129i874341l917147l457706m32065M248039O605595L584150j734009k656367
10121g633851K014542N563323K762316k470143l197520Q3340J003235k255296
10113d130054m522056k014986K592835M948508M075757J126256k356744l400347
10105c680831K30373M905588L703292l107017o338785j000228N292318L543422
10097C548132k735243l700050P95496K077970j773937k900305J877686M794764
10089A984513K73468n260865l684537K179158M275058K085268R23849J240778
10081D016690j027663m949249m600300P35047M435992K726884P0375J195272L540625
10072F143673K067521k328000m143868j356659K056449J782636j493287l533824
$$ plain form
10129 -9874341 -13791488 -17249194 -17681259 -13433220 -6827625 -3243475 -4977484 -7633851
10121 -7633851 -5619309 -55986 2706330 236187 -2961333 -2877993 -1874758 -4130054
10113 -4130054 -8652110 -10667096 -8074261 -3125753 950004 2076260 -280484 -3680831
10105 -3680831 -3450458 1455130 5158422 2051405 -4287380 -5287608 4710 3548132
10097 3548132 812889 -2887161 -2091665 -13695 -1787632 -4687937 -2810251 1984513
10089 1984513 2257981 -3002884 -6687421 -4508263 -233205 1852063 2775912 4016690
10081 4016690 2989027 -1960222 -6560522 -5825475 -1389483 1337401 1407776 2603048 6143673
10072 6143673 8211194 5883194 1739326 382667 2439116 4221752 2728465 -805359
10064h05359k093130M76120P03114r97897r66263J881787L892239K113566j061924
10055C142253j679554r2477P52134O85196J287121J160673k117356n931684m743492
10046g537186R90197M179034J244501k923406k890884r4402J349031J452928K435571
10037a794616L552091K597917L06394q66503p07610p13446j259386j994493l053193
10028c932845l543059j480473K389981M070095K320350J057650K289693J767816
10020D939208l043428n921834n17448P761669P825967o56736o672463m274056
10012e59121J04372n72183l765775l700631q05517Q94616Q91101J182149J566522
10003d764467P78578j62514K55999R90397M44893n45534n03788Q1862L06193O14191
$$ plain form
10064 -805359 -2898489 -2422369 -1719255 -2717152 -3683415 -1801628 2090611 4204177 3142253
10055 3142253 1462699 1370222 2122356 2807552 4094673 5255346 3137990 -2793694 -7537186
10046 -7537186 -6546989 -2367955 -1123454 -4046860 -6937744 -7032146 -5683115 -4230187 -1794616
10037 -1794616 1757475 4355392 4661786 3795283 3087673 2374227 1114841 -879652 -3932845
10028 -3932845 -7475904 -8956377 -6566396 -2496301 -175951 881699 3171392 4939208
10020 4939208 1895780 -4026054 -4543502 3218167 11044134 10387398 3714935 -559121
10012 -559121 -454749 -1026932 -4792707 -8493338 -9298855 -8404239 -7513138 -6330989 -4764467
10003 -4764467 -3985889 -4148403 -3892404 -2902007 -2457114 -3002648 -3506436 -3424574 -3118381 -2504190
9993b504190R82548J49272j457826j415332J69590L5384k002902j384641L112250
9984d315847N337624J056804m143368l086065J413164J453257k700294l665818
9976h650543J75261K773136J827843K018245M422289K775833m805274r417776
9968h880986l970261M766425N477701r81946l982522j43729K541401j008980m438479
9959a0621376p41175N829713O086414N3837l557521j112534J141560j709801m822010
9950i452893j754325M359406N270099O57108j623941J472274L389882p82051n783469
9941d247910m494495O83905J833554k033171l908637K85387O172452P557784L747938
9932E596807j422530m220506l075511R84635M302257L294212j295837m591750
$$ plain form
9993 -2504190 -1521642 -1372370 -2830196 -4245528 -4075938 -4040554 -6043456 -7428097 -4315847
9984 -4315847 1021777 2078581 -2064787 -5150852 -3737688 -2284431 -4984725 -8650543
9976 -8650543 -8475282 -5702146 -3874303 -1856058 2566231 5342064 536790 -8880986
9968 -8880986 -12851247 -8084822 -2607121 -3589067 -7571589 -7715318 -5173917 -6182897 -10621376
9959 -10621376 -11362551 -5532838 553576 607413 -2950108 -4062642 -2921082 -4630883 -9452893
9950 -9452893 -11207218 -6847812 -1577713 -920605 -2544546 -1072272 2317610 1535559 -4247910
9941 -4247910 -8742405 -8058500 -6224946 -8258117 -12166754 -11881367 -5708915 1848869 5596807
9932 5596807 4174277 -46229 -3121740 -2137105 2165152 5459364 4163527 -428223
9924d28223l277485M31205J876956n7270j824798k67594K729921K523283j434063
9915B71932l986421j567492K028326J369221j713249j268486K095950J902293
9907h67926k218984k719871K668872N838110J765009k688444r15784J911866q57899
9898A914949m139761j23973O370374M981537k584742n895666l292629j892611
9890d662522k650905k21448L730546K259362k500580k125506J710304L05991l598150
9881g752908J76406P007117K450038q415754m600870J0396616M279438l0503124
9873b6963041n1100297k1329221L0439182M6797582J9424862p455102n315843
9866a5501878P517999P143318j023797k627577m90946k323587l042717L179970
$$ plain form
9924 -428223 -3705708 -3274503 -1397547 -1454817 -3279615 -3547209 -817288 1705995 271932
9915 271932 -3714489 -5281981 -3253655 -1884434 -3597683 -4866169 -2770219 -867926
9907 -867926 -3086910 -5806781 -3137909 2700201 4465210 1776766 860982 2772848 1914949
9898 1914949 -2224812 -2348785 4021589 9003126 6418384 522718 -2769911 -4662522
9890 -4662522 -7313427 -7534875 -3804329 -1544967 -4045547 -6171053 -4460749 -4154758 -7752908
9881 -7752908 -7576502 -569385 1880653 -6535101 -11135971 -739355 3540083 -26963041
9873 -26963041 -78063338 -99392559 -68953377 -22155795 -2730933 -10186035 -15501878
9866 -15501878 -7983879 -840561 -1864358 -4491935 -4982881 -7306468 -10349185 -7169215
9858g169215Q505462M714612j320349L40292N472488L923315l158988o799572
9850D508045m626593j076169J542152L141966K140415p17460m09093L805305M651688
9841A2960256j487295p037199n306340j719690l364821n463982r7198Q053913
9833c462356Q019548O89179k881531K91730J801439k528902o011842l156207J786635
9824e452307K632363j2213k038575k101581j025456N78423J373763k67717l004308
9815i317608l200742j82689K628773K782693J529980P18684M12947L46845N37974
9806c743143J7950j923725l311821j814689Q43093R65530q16873k36675L152554
9797f867799M581817J682853j708947j811634j88625K94786M20464J700732K292847
$$ plain form
9858 -7169215 1336247 6050859 4730510 5070802 10543290 14466605 11307617 4508045
9850 4508045 -118548 -1194717 347435 3489401 5629816 4912356 4503263 8308568 12960256
9841 12960256 11472961 4435762 -870578 -2590268 -5955089 -11419071 -11516269 -3462356
9833 -3462356 4557192 5246371 2364840 2656570 4458009 1929107 -4082735 -7238942 -5452307
9824 -5452307 -2819944 -2832157 -4870732 -6972313 -7997769 -7419346 -6045583 -6313300 -9317608
9815 -9317608 -12518350 -12701039 -10072266 -7289573 -5759593 -5040909 -4627962 -4281117 -3743143
9806 -3743143 -3725193 -5648918 -8960739 -10775428 -9932335 -8966805 -9783678 -10020353 -6867799
9797 -6867799 -2285982 -603129 -2312076 -4123710 -4312335 -4017549 -3597085 -1896353 396494
9788C96494L65074j362099N03688L540561K415629k413848m611736j399278K296827
9779b68688J380331k344389m028315l043679k029831j151876J512538M716734
9771e257175M547923R52085j137380R17828L394587K195264r18669j809820p50242
9762B134401j226204l506070l932188n38441M134177O214943M191755l83177m028004
9753C061192m004949j501419m77385j707211j098803L194816O054302K713884
9745F234427k854542l447927J69224J279502j218147j999447J32924K92947k392636
9736c803675k199074K556912N306044K028541k110653k113583j081563k619844
9728d036895l060467J077648M547999J157988m915044m870949J008800M533919
$$ plain form
9788 396494 761568 -600531 -96843 3443718 5859347 3445499 -1166237 -2565515 -268688
9779 -268688 1111643 -1232746 -5261061 -8304740 -10334571 -11486447 -9973909 -5257175
9771 -5257175 -709252 242833 -894547 23281 3417868 5613132 4694463 2884643 2134401
9762 2134401 908197 -2597873 -6530061 -7068502 -2934325 3280618 7472373 7089196 3061192
9753 3061192 -943757 -2445176 -2922561 -4629772 -5728575 -2533759 3520543 6234427
9745 6234427 3379885 -68042 101182 1380684 162537 -1836910 -1703986 -1411039 -3803675
9736 -3803675 -6002749 -3445837 1860207 3888748 1778095 -335488 -1417051 -4036895
9728 -4036895 -7097362 -6019714 -1471715 -313727 -5228771 -10099720 -9090920 -4557001
9720d557001K485438l98640n43496L29130M28065N40481R06429Q02624J172050
9711A165080K966960L849807J392920j938256k171629l50454j02717r03708j08411
9702C799592N64811k043323m932573k531155L041054M096963j86887k565867J1027
9693g46358K222265O31001j079031m53915r93664m073242m418789P88064N557391
9684b566278M073399j95603r64590O79395k67330l163367l039928Q02673M013178
9675f28451L805445J308579j438250k707324j027883K323400K995790n57191l649046
9666D25069j950182J596503J399699k123104m194902l663106l079314k338570
9658a3927907J025279N489609O083825K153274j282468j342970j006587k890391
$$ plain form
9720 -4557001 -2071563 -2470203 -3013699 -2684569 -2256504 -1716023 -809594 -6970 1165080
9711 1165080 4132040 7981847 9374767 7436511 5264882 4914428 4811711 3908003 3799592
9702 3799592 4364403 2321080 -2611493 -5142648 -2101594 1995369 1808482 -757385 -746358
9693 -746358 1475907 2106908 1027877 573962 -419702 -4492944 -8911733 -8123669 -2566278
9684 -2566278 1507121 1311518 346928 1026323 758993 -2404374 -5444302 -4641629 -628451
9675 -628451 3176994 4485573 3047323 339999 -687884 1635516 4631306 4074115 425069
9666 425069 -1525113 71390 1471089 -652015 -4846917 -8510023 -11589337 -13927907
9658 -13927907 -12902628 -7413019 -1329194 824080 -458388 -1801358 -2807945 -5698336
9650e698336m214506j210590M647930Q025992N859316J49444m472830n081071
9642a994651k990389j771509k220517j281931K251553M105884O20027m225646
9634g507179l697140J234524L232640L57951j218443J875413M432222J803407
9626E13395k122934j736196R56664L91338k952309l865516j101593J697006K531432
9617e688713K584956J942120n62241l330919l070196j08692K029907K385113L082715
9608g35950M072014K613719j284937m092671m432734m424425m273450j251661
9600a3810095L981740O001921K721428n63503Q49825L937220L415907K13411p45377
9591F002477J663521M111863L957139R63816l987527q244648p965222l058684
$$ plain form
9650 -5698336 -9912842 -11123432 -6475502 1550490 7409806 7559250 3086420 -1994651
9642 -1994651 -4985040 -6756549 -8977066 -10258997 -8007444 -3901560 -3281533 -7507179
9634 -7507179 -11204319 -9969795 -6737155 -6379204 -7597647 -5722234 -1290012 513395
9626 513395 -1609539 -3345735 -2389071 -1997733 -4950042 -8815558 -9917151 -8220145 -5688713
9617 -5688713 -3103757 -1161637 -1723878 -5054797 -8124993 -8233685 -6203778 -3818665 -735950
9608 -735950 3336064 5949783 4664846 572175 -3860559 -8284984 -12558434 -13810095
9600 -13810095 -9828355 -3826434 -1105006 -1668509 -818684 3118536 6534443 6747854 6002477
9591 6002477 7665998 11777861 15735000 16698816 12711289 4466641 -3498581 -6557265
9583f557265J276491J611923J174271L257296M350407K69410m838518l715602
9575c171587K111881M192385m2574m697626n451617l829833j106901L398420O792145
9566a805307M240778j791520k783598K595470N571729J362611l192399j448580
9558B749184K581851K473294P2175p1932n5142l479684o504256l487347K413823
9549c308034L616364K26046j241660Q47384K123944J119283P05611J145668k46161
9540D988445k573675j999603J027289K202045P56123n53245j960845n286510o882418
9531a0282394j389508P091483P924336K11040m434132M48361O040106K385122
9523G994414o178230q371452k679581K497788K106377o58591j640258q77409k5247
$$ plain form
9583 -6557265 -5280774 -3668851 -2494580 762716 5113123 5382533 544015 -3171587
9575 -3171587 -1059706 3132679 3090105 -1607521 -7059138 -10888971 -11995872 -8597452 -1805307
9566 -1805307 2435471 643951 -2139647 455823 6027552 7390163 4197764 2749184
9558 2749184 5331035 7804329 7876504 7804572 7749430 4269746 -2234510 -5721857 -3308034
9549 -3308034 308330 534376 -707284 140100 2264044 3383327 4088938 5234606 4988445
9540 4988445 2414770 415167 1442456 3644501 4400624 3847379 1886534 -3399976 -10282394
9531 -10282394 -11671902 -4580419 3343917 3554957 -879175 -430814 5609292 7994414
9523 7994414 1816184 -6555268 -9234849 -6737061 -4630684 -5289275 -6929533 -7806942 -7832189
9514g832189M49121O96750R98295J831816K740582K357245R30835N99242J668052
9505D439749J663045j09222q70838L22559R0355k876832l726005J042208O139514
9496F114533M236715k595149n566652k119663J414717N37119j579813j277974
9488h36167o64313k471480l703648Q5168O623559Q458563K639174n199392p703628
9479b772164m104919K84253J410648N75604P13118J233524o45258m309973n211343
9470a2826510j183417L854271N069839L244089K688978M076269L674831L9349
9462H637699k882574j589811J174664Q2426m570042o439386j981420L778124L479246
9453c11074k331893n598096j863776L696076M204939R85473L97253L069216L010439
$$ plain form
9514 -7832189 -7383068 -6686318 -5688023 -3856207 -1115625 1241620 2172455 2771697 4439749
9505 4439749 6102794 5993572 5122734 5445293 5535648 2658816 -1067189 -24981 6114533
9496 6114533 10351248 7756099 2189447 69784 1484501 2021620 441807 -836167
9488 -836167 -1500480 -3971960 -7675608 -7590440 -966881 7491682 10130856 4931464 -2772164
9479 -2772164 -6877083 -6592830 -5182182 -4606578 -3893460 -2659936 -3305194 -7615167 -12826510
9470 -12826510 -14009927 -10155656 -5085817 -1841728 847250 4923519 8598350 8637699
9462 8637699 5755125 4165314 5339978 5422404 852362 -5587024 -7568444 -3790320 -311074
9453 -311074 -2642967 -8241063 -10104839 -6408763 -2203824 -1218351 -821098 2248118 5258557
9444E258557k071155o272433m256567R20385L060603J828633J311998K222686
9436B002707J377793j666218k887094J27683M281230M948475J511837k596777
9428G099636m021138k610503j010728j377484k473432j209160K394427M099843
9420H91461J291937k422489j842903K127517L700369Q18390k091709j165923J397787
9411B704437J476651n77147j194516M39108J351860l64783k716499k854763r48814
9402b684466N97723Q23844J225135K865587M062725K286860k135548n662241n256019
9393c876400j643226J539290J416897j354734l141319j087927L151394M595086
9385d00939J186263k715791j806998K422922L509293m75156m115696k902106O29511
$$ plain form
9444 5258557 3187402 -3085031 -7341598 -6421213 -3360610 -1531977 -219979 2002707
9436 2002707 3380500 1714282 -1172812 -1045129 3236101 8184576 9696413 7099636
9428 7099636 3078498 467995 -542733 -1920217 -4393649 -5602809 -3208382 891461
9420 891461 2183398 -239091 -2081994 45523 3745892 4564282 2472573 1306650 2704437
9411 2704437 4181088 3603941 2409425 2848533 4200393 3835610 1119111 -1735652 -2684466
9402 -2684466 -2086743 -1262899 -37764 2827823 6890548 9177408 7041860 1379619 -3876400
9393 -3876400 -5519626 -3980336 -2563439 -3918173 -7059492 -8147419 -4996025 -400939
9385 -400939 785324 -1930467 -3737465 -1314543 2194750 1719594 -2396102 -5298208 -4668697
9376d668697J989392J558208K148553L238467K507478O96873J1252m42775k550987
9367D487764m096058j400207L631588M920025R79643l111659l295146j016954
9359A098996Q50558J541474N66063k596038n281762l167458K831500O120527L472065
9350E435925l70126k64942J941691J606784j231713l076351k606976q63805J661789
9341B232276M274104M771747K372026m30807j779034k987161m285741k588702
9333A578708K283377M214289m35700n332647k886842L335148L704708k374886
9325D086155o169828l752710m99427m30541p23744O74707R54276o93818m24718
9316f979648K348482K557967r34938j945307J786058L019859k437218o561677
$$ plain form
9376 -4668697 -2679305 -1121097 1027456 4265923 6773401 7470274 7481526 7038751 4487764
9367 4487764 391706 -1008501 2623087 7543112 8522755 5411096 2115950 1098996
9359 1098996 1949554 3491028 4057091 1461053 -3820709 -6988167 -4156667 1963860 5435925
9350 5435925 5065799 4800857 6742548 8349332 7117619 4041268 1434292 570487 2232276
9341 2232276 6506380 11278127 13650153 13219346 11440312 8453151 4167410 1578708
9333 1578708 3862085 8076374 7640674 2308027 -578815 2756333 6461041 4086155
9325 4086155 -2083673 -5836383 -6335810 -6766351 -7490095 -6815388 -5861112 -6554930 -6979648
9316 -6979648 -4631166 -2073199 -3008137 -4953444 -3167386 -147527 -2584745 -9146422
9308i146422j645379N767565M674092k410977l870552J882201M930598R90385
9300A171511k917121j861508j75124j471185k119809K26683R72978k455157m199583
9291a2828315L92747N617209L875576k000650l462282K37606K101124m99844k366311
9282h933140R9715L352609L031593L77063q69120l78060o75649k394034k962784
9273i351807r0032M798702P288997M439178j614450n414485l828467J146174N394132
9264B767942O604115M446128o05589o436537r070976o151765k08041L673120L233202
9255a748401N17555j493819j787699q55605Q02215K797550M222762L877531J614144
9246G946233p65490j091592O7216n70413m197941o828064m023316K264482N456566
$$ plain form
9308 -9146422 -10791801 -5024236 -350144 -2761121 -6631673 -4749472 181126 1171511
9300 1171511 -1745610 -3607118 -3782242 -5253427 -7373236 -7146553 -6173575 -8628732 -12828315
9291 -12828315 -12435568 -6818359 -2942783 -4943433 -8405715 -8168109 -6066985 -6566829 -8933140
9282 -8933140 -8833425 -5480816 -2449223 -2072160 -2941280 -3319340 -3994989 -6389023 -9351807
9273 -9351807 -9441839 -4643137 2645860 7085038 5470588 56103 -3772364 -2626190 2767942
9264 2767942 9372057 13818185 13212596 6776059 -2294917 -8446682 -8654723 -4981603 -1748401
9255 -1748401 -1230846 -2724665 -4512364 -5367969 -4565754 -1768204 2454558 6332089 7946233
9246 7946233 7180743 6089151 6156367 5585954 1388013 -5440051 -9463367 -7198885 -1742319
9237a742319K943987j180853k607048j572766K27770K724625M888481L553830
9229G235707j542718n186194l196845J389889K805102O82996p68098J94210J421044
9220C035093J542537J532133J699557R60327n71240j292781p07409N1428J92425
9211F442070l20663j848770m379002o159470n112560j481967K277510L789905
9203f792947K277583q40717k311778j76891K859627K270653j228825j759166K628266
9194c074195N991456L243001j984363l229224r63843n60597l290991n424397m638124
9185a3931277j846509J984548N788343O635345L035637j351804j993141K35600
9177a443258J595444J806007K482329K026665j504154m696958k940869J394404
$$ plain form
9237 -1742319 1201668 20815 -2586233 -4158999 -3931229 -1206604 3681877 7235707
9229 7235707 5692989 506795 -2690050 -1300161 1504941 2187937 1419839 1614049 3035093
9220 3035093 4577630 6109763 7809320 8769647 8198407 6905626 6198217 6249645 6442070
9211 6442070 6121407 4272637 -106365 -6265835 -11378395 -12860362 -10582852 -6792947
9203 -6792947 -4515364 -5356081 -7667859 -7844750 -4985123 -2714470 -3943295 -5702461 -3074195
9194 -3074195 2917261 6160262 4175899 946675 -17168 -577765 -3868756 -9293153 -13931277
9185 -13931277 -15777786 -13793238 -8004895 -1369550 1666087 314283 -1678858 -1443258
9177 -1443258 152186 1958193 4440522 6467187 4963033 266075 -2674794 -1280390
9169a280390K138005p01101j674881L86794J335765l871n02652K47409n11279
9160e66201j929504m09704K526561J765721j568827j065989L178916L711267j242152
9151D400088m206137j257804J845012P26085m77260J452805J917944k267903n536731
9142c403901k915643J090090P82347p49399J624893M694521K475377k623135l393223
9133b418073N77012L258283J970159m37488j522595j292814O0624J667445J503241
9124C365794J51317J203967M203425K835013m722492j0091978o263679J304610
9116h014023L449780J458454K589637N968051M321268k231168n394481j886422
9108B61096K483749L006474J577805N28165j059183k865299k113808J074511K917947
$$ plain form
9169 -1280390 857615 156514 -1518367 -1131573 204192 200321 -302331 -54922 -566201
9160 -566201 -2495705 -2905409 -378848 1386873 -181954 -1247943 1930973 5642240 4400088
9151 4400088 193951 -1063853 781159 1507244 1029984 2482789 4400733 2132830 -3403901
9142 -3403901 -6319544 -5229454 -4447107 -5196506 -3571613 1122908 3598285 975150 -2418073
9133 -2418073 -1841061 1417222 3387381 2949893 1427298 134484 195108 1862553 3365794
9124 3365794 3517111 4721078 8924503 11759516 7037024 -3054954 -9318633 -8014023
9116 -8014023 -4564243 -3105789 -516152 5451899 9773167 7541999 2147518 261096
9108 261096 2744845 5751319 7329124 7857289 6798106 3932807 1818999 2893510 5811457
9099E811457K002747O25451o51858l819354p684422p443880k035092L280394L891937
9090f022620J142332j185336j847697j737227j433798p17880J060937M115052
9082f626237O475619N011752K96721k546688j002433O48541j313990k966230O41180
9073a381765N846199N483327Q44510o16027J831530J421006l600451o516065l471404
9064a59140N68397O05889j261016j436346r89482j905597k492162p87489J490579
9055f366367J959460J261015J094090J536008K107394K536372J556405j623220
9047D061157m298574k860259J309620L121940J227985q29662j146047j515193
9039i29033k413178j885016k71007J16793O87669M769998R041205N420851n419722
$$ plain form
9099 5811457 7814204 8439655 7787797 3968443 -3715979 -11159859 -13194951 -9914557 -6022620
9090 -6022620 -4880288 -6065624 -7913321 -9650548 -11084346 -11802226 -10741289 -6626237
9082 -6626237 -150618 4861134 5157855 2611167 1608734 2257275 943285 -2022945 -1381765
9073 -1381765 4464434 9947761 10792271 10176244 12007774 13428780 9828329 3312264 -159140
9064 -159140 409257 1015146 -245870 -1682216 -2671698 -4577295 -7069457 -7856946 -6366367
9055 -6366367 -4406907 -3145892 -2051802 -515794 1591600 4127972 5684377 4061157
9047 4061157 -237417 -3097676 -1788056 1333884 2561869 1732207 586160 -929033
9039 -929033 -3342211 -5227227 -5498234 -5381441 -4693772 76226 9117431 14538282 9118560
9030I118560j1383915n174810M649719N864027m87538l670653K55985M458610
9022C629985K857953k080352m516080k929728k98416O73986L00811L93835J209783
9013g58223J113502k91199p19678J056018K277420M73199j594509j75687K240263
9004C621106M51517l755772l348300K004215M441538P47668k227457O60334M051918
8995F646767J372051m084001m981833j729331k80120j467230p44227K753696M435480
8986A921252K004589j027259j022115Q53758J095697j330153m065532m180729
8978e750492j370364J627236K330214J598761J644116J921375L49808j853455
8970D97199j141486K021786K961626M70092q45468J425800K757806q09941n215155
$$ plain form
9030 9118560 -2265355 -7440165 -2790446 3073581 2586043 -1084610 -828625 3629985
9022 3629985 6487938 4407586 -108494 -3038222 -3336638 -2662652 -2361841 -1968006 -758223
9013 -758223 355279 64080 -655598 400420 2677840 3151039 1556530 1380843 3621106
9004 3621106 4072623 316851 -3031449 -1027234 3414304 4161972 1934515 2594849 6646767
8995 6646767 8018818 3934817 -1047016 -2776347 -3056467 -4523697 -5267924 -2514228 1921252
8986 1921252 3925841 2898582 1876467 2730225 3825922 2495769 -1569763 -5750492
8978 -5750492 -7120856 -5493620 -3163406 -1564645 79471 2000846 2350654 497199
8970 497199 -644287 1377499 4339125 4809217 3963749 5389549 8147355 7337414 2122259
8961B122259l950695J865960M728709J076519m364908n050802l59065M278727
8953C46704L939834j06729k373500q41458L94213j709881l553458j290994J437540
8944c757729l53771k677146J489874P897595N275171n185252q655156M93184Q697906
8935C224676M065603n531415o160562Q80557M471720K659010K189838L683869
8927I483296J213793m924339p431382m129571n05656K40288N28769J491483J237226
8918b796093L26312J104426J710088j308688m817976k259061M769567P296510
8910D025085K778536j089604P63096K866287j092330p635622q552029k454459
8902a0391040M123823N333312J834480j439497j121726J407956K606362J924881
$$ plain form
8961 2122259 -1828436 37524 4766233 5842752 1477844 -3572958 -3932023 346704
8953 346704 4286538 4179809 1806309 964851 1359064 -350817 -3904275 -5195269 -3757729
8944 -3757729 -4111500 -6788646 -5298772 2598823 7873994 2688742 -5966414 -5473230 3224676
8935 3224676 7290279 1758864 -4401698 -3521141 950579 3609589 5799427 9483296
8927 9483296 10697089 5772750 -1658632 -5788203 -6293859 -6053571 -5524802 -4033319 -2796093
8918 -2796093 -2469781 -1365355 344733 -963955 -5781931 -8040992 -3271425 4025085
8910 4025085 6803621 5714017 6477113 9343400 8251070 615448 -7936581 -10391040
8902 -10391040 -6267217 -933905 900575 -538922 -1660648 -252692 2353670 4278551
8894D278551J965958K918259J081264m387272p961713n484786j031286l90261
8886i011286j867185m76950K413368J857609q80278k94251L006707L165671j11741
8877b198336j091921J104241R40651k393863k201064L736410P557640L094378
8869H548136m219407n478841q70072K341116R13666j345096m70213K264322K517333
8860D200944j164249m498991k150515M094665N623806j188318q020811n657916
8852h761385K065308M102947o10264k560029J902918N137639J915251k423645
8844G68740k258227m94524j235093k044873o5046J357641j003172l398474j362923
8835i735951K396232K846491O52907p14101j185822j457045Q20064N702444O915901
$$ plain form
8894 4278551 6244509 9162768 10244032 5856760 -2104953 -7589739 -8621025 -9011286
8886 -9011286 -10878471 -11355421 -8942053 -7084444 -7964722 -8258973 -5252266 -2086595 -2198336
8877 -2198336 -3290257 -2186016 -1245365 -3639228 -5840292 -2103882 5453758 8548136
8869 8548136 4328729 -1150112 -2020184 320932 1234598 -110498 -580711 1683611 4200944
8860 4200944 3036695 -1462296 -3612811 481854 6105660 4917342 -3103469 -8761385
8852 -8761385 -6696077 -2593130 -3203394 -5763423 -3860505 1277134 3192385 768740
8844 768740 -1489487 -1984011 -3219104 -5263977 -5329023 -3971382 -4974554 -8373028 -9735951
8835 -9735951 -7339719 -4493228 -3840321 -4554422 -5740244 -7197289 -6377225 -674781 6241120
8826F241120O19365o335666n211955J242385L260080o92556k897209J74375L245504
8817c54557K362437P24368J494618K256294M73245j486236j030426l87088k490803
8808A561852n222730m335064j45613K891474K451421N52996m27656p45283j373215
8799d791818j542996M9967K725374M194540L156050L28032k698426m260085k854582
8790e693944J207611M453857L388188m43770j860391L55296J509639j004700k825164
8781i13378j37872K833305M08639m305641l949742O36316J875962j188629j286010
8772f027050L641716N832217P46430m766156l461294J094036J566501j284999
8764b658599j787017L14909R15119q2240O95921K853458K656419p6256j815804
$$ plain form
8826 6241120 6860485 524819 -4687136 -3444751 -184671 -877227 -3774436 -3600061 -354557
8817 -354557 2007880 2732248 4226866 6483160 6956405 5470169 4439743 4052655 1561852
8808 1561852 -3660878 -7995942 -8141555 -5250081 -2798660 -2245664 -2673320 -3418603 -4791818
8799 -4791818 -6334814 -6284847 -3559473 635067 3791117 4119149 1420723 -2839362 -5693944
8790 -5693944 -4486333 -32476 3355712 2911942 1051551 1406847 2916486 1911786 -913378
8781 -913378 -1051250 1782055 2190694 -2114947 -6064689 -5428373 -3552411 -4741040 -6027050
8772 -6027050 -2385334 3446883 4193313 -572843 -4034137 -2940101 -1373600 -2658599
8764 -2658599 -4445616 -4130707 -3215588 -3297828 -2601907 251551 2907970 2831714 1015910
8755A015910j670254k061923l068432j755828J894860L385806J3632m692680n167359
8746a2106268p23692L601550K973547j334715l143115P37486N718784N456510
8738A180087R50388j383693j42820o93500n039407p334216l302263K564441M360642
8729h840341L393171L461110K971763r32777m581351k263617L827162N959075
8721B994195K143587j961107k072791Q0054J307705Q33131o29583j578345j45449
8712I71397K683162K388075k430579n873850k670139L049520L676887j90951k024696
8703d21174r60162j722811l881376j540058M977139P321279K211251k849025j408269
8694A726794K487652K133838j413141k943561j900819j379377k014701k344957
$$ plain form
8755 1015910 -654344 -2716267 -5784699 -7540527 -5645667 -2259861 -2246229 -6938909 -12106268
8746 -12106268 -12829960 -9228410 -6254863 -7589578 -10732693 -9995207 -4276423 1180087
8738 1180087 2130475 746782 603962 -89538 -5128945 -12463161 -15765424 -13200983 -8840341
8729 -8840341 -5447170 -1986060 985703 52926 -4528425 -6792042 -2964880 2994195
8721 2994195 5137782 3176675 1103884 1183938 2491643 3324774 2695191 1116846 971397
8712 971397 3654559 6042634 3612055 -2261795 -4931934 -1882414 1794473 1603522 -421174
8703 -421174 -1381336 -3104147 -6985523 -8525581 -3548442 3772837 5984088 3135063 1726794
8694 1726794 4214446 6348284 4935143 1991582 90763 -1288614 -3303315 -5648272
8686e648272k407095k410014o75412K925638M579645J964730r84452L80881L789547
8677A515196L425536q42997l424152j713274P19708M40357j149063j171511L44633
8668a855567J671559K383456K795610K054694p56245m139656m948141k127276
8660d921566J578493K511159J21758k695159k977429m98162K666309M204397K999944
8651B989744k16751l038484l271653j249700O95805J195952P14804m89919k576379
8642e246581l631835n85144N290347P473482K443889m096799m026829J887933
8634d91537M945471P15246n096345m840837J117859N729414M503261K38575j658901
8625E162206l74382j5275k673827m287614o57101M563876L682703l056739o242573
$$ plain form
8686 -5648272 -8055367 -10465381 -11140793 -8215155 -3635510 -1670780 -2655232 -2274351 1515196
8677 1515196 4940732 4097735 673583 -1039691 -319983 120374 -1028689 -2200200 -1855567
8668 -1855567 -184008 2199448 4995058 7049752 6293507 2153851 -2794290 -4921566
8660 -4921566 -3343073 -831914 -710156 -3405315 -6382744 -6880906 -4214597 -10200 2989744
8651 2989744 2772993 -265491 -3537144 -4786844 -4091039 -2895087 -2180283 -2670202 -5246581
8642 -5246581 -8878416 -9463560 -4173213 3300269 5744158 1647359 -2379470 -491537
8634 -491537 4453934 5169180 72835 -4768002 -3650143 2079271 6582532 6821107 5162206
8625 5162206 4787824 4772549 2098722 -2188892 -2845993 1717883 5400586 2343847 -3898726
8616c898726q03600O048399N308627j228362n146964l516242P7559K835756L906525
8607C582972J437806m152522o858505k609113K899634K057144k295201j900035
8599g837820K546808L309825l2348p53447J023306j638373p129876m977101N139122
8590a0349904R315942J310409o059398j075216Q288402P927383p45661n928229
8582B683728m289326j390573Q05745L782133M262593j180301o655538m229768
8574f211307K222840K647228k264069k831711K230695L959017o39618m003590
8566d890515k087722k03722j083898N18558N996525P275616J83963o519739l850219
8557d661153L641458N622649J244481k382551k367910j613216j084147P67192
$$ plain form
8616 -3898726 -4702326 1346073 6654700 5426338 279374 -3236868 -3159309 -323553 3582972
8607 3582972 5020778 868256 -5990249 -8599362 -5699728 -3642584 -5937785 -7837820
8599 -7837820 -5291012 -1981187 -2013535 -2766982 -1743676 -3382049 -10511925 -15489026 -10349904
8590 -10349904 -1033962 276447 -5782951 -6858167 1430235 9357618 8611957 2683728
8582 2683728 -1605598 -2996171 -2190426 1591707 5854300 4673999 -1981539 -6211307
8574 -6211307 -3988467 -1341239 -3605308 -6437019 -4206324 -247307 -886925 -4890515
8566 -4890515 -6978237 -7181959 -8265857 -7747299 -1750774 5524842 5708805 -810934 -4661153
8557 -4661153 -1019695 4602954 5847435 3464884 1096974 -516242 -1600389 -833197
8549h33197K145594m76061m857357m356683J927667O589571L834542k852224n894366
8540d772514l037675J606677L708273K559219l01017l000465l434628l43361M056559
8531b958932M774679O7043m816641l600341K115047M856503K570451J478223M908652
8522I394684O475867M82425p035786o562838m51935O21109m864798p083319j651493
8513a0676084L365849J838172k99565L192471O648387K209508n253155m766957
8505c741374K879160O049118M41521n191926l624511P85068R59443k196797l639898
8496g280196k691603j654240k64441K362748L331327j51788m199278k076228N375440
8487g248259R314453M623667l114186n292889r74283L780180M495898J987432
$$ plain form
8549 -833197 1312397 836336 -4021021 -8377704 -6450037 139534 3974076 1121852 -4772514
8540 -4772514 -7810189 -6203512 -2495239 63980 -237037 -3237502 -6672130 -7015491 -2958932
8531 -2958932 1815747 1882790 -2933851 -6534192 -4419145 437358 3007809 4486032 9394684
8522 9394684 15870551 16352976 9317190 2754352 2302417 2923526 -1941272 -9024591 -10676084
8513 -10676084 -7310235 -5472063 -5771628 -2579157 4069230 6278738 1025583 -3741374
8505 -3741374 -862214 5186904 5628425 436499 -3188012 -2402944 -1443501 -3640298 -7280196
8496 -7280196 -9971799 -11626039 -11890480 -9527732 -6196405 -6348193 -10547471 -12623699 -7248259
8487 -7248259 2066194 6689861 3575675 -1717214 -2691497 1088683 5584581 7572013
8479G572013j086992l083394k967278q44234P10617p19534k994164j501846L363114
8470a551698N323684J186849l831560l678036m71160n22841l926353m640966m29062
8461a2541143L797666L809402J544165M35274O6579j327050k621962j552009J481776
8452f907302M053645M525277K522195j192898l773522k064280K594614M360458
8444D118187L87335m636715m849612j378715J91087j414140k103836J99587K315148
8435g171674J350428p00714n06882J237751J248287o84244q73986K543822N689007
8426B131795L380206l293766p237245m281639J505015M047241L428833L282792
8418B963232K829592j499934p132952o374675J430921O876880L962446j040476
$$ plain form
8479 7572013 6485021 3401627 434349 -409885 300732 -418802 -3412966 -4914812 -1551698
8470 -1551698 3771986 4958835 1127275 -2550761 -3021921 -3544762 -7471115 -12112081 -12541143
8461 -12541143 -8743477 -4934075 -3389910 -2954636 -2888057 -4215107 -6837069 -8389078 -6907302
8452 -6907302 -2853657 1671620 4193815 3000917 -772605 -2836885 -242271 4118187
8444 4118187 4505522 -131193 -4980805 -6359520 -6168433 -7582573 -9686409 -9486822 -7171674
8435 -7171674 -5821246 -6521960 -7028842 -5791091 -4542804 -5227048 -6101034 -3557212 2131795
8426 2131795 5512001 2218235 -5019010 -9300649 -7795634 -3748393 -319560 2963232
8418 2963232 5792824 4292890 -2840062 -9214737 -7783816 -906936 3055510 2015034
8410B015034l95266K574518M54505m266332l044663L410747N232334p33780o098173
8401h51076m708824j302340j788853l539444j539360K489092L885497L002529
8393d352779K751458K203173o53305k909288n26998L814257L677045j094949m023586
8384a114972j911844J294062J796869J134563J704067K183416P09708j130804
8376D665065r84030K44534L14415m52246m26805k19761j513626l257128k628386
8367d257968K22428J886227R41676J63205J793416L627730K576660j48240j056877
8358E748257l02099j240316m086413m719468j312737K337832K786886K062652
8350A274594L048408L651680Q51888k420776j063211L009945K817178k328387
$$ plain form
8410 2015034 1619768 4194286 4648791 382459 -2662204 748543 5980877 5247097 -851076
8401 -851076 -5559900 -6862240 -8651093 -12190537 -13729897 -11240805 -7355308 -4352779
8393 -4352779 -1601321 601852 -51453 -2960741 -3487739 326518 4003563 2908614 -1114972
8384 -1114972 -3026816 -1732754 64115 1198678 2902745 5086161 5795869 4665065
8376 4665065 3681035 3925569 4239984 3787738 3360933 3141172 1627546 -1629582 -4257968
8367 -4257968 -4035540 -2149313 -1207637 -1044432 748984 4376714 6953374 6805134 5748257
8358 5748257 5446158 4205842 119429 -4600039 -5912776 -3574944 -788058 1274594
8350 1274594 4323002 7974682 8826570 6405794 5342583 8352528 11169706 8841319
8342H841319n066792j593711K436832J335824j988887k000953L21848M08342j827542
8333H66280l099387l089491l568203l333228j08687L909323M155464M25352l511433
8324g354010n515580n123760m34438Q176559J3145950P083368n023598r863805
8316d909314l497464L936553L858933K37503J27317K026189Q38436k262940k994115
8307b638902k231630l170386l807645k74868M849601N537444K059410m4626K41430
8298E19828j269063m819129n176841q08468L062959L051847K216867K994353K465191
8289B237544j009997k788544P33724M863638L229065j921722l065975R93576M078171
8280G349480K743030L91390N2339m92805l449978o024136m716184j152658O27190
$$ plain form
8342 8841319 3774527 2180816 4617648 5953472 3964585 1963632 2285480 2693822 866280
8333 866280 -2233107 -5322598 -8890801 -12224029 -12332716 -8423393 -4267929 -3842577 -7354010
8324 -7354010 -12869590 -17993350 -18427788 -10251229 2894721 9978089 4954491 -4909314
8316 -4909314 -8406778 -4470225 -611292 -373789 -246472 1779717 2618153 355213 -2638902
8307 -2638902 -4870532 -8040918 -11848563 -12123431 -7273830 -1736386 323024 278398 519828
8298 519828 -749235 -5568364 -10745205 -11553673 -8490714 -5438867 -3222000 -227647 2237544
8289 2237544 1227547 -1560997 -827273 4036365 7265430 5343708 2277733 3271309 7349480
8280 7349480 10092510 10483900 10536239 10043434 6593456 569320 -4146864 -5299522 -4672332
8271d672332M77929J359921L365693L076936p06698m478438m650887j760735J464424
8262f524187L570232M014695J986909j603047k974740J96548M470736M421201
8254G558347J56319l101765k987914k575882l643287k871730J719121N368825
8246c77966K997213k158852k666190J851458M370340J530145j948722j945605
8238A651821j315553l423173m876590q42966N688541O910783J677860k626338
8230B844385q97526K891169K694291n07390j309608J045634J794001j174039l490257
8221C890660j052699L161397L022991j664099m595808k031981J857111J322034
8213C909606k371231k928621J314432M511117J763203l288707l045057L322292
$$ plain form
8271 -4672332 -4194403 -2834482 531211 3608147 2901449 -1576989 -6227876 -7988611 -6524187
8262 -6524187 -2953955 1060740 3047649 1444602 -1530138 -1333590 3137146 7558347
8254 7558347 7714666 4612901 1624987 -950895 -4594182 -7465912 -5746791 -377966
8246 -377966 2619247 460395 -2205795 -354337 4016003 5546148 3597426 1651821
8238 1651821 336268 -3086905 -7963495 -8806461 -3117920 3792863 5470723 2844385
8230 2844385 1946859 4838028 7532319 7024929 5715321 6760955 8554956 7380917 3890660
8221 3890660 2837961 5999358 9022349 7358250 2762442 730461 2587572 3909606
8213 3909606 1538375 -1390246 -75814 4435303 6198506 2909799 -135258 3187034
8205C187034P979767M407671l936533p792974l619673K504172L150261j388992
8197D490733m783513l632963j115478j315384l217651k579441J823936O362954
8189c966807O925344L424612o03868k002272q21374P06044J156701Q63134J00097
8180E781611j649742l482995k478747J909994M759385J270179n263123o441624
8172e595062n91287M255251J882317l349328l808612K25592K758040K014393J260523
8163i48173J520535O29180q46716K52900K878395J883312l188474n790442j882649
8154e492132L764366M653086J441943p12942l06177o5163j251945k087132j525422
8145a581518q75390j095322j098153J88415J599269R97512j381856k254020N78923
$$ plain form
8205 3187034 11166801 15574472 11637939 3844965 225292 2729464 5879725 4490733
8197 4490733 -292780 -3925743 -5041221 -6356605 -9574256 -12153697 -10329761 -3966807
8189 -3966807 2958537 6383149 5779281 3777009 2955635 3661679 4818380 5681514 5781611
8180 5781611 4131869 648874 -1829873 80121 4839506 6109685 846562 -5595062
8172 -5595062 -6186349 -1931098 -48781 -3398109 -7206721 -6981129 -4223089 -2208696 -948173
8163 -948173 572362 1201542 354826 607726 3486121 5369433 2180959 -3609483 -5492132
8154 -5492132 -1727766 2925320 4367263 3654321 3348144 3282981 2031036 -56096 -1581518
8145 -1581518 -2456908 -3552230 -4650383 -4461968 -2862699 -1865187 -3247043 -5501063 -4922140
8136d922140M103033L068437k205003m992146j688190K284671Q49512k625213
8128f127039q05582M701896N037965j423930n849243k514563L330416N044794
8120A394714L764195K837518P27400l895786o228047k085580L838784L920769
8112D273967j313112m946613m050425j723969o13984n60495j419520k764789k016039
8103a5134979K142795N861397M417323r47524m812110m526916j439855K394016
8095a2045853M596918K601734k060784l137210J707449N897730L560194q16398
8087C03780r0055K954278O27203n404296o206381p55468K561526L58202j121237
8078f772448J812059M011833J310095k413500k442447o3902J775512K953093K965834
$$ plain form
8136 -4922140 -819107 2249330 44327 -4947819 -6636009 -4351338 -3501826 -6127039
8128 -6127039 -6932621 -2230725 2807240 1383310 -4465933 -6980496 -3650080 1394714
8120 1394714 5158909 7996427 8723827 4828041 -1400006 -3485586 353198 4273967
8112 4273967 2960855 -1985758 -6036183 -7760152 -8374136 -8934631 -10354151 -13118940 -15134979
8103 -15134979 -12992184 -7130787 -2713464 -3660988 -8473098 -13000014 -14439869 -12045853
8095 -12045853 -7448935 -4847201 -6907985 -10045195 -8337746 -2440016 1120178 303780
8087 303780 213725 3168003 3795206 -1609090 -7815471 -8570939 -6009413 -5651211 -6772448
8078 -6772448 -4960389 -948556 361539 -2051961 -4494408 -4558310 -2782798 170295 3136129
8069C136129j30178m499156m825738o19501K451594J798130J024859J597742P3662
8060G543l209465k148246L841501O087284J65730n950180m282099J113828K375595
8051a998509K03751o86847j287036l989511m799677J76969N672397M736151O18511
8042a353801Q04001L469763J299131m298800n015180m61864J036919k891014m771798
8033a2182643l22360M988341N768326M125433L429315K449954r2341j666333p60268
8024E737424j92736j983107l688285k992704j401810m64873J124286L546351L401725
8015C086271r56306n083555l561181K503097O599015M628072q50911m008610k027730
8006C28162K220785L690045J078460k026246k175904M0359K122109K809312J551988
$$ plain form
8069 3136129 3005951 -1493205 -6318943 -6938444 -4486850 -2688720 -1663861 -66119 7543
8060 7543 -3201922 -5350168 -1508667 4578617 4744347 -1205833 -5487932 -4374104 -1998509
8051 -1998509 -1794758 -2481605 -3768641 -7758152 -12557829 -12380860 -6708463 -1972312 -1353801
8042 -1353801 -549800 2919963 4219094 -79706 -5094886 -5556750 -4519831 -7410845 -12182643
8033 -12182643 -12505003 -7516662 -1748336 2377097 5806412 8256366 8164025 6497692 5737424
8024 5737424 5544688 3561581 -126704 -3119408 -4521218 -4986091 -3861805 -315454 3086271
8015 3086271 2129965 -2953590 -6514771 -4011674 2587341 7215413 6364502 2355892 328162
8006 328162 2548947 6238992 7317452 5291206 3115302 3155661 5277770 8087082 9639070
7997I639070j714470m233083k138205K758473L172461k669259o391141j739617
7989c315771M847779M113194j216013j755238K467617L017447j725135m419963
7981B013917j957253P07114R75654J733077K513944j050439o597304n559818K144598
7972e076510N666584J49737n473510l482905J165208J601361N33406K370340L453787
7963I07498k68778l926986j833992K110509J674168o46243M67249K469415M17468
7954A370308k550523q70610K328840P96212k616535r42029L335172K066484l517920
7945f00601m261657J134893M218359J338230j720878j367783j275659l140726
7937e675822k706147J487060M474219L513796K099635K178912O45104k957550
$$ plain form
7997 9639070 7924600 3691517 1553312 4311785 7484246 4814987 -1576154 -3315771
7989 -3315771 1532008 5645202 4429189 2673951 5141568 8159015 6433880 2013917
7981 2013917 56664 763778 1739432 3472509 5986453 4936014 -1661290 -7221108 -5076510
7972 -5076510 590074 739811 -4733699 -8216604 -7051396 -5450035 -4916629 -2546289 907498
7963 907498 638720 -3288266 -5122258 -3011749 -1337581 -1983824 -1516575 952840 1370308
7954 1370308 -1180215 -2050825 278015 1074227 -1542308 -2484337 850835 2917319 -600601
7945 -600601 -4862258 -3727365 490994 1829224 108346 -1259437 -2535096 -5675822
7937 -5675822 -8381969 -6894909 -2420690 1093106 3192741 5371653 6016757 3059207
7929C059207l471449R45847M437503K412776j889179l962542m422426m519870
7921g410133k077472L077292N840368L327687M4583K99604J035040j905233n502942
7912c271206m232380Q66738M320360M484276L592517K125052p92280l273256k798670
7903A021151j141990j778110l535427k344106J241234J963408j876274n050818
$$ plain form
7929 3059207 -412242 533605 4971108 7383884 5494705 1532163 -2890263 -7410133
7921 -7410133 -9487605 -6410313 -569945 2757742 2802325 3101929 4136969 2231736 -3271206
7912 -3271206 -7503586 -6636848 -2316488 2167788 5760305 7885357 7093077 3819821 1021151
7903 1021151 -120839 -1898949 -5434376 -7778482 -6537248 -4573840 -6450114 -11500932
$$ [...]
##END NTUPLES=NMR SPECTRUM
##END=
