##TITLE=31Pdec_DPAH47-1
 CDCl3, 24 sc
 6.4.2022
##JCAMPDX= 6.0         $$ Bruker NMR JCAMP-DX V2.0
##DATA TYPE= NMR SPECTRUM
##DATA CLASS= NTUPLES
##ORIGIN= UXNMR, Bruker Analytische Messtechnik GmbH
##OWNER= root
$$ XWIN-NMR		Version 3.5
$$ Wed Apr  6 11:02:03 2022 Russian Standard Time (UT+4h)  she@DPX200
##.OBSERVE FREQUENCY= 81.013821
##.OBSERVE NUCLEUS= ^31P
##.ACQUISITION MODE= SIMULTANEOUS
##.ACQUISITION SCHEME= undefined
##.AVERAGES= 24
##.DIGITISER RES= 16
##SPECTROMETER/DATA SYSTEM= spect
##.PULSE SEQUENCE= zgpg30
##.SOLVENT NAME= CDCl3
##.SHIFT REFERENCE= (INTERNAL, CDCl3, 0, 248.564)
##AUDIT TRAIL= $$ (NUMBER, WHEN, WHO, WHERE, WHAT)
$$ ##TITLE= Audit trail, XWIN-NMR		Version 3.5
$$ ##JCAMPDX= 5.01
$$ ##ORIGIN= Bruker BioSpin GmbH
$$ ##OWNER= she
$$ F:/spectra/data/she/nmr/P31/1/pdata/1/auditp.txt
$$ ##AUDIT TRAIL=  $$ (NUMBER, WHEN, WHO, WHERE, WHAT)
(   1,<2022-04-06 11:01:14.28 +0400>,<she>,<DPX200>,
      <created by zg, POWCHK disabled, PULCHK disabled
       configuration hash MD5:
       00 E9 B6 7A A2 85 ED C7 34 08 36 98 17 FE 4E 26
       data hash MD5: 32K
       0D 98 2D C5 05 86 17 F7 AD EA DE 88 DD DE 25 D2>)
(   2,<2022-04-06 11:01:16.57 +0400>,<she>,<DPX200>,
      <Start of raw data processing
       efp BC_mod = 2 LB = 1 FT_mod = 6 PKNL = 1 PHC0 = -9551.131 PHC1 = 125.8756 SI = 64K 
       data hash MD5: 64K
       B5 9C E4 FA 21 9A B7 6D C7 83 33 00 C7 A1 45 98>)
(   3,<2022-04-06 11:01:33.96 +0400>,<she>,<DPX200>,
      <pk PHC0 = 4.261479 PHC1 = 0 
       data hash MD5: 64K
       9A 86 96 DD A4 1B 0E B0 B3 CF 15 B4 4D E4 B3 DD>)
(   4,<2022-04-06 11:01:37.35 +0400>,<she>,<DPX200>,
      <abs ABSG = 5 
       data hash MD5: 64K
       45 C0 74 F3 96 03 ED 0C 4F 99 32 38 11 E3 19 77>)
$$ ##END=
$$ 
$$ hash MD5
$$ D5 96 B7 97 35 DE E8 05 87 20 7E 18 AC 76 9E 94
##$RELAX= 
##$RELAX= 
##$RELAX= 
##$RELAX= 
##$RELAX= 
##$RELAX= 
##$RELAX= 
##$RELAX= 
$$ Bruker specific parameters
$$ --------------------------
##$DU= <F:/spectra>
##$EXPNO= 1
##$NAME= <P31>
##$PROCNO= 1
##$TYPE= <nmr>
##$USER= <she>
##$AMP= (0..31)
100 100 100 100 100 100 100 100 100 100 100 100 100 100 100 100 100 100 
100 100 100 100 100 100 100 100 100 100 100 100 100 100 
##$AQSEQ= 0
##$AQ_mod= 1
##$AUNM= <au_zg>
##$AUTOPOS= <>
##$BF1= 81.014009
##$BF2= 200.13
##$BF3= 200.13
##$BF4= 200.13
##$BF5= 200.13
##$BF6= 200.13
##$BF7= 200.13
##$BF8= 200.13
##$BYTORDA= 1
##$CFDGTYP= 0
##$CFRGTYP= 5
##$CHEMSTR= <none>
##$CNST= (0..31)
1 1 145 1 1 1 1 1 1 1 1 1 1 1 1 1 1 1 1 1 1 1 1 1 1 1 1 1 1 1 1 1 
##$CPDPRG= <waltz16>
##$CPDPRG1= <>
##$CPDPRG2= <waltz16>
##$CPDPRG3= <>
##$CPDPRG4= <mlev>
##$CPDPRG5= <mlev>
##$CPDPRG6= <mlev>
##$CPDPRG7= <mlev>
##$CPDPRG8= <mlev>
##$CPDPRGB= <>
##$CPDPRGT= <>
##$D= (0..31)
0 1 0 0 0 0 0 0 0 0 0 0.03 2e-05 3e-06 0 0 0 0 0 0 0 0 0 0 0 0 0 0 0 0 
0 0 
##$DATE= 1649228473
##$DBL= (0..7)
120 120 120 11 120 120 24 19 
##$DBP= (0..7)
150 150 150 150 150 150 150 150 
##$DBP07= 0
##$DBPNAM0= <>
##$DBPNAM1= <>
##$DBPNAM2= <>
$$ [...]
##$SUBNAM3= <"">
##$SUBNAM4= <"">
##$SUBNAM5= <"">
##$SUBNAM6= <"">
##$SUBNAM7= <"">
##$SUBNAM8= <"">
##$SUBNAM9= <"">
##$SW= 501.771253377433
##$SWIBOX= (0..15)
0 1 3 0 0 0 0 0 0 0 0 0 0 0 0 0 
##$SW_h= 40650.406504065
##$TD= 32768
##$TD0= 1
##$TE= 0
##$TE2= 300
##$TE3= 300
##$TEG= 300
##$TL= (0..7)
0 120 53 12 22 120 120 120 
##$TP= (0..7)
150 150 150 150 150 150 150 150 
##$TP07= 0
##$TPNAME0= <>
##$TPNAME1= <>
##$TPNAME2= <>
##$TPNAME3= <>
##$TPNAME4= <>
##$TPNAME5= <>
##$TPNAME6= <>
##$TPNAME7= <>
##$TPOAL= (0..7)
0.5 0.5 0.5 0.5 0.5 0.5 0.5 0.5 
##$TPOFFS= (0..7)
0 0 0 0 0 0 0 0 
##$TUNHIN= 0
##$TUNHOUT= 0
##$TUNXOUT= 0
##$USERA1= <user>
##$USERA2= <user>
##$USERA3= <user>
##$USERA4= <user>
##$USERA5= <user>
##$V9= 5
##$VALIST= <valist>
##$VCLIST= <CCCCCCCCCCCCCCC>
##$VD= 0
##$VDLIST= <DDDDDDDDDDDDDDD>
##$VPLIST= <PPPPPPPPPPPPPPP>
##$VTLIST= <TTTTTTTTTTTTTTT>
##$WBST= 1024
##$WBSW= 4
##$XGAIN= (0..3)
0 0 0 0 
##$XL= 0
##$YL= 0
##$YMAX_a= 1085
##$YMIN_a= -1471
##$ZGOPTNS= <>
##$ZL1= 120
##$ZL2= 120
##$ZL3= 120
##$ZL4= 120
##$ABSF1= 248.5645
##$ABSF2= -253.2056
##$ABSG= 5
##$ABSL= 3
##$ALPHA= 0
##$AQORDER= 0
##$ASSFAC= 0
##$ASSFACI= 0
##$ASSFACX= 0
##$ASSWID= 0
##$AUNMP= <proc_1d>
##$AZFE= 0.1
##$AZFW= 0.5
##$BCFW= 0
##$BC_mod= 2
##$BYTORDP= 0
##$COROFFS= 0
##$CY= -3
##$DATMOD= 1
##$DC= 0
##$DFILT= <>
##$DTYPP= 0
##$F1P= 0
##$F2P= 0
##$FCOR= 1
##$FTSIZE= 65536
##$FT_mod= 6
##$GAMMA= 0
##$GB= 0
##$INTBC= 1
##$INTSCL= 5.30512e-09
##$ISEN= 30
##$LB= 1
##$LEV0= 0
##$LPBIN= 0
##$MAXI= 10000
##$MC2= 0
##$MEAN= 0
##$ME_mod= 0
##$MI= 50
##$NCOEF= 0
##$NC_proc= -8
##$NLEV= 6
##$NOISF1= 182.463
##$NOISF2= 159.3651
##$NSP= 0
##$NTH_PI= 0
##$NZP= 0
##$OFFSET= 248.5645
##$PC= 4
##$PHC0= -9546.869
##$PHC1= 125.8756
##$PH_mod= 1
##$PKNL= yes
##$PPARMOD= 0
##$PSCAL= 0
##$PSIGN= 0
##$REVERSE= no
##$SF= 81.014009
##$SI= 65536
##$SIGF1= 159.3651
##$SIGF2= -187.1042
##$SINO= 113.3802
##$SIOLD= 16384
##$SREGLST= <1H.CDCl3>
##$SSB= 0
##$STSI= 65536
##$STSR= 0
##$SW_p= 40650.406504065
##$SYMM= 0
##$S_DEV= 0
##$TDeff= 32768
##$TDoff= 0
##$TI= <>
##$TILT= no
##$TM1= 0
##$TM2= 0
##$TOPLEV= 0
##$USERP1= <user>
##$USERP2= <user>
##$USERP3= <user>
##$USERP4= <user>
##$USERP5= <user>
##$WDW= 1
##$XDIM= 65536
##$YMAX_p= 275599087
##$YMIN_p= -249643349
$$ End of Bruker specific parameters
$$ ---------------------------------
##NTUPLES= NMR SPECTRUM
##VAR_NAME=  FREQUENCY,     SPECTRUM/REAL,   SPECTRUM/IMAG
##SYMBOL=    X,             R,               I
##VAR_TYPE=  INDEPENDENT,   DEPENDENT,       DEPENDENT
##VAR_FORM=  AFFN,          ASDF,            ASDF
##VAR_DIM=   65536,         65536,           65536
##UNITS=     HZ,            ARBITRARY UNITS, ARBITRARY UNITS
##FACTOR=    0.620285442955139, 1,           1
##FIRST=     20137.2065510759, 0,            0
##LAST=      -20513.1999529892, 0,           0
##MIN=       -20513.1999529892, -249643349,  0
##MAX=       20137.2065510759, 275599087,    0
$$ Real data points
##PAGE= N=1
##DATA TABLE= (X++(R..R)), XYDATA
$$ [...]
40786 716916 1124355 -28405 326422 3246493 4860269 2228344 -1158365 -520451 1913748
40777 1913748 -166975 -6540695 -9483103 -5149380 157008 -1151128 -7229685 -9822896
40769 -9822896 -5726793 -355904 -70250 -4748481 -9123441 -9367302 -6878201 -5866397
40761 -5866397 -7841817 -9344534 -6189571 583813 5258142 4554658 1785672 2162063
40753 2162063 5844188 8189614 6104907 1526201 -1771474 -2816264 -3710655 -6127693
40745 -6127693 -8867686 -9315578 -6707583 -2957841 -117809 1786301 3636032 5196529
40737 5196529 5566125 4668000 2852096 248687 -1676925 230093 6431376 11403059
40729 11403059 9200903 2131644 -1077271 3188003 8711689 8423980 3316516 -865545
40721 -865545 -1636084 -349571 1825346 3785721 2762537 -2347232 -7307792 -6810963 -1559069
40712 -1559069 3089270 4607234 5009443 5786215 6002011 5566109 5683935 5404469 2250257
40703 2250257 -2677449 -4682700 -2136035 973864 1023000 -628269 -1177768 -756527 -576419
40694 -576419 -73030 1138798 1439323 389799 793842 4018559 5986546 2235632 -4790715
40685 -4790715 -8193699 -5647816 -1561172 -314363 -1688268 -3664049 -5517791 -6396392
40677 -6396392 -4349105 614343 4691470 4067645 -591252 -5300094 -7391593 -7156636
40669 -7156636 -5710429 -3588584 -1798350 -2247442 -5570085 -9208518 -9460627 -5987729
40661 -5987729 -2754545 -3030461 -4747191 -3466596 585712 2374139 69365 -1288194
40653 -1288194 2450616 6992769 5274187 -1517775 -5180322 -2442749 1366642 2093702
40645 2093702 2870388 6629654 9167867 5800930 146113 -1034730 1187081 4346
40637 4346 -5222054 -7512505 -3754340 292234 -529589 -3149363 -2533370 -697 193604
40628 193604 -1431953 -1302830 194253 -582046 -3761658 -5436149 -3994624 -2141602 -1915016
40619 -1915016 -2056220 -1534151 -1742489 -3366747 -4222864 -2289542 1351958 4262927 5406436
40610 5406436 4956043 3461729 2375878 3110505 4305177 2627800 -2081788 -5354469
40602 -5354469 -4116783 -1317087 -1347370 -3379951 -3393271 -1062094 308030 151086 1646598
40593 1646598 5532379 8022622 6961204 5404670 5963926 5710056 1072976 -5204399
40585 -5204399 -7247332 -4684672 -2710242 -3761916 -4535503 -2286192 1079712 3391609
40577 3391609 5954682 9588453 10984791 7497356 2730540 2223336 5072251 5207325
40569 5207325 713415 -3543949 -3630437 -1817754 -1860786 -3205011 -3059963 -1212640 549308
40560 549308 1630995 2071349 641794 -3124844 -6353228 -5810910 -2783624 -1596803 -3653082
40551 -3653082 -6351432 -7783701 -8598602 -8513418 -5202253 1168254 5844079 5185724 2062139
40542 2062139 1784363 4091856 3617893 -1550268 -6367108 -5928505 -2357998 -1058856 -2462730
40533 -2462730 -2192371 1024357 2701204 -389979 -4811436 -5310977 -2093032 594436
40525 594436 1014100 700119 -42591 -2443092 -5140441 -4693015 -1139727 1448533 1187456
40516 1187456 559879 832525 -555354 -4347022 -6351754 -3865653 -685027 -1133869 -3225542
40507 -3225542 -3170733 -2988613 -6947104 -12660691 -12922763 -6070013 1747234 5001289 4044609
40498 4044609 1539909 -1051938 -2441134 -1496006 760310 2652384 5034577 9000960
40490 9000960 11651147 9530561 5360655 4912165 7448040 6548590 1131682 -2271175
40482 -2271175 -286680 2172567 843845 -1318863 -751638 481989 -4195 258203 2957415
40473 2957415 3923351 -379836 -6249358 -8504816 -8159260 -8420812 -7846298 -4110829 -253487
40464 -253487 -61528 -1025194 812523 2661850 -269987 -4864260 -3813231 2380834 5970523
40455 5970523 3981472 1177081 779969 401757 -1665046 -3464152 -4057709 -4590912 -3736814
40446 -3736814 1145019 7276193 7993741 2650337 -1948093 -1910128 -1016281 -2651035 -4170298
40437 -4170298 -2941287 -1548475 -2615028 -3727125 -1861257 1520752 3671983 4814697
40429 4814697 5746509 5289727 3583833 3868297 7305565 9736544 7367156 2530740 288331
40420 288331 1985528 5055346 6618115 5185239 1773213 632152 4784251 9780847
40412 9780847 7620432 -1146660 -6166733 -1781350 4521808 3675533 -1888199 -4109173
40404 -4109173 -2435961 -2111285 -3162100 -849492 4264923 5866304 1969113 -2320131
40396 -2320131 -3269712 -2944087 -3602500 -3830892 -2463461 -1267319 -1304132 -654841 1989054
40387 1989054 4655831 4889312 2760380 -96012 -2258297 -2740532 -1662958 -1007657 -2595626
40378 -2595626 -5405829 -7013235 -7100860 -7115120 -7266243 -6679645 -5707137 -5082920 -3624083
40369 -3624083 30997 4225963 6165820 6139201 6413084 6925582 5881011 3609398 1643231
40360 1643231 -1033963 -6042355 -10669341 -10334915 -6036680 -3712524 -5434074 -6878003
40352 -6878003 -4936919 -2121651 -1069835 -55699 2739910 4954569 3876356 1356113
40344 1356113 1268894 4216584 7580973 9025796 7799860 4495312 1415968 1302053 4018813
40335 4018813 6190978 5162588 1376233 -3606022 -8542338 -11192479 -8974821 -2598103
40327 -2598103 3660182 6614218 6617569 4941692 2312401 822951 2976412 7164268 8270061
40318 8270061 4701417 631691 -718743 -1238227 -2716275 -2664818 742714 4167645 4128495
40309 4128495 2566648 2570000 2324650 -1059102 -4764611 -3634089 1324373 3756358 614020
40300 614020 -5112522 -9645864 -11482852 -9754213 -4553950 948728 3080777 2419876
40292 2419876 2044681 1634459 -1868954 -7693600 -10567647 -7879895 -3084493 -392241
40284 -392241 53127 57109 135246 516522 2319816 5315422 6672140 4213096 -331885
40275 -331885 -2977594 -1715048 1633248 3154789 527771 -4092810 -5546371 -1509532
40267 -1509532 4121793 5817216 3348526 1298648 2266117 3953086 3366997 868177
40259 868177 -943618 -295938 2401922 4755704 4206201 1327966 337266 4033400 9500835
40250 9500835 11703827 9865206 6733324 3315941 -759899 -2979444 -332298 3889051
40242 3889051 2467726 -4869584 -9586427 -6295601 -296420 1085900 -958200 -518703
40234 -518703 2864134 4358291 2140714 -498967 -885321 90968 957178 1804691 2978548
40225 2978548 4264655 5527079 6435770 6380898 6205791 8107894 11569924 11926035 6467909
40216 6467909 -291912 -1977253 590706 1062481 -2168430 -3531009 297733 4376341
40208 4376341 2692250 -2785525 -5309701 -3651888 -3677893 -8988373 -14781910 -14202716 -8159710
40199 -8159710 -4353822 -6489283 -8961940 -4941400 3608204 8577245 6982655 4074477
40191 4074477 4459918 5792460 4234200 1410313 1312188 3401161 3918403 2325247 1383619
40182 1383619 1670528 997354 -819474 -1508203 -1165302 -2622528 -5738058 -6231542 -2541922
40173 -2541922 650935 -879276 -4402701 -4669561 -2238423 -2378555 -6521069 -9682280
40165 -9682280 -7314308 -1027414 4141518 5528357 4114947 2051617 1080902 2240173
40157 2240173 4903675 6488218 4985976 1713016 -215014 -149874 -491664 -2382804 -3332645
40148 -3332645 -1037127 2381501 2767942 -336146 -3337455 -3770465 -2740232 -1753835 -383792
40139 -383792 1481581 1948282 -116908 -2678184 -3165882 -2002817 -1354864 -1707221 -1936120
40130 -1936120 -1753817 -1799146 -1939420 -1559314 -1121144 -1617218 -2744508 -3087188 -1854865
40121 -1854865 481455 2604477 2872565 932414 -587235 1555512 5885416 6387876
40113 6387876 409417 -6823293 -8946938 -6602887 -4437656 -2895383 998932 6178432
40105 6178432 7647847 4446097 1269750 840791 438445 -2066953 -4361467 -4590965 -4939405
40096 -4939405 -6941015 -7886951 -5827846 -3982380 -5582049 -7730447 -5504613 146074
40088 146074 3729674 3048223 831785 -674211 -1911030 -2744324 -1634661 812264 1286521
40079 1286521 -1417156 -3754957 -1631794 4379730 9812904 11457930 10171797 8543517
40071 8543517 7019926 3720670 -1609234 -5284919 -3663732 1254567 3501586 941302
40063 941302 -2235431 -2335527 -1439217 -2785812 -4564909 -2915183 1251474 3619093 3462852
40054 3462852 3854461 5066682 3511784 -1385108 -4552713 -2283452 2191017 3492552
40046 3492552 1538651 599416 2709254 5483890 5834783 3194647 -599501 -2583297
40038 -2583297 -381673 5171336 9378634 7843812 1610867 -3634438 -4030949 -1664999
40030 -1664999 -1347701 -4463975 -7464354 -6364766 -1613182 2240758 1467760 -3028121
40022 -3028121 -7134583 -8000566 -6074561 -3120020 -8820 2748250 3950099 3113061
40014 3113061 2282158 4158321 8025265 9707630 6868942 2513710 1072359 2264269
40006 2264269 1923838 -1171255 -2924340 25360 5020002 7085842 5720595 4218594
39998 4218594 3456243 1018095 -3020040 -4229729 -186726 4922797 5471594 1885787
39990 1885787 -711299 -29169 1233733 762182 254501 2078547 4979194 5544598 2911050
39981 2911050 -144438 -850195 380612 1087090 52041 -1793948 -3442537 -5071592
39973 -5071592 -6540519 -6364790 -3986086 -1850247 -2701773 -5321102 -5884052 -3729257 -2526361
39964 -2526361 -4665133 -7670710 -8060391 -6043537 -4161446 -3602905 -4236993 -6088555 -8163550
39955 -8163550 -7882259 -4576159 -1685673 -2421779 -5043354 -5776846 -4592813 -4120081 -4335151
39946 -4335151 -2977189 -563769 -178075 -2146727 -3515356 -3325943 -3897237 -5969103 -7050762
39937 -7050762 -5919320 -4512683 -3933468 -2919686 -1817363 -3150313 -5912950 -4541191
39929 -4541191 2812482 9740366 9814299 5231750 2153636 1254858 -781095 -3203672 -2106996
39920 -2106996 1555085 2455222 130539 433862 5467780 8874002 5227060 -1332666
39912 -1332666 -3103736 267016 2594676 792567 -2097363 -3052010 -2776000 -2128413 565097
39903 565097 6107173 11270596 11927821 8054668 3466215 1317712 1575265 2394414 2323200
39894 2323200 1156438 -165315 -373370 614767 1125006 -427109 -3167317 -4225132 -1849257
39885 -1849257 2586098 5901044 5966057 3270640 310917 -466306 1309216 3768925 4918776
39876 4918776 4593261 3798573 2829885 1313189 -269485 -769015 -199660 244242 252241
39867 252241 690475 1412000 919604 -843118 -1660723 -615279 -287165 -2993981 -6456802
39858 -6456802 -6152725 -1378291 3673898 4818946 1768923 -2711604 -5526822 -5226814
39850 -5226814 -3139459 -2427164 -4386662 -6258835 -4710205 -665890 2092983 2668509
39842 2668509 3907794 7054944 9164008 7571808 4160300 2863943 4566628 6463730
39834 6463730 5581325 1639288 -2791541 -4325254 -2069868 730531 -107029 -4540946
39826 -4540946 -8240327 -8016086 -4876462 -1058310 2809068 5906620 5822844 1918301 -2098225
39817 -2098225 -2267173 229837 957549 -1297084 -3250308 -2356591 -262672 -64061 -2177460
39808 -2177460 -4128781 -3420883 56906 3854088 5033527 3011240 215145 -604782
39800 -604782 761533 2513925 3507920 4202343 5280517 6511309 7077880 6372424 4474378
39791 4474378 2165996 270841 -987764 -1385923 70949 3695130 6951067 6171225
39783 6171225 1434716 -2615164 -2479302 -152667 440411 -630515 -17689 3259174 6110635
39774 6110635 5490309 1827893 -2038005 -3657159 -2511974 -121463 1383198 1646595
39766 1646595 2328325 4008874 4398179 1475912 -3060191 -5873900 -6234938 -5491405 -3643212
39757 -3643212 107743 4224075 6145323 6484470 7818514 9189677 6555683 -125857
39749 -125857 -5173966 -4940549 -2850445 -3424922 -5289184 -4531388 -2023638 -2108495 -5339214
39740 -5339214 -7748776 -7376070 -6805114 -8128545 -9393262 -8037067 -4991539 -3092882
39732 -3092882 -3151787 -3600562 -3034825 -1539839 -70463 414059 -374130 -1614077 -2132564
39723 -2132564 -1918139 -2092313 -3074342 -3775822 -3093865 -1245899 848447 2503315 3134437
39714 3134437 2386204 1010177 389169 549347 139304 -828976 -279496 2301268 3765975
39705 3765975 1592240 -1404024 -367423 4160792 6285946 2951491 -1955894 -3474086
39697 -3474086 -1905231 -654188 -864610 -1703740 -3706647 -7736063 -11708336 -12326657 -9769903
39688 -9769903 -7146114 -5595946 -3739896 -1925980 -2513086 -4914209 -5004473 -1665075 468988
39679 468988 -1822119 -4247251 -863222 6259696 8728031 2945561 -5397306 -9079995
39671 -9079995 -7478050 -4832022 -3655416 -3114964 -2522767 -2998660 -5011679 -6462083 -4934909
39662 -4934909 -1316626 621521 -914701 -2608080 237389 7037739 11584603 9619004
39654 9619004 4513400 2938501 6120372 8588076 5917236 815607 -336595 4349776
39646 4349776 9711068 9463214 3458551 -2213343 -2366426 1540717 4121554 3280801 1917955
39637 1917955 2381186 2846934 1228320 -408005 1204102 4860707 5913296 2392987
39629 2392987 -3165159 -7591330 -9424645 -7792228 -3034449 1069177 26915 -4898870
39621 -4898870 -7023554 -3242159 1287154 639490 -3336962 -4393826 -1248097 1687286
39613 1687286 1967642 2089815 4046232 5583003 3912930 -67583 -3327097 -4126621 -2301325
39604 -2301325 1521667 5195370 5734963 2808416 -190110 -443953 759595 840085 94192
39595 94192 204808 459170 -899163 -2660894 -2059900 99902 -18560 -3034585 -4800119
39586 -4800119 -2452119 1851050 5021554 7001132 8178515 6658537 1620196 -3537162
39578 -3537162 -5185471 -4271488 -3492313 -2311753 668620 2724520 149157 -4675358
39570 -4675358 -5440050 -1324731 1718179 187456 -2349809 -1998074 -350254 -337056 -895490
39561 -895490 359818 2620880 3757725 3890137 3746181 2239144 -819935 -2181854 846605
39552 846605 5804053 8025894 6531816 3793850 1584470 475360 1496369 4414872
39544 4414872 5869227 3137081 -1340595 -2869977 -858595 1300547 1461426 76153
39536 76153 -2422864 -5467057 -6596806 -4195488 -1245268 -1962293 -5296760 -6353228 -3769747
39527 -3769747 -767584 857720 2405193 3715456 2683324 297525 443510 3084438
39519 3084438 3291926 -801979 -4719510 -4982818 -4086521 -4664021 -4262397 -557096 3064316
39510 3064316 2623910 553691 1795475 5597831 7063912 5175738 3585791 4209462
39502 4209462 5227837 5242292 4753207 3465863 446134 -2710285 -2791898 353157 3302400
39493 3302400 3542432 1633263 -773958 -2002660 -270829 3661180 4767872 -405281
39485 -405281 -6718339 -5379339 3342230 9279245 6799756 2816191 5381066 10863553
39477 10863553 10252444 4049483 1429661 5385008 8127251 3610239 -3426637 -5477319
39469 -5477319 -3257808 -2790723 -5338280 -6608286 -4401580 -1191920 835716 2272594
39461 2272594 3250034 2156337 -871898 -2818882 -2051452 -701657 -771497 -693190 1540753
39452 1540753 3965274 2636652 -2685427 -7578701 -7844157 -3677994 1166196 3284356
39444 3284356 2580056 1717760 2435420 2959048 709145 -2739984 -2405961 3247754 9215039
39435 9215039 9974450 6199604 2743583 1999254 2529772 2874399 3071512 2774499 1051821
39426 1051821 -1698224 -3975366 -5366160 -6601573 -7724965 -8007784 -7295417 -6023125
39418 -6023125 -4768782 -4827045 -7187303 -9428388 -6767984 959314 6765555 5072797
39410 5072797 -318973 -1908801 847440 2921187 3288318 5196249 7834443 6580524
39402 6580524 2450830 2307952 7053689 8437962 1943734 -5355847 -5750847 -2614565
39394 -2614565 -3748767 -8214240 -8059968 -643150 8030106 11270634 7545430 -429674
39386 -429674 -7586017 -8832197 -4020095 729305 514363 -1846644 -1208961 1053487 -168281
39377 -168281 -3996848 -3907677 1987342 7652673 7799667 4462074 2624607 3451808 4442474
39368 4442474 3572735 1050358 -1658441 -3467935 -5032434 -7901458 -11189869 -10907475
39360 -10907475 -5025325 2637496 6718397 6740152 5713587 4455734 2089682 648712
39352 648712 3306191 8082075 9024411 4546816 -592183 -2736982 -3494200 -4674567 -4304664
39343 -4304664 -695267 3544990 4873166 3436177 1656475 534366 -295162 -717556
39335 -717556 -288875 1060422 3196757 5026220 3968147 -823904 -5159443 -4004962
39327 -4004962 781499 2033553 -2241064 -5741903 -3770817 -307042 -988333 -4266693
39319 -4266693 -5152710 -3828968 -4124977 -5801298 -4975718 -1444232 581487 -579497 -1841191
39310 -1841191 -1226437 -1174684 -3921520 -7271260 -7538457 -4468719 -1045693 357442 118399
39301 118399 297587 2100437 4060944 3270154 -583965 -3538071 -1835501 2720809 4728636
39292 4728636 2325976 -842711 -1396212 -572408 -1173324 -3119045 -4556232 -5279367 -6141363
39283 -6141363 -6357992 -4513923 -1831384 -1350235 -3366788 -4422327 -2041639 1743568
39275 1743568 3324145 2255143 842969 23009 -1645237 -4748154 -7310801 -7475808
39267 -7475808 -6194404 -5779459 -6745659 -7441038 -6273129 -3217300 444888 3002258 3452270
39258 3452270 2598337 2392107 3405643 3908387 2528622 658452 538560 1875216 2403468
39249 2403468 1237982 -566127 -2470208 -4932427 -7218581 -7323057 -4929975 -2242219
39241 -2242219 -775097 682381 3542625 6499106 6725428 3100298 -2772286 -7872150
39233 -7872150 -9510715 -7100042 -2979584 -299796 391713 941921 1807486 1096271 -1515060
39224 -1515060 -2896919 -844319 2128143 2417937 855682 915418 2556308 2161887 -1161086
39215 -1161086 -3446907 -1619423 1995091 3267686 1963219 1032998 1642247 1994431 997389
39206 997389 336245 1772155 4122358 4673409 3050739 1862739 2908066 4254375 2822671
39197 2822671 -691080 -1923454 1287891 5452433 5868003 2800669 368336 273458 394069
39188 394069 -123427 1440720 6554609 11765533 13001885 11131019 9697166 8997250 6705348
39179 6705348 3513417 3304415 7124048 11423854 13572389 14750871 15466816 12932401
39171 12932401 6375117 811657 798143 3491903 3328892 1222862 2507955 6595116
39163 6595116 6195316 -1530951 -9905689 -12149457 -10070796 -8817733 -7800823 -2975562
39155 -2975562 4483177 8363088 6155331 2281129 1455841 2931416 3237906 1811029
39147 1811029 1411708 3890494 7419358 8524259 6476196 4511023 5483328 7342535
39139 7342535 5758157 1128821 -1144752 1088220 2825296 -289840 -4541401 -3822643
39131 -3822643 360376 1296501 -1784269 -2377993 2529965 7417831 6882368 3506285 2825819
39122 2825819 4722386 4841220 2145113 34313 538832 1519578 327078 -2462209 -4061042
39113 -4061042 -2886762 -114757 1813130 1820091 914036 45811 -1590649 -4608291 -6888246
39104 -6888246 -5816781 -2902473 -2715022 -6167941 -8275838 -4837819 1376429 4107526
39096 4107526 1617107 -1898239 -2287934 -37082 1471776 374072 -1838191 -2299733
39088 -2299733 -237335 1867390 1306278 -1094595 -2027676 -625916 164816 -1769364 -4270983
39079 -4270983 -4215834 -2200560 -1238718 -2153917 -3251594 -3883136 -5169250 -6963899 -7020196
39070 -7020196 -4250298 -680045 1124489 990783 206507 -929352 -2823839 -4570294
39062 -4570294 -4288216 -1899548 -24201 -1031985 -3970863 -5600049 -4184171 -1059545
39054 -1059545 1592092 3141776 4073174 4375072 3593241 2005908 698274 465951 1043085
39045 1043085 1193256 -416937 -3627457 -6066207 -5348570 -2228563 128381 373381 179021
39036 179021 478165 -390657 -2911351 -4072842 -1942631 309170 -1086738 -4344375 -5114174
39027 -5114174 -3733338 -4027551 -5969044 -5730787 -3197129 -2954205 -6343433 -8737881 -7173359
39018 -7173359 -4788723 -4347861 -3053933 1527259 5231734 2886473 -2973883 -5108098
39010 -5108098 -1848348 1234521 -342536 -4907138 -8475600 -9570698 -8907102 -7212196
39002 -7212196 -4918084 -2432541 252005 3301126 6071895 7175221 5710968 2296963
38994 2296963 -798034 -950171 2020311 4613611 3350353 -272335 -1370369 1244244
38986 1244244 3082328 655485 -3347693 -4038108 -619216 3874181 6489491 5464796
38978 5464796 329907 -6015682 -8049023 -3922457 1318395 2164215 -340353 -1789450
38970 -1789450 -1725344 -2879082 -5347921 -6981624 -8080442 -9986496 -10002938 -4120685 5002030
38961 5002030 9302655 6080801 1589658 1606092 4005764 4057828 2240449 2302552 4766097
38952 4766097 6930647 7571078 7626255 7175054 5234993 2295446 223616 -392554 -564976
38943 -564976 -557788 562951 2525615 2999536 518234 -2742995 -2842613 966734 4488744
38934 4488744 3122024 -2329998 -6204126 -4762026 -513235 1506293 35850 -1860445
38926 -1860445 -1389250 1184485 3793323 4325023 1462138 -3780299 -7300752 -5302275
38918 -5302275 748228 4690443 2418283 -3394690 -6471635 -3879388 1151500 2833482
38910 2833482 -1265532 -7597825 -9975494 -6030398 110591 2492098 48272 -2849669
38902 -2849669 -2346423 268311 675743 -2845106 -7102277 -7509256 -3533560 281544 -329990
38893 -329990 -3764911 -4475575 -473874 4152022 5438247 4800250 5336262 6014465 3840841
38884 3840841 -64169 -1622995 -596804 -1045642 -4105246 -5296292 -1413320 3982188
38876 3982188 5409858 3146310 2162045 4505227 6531275 4308437 -918485 -4297647
38868 -4297647 -3338860 -708060 -805044 -4510699 -8306743 -8455631 -4959956 -1026343 356359
38859 356359 -1291889 -4007075 -4902102 -2533435 1479783 4085828 4411400 4182785 4171672
38850 4171672 2947673 716168 1248182 6752227 13064356 14003985 9424647 4818263
38842 4818263 3398752 3075073 1867317 1699765 4505985 7926777 8055477 4916202 2426837
38833 2426837 3266851 5894911 7173296 6602550 6523719 8053110 8624849 5573508 1168370
38824 1168370 607380 4353953 6399831 2447884 -3714253 -5359261 -1362810 4347286
38816 4347286 9141182 12551516 12860971 8769975 3880909 3584701 6986884 7569808 3059159
38807 3059159 -950179 649031 5594732 8700474 8872339 8139048 7054673 5039785
38799 5039785 3262983 3504486 5018053 5226072 3046666 -326251 -3355797 -5336013
38791 -5336013 -6082854 -5659141 -4421305 -3095551 -2886312 -4712776 -7501628 -8504393 -6856820
38782 -6856820 -5275988 -6014892 -7037712 -5476955 -3022835 -3368480 -5451554 -4633804 -530810
38773 -530810 2092455 1222779 607285 2849410 4984015 3910633 1479672 707909 943280
38764 943280 376949 -108043 774643 1528278 388294 -1667124 -3564399 -6876286 -12367467
38755 -12367467 -16462092 -15207689 -10077281 -6174839 -5773380 -6568930 -5328562 -1030116
38747 -1030116 4317145 6401487 2421060 -4117949 -5525689 638208 7512162 7434522
38739 7434522 1216994 -4780347 -7428425 -7813061 -6183786 -1891836 2559331 2969971
38731 2969971 -749130 -4615857 -6614815 -8472178 -10919547 -11429633 -8252481 -3695225
38723 -3695225 -1606703 -3124799 -5716781 -5495333 -861772 5002986 6527688 2426330
38715 2426330 -1737728 -381806 4377048 5556903 968058 -4226445 -4962944 -2423963
38707 -2423963 -1424688 -4405563 -9348825 -11905894 -9068683 -2442382 2176575 598816
38699 598816 -4535019 -6804374 -4136532 -796083 -823361 -3003135 -4007665 -3478364 -3269895
38690 -3269895 -3493553 -2389954 257014 2165689 1654140 20038 -265841 1091007 1876721
38681 1876721 189062 -3616269 -7983535 -11699065 -13573024 -12257192 -8129750 -3997541
38673 -3997541 -1628160 1089108 6383173 11206991 10211422 4244159 601631 3067606
38665 3067606 6884017 6663221 4323104 4566446 6497364 5651889 2191036 947967 3653271
38656 3653271 6367617 5354691 1442883 -2362032 -4419466 -4799131 -4545128 -5036798 -6187439
38647 -6187439 -5638896 -1824111 2970152 5065891 4087448 2622285 2263739 2925263 4905559
38638 4905559 8099195 10004638 8320144 4939752 3427472 3174868 791007 -2835192
38630 -2835192 -2513257 2783216 6915670 4988120 285757 -965464 1622482 3469162
38622 3469162 2649861 1949479 3473884 5194303 4226601 1145718 -862000 -307210 830222
38613 830222 2149 -2362007 -3465537 -2019254 148292 883610 440366 351746 1193467
38604 1193467 2903655 5658062 8559214 9156440 6676227 4139216 4295581 4863651 1608993
38595 1608993 -4492493 -7571614 -5035061 -1271986 -1279518 -3813062 -3624361 1217724 6878781
38586 6878781 8300566 4573322 -513966 -2737735 -1749943 -476556 -437275 298008 3240293
38577 3240293 5835977 4476615 -103077 -3604601 -3859904 -2615016 -1691926 -651427
38569 -651427 973195 1928544 1024789 -1117112 -2969314 -3467811 -2337537 -459002 373662
38560 373662 -300981 -313254 1986847 4118944 2072514 -3660803 -7953718 -7456958 -4056919
38551 -4056919 -1054781 1035604 3223515 4970887 4604329 1888394 -1295532 -2769541
38543 -2769541 -2243918 -1650480 -2609653 -3541961 -1309835 3381173 5226805 1408701 -3554014
38534 -3554014 -3749322 -104311 2032168 1551271 2120475 4890571 6771184 6439917 6312444
38525 6312444 7349650 7250603 5328247 4055704 4025839 2510915 -850107 -2119510 451185
38516 451185 2901588 1754901 -784526 -1424512 -1411491 -3409029 -6074042 -6020372 -2881412
38507 -2881412 1186420 4958976 7927885 8686591 6552185 3187647 486146 -1208441
38499 -1208441 -1490275 279052 1997441 -120980 -5174436 -6920700 -2698511 1866131
38491 1866131 1180279 -2178379 -2724589 -750455 433660 1735386 5425077 8228552
38483 8228552 5490791 528100 1323424 8096509 12371608 9365185 3579387 366293
38475 366293 -558049 -482454 2259425 7545659 10524898 7970217 3274299 1088148 942590
38466 942590 205129 -438098 951546 2952870 2830052 1044620 -424442 -2139891 -5183618
38457 -5183618 -6965201 -4149102 1008749 2405864 -1419037 -5207555 -4619781 -1764484
38449 -1764484 -957819 -2343595 -2753159 -948793 1192081 2248251 3318449 5725383
38441 5725383 8174000 7655283 3336340 -1330574 -1600262 3086257 7753096 7183245 1806108
38432 1806108 -3243437 -4390608 -2748738 -830508 1184415 4253232 7344645 7826177
38424 7826177 4573446 -849471 -5837003 -8450637 -8110889 -5990226 -4292641 -3841827
38416 -3841827 -2954538 -90325 3331417 4811171 4587790 4774110 5120135 3241197 -351594
38407 -351594 -1408823 1946740 5731520 5483942 2321862 391711 558723 362662 -1274352
38398 -1274352 -3181436 -4900813 -6675587 -6874032 -3306683 2564378 6129246 4902961
38390 4902961 505590 -4567093 -8817175 -10367448 -7781317 -3286218 -1412022 -2986129
38382 -2986129 -3990814 -1853637 979155 1786779 1815579 2663921 2081209 -2427224 -8283822
38373 -8283822 -10659027 -9258328 -7906873 -7943408 -6483702 -1925326 2663859 3415399 528580
38364 528580 -2423806 -2639915 -270550 2552959 3808824 3193391 2261363 2705199 4394601
38355 4394601 5583365 5044616 3370214 1992427 1419571 745061 -1216367 -4431273 -7403987
38346 -7403987 -8597093 -7930155 -6496392 -5030250 -3379580 -1501759 -122671 29310
38338 29310 -814782 -1670616 -1842843 -1549670 -1307075 -606650 2024671 6527640 9593566
38329 9593566 7810940 2712715 -339053 556237 1203684 -1684084 -4713477 -3161986
38321 -3161986 1101143 2601281 1194258 1607901 4629098 5606186 2791382 591880
38313 591880 2141220 4483630 4273514 3093064 3458452 4031672 2736583 788324 -267741
38304 -267741 -1894567 -4903614 -6019523 -2696183 1673166 2302144 324825 384802 2732067
38295 2732067 3237504 586169 -1829436 -1614009 -572795 -1216380 -3366034 -5277458 -5831016
38286 -5831016 -4982304 -3726716 -3713720 -5596706 -8222555 -10404143 -12104185 -12680107 -10188975
38277 -10188975 -4520579 946396 3319652 3816752 4860917 5829026 4782592 2345593
38269 2345593 440847 -1085499 -3229816 -4989171 -5131723 -4941531 -5737196 -5796994 -3572312
38260 -3572312 -1562703 -2508499 -4082798 -2535392 549111 1049062 67483 2091736 6277071
38251 6277071 6983439 3423849 1376505 3747834 6479044 6178983 5104571 5456809 5065147
38242 5065147 2620984 1454285 3560182 4848555 1356782 -3869103 -5206200 -2479742
38234 -2479742 359644 1640952 2049023 914867 -2190536 -4031149 -1318932 3376097
38226 3376097 4530992 1717800 -472671 -115257 93336 -952599 -447652 2547969 4265965
38217 4265965 2112602 -919113 -1201581 -175262 -932212 -1994680 388791 5085903
38209 5085903 6537721 2626064 -2675883 -5643501 -7238737 -9041835 -9112199 -5771057
38201 -5771057 -2527990 -4415641 -10479611 -14378067 -12473792 -7403618 -3159910 -588231
38193 -588231 870939 543319 -1992863 -4945228 -5895529 -4137626 -544901 3268721 5258708
38184 5258708 4700154 3977676 5804200 8428508 7519983 3580276 2375207 5726399 7408402
38175 7408402 2376371 -4832757 -6534592 -2995504 -645841 -1698488 -2582196 -1731033
38167 -1731033 -1793415 -3365142 -2845513 1566753 6608952 8569010 7248582 3965321 -496824
38158 -496824 -4424919 -5209103 -2446702 1717529 5916604 9945495 11717578 8431766
38150 8431766 2026074 -1215172 1227628 4487507 3426145 -500355 -2779136 -2853823
38142 -2853823 -3412404 -4742616 -4259293 -1286027 1403902 1660241 1096304 2679404 6274093
38133 6274093 8326693 6553189 3690135 4523760 9220741 12509373 10873155 7345841
38125 7345841 6331599 6807469 5100060 2059727 1714823 3634627 2832033 -2046265 -6280630
38116 -6280630 -6435699 -4753695 -3962651 -2810171 191577 3006972 3589335 3571764 4957111
38107 4957111 6216250 5187227 3144229 2376881 1987826 -204598 -3239008 -4059191 -1985381
38098 -1985381 928581 3257811 5167891 6458076 6115025 4010539 1607447 842247
38090 842247 2634897 5719569 6910960 4205138 -42027 -1088921 2451961 7119183
38082 7119183 9521200 9979977 10000306 9042318 6055999 2179478 -359666 -777474 388313
38073 388313 2577779 4999146 6371234 6098334 4854167 3579395 2950479 3518329 4691784
38064 4691784 4315443 1600830 -615366 248689 1728454 -112687 -3395472 -2635145 1802284
38055 1802284 3436949 354099 -1343273 1925768 4494972 448263 -6691139 -9483227
38047 -9483227 -7236083 -4797143 -4272283 -4381879 -5288613 -7508266 -7860121 -2955098 4117707
38038 4117707 6428842 2298058 -3272222 -5986129 -6317005 -6241375 -6388949 -6795214 -6852780
38029 -6852780 -4546558 934876 6325027 7475050 4791853 1995511 412617 -1429360
38021 -1429360 -3282328 -2988870 -1112292 -1344918 -5158519 -9466715 -10717315 -8579418
38013 -8579418 -4832986 -1128243 1473108 2795210 3717945 4437066 3167752 -1252887
38005 -1252887 -6256292 -7698874 -4785359 -550939 1927704 1525889 -1608672 -5833254
37997 -5833254 -7898870 -6020888 -2516649 -760635 -546077 471992 1881462 883725
37989 883725 -2866291 -6556550 -8380033 -8861596 -7868836 -4009563 2065097 6908764 8215767
37980 8215767 7378247 7071451 7900609 8252480 6507051 3095554 642910 1248345 3386449
37971 3386449 3408861 719311 -1393207 -1287894 -1585423 -3906438 -5103573 -2330032 1980780
37962 1980780 4487122 6422728 9522275 10325343 5220948 -1605497 -2673940 1881596
37954 1881596 5224292 4566141 3330468 3015649 1178321 -1597482 -889465 3369912 5422799
37945 5422799 3008618 1012770 2680988 4153374 1845258 -948825 261598 3701685
37937 3701685 4378351 1017821 -3960409 -8125454 -9456726 -6533717 -1356009 1348372
37929 1348372 119330 -1637294 -2000010 -3457667 -6721641 -7436127 -3508635 -457589
37921 -457589 -3838371 -10379561 -12486940 -8464871 -2668509 1674839 3971722 3047759
37913 3047759 -1221965 -4387623 -1689717 4495605 6994208 3690745 -58743 668589
37905 668589 4791512 8423371 9261258 6426306 -162379 -8139747 -13034704 -12235860 -7267494
37896 -7267494 -1385876 3382001 6250204 6838982 5707304 4517602 4325404 4105115 1957589
37887 1957589 -2073413 -5117681 -4356658 -704293 2055559 2630731 4270920 9013495
37879 9013495 12556936 9621560 3024888 1107910 5514899 8375241 4272510 -1648068
37871 -1648068 -2075338 1654824 3142029 1209476 -10055 1164651 2505503 2978617
37863 2978617 3666919 4254454 3478187 2402500 2826326 3531459 2570304 1649104 3088352
37854 3088352 4259216 1397854 -2310786 -42591 7068808 9753042 4100771 -2496151
37846 -2496151 -2607378 917898 1068936 -2272764 -3529573 -469640 3648785 5308201
37838 5308201 3577969 -909753 -5880826 -7553949 -4559500 -723789 -586373 -3280650
37830 -3280650 -4394741 -2803366 -1490200 -1837141 -1422699 1537761 5183327 7049704
37822 7049704 7365676 7536325 7496907 6510923 5014950 3648588 1531703 -2287872 -6032951
37813 -6032951 -6121709 -1635099 3715100 5392647 3032426 199838 -483467 -32158 -278555
37804 -278555 -445760 1309995 3914142 3754423 -419961 -5255992 -6664199 -4291758 -822748
37795 -822748 1707480 3151482 3773861 3525968 2714535 2084803 2249131 3663412 6354892
37786 6354892 8727967 8025741 3878493 207694 899284 4223637 4909954 1895378 244
37777 244 2398593 5526497 4659804 1293518 578037 3429581 6285861 7978081 11167497
37768 11167497 15898024 17297315 12739261 7029306 6403217 10143693 12399373 10584394
37760 10584394 7624535 6550586 6950697 7016164 5791236 3048062 -216718 -1174292 1746620
37751 1746620 5127980 3811642 -1311182 -3050737 2470520 9977686 12122570 9189182
37743 9189182 7330874 8912650 9654673 5768755 -297703 -3148729 -918001 3642486
37735 3642486 7167687 8666033 8706763 7359258 4085402 -476875 -3771586 -3580301 -927719
37726 -927719 675986 -527157 -2433464 -2226686 -184291 1468739 2418305 4332434 7101965
37717 7101965 7866913 5073233 1292022 -4986 978438 1375492 359306 -77937 860180
37708 860180 1178604 -135741 -722250 1207515 2941897 1053854 -2196438 -933152 5495723
37699 5495723 10514844 9054452 3994303 865398 -34884 -1863447 -4327438 -4005815
37691 -4005815 -703834 1774888 1676912 1455596 2654653 2918841 310159 -2765670 -2733602
37682 -2733602 123496 2307185 1558183 -1183546 -3354872 -2988157 -258842 2220460
37674 2220460 1630028 -1821915 -5006057 -5726969 -5040863 -5024594 -5709257 -5269988 -2360998
37665 -2360998 2340676 6194535 6337703 2679500 -1057217 -952032 2641119 5989070
37657 5989070 6718755 5178037 1776836 -3344578 -7707127 -7694889 -3949903 -1944894 -4925954
37648 -4925954 -9265764 -9360410 -4747773 206956 1840221 58690 -2752760 -3603057 -984995
37639 -984995 3234556 5238648 3599832 512904 -1889445 -3731340 -4871144 -3648317
37631 -3648317 -290088 1670913 194720 -1821340 -947484 1451141 1705033 -404927
37623 -404927 -1992488 -1686822 -451155 1056574 2558108 2414560 -846026 -5447554 -7558190
37614 -7558190 -5670421 -1924730 638981 651395 -1088032 -2322564 -1299389 1187293
37606 1187293 2960559 3794710 5041786 5711259 3032356 -1609103 -2195198 3299377 8385085
37597 8385085 6506808 152287 -3413447 -2149968 529044 2729579 5141629 6836397
37589 6836397 6040081 4262961 4300514 5040967 3484064 741010 339652 1568695 650670
37580 650670 -2070933 -2623243 -932745 -987292 -2957003 -2363161 1407600 3030730 276187
37571 276187 -1813005 572104 3573551 2347490 -1020232 -1552520 460570 741345 -1816705
37562 -1816705 -4091210 -3724840 -1410926 1241362 3358670 4644112 5283786 5593463 5142628
37553 5142628 3361156 1044641 -681296 -2620594 -5876337 -8238755 -6193977 -1072767
37545 -1072767 1362054 -934361 -3024126 -354195 4585279 6082009 2634826 -2453252
37537 -2453252 -5587245 -5522038 -3569583 -2943346 -5611440 -8713576 -7307907 -1760849 1855885
37528 1855885 534407 -1487624 -320501 1001826 -1778821 -6171108 -6555073 -3171682
37520 -3171682 -1498774 -3724731 -6227395 -5557033 -2569019 -100444 250852 -1289603
37512 -1289603 -2906327 -2260229 549245 1847191 -1459001 -7302465 -10332559 -7858261
37504 -7858261 -2128619 2490199 3010945 -331894 -4083618 -4563335 -2058095 -379632
37496 -379632 -1374319 -2616944 -1998458 -1138279 -1746753 -2033256 -44623 2436806 2970843
37487 2970843 2685456 3596047 4400819 3204864 1953609 3444289 5961498 5812462 3538792
37478 3538792 2525485 2786198 1460734 -1387893 -2897025 -2883442 -3779919 -5136837 -3687325
37469 -3687325 475545 2977343 1508361 -1494810 -3442868 -4312456 -3811169 -625796
37461 -625796 3858069 5385954 2297151 -2312215 -5107316 -5604064 -4003491 -292341
37453 -292341 3327109 3708718 2016466 2964036 6973252 8348308 4063190 -955089 -1338544
37444 -1338544 654310 -360592 -3932871 -5008622 -2045270 1579323 3399685 4233192
37436 4233192 4781594 4075332 2007739 352412 473394 1982764 3780237 4777806 4034450
37427 4034450 1918548 520882 1171464 2353842 1879741 108163 -1006265 -910548 -156019
37418 -156019 1723519 5158521 8093447 7732775 4645912 2183559 1673412 1232784 -133284
37409 -133284 -516671 1374354 3467811 3239460 1442527 598934 1030680 951738 118399
37400 118399 759207 4016386 7402556 7595116 5010363 3470914 4847835 6138533 3797546
37391 3797546 -346594 -630683 4683289 10472658 11368966 8436715 6218691 5333771 2516853
37382 2516853 -2407034 -4648179 -1427253 3164381 3445202 -283897 -2964459 -1979666
37374 -1979666 681873 2814869 4470979 5408507 3885110 -87530 -3070792 -2133850
37366 -2133850 1381348 4113438 4903891 4406244 2242011 -2223462 -7045404 -8926147
37358 -8926147 -7337193 -4690884 -2463913 -128774 1913667 1812700 -314347 -1644750
37350 -1644750 -720272 727398 1463752 2923200 5589790 6620009 4145147 1167817
37342 1167817 1715954 5283139 8445415 9797230 9646691 7236478 2877828 871964
37334 871964 4782420 10772403 11575594 7064912 4592338 7689205 10907424 8676989
37326 8676989 3462015 876984 1141010 397062 -2216467 -3766338 -2640184 -463348
37318 -463348 787189 801251 398179 936629 3575263 7537119 10078296 9477509 6798270
37309 6798270 3806740 1194319 -171260 825180 2698886 1838330 -1686306 -2418088 2842375
37300 2842375 9168930 9989479 6667059 5994452 9745768 12776071 11289210 7295052
37292 7295052 4191924 3005758 3912133 6610812 8108779 5123082 153640 -89633
37284 -89633 5460831 9351293 6006207 5244 -787412 3532409 6289229 4670717 2767624
37275 2767624 4295541 7345548 7738629 4398890 42227 -1658920 931732 5837800
37267 5837800 8968847 8476308 6929195 7678734 10296816 11801759 11202943 9998030 8905755
37258 8905755 7230705 5258832 4193540 3640293 2223250 827678 1737638 3918690
37250 3918690 3017120 -2296039 -7508635 -8153901 -5542672 -3849905 -4017086 -3838016 -2304220
37241 -2304220 -336424 1822678 4573278 6759424 6613651 4734861 3177465 1751665
37233 1751665 -1311859 -4543748 -3061357 4622916 12602415 13515893 7103408 -35962
37225 -35962 -2654092 -2017924 -2454253 -5188499 -7305469 -5837229 -1058747 4528523 9093269
37216 9093269 12206083 13396223 11890143 8417221 5690360 5698466 7491663 9062481 10315924
37207 10315924 12111416 13235338 11283102 6794404 3600578 3995761 6044103 6987558
37199 6987558 6834562 6723802 6108776 4203136 2542884 3144242 5020162 5402658 4009726
37190 4009726 3337408 4724668 6714357 7634373 7476239 6767071 5753349 5226706 6045835
37181 6045835 7230016 6628892 4176722 2312327 2376871 3005707 3191398 4163739 6323795
37172 6323795 7097077 4841825 2763457 4995732 9636237 9981925 3488480 -4113375
37164 -4113375 -5486034 -8031 6568449 8987061 6809804 2956818 279485 -371064
37156 -371064 -193924 -926154 -2707159 -3754848 -2703218 -390999 1723872 3883264 6928590
37147 6928590 9529081 9040692 5534248 2524907 2489368 3755406 3602042 2633129 3521360
37138 3521360 6362790 8203897 7375747 5759506 5878663 7746786 9802526 11408375
37130 11408375 12909824 14113900 14161305 12658115 10076032 7322434 5495049 5509285 7105208
37121 7105208 8439136 7477381 4105336 678222 106750 2809478 5519284 4274468
37113 4274468 -645443 -4206725 -2609588 1765712 3968947 3529741 3801629 4800353 2288042
37104 2288042 -4200323 -7989372 -3982525 3444332 6365317 4135826 2490724 3645827
37096 3645827 3937519 1448652 -525841 334658 1112089 -1201548 -4147765 -3036349 2527774
37087 2527774 8501722 11451871 11255078 9613628 7826966 5764693 2314608 -2432045
37079 -2432045 -5561661 -3902051 1366305 5033746 3748090 -693836 -4852727 -7597872
37071 -7597872 -8881953 -7530398 -3168446 1394759 2629476 393345 -2476095 -3800278
37063 -3800278 -3468065 -2269894 -1361250 -2121296 -4564832 -6306338 -4755625 -154260 4644513
37054 4644513 7025715 6580705 5008376 4562199 5657856 6058001 4049936 1887451 2915813
37045 2915813 5281904 3194089 -3864317 -8381465 -4906446 1768847 3558731 336308
37037 336308 -2009431 -1891715 -2887929 -5327618 -4970149 -1112077 1280826 -183453 -1568010
37028 -1568010 -189013 414126 -2449879 -4187325 415391 7843107 9815921 4931077
37020 4931077 140405 809942 4797079 7250459 6522779 3610621 -319657 -3360876
37012 -3360876 -2681305 2128496 6937748 6913301 2022012 -3242900 -5354184 -4963959 -4280750
37003 -4280750 -3352179 -802695 2530974 3162631 -749350 -6146565 -8007610 -5281237
36995 -5281237 -2111616 -2680856 -6339654 -8934492 -7993718 -5133883 -3449250 -3834593 -4565592
36986 -4565592 -3867635 -1859535 229017 1807717 2978313 3410444 2648840 1681050 2624985
36977 2624985 6122274 10344315 13361388 15020931 15498875 13899293 10143878 6667409
36969 6667409 5876145 6942938 7380937 6735513 6240969 5986273 5469055 5999702 8912937
36960 8912937 11854968 10904809 6548396 3319289 2905042 2247637 -174219 -1261333 832283
36951 832283 2525048 498390 -2225426 -645057 4379148 7622689 7302661 6480981 7308526
36942 7308526 8631689 9668957 11731034 14930820 16469513 14003535 8765849 3984482
36934 3984482 1395713 80074 -2008634 -5463586 -7946868 -6366348 -1588623 833189
36926 833189 -3010260 -9681850 -11973852 -7436749 -284930 4684795 6585139 6743389
36918 6743389 6223713 6196522 7780537 10058615 10555607 8839564 7365092 7621124 7894035
36909 7894035 6384095 4268584 3703466 4501730 4864347 4303634 3986409 4747428 6044225
36900 6044225 6475709 4807629 1395096 -1155047 -349009 2610564 3648583 1311583
36892 1311583 -831356 844091 4726998 6368968 4827299 3337641 3871493 4347357
36884 4347357 2410380 -507152 -903528 2151324 5926427 7294013 5679919 2722482
36876 2722482 313867 -435014 713637 2995780 4958772 5827346 6353843 7455047 8458116
36867 8458116 8096431 6940450 6812546 7573119 6992336 4774825 3897787 5969237 7968491
36858 7968491 6647078 4022932 4578051 8160214 9988197 7635904 3830869 1585595
36850 1585595 452339 -923245 -1852216 -1153916 695254 2550889 3876367 4159733 3230530
36841 3230530 2780799 4922077 8462014 9607692 7427869 5398193 6116321 7870037
36833 7870037 8278308 7844033 7518875 6158280 3355941 1749476 3169999 5097950 4394572
36824 4394572 2250990 1872968 3315576 4341431 4680459 5612221 6556170 5655615 2853251
36815 2853251 -508165 -3758535 -5888419 -4747416 -653389 1797190 -200991 -2353633
36807 -2353633 741926 6510615 7605280 2991880 -1037739 -833376 792370 1796036
36799 1796036 4654502 10088951 13382695 10868552 5366886 1604656 428986 870413
36791 870413 3494520 7585302 8854889 4693242 -992198 -2630160 -542149 619716
36783 619716 -807640 -2249431 -2114817 -2012737 -3446861 -5347056 -5532247 -3017592 1054970
36774 1054970 3906972 3635025 2024738 2856334 6353116 8252283 6292810 4084058
36766 4084058 5287842 7399258 5969702 2428653 1971122 4820616 5753125 2785061
36758 2785061 467339 2620368 6783469 8698957 8231606 7369935 5554710 1252491
36750 1252491 -3507701 -4512653 -1209771 2322207 2896539 1744920 1212632 536663 -2577099
36741 -2577099 -7396806 -10023548 -8072906 -3354012 848350 3248689 4104495 3067479
36733 3067479 -444828 -5493552 -9980031 -12252912 -11153388 -5924338 1688771 6625484
36725 6625484 5122078 -197018 -3145034 -1924334 -691525 -2678369 -5724407 -6240132
36717 -6240132 -4056840 -1146659 1510210 3437028 3634012 2447889 2248051 4021433
36709 4021433 5478893 4671410 3092314 2780089 2716204 864079 -2247627 -4738890 -6300622
36700 -6300622 -7186337 -6129373 -2178093 2773697 5771702 5777236 3135855 -1545635 -5877245
36691 -5877245 -6093243 -1995891 1443829 830428 -422551 2285725 6976530 8083361
36683 8083361 4907389 1504999 -375033 -2533916 -5246219 -6523243 -6427002 -7120503 -8508188
36674 -8508188 -8423892 -7059882 -6557387 -6327175 -3645765 968889 3833224 3872369 3652462
36665 3652462 4398006 4709924 4498132 5299584 6258869 4636516 758644 -2217934 -3429632
36656 -3429632 -4175550 -3330228 860511 4786675 2747858 -3165284 -4596814 21284
36648 21284 2712836 -618334 -3101062 1476006 8077015 8444019 3486040 196115 713152
36639 713152 1768758 2002514 3122927 5439353 7355671 7891481 6351591 2164653 -2144404
36630 -2144404 -2049584 1516762 1118783 -6112011 -12064645 -8512744 798174 6231107 5969980
36621 5969980 5388362 6108998 4826187 1551150 289377 1533278 1614187 -209586 -771302
36612 -771302 741355 1886424 2297344 3649637 4499986 1712993 -2902090 -4050775 -1376221
36603 -1376221 285209 -501107 -99860 2194245 2028397 -1766223 -3740128 27773 5992807
36594 5992807 8653632 7326805 4692290 2917791 3488989 6626932 9039112 6706868
36586 6706868 1414425 -424776 3097745 6921444 7335108 6574398 6748271 5817756 3157698
36577 3157698 2735828 6308363 9201140 7630268 4736287 4221686 3551922 -425795 -4253826
36568 -4253826 -3389024 -728677 -1742713 -4278690 -1930763 3983709 4980404 -1367716
36560 -1367716 -7194129 -5883921 -833418 1094033 -604251 -1475777 132668 1692173
36552 1692173 1677419 1970673 4397656 7385721 7701812 4849751 2101373 2291197 3705032
36543 3705032 2193238 -2784210 -6842492 -6266002 -2327753 1453094 3737713 4903381
36535 4903381 4646807 2965945 1753587 2418851 3325216 2572443 1952718 4668550 9845886
36526 9845886 12858584 11135443 6611773 2230526 -1107338 -3529131 -4631238 -3999836
36518 -3999836 -1967781 556031 2238480 1951352 387991 -135663 902048 622410 -3038836
36509 -3038836 -7106221 -6884063 -2639409 640855 -22413 -2662408 -4325149 -4344911 -3000521
36500 -3000521 -493880 1455947 221918 -3923661 -7375412 -8025401 -7591796 -7442218 -5534007
36491 -5534007 -504832 4004433 3186130 -2043578 -5920976 -5330699 -2798980 -1566094
36483 -1566094 -1211773 190202 2237928 2909230 1806416 586838 627911 1733885 2778892
36474 2778892 2508875 367863 -2220671 -2375268 527558 2561866 -456101 -6521515
36466 -6521515 -8815695 -4535977 1387628 3551866 3170966 4172894 5676360 4057213
36458 4057213 782044 1404714 6190111 8371969 4267892 -667708 181321 5194134
36450 5194134 7968939 6956506 6271696 8450471 11394348 12259501 10467973 6874365
36442 6874365 3115220 1540817 2836390 4127009 2376693 -969011 -1987199 -301520
36434 -301520 646573 -829095 -2842620 -4036423 -5259918 -6128223 -4253013 98188 2539230
36425 2539230 542653 -2416972 -1936043 826971 1499251 -573632 -1900044 -620984
36417 -620984 1195455 1242992 -285869 -2124705 -3202850 -1973112 2460730 7492431 8346511
36408 8346511 4006687 -898388 -2200611 -1363972 -1698100 -2337910 -522466 1990232 657177
36399 657177 -3669589 -4604645 -295351 2507827 -1489530 -7222460 -6290749 647848 5399081
36390 5399081 4522586 2859524 4415206 6570812 5619749 2628619 745105 552730 853462
36381 853462 1063134 712292 -673488 -1748204 -500469 1752751 1455175 -929646 -605610
36372 -605610 3606985 6450111 4563956 2125179 3656561 6357599 5373303 2406912
36364 2406912 2302775 4133890 3095891 -358676 -834863 2633636 4569827 1688317
36356 1688317 -2379618 -2986332 -436112 2036342 2711372 2025602 1364573 2204889 4331379
36347 4331379 5005171 2424708 -687781 -169184 3612308 6466011 6399147 4976824 3281276
36338 3281276 1016854 -477358 967675 4102794 5291426 4282533 4398635 6352480
36330 6352480 6784904 4201413 1550768 1080866 1024280 -511257 -2316666 -2906397 -3006971
36321 -3006971 -3126050 -1895384 1087995 3536785 3306250 679974 -2878012 -5635583
36313 -5635583 -5384985 -1934010 443229 -2445376 -7782885 -8706964 -4473587 -1347751
36305 -1347751 -2247439 -2690064 325256 2709850 791552 -2055331 -1401002 1149553 2231567
36296 2231567 3051627 5685860 7568088 5831081 3274160 3666945 4585858 1749612 -2300606
36287 -2300606 -1208771 4976449 9623568 9089079 6076019 3380951 320912 -3645495
36279 -3645495 -6669276 -7183472 -5492280 -2543686 -140805 -1378395 -7021746 -12427260
36271 -12427260 -12284324 -7589374 -3592988 -1924142 66958 2686600 2512447 -1491739
36263 -1491739 -5743965 -7526106 -8243482 -9421035 -9391249 -6199021 -1043285 2911349 3269737
36254 3269737 -441829 -5968625 -8824666 -6698055 -3237191 -3819023 -7542489 -7864266
36246 -7864266 -2122192 4230885 5023150 989474 -2800554 -3927476 -3723389 -3503391 -3144470
36237 -3144470 -2755924 -3139710 -4396360 -5455521 -5142663 -3174217 -367700 1800757 2214951
36228 2214951 952541 -912748 -1977383 -996479 2134829 5374257 5931937 3593238
36220 3593238 1197777 872095 1580722 1517331 713144 -136121 -885275 -391247 3014266
36211 3014266 7315469 7001567 785330 -5020953 -5363341 -4429475 -8557819 -14716011 -14122769
36202 -14122769 -5983640 803179 355149 -3363048 -4233227 -1823481 1042708 2985471
36194 2985471 3543642 2339642 946528 1709962 3395583 2235157 -1711416 -3970250
36186 -3970250 -2497738 -152360 708452 756257 -186105 -3450721 -6491206 -4301130 1858504
36177 1858504 4249086 233799 -3444153 -2122099 -1037783 -5595257 -11028258 -9692408
36169 -9692408 -3320163 441448 -41817 -339900 751493 240415 -1952058 -2557443 -1192020
36160 -1192020 -297208 530845 3402453 5910679 3440306 -1974732 -2803751 2333060 5691377
36151 5691377 2140529 -3048473 -2765558 1243052 2236447 -529408 -1294751 2695932 7225401
36142 7225401 7946590 6616744 7565293 10500823 10637982 5839241 144427 -1652594 -514277
36133 -514277 -1093021 -4238097 -5588967 -2441103 1751667 2083725 -1126495 -3142234 -926395
36124 -926395 3957362 7812337 8285671 5820930 2933191 1728495 1738839 1026779 -776963
36115 -776963 -2234006 -2597211 -2119845 -101021 4194060 8597862 9827003 8628187 8795912
36106 8795912 10365154 9089179 4369428 1833206 4933620 9475059 10405250 9160208
36098 9160208 10099425 14104654 19716960 26303871 32802080 38440527 47218264 64266009
36090 64266009 85168761 100452605 116503005 155940755 221975303 275599087 271559174
36083 271559174 213185758 148753862 112916751 95383973 73061217 47545641 34449543
36076 34449543 33703764 31505605 23297622 16290194 12945780 8026800 1314843 -328270
36068 -328270 5015418 10737413 11804126 10074652 8393294 6880286 6137051 7267326
36060 7267326 7776272 4007421 -1448344 -1512184 4688772 9515666 7714439 3484110 2966320
36051 2966320 4757409 2926725 -3273563 -7823888 -5906998 58268 3577708 1599025
36043 1599025 -2817273 -5191837 -4982465 -4551301 -4453141 -3380181 -2455239 -4689256 -8716444
36034 -8716444 -8427863 -2137412 3013527 661651 -5275849 -6832862 -3896602 -2231175
36026 -2231175 -2097783 2034741 10323962 15165408 12439618 7364949 5495887 4764822
36018 4764822 1330484 -2352813 -1380133 3195879 5668274 3649999 -6738 -2040272
36010 -2040272 -1374444 2142248 7529222 11427913 10578885 5940710 1852984 909312 1614815
36001 1614815 977334 -2365748 -7210021 -10280311 -8439085 -2387355 2689180 2481028
35993 2481028 -1238611 -3403225 -2774866 -2669287 -4616440 -5654593 -3602359 -1103103
35985 -1103103 -1353834 -2609182 -807842 3754595 6441966 4889332 1950828 1185294
35977 1185294 2471543 3610155 3838324 3821946 3813256 3656038 3409908 2476942 -408497
35968 -408497 -4499233 -5945190 -2041868 4278649 7095114 4573327 730373 -234512
35960 -234512 1174191 1463956 -1279467 -5758980 -9148513 -9579636 -7756684 -6135373 -5542961
35951 -5542961 -3530676 1756911 7014603 6699517 882267 -3766163 -2446414 1902156
35943 1902156 3614898 1969315 533322 1093385 1908435 1038186 -1625752 -5085390 -7569578
35934 -7569578 -6863644 -2658544 2027875 3883688 3078970 2100754 1881252 1403689 292881
35925 292881 -653196 -955778 -363121 1835723 5079016 6225653 2959158 -2077809 -3642689
35916 -3642689 -369901 3815926 4760970 2012071 -2170328 -4998201 -4335523 -489658
35908 -489658 2900186 2387741 -598731 -1203385 2486555 7263225 9386949 8524111 6444451
35899 6444451 4553526 3677996 3909758 3790515 1789784 -920490 -1491644 501936 2566508
35890 2566508 3047127 2397313 652543 -2542701 -4830325 -2562323 3083655 5929935
35882 5929935 3127687 -772903 -1179925 -336337 -2386474 -5487307 -4684047 -357717 2458276
35873 2458276 2454652 3547019 7247774 9276197 6134381 645827 -2250330 -2258554 -2843282
35864 -2843282 -5244977 -6859832 -5541196 -2868378 -2092589 -4114916 -6597514 -6612417 -3260564
35855 -3260564 2146720 7236306 9413971 7131092 2018617 -1257002 307853 3875903
35847 3875903 4186971 1277168 1003872 6329952 12002511 11184107 4530027 -1423222 -3169481
35838 -3169481 -3035746 -3645379 -4188545 -3240711 -1755973 -1521366 -2771651 -4592657 -6077960
35829 -6077960 -6305713 -4695139 -1968084 576827 2864642 5564211 7996500 8644206
35821 8644206 7824539 7448420 7676440 6377360 2877278 -195988 -315917 1560470 2538705
35812 2538705 1305180 -1124232 -2785919 -1798843 2474269 8004685 11148486 10346086
35804 10346086 7556917 5040066 2448832 -1262604 -4621666 -4661318 -732469 4453659
35796 4453659 7541210 7234141 4559155 1312528 -1819596 -5649105 -10346549 -13459117
35788 -13459117 -12109890 -7323897 -3489573 -2627068 -2281235 -794137 -1006025 -5271245
35780 -5271245 -9749280 -8489657 -1956929 3299136 3242216 105839 -2675149 -4550389
35772 -4550389 -5647991 -5008640 -3297766 -3606188 -6890630 -9559224 -8208361 -4072024
35764 -4072024 -106836 3453611 7135566 8321980 3947068 -3721606 -8370320 -7155651
35756 -7155651 -3524731 -1826689 -2179145 -2001248 -265162 1618589 2101474 1349219 967651
35747 967651 2203943 4408395 5848201 6231364 6976926 8161421 7289149 3017963 -1890236
35738 -1890236 -4000123 -3735870 -3228869 -1649115 2670414 6738169 5445964 -113669
35730 -113669 -3080291 -1062783 609784 -1241721 -1551768 3841591 9047114 5797006
35722 5797006 -3524129 -9068507 -7985057 -6692788 -8423148 -7872866 -1546815 4715926
35714 4715926 4224305 -219764 -944192 3030201 5506888 2658237 -2785355 -6598580
35706 -6598580 -7211902 -4364766 1683994 8155049 10732901 8493948 5145379 3812373
35698 3812373 3399381 2028362 1095266 2719085 5106753 4290231 -61748 -4162578 -5662189
35689 -5662189 -6114460 -6851593 -6136456 -3003151 -905687 -3614962 -9004983 -11266794 -9033965
35680 -9033965 -6709637 -6693484 -5152301 1336841 8676477 9504979 3105468 -3423669 -3899606
35671 -3899606 748775 5544303 7336914 6337142 4407605 3466105 4028873 4360391 2471339
35662 2471339 -745535 -2449251 -2234490 -2670713 -4329482 -3642863 1658139 7649392 8399298
35653 8399298 3719808 -903921 -1641579 38923 1331154 1995868 2708966 2406247 -118268
35644 -118268 -3295735 -3897777 -914169 3247562 5487904 4811723 2299929 -626283 -3210817
35635 -3210817 -4954514 -5006962 -2756044 700623 2445808 299155 -4458750 -8043539
35627 -8043539 -8198096 -6124841 -3905957 -1628141 1448013 4188009 4440732 2294233
35619 2294233 80234 -1139955 -2624458 -4707111 -5264309 -3291724 -1620069 -3232985
35611 -3232985 -6397255 -6754527 -3685799 -1206027 -2146075 -4446539 -4286010 -695959 3883874
35602 3883874 5958539 3560369 -1563467 -4367452 -1655307 3225960 4048321 150918
35594 150918 -2962615 -2236031 -1058083 -2431414 -3767431 -2537248 -1881958 -4835458 -7132879
35585 -7132879 -2903706 4956576 7733285 3345545 -1563754 -2094911 -159781 2081846
35577 2081846 6112642 11341999 12377112 6626611 -331923 -1699117 1859212 4722289
35569 4722289 4375040 2656501 1311887 482098 296318 680934 610577 -96155 349400
35560 349400 3035936 6287141 8055702 8326751 7523021 5164065 2033029 724825 1740344
35551 1740344 2056351 24601 -1660194 -714886 691484 152902 -503412 732763 1240729
35542 1240729 -1665743 -4525417 -2404984 2265121 2383624 -2950317 -7003022 -5456507
35534 -5456507 -1741428 -746742 -2441651 -3935878 -3814474 -2314937 -318389 285304 -2034757
35525 -2034757 -5685224 -7162887 -5597907 -3408496 -2348703 -2052670 -2444895 -3815350
35517 -3815350 -4236631 -1108227 3916082 5883357 3789026 2498443 5347911 9027399
35509 9027399 8913437 6172838 5761418 9059764 11942654 10000051 3731861 -1688532
35501 -1688532 -1484458 3485047 7094791 4761931 -1143656 -4692525 -3831225 -1420744
35493 -1420744 -150475 -444134 -2655211 -6589353 -8892062 -6024969 -401898 1747738
35485 1747738 -493991 -1635875 717004 1997574 -730319 -3230039 -1850903 -527820
35477 -527820 -3739492 -7496159 -4804500 2984742 7842280 6558733 3477982 2152880
35469 2152880 994728 -1885542 -5194818 -7385296 -8639869 -8534558 -5609515 -797874
35461 -797874 1964296 191594 -4237120 -7394358 -6684922 -2135004 3211981 4581564
35453 4581564 205938 -5303473 -5487287 18426 5379636 6408079 4554760 2475529
35445 2475529 143049 -2590850 -3559519 -1544528 769377 371965 -1407264 -1057883 1469535
35436 1469535 2616351 513337 -2566702 -3701768 -2883601 -1840489 -1032671 309335
35428 309335 1818092 1691745 -705928 -3385584 -3913885 -2096915 688154 3803990 7132902
35419 7132902 9307672 8857808 7262555 7895989 10918797 12140842 8718863 3285335
35411 3285335 75542 -572798 -880611 -904850 1038393 4157706 5162340 2652833 -1264354
35402 -1264354 -3953419 -4558366 -3432863 -1535437 -352371 -452229 -450414 788425 1974362
35393 1974362 1797306 2071274 5033920 8515674 8078187 3931735 1226446 2538034 4405150
35384 4405150 3117740 65150 -1177213 -79520 1189643 1191865 -22514 -1924583 -3472731
35375 -3472731 -3616552 -3076080 -3691197 -4998850 -4104665 -428864 2417288 1673959 -518195
35366 -518195 -786303 494477 1152117 1684522 3744453 5812260 4817288 1492907 -110667
35357 -110667 1436369 3408626 3787135 3678759 3669827 1640087 -3366907 -7872988 -7437503
35348 -7437503 -1945400 4835336 9720096 11864541 11130803 7572733 2804480 -352577
35340 -352577 -557749 856614 1912140 2086605 1805854 1035744 -481521 -2212068 -3189528
35331 -3189528 -3126309 -2232972 -327852 2573070 4963306 4905576 2888519 1854287 3270128
35322 3270128 4792221 3493332 66041 -2342478 -2541375 -1991708 -1583816 -715562 101621
35313 101621 -1175099 -4707977 -7621504 -7888612 -6990342 -6808192 -6287994 -3793650 -662906
35304 -662906 933159 2194708 5742434 9956396 9748826 4039390 -1582203 -1893029 1400830
35295 1400830 2960622 1282368 -558720 -279933 1185587 2471576 3557626 4026394
35287 4026394 2513919 -633311 -2454039 -1002883 1660676 1972903 -704791 -3817241
35279 -3817241 -4801748 -2883791 1206047 5138575 5399821 468254 -6390884 -9938434
35271 -9938434 -8842601 -6356038 -4857300 -2860005 1140659 4879349 5042539 1995864
35263 1995864 -846302 -1306594 183551 2478499 4539689 5019074 3432470 1441098
35255 1441098 902111 1218389 918976 1078282 3939500 8117161 8790613 3933351 -2734304
35246 -2734304 -6853278 -8736396 -10948188 -12758951 -10874168 -5505086 -1954325 -4206759
35238 -4206759 -9099179 -9777423 -4609964 440650 -230636 -4314307 -5330400 -2409153
35230 -2409153 -1325593 -4903707 -7747381 -4009785 3734095 8263282 7571037 5393927
35222 5393927 3688201 1031317 -1706701 -912625 2914103 3952931 -525135 -5693527
35214 -5693527 -6286322 -3507643 -1286047 -130208 882451 -71464 -4357151 -8048093
35206 -8048093 -5853852 1130182 6190290 4954239 -1073353 -7879604 -12030749 -11399778
35198 -11399778 -6879050 -2953892 -3078216 -5175394 -5102813 -3202382 -3075231 -4955542 -5527990
35189 -5527990 -4244738 -4409958 -7021490 -8600375 -6874398 -4203534 -3317693 -3514289 -3201049
35180 -3201049 -2741025 -2669704 -2257766 -1786310 -3081993 -5835141 -6622783 -3780967 -160111
35171 -160111 1214150 1116075 1312703 880733 -1755698 -5567807 -8345250 -9212104 -7827107
35162 -7827107 -3987260 20636 382759 -2361609 -2603877 1844960 5273056 2721056
35154 2721056 -1663878 -1261707 2053064 1445308 -2912978 -4265361 -1053736 777430
35146 777430 -1481351 -2934917 -359388 2002791 231132 -2213288 -325881 4518380
35138 4518380 7563729 7771589 7300137 7140371 7395685 8762662 9950481 7183976 371090
35129 371090 -4091852 -1569259 3358701 3238521 -1657553 -5232256 -5279167 -4285206 -2473822
35120 -2473822 2036547 6460591 4759722 -2728031 -8073382 -6338943 -1249095 1983205
35112 1983205 3436706 5067357 6039174 5207995 3953685 3246710 1884513 363150 1778266
35103 1778266 5667543 6265750 1340504 -2443606 1119275 7436581 7343077 886861 -2999576
35094 -2999576 194205 5323209 6760388 5925027 6878872 9567657 11006422 10100946 8189021
35085 8189021 6485872 5189506 4219393 3690187 4201475 6535193 9983562 11791472 10145782
35076 10145782 6875268 4906872 4115768 2677481 1460311 2999437 6221434 6657267
35068 6657267 2989122 -623779 -434470 2206747 4078376 4795230 5676880 6277010 4916280
35059 4916280 1651082 -1249755 -1331951 2105132 6898275 8787701 5414306 -98760
35051 -98760 -2043332 850186 4086959 3803614 1102173 -1392404 -3614768 -6186787 -7557145
35042 -7557145 -6160626 -3375877 -1550014 -881329 -749663 -2006447 -4896307 -6525709
35034 -6525709 -3975873 929496 3241153 1023431 -2752864 -4265294 -2490530 1077703
35026 1077703 4325323 5974325 6377708 6674016 6699417 5154944 2603072 1903124 3852630
35017 3852630 4920265 2127049 -1915025 -2314091 1150072 4118396 4019209 2634675 2313815
35008 2313815 3054868 3918735 4488579 4179383 2402654 73319 -934469 -217025 940906
34999 940906 1787921 2727110 3705550 3822619 2789697 1498027 1277000 3426366 8274014
34990 8274014 13296516 13994018 9045676 3044632 1308018 3465403 5386828 5752895
34982 5752895 6353777 6812289 4203587 -1368920 -5361515 -4516770 -696709 2133154 1835422
34973 1835422 -1481584 -5715519 -7103659 -3944572 -226176 -1279762 -5519583 -5946059
34965 -5946059 -1220827 1078980 -4330537 -11787449 -12471959 -6664771 -2208841 -3156921
34957 -3156921 -6016042 -6551171 -4880542 -3189779 -2554721 -3167472 -4775813 -5894636 -4765862
34948 -4765862 -1926587 -211780 -1524409 -4560874 -6029952 -3702461 1392243 5543063
34940 5543063 6020239 4314074 4162454 6089306 6318734 2295188 -3134610 -5001058 -2018532
34931 -2018532 2588873 4706179 2607871 -1731357 -3720792 -575521 4754411 6758052
34923 6758052 4798536 3424494 4455489 4124636 418714 -2737837 -2667022 -3252757 -7212403
34914 -7212403 -8611460 -1033417 10530063 14804967 9442174 2526048 -100345 -41265
34906 -41265 1170850 5168237 10128473 9945336 3736581 -1297346 -549979 1337787 -983481
34897 -983481 -4858706 -4956658 -2021712 -412300 -824024 -956478 -342231 290766 1547109
34888 1547109 2982538 1509785 -3427597 -6693000 -4383394 -342719 -195555 -2199683
34880 -2199683 -458374 5221836 9544228 10366028 10376405 10800270 10007526 8425259 8594306
34871 8594306 9862761 8907448 6139486 5709168 8242713 9486554 7409872 4667798
34863 4667798 2486232 -1384430 -6127907 -6075756 384957 6049161 4328378 -1235251
34855 -1235251 -2740088 383757 1983228 -390909 -2215819 599397 6138427 9533122
34847 9533122 8318312 3867262 -231475 -959014 1158551 2236221 -129354 -3412028
34839 -3412028 -3891227 -2355164 -2660330 -5347061 -6658875 -4406503 -1191270 -375409 -1574193
34830 -1574193 -1884350 191882 3484384 5572895 4599287 946819 -2268241 -1839840 1744166
34821 1744166 4636838 4245661 1613447 -1496407 -5226094 -9332102 -10711887 -6776355
34813 -6776355 -447227 2121877 -484206 -2860243 -578109 3229661 2643448 -1736813
34805 -1736813 -3174316 1294442 6261382 5573713 588265 -2840303 -2748020 -1794749 -1178857
34796 -1178857 810291 3976319 5185554 3769729 3333007 5638917 6879271 3619939
34788 3619939 -930564 -1142105 2616602 4687658 2599190 64461 763904 3135241
34780 3135241 3218082 127555 -3292760 -4044419 -1937477 354427 -225006 -3879497 -7346224
34771 -7346224 -7491482 -5000474 -3011114 -2738052 -2720008 -2267245 -2822736 -4893993 -6124877
34762 -6124877 -4362815 -1141680 96527 -1249987 -2026401 404706 4497472 6374790
34754 6374790 4752122 2371757 2037482 2878790 2215696 -31513 -1409981 -1124577 -1057119
34745 -1057119 -1986861 -2131272 -921625 -773760 -2713546 -3627826 -1196664 1552105 860506
34736 860506 -1238954 -205878 3062351 3589273 941927 -10411 2317711 3407549 583811
34727 583811 -2226833 -1121495 1452661 1269455 -719626 -750052 1153461 1770930 362457
34718 362457 -783591 -1010536 -2535163 -6463604 -10325819 -10558679 -6171212 405867 5511408
34709 5511408 7438486 7454339 7017733 5030455 304115 -4021271 -2813497 3294648 7029864
34700 7029864 3839882 -1924255 -3447666 -360759 2826388 3938803 3869377 2393931
34692 2393931 -1332355 -5084708 -5453952 -3241820 -2463313 -3906027 -4047063 -886222 3203975
34683 3203975 5280460 4835176 2209737 -2252416 -6211487 -6076940 -1692421 2517911
34675 2517911 3042484 1543570 1580778 3182875 3335327 909538 -1498523 -1061306 1536714
34666 1536714 2936335 1268805 -1765504 -3557079 -3971688 -4295743 -3897067 -1066446 2954788
34657 2954788 4729648 4207019 4900350 6670748 4003645 -4599604 -11230468 -8810338
34649 -8810338 -2139120 -863080 -4612455 -4494421 1708238 6018704 3517155 -485047
34641 -485047 -198199 2019505 1720580 49256 -429322 -1927776 -7095535 -12514380 -12751004
34632 -12751004 -8275418 -3991165 -2069611 -1084978 -252903 179960 1196275 3431947
34624 3431947 4808041 3465414 1278438 799469 882978 -669947 -2507309 -2368544 -2080961
34615 -2080961 -4630049 -7904918 -7098638 -2503363 820472 859626 373448 655499 -341921
34606 -341921 -2472171 -1911073 2503130 6565570 7116501 6629393 8121776 9431852 6654396
34597 6654396 764474 -3237817 -2740183 -20107 1174840 -587613 -3733461 -5448886
34589 -5448886 -4510897 -2765446 -2757380 -4008007 -3784713 -1778532 -1018720 -2950935 -4708373
34580 -4708373 -3433760 -752853 -309300 -2708168 -5498483 -6672835 -5673643 -2341541
34572 -2341541 2368858 5604068 5290876 3060530 2108643 2758685 2615613 556154 -2140237
34563 -2140237 -4366689 -6066874 -6422964 -4035839 360203 3748708 4204068 2420089
34555 2420089 -488071 -4143354 -7103714 -6830800 -3245544 -36387 -335390 -2717029
34547 -2717029 -3311710 -308380 5333985 11654001 15884433 14888703 8556147 1628656
34539 1628656 -934850 434082 1914311 2631167 4866948 8409437 9587453 7024965
34531 7024965 3936335 2906914 2478960 1214025 1152001 4100293 7831448 9362258 9030283
34522 9030283 7863055 4225117 -2441992 -7558285 -6727063 -3204257 -3883805 -8690836
34514 -8690836 -10563500 -6400696 -1299990 -28263 -624111 243509 1053203 -941864 -3874585
34505 -3874585 -4022103 -2002945 -1507256 -3008600 -2966254 686640 5391907 6959030 4091192
34496 4091192 -342428 -1914977 959965 4961416 5358694 1624339 -2391927 -4006464
34488 -4006464 -4559743 -5894766 -7199037 -7110937 -6135521 -4917862 -2654698 709137 3150351
34479 3150351 3455759 2990967 2803157 1966716 854919 2371070 6838844 9220791 5426129
34470 5426129 -1403134 -5039351 -4230753 -2497700 -2098476 -2508204 -3013814 -2613842 743726
34461 743726 6600606 9899340 7117164 2086440 363104 338763 -3362754 -9420917 -10678437
34452 -10678437 -5534540 -670374 -889409 -3413923 -4650387 -5823733 -8319638 -9121563
34444 -9121563 -5269773 932534 4832204 4799589 2334729 -256434 -551772 2333027 5359784
34435 5359784 4468459 893945 94194 3175255 4901097 2459895 255287 2371559
34427 2371559 5786519 5715335 3147915 2080572 2891936 3280888 2702567 1544249 -932471
34418 -932471 -3769649 -3253294 786226 1959634 -3647328 -9586041 -7326760 714042
34410 714042 4517711 1123927 -2585046 -1658968 836010 1119404 384510 225826 -1155644
34401 -1155644 -4408634 -5743647 -2205131 3375348 6200368 5446431 3457049 1608101
34393 1608101 -170428 -1768635 -3196555 -4832804 -5676193 -3412156 2015897 6961199
34385 6961199 8032476 5736668 2783378 895544 764240 2661437 5090198 5167685 2622428
34376 2622428 1175270 3404583 6512607 6421065 4133279 3920553 6110603 6326927 2553097
34367 2553097 -1363465 -1343034 1076806 1471950 -925930 -2760010 -1885741 48882 698426
34358 698426 -112507 -1652683 -3926192 -6300657 -6525841 -3545150 -16342 583682 -1442269
34349 -1442269 -3068041 -3510220 -4637337 -6347484 -5601666 -1460608 2651285 3933199
34341 3933199 4181983 6039960 8177719 7525636 4066280 35740 -3677281 -6839700
34333 -6839700 -7554793 -4749487 -1562857 -1828510 -4014569 -3256179 896100 3604012 2145579
34324 2145579 -480249 -712773 881129 1929639 1977966 1914922 2063730 2332115 2496557
34315 2496557 1877390 681275 1123863 4260271 6597536 4138351 -692088 -1594554 1652778
34306 1652778 2073676 -3651890 -9551199 -9133579 -4154752 -135099 1877225 3738825
34298 3738825 4578570 2827900 1067095 2767157 5940251 5696090 1915887 -1015897
34290 -1015897 -1307333 -1299867 -2205592 -2276769 -497477 2038139 4428516 5924963 4363074
34281 4363074 -1023277 -6009874 -5593588 -1477395 -102171 -3227893 -6226282 -6345511
34273 -6345511 -6352480 -8095556 -8634897 -5896157 -2832559 -2280399 -2283428 -458775 1208766
34264 1208766 294101 -1115583 -275305 571504 -2076937 -5744379 -4460242 2102382 7564946
34255 7564946 7553668 4658727 3321605 3980323 4600942 4844232 5626231 6106293 4207071
34246 4207071 241064 -2214495 -267425 4444914 7350753 6254719 3328725 1227597
34238 1227597 -481237 -2991697 -4557406 -2770832 502022 898213 -1639989 -2629390
34230 -2629390 -649119 20894 -3308989 -6937346 -6786182 -4481180 -2981421 -646619
34222 -646619 4541627 8510872 5923500 -538075 -3035356 -16243 2531824 1566917
34214 1566917 1097245 3846831 6021223 4053354 788712 525906 2216587 2065225 -331017
34205 -331017 -2604461 -3787710 -4017693 -2376213 1094528 3072817 603167 -4021469
34197 -4021469 -5501141 -1992150 3417144 6681408 5577508 -56271 -7419163 -10909464
34189 -10909464 -6941745 1128050 5870547 3945772 -1146676 -4530989 -5062420 -4117175
34181 -4117175 -2375521 -7205 1647741 1007070 -1391995 -3032517 -2139598 666080
34173 666080 3676321 6145742 8202410 9216655 7754894 3706260 -836859 -3858927
34165 -3858927 -5432338 -6217039 -5478367 -2680100 349749 1653063 2395184 4444816 5710882
34156 5710882 2466642 -3758154 -6843477 -4663557 -1633122 -953348 -225351 2289365
34148 2289365 3305463 1003473 -4495 3702717 6894176 3318767 -3218713 -4105485
34140 -4105485 232850 1321144 -3071936 -5616904 -2174935 1598414 326697 -2468860
34132 -2468860 -1174714 2810594 4840309 5276385 7636862 11291685 11989675 8532038
34124 8532038 4109892 1393632 44174 -1003693 -1736415 -1721695 -768067 831905 1671238
34115 1671238 -63989 -4109877 -7711194 -8828329 -8209566 -7260806 -5886295 -3856368
34107 -3856368 -2292148 -2067034 -2338685 -2068217 -1419788 -687635 201989 356655 -1413397
34098 -1413397 -3812354 -4026816 -2414717 -2336345 -3729220 -1609283 5825238 12083690 10068222
34089 10068222 1755615 -4721002 -5430462 -3130002 -1057406 405186 1133134 65738
34081 65738 -2496650 -4405924 -3960555 -923317 3798535 7534293 6832089 1833521 -2381456
34072 -2381456 -1981416 461588 722316 -104156 1388770 3351210 762460 -5723316 -9804154
34063 -9804154 -8773055 -6196277 -4391347 -1096540 4063511 6377773 3084502 -1666081
34055 -1666081 -3053190 -2472963 -3874936 -6880203 -8216897 -7349025 -6128697 -4779411
34047 -4779411 -2580591 -1160085 -2787765 -5980138 -6703567 -3932630 -633028 1020537
34039 1020537 2188474 4273721 6073809 5736333 3922532 3018048 3514276 2953743 -547109
34030 -547109 -4767041 -5496701 -2527370 -842406 -3780027 -7483019 -5902250 97492
34022 97492 3505121 1121811 -2482468 -2561841 -728946 -1005539 -3629039 -6446972 -8915433
34013 -8915433 -10646665 -9162426 -3872355 216474 -1771126 -6602248 -6520826 -519013
34005 -519013 3979120 1868422 -2893895 -4073605 -2127370 -2330724 -6474520 -10505000
33997 -10505000 -9829212 -4114407 3165077 7977234 8371634 5326247 1510684 -1145441
33989 -1145441 -2650043 -3867941 -5122310 -6212227 -6937303 -7058755 -6421481 -5474679 -4850899
33980 -4850899 -4106312 -1925504 1928759 5977102 8866085 10488605 10564967 8072723 3849298
33971 3849298 1939225 5335292 10990897 12361071 7339546 538589 -3312118 -4782377
33963 -4782377 -6450966 -7672801 -6462468 -4332491 -4496913 -6123043 -5433832 -2731127
33955 -2731127 -2785603 -6545363 -8119432 -3597530 2039210 1984046 -1971793 -2298438 2801728
33946 2801728 7331930 6835658 3642200 1619503 1269103 2166635 5324829 10098942 12678294
33937 12678294 11061790 8603798 9317871 11985044 12160256 8286453 2822731 -1357517
33929 -1357517 -2985802 -1949933 639020 2593526 2621391 1293892 -876800 -4153703
33921 -4153703 -6890171 -5216389 1555476 7755123 7537033 2745374 604826 4454964
33913 4454964 10763323 14788062 14877040 11009610 3749974 -3780157 -6785347 -4086148
33905 -4086148 16151 1202090 182138 208230 1815267 2963849 3131524 3985136 5910412
33896 5910412 6727010 4988739 2511619 1878931 2751779 2908154 2297816 3032686 4788325
33887 4788325 3880640 -606008 -3243178 650673 6693482 6501480 533753 -1666815
33879 -1666815 4041276 9739940 8014084 3546229 4348079 7290890 3008707 -7184777
33871 -7184777 -11011721 -3456208 5378399 5133009 -896302 -3166633 -486999 763162
33863 763162 -1865919 -4382906 -4256658 -3701115 -4333992 -4225694 -2025849 155016 66341
33854 66341 -1474161 -2655599 -3510800 -4430571 -3697047 526681 6104844 7797753 3575180
33845 3575180 -1928552 -2637070 1263046 4043411 3029021 2231752 5029708 7504310
33837 7504310 4124973 -2545453 -4462739 -34844 3622033 1995279 -291779 1970438
33829 1970438 5692085 4842009 363178 -1695541 544362 3602521 5270567 6345419
33821 6345419 6347068 3567307 -232805 -928260 1071042 575098 -3857199 -6579789 -3190077
33812 -3190077 2455619 3805207 900211 -677730 1630527 4699403 5463629 5037935
33804 5037935 5728366 6860727 5807171 2094835 -1338432 -1190712 2645169 6844385
33796 6844385 7615085 3622932 -3457432 -10061897 -12232304 -7890211 582157 6974936
33788 6974936 6723680 1784904 -1741817 -778858 2033697 2916933 1542479 -112559 -1081227
33779 -1081227 -1517536 -1006395 893695 2889916 2678009 -373620 -4416600 -7149616 -7848708
33770 -7848708 -7249771 -6038357 -3908007 -320765 3822652 6067964 4977018 2450818
33762 2450818 2055178 4846119 8232795 9371667 8232968 6570708 5251440 3838060
33754 3838060 2043979 415991 -313956 -139853 -260108 -2389833 -6642837 -10283797 -10061743
33745 -10061743 -6020249 -1503250 899471 1635550 1952492 1639244 419662 -241909 1215979
33736 1215979 3812713 4757074 2667728 -847331 -2650861 -901871 2942524 5099567
33728 5099567 3615070 1191406 1967096 5713897 7876904 5681906 1260449 -1945550
33720 -1945550 -2661623 -853563 2777071 4961788 2036722 -3702203 -4681366 1466786
33712 1466786 7176900 5504015 358143 -392554 2243549 965784 -4695127 -7340736
33704 -7340736 -4070509 -874446 -2465088 -5497471 -5097054 -1617657 2420726 6273601
33696 6273601 8557096 6565527 1604769 -326327 3084338 6588047 5640592 2971024
33688 2971024 2470073 2360133 142829 -1044207 2154583 6008370 5327887 2796547 4466305
33679 4466305 8507262 7476759 948688 -3270322 -1445666 1184444 173593 -1325025
33671 -1325025 678149 3939266 4461204 3338704 4232541 7106643 8821591 7884311 5050450
33662 5050450 1050486 -2886606 -3768149 233803 5984281 7718401 3755961 -1404385
33654 -1404385 -2735916 -739366 7971 -2225790 -3581015 -362472 4829962 6430882
33646 6430882 4450460 4608252 8946105 12042244 9678486 5627124 4721166 4230382 -750275
33637 -750275 -6879274 -6083209 1751427 8046095 7814923 4796960 3281001 2681796 2313713
33628 2313713 3954730 6629862 5812175 1266064 -944386 1966587 4550921 2125534
33620 2125534 -1872440 -2842104 -3032416 -6121083 -9149162 -7195659 -2108061 782730
33612 782730 1477342 3354347 4926895 1639847 -5007427 -7895835 -4487446 -157967
33604 -157967 -215252 -3885763 -7270671 -7645384 -4000460 2362423 7007646 6174843 2099542
33595 2099542 780854 4032140 7669943 8132904 6776973 6427085 7347031 8260356 8604374
33586 8604374 8335023 7474558 6610908 6177223 5239954 2829246 -4433 -1528316 -1954099
33577 -1954099 -2514451 -3064209 -3145285 -3983103 -6345574 -7870709 -5989613 -2168562 306876
33568 306876 1145917 1735245 1073649 -2049786 -4644237 -3098500 51890 -706157 -4641563
33559 -4641563 -5737004 -2920049 -1676167 -4112263 -5176621 -1492376 3226650 5033981
33551 5033981 5298947 5427976 2679340 -3625301 -7555149 -4282249 2115022 4546128
33543 4546128 2892199 2022246 2904089 2215469 -779973 -2922677 -2201297 541913 4281432
33534 4281432 8073187 9502564 6871423 2338125 -529193 -1375662 -2025095 -2376087 -1188539
33525 -1188539 299806 -279099 -2156145 -2483144 -1193641 -909470 -2174507 -2615799 -1206427
33516 -1206427 -18527 -1023194 -3585014 -5543216 -5112740 -2236694 361446 -1003495
33508 -1003495 -5889890 -8493473 -4587259 2305854 5413000 3473424 553761 -1228741
33500 -1228741 -3341023 -5783407 -6203691 -4764219 -4650023 -6430436 -6637879 -3512318 152396
33491 152396 1441748 474141 -2167887 -6480551 -9728899 -7247192 417265 5762976
33483 5762976 3501738 -2363739 -4529536 -1799549 1999649 5149728 8412585 10269260
33475 10269260 7999531 3461227 2338286 6485063 11290880 12009041 8968441 4956795
33467 4956795 1160414 -1709344 -1216366 4198064 11455627 14981365 12901796 8732792
33459 8732792 6224101 4835555 2173565 -739438 1180 4853857 8405178 5935984
33451 5935984 288603 -1616385 1676983 4613851 3326373 970380 1676468 3436856
33443 3436856 1439055 -4148499 -8624523 -9649208 -8866766 -7330474 -4512523 -2229843
33435 -2229843 -4196285 -9953238 -13925304 -12749478 -9156987 -5983253 -1202455 6832540
33427 6832540 13428746 12683408 6283164 1317986 537908 677722 -83466 401724 2310786
33418 2310786 1958303 -1494958 -3283566 -820793 917025 -3051570 -8740315 -8140600
33410 -8140600 -1118481 4325078 3703590 1667690 4025992 9223504 11285212 8298637
33402 8298637 4160601 2775790 3593044 3523557 1602700 378405 2543535 7025178 9662830
33393 9662830 7974617 3820812 518441 -1133395 -2513958 -4317890 -5979585 -6911937
33385 -6911937 -6385175 -3299292 1724745 5225981 4533275 1516082 -165310 -437610 -1876871
33376 -1876871 -4298910 -4806061 -3357990 -3469719 -6131110 -7637404 -5498448 -2229124
33368 -2229124 -604171 831253 3982728 6280353 3912272 -1818193 -5450797 -4028893
33360 -4028893 260531 3515538 3573202 612506 -3265202 -5318068 -4802912 -3840627 -4337257
33351 -4337257 -5247288 -4609775 -2979874 -2608263 -3948838 -5006029 -3842355 -413568 3547142
33342 3547142 5634887 4833496 3149884 3586126 5835040 6306252 3464771 306802 -147698
33333 -147698 1160201 2019197 2521089 3182891 2496449 -338646 -2826291 -2641984 -1106189
33324 -1106189 62958 2235805 6110810 8077566 5593080 2909177 5086171 8972978
33316 8972978 7561057 1603072 -1432834 406195 1303426 -1182011 -1924885 1670578
33308 1670578 4124725 1480731 -1052564 2506424 8728578 10201208 7077967 5783617
33300 5783617 8469930 10841191 9819108 7235870 5473350 4322258 3062377 1996426
33292 1996426 1153515 198912 -182275 771654 1918548 1748935 1388831 3155714 6307667
33283 6307667 7231251 4284675 -994 -2110661 -1108715 1163839 1839460 -779955
33275 -779955 -5014502 -6331007 -2294503 3435189 4753920 856695 -2588083 -905434
33267 -905434 3670207 5355711 2203726 -2215253 -3880605 -2924532 -2613532 -4949668 -8394027
33258 -8394027 -9898639 -8301339 -5046694 -2045531 10724 1069845 737243 -1197142
33250 -1197142 -3784157 -5301249 -4675032 -2435116 -411737 -189408 -1387005 -1968859 -930386
33241 -930386 235221 -121858 -1320276 -2122701 -3419057 -5982626 -6871170 -2735546 3348949
33232 3348949 3936809 -2233375 -7332078 -5222997 181790 1924235 541099 1358771
33224 1358771 4649270 5857727 4261930 3933931 5718759 5255501 683193 -3907202
33216 -3907202 -5250361 -5572539 -7202379 -7430793 -2974685 4030682 8870395 10513939
33208 10513939 10904717 10121610 6752808 2063285 -485127 127388 1667370 2480060 2990577
33199 2990577 3192500 1857642 -826383 -2513595 -1894784 -610482 -728890 -2073928 -3388448
33190 -3388448 -4539195 -5857132 -6407062 -4852960 -1662855 1205406 2733887 3420279
33182 3420279 3302500 1183240 -3215021 -7682898 -9676511 -9423194 -9226179 -9878810 -9784239
33173 -9784239 -8235275 -7400559 -9186047 -11502168 -10291616 -5152563 -389563 338606
33165 338606 -1782193 -3314935 -3479951 -4166855 -6033739 -7402501 -7336922 -7258331 -8177216
33156 -8177216 -8294545 -5517813 -1394607 -41411 -2963745 -7077696 -8699440 -7683709
33148 -7683709 -6304089 -5605783 -4834749 -3580984 -2241442 -558499 2104381 4766017
33140 4766017 5243109 3267750 1245843 967819 1488967 1506124 1754780 3072854 3856228
33131 3856228 2127292 -836941 -1840784 -536483 -66732 -2507933 -6186712 -8440373
33123 -8440373 -8834097 -8300042 -6882964 -4086788 -440512 2836493 5139468 6219468
33115 6219468 5231478 1513315 -3680756 -7397454 -7477360 -4558806 -1435435 -405838 -1106002
33106 -1106002 -1102495 957818 3108577 2006403 -2753407 -7518320 -8510861 -5889756 -2876915
33097 -2876915 -1614343 -1310930 -397499 896949 894735 -1141208 -3803384 -4998009 -4229000
33088 -4229000 -2763317 -1447742 543104 3755653 6167483 4872056 192304 -3952983
33080 -3952983 -4652092 -3122765 -2038062 -1722314 -1056808 -545576 -1573669 -3223798 -2896827
33071 -2896827 -442274 1067066 -423263 -3263676 -4782807 -4539681 -3539546 -2213436
33063 -2213436 -950208 -974650 -2659448 -4171910 -3727600 -2019521 -420596 1788664 5647947
33054 5647947 9068826 8706906 5259746 3303685 4994266 7332776 7228358 5937606
33046 5937606 5903612 5971671 3417053 -698994 -2246089 -249655 1210785 -1155430 -4676857
33037 -4676857 -3863731 2190471 8027741 8103400 3196174 -1044292 -1197936 733548 1867819
33028 1867819 3171113 6748327 10374279 9245166 3222411 -2343662 -4424186 -6224588
33020 -6224588 -10526371 -13782589 -11550145 -6393380 -4458622 -5913863 -5148198 -334258
33012 -334258 3589470 2952713 600710 344318 915488 -884372 -4448206 -6687602 -6864182
33003 -6864182 -6463208 -5698884 -3535924 -533433 1151013 497187 -1480905 -3227556 -3689515
32994 -3689515 -2637730 -1236580 -1321040 -2882808 -3558839 -2024455 -374237 -1234499 -3776658
32985 -3776658 -4762157 -2804670 309549 2035989 1407598 -231337 297435 5286191 12317275
32976 12317275 14993733 9865174 1197096 -3720004 -2674933 850504 3603633 5132832
32968 5132832 5031084 2224361 -1818612 -2973775 316756 4230628 3990366 -682907
32960 -682907 -6135991 -9016788 -8174399 -3965311 1953344 6621746 7523051 4719148 588125
32951 588125 -2374292 -3132529 -2311863 -1670841 -2737661 -5004323 -5941259 -3854524 -451209
32942 -451209 619716 -2105360 -6314374 -8780125 -8610121 -6809956 -3971439 -508063
32934 -508063 1221208 -1954048 -9278367 -14890880 -13982026 -8610299 -4385407 -2634351
32926 -2634351 -46541 4037710 5211589 1069665 -3772279 -3571093 483226 2408663
32918 2408663 146942 -2174556 -567506 3828641 6777585 5470212 378052 -5498298
32910 -5498298 -8587526 -7223677 -2708095 2291686 5706646 6313764 4044597 1196841
32902 1196841 1131102 4050224 6369263 6175056 6254626 8772347 10378528 7166338 1769656
32893 1769656 -88838 1598077 1920374 -275004 -1322410 -557003 -1869833 -5659229
32885 -5659229 -6472220 -2122465 1377152 -1141669 -5336288 -3608632 3581414 8770844
32877 8770844 7916325 4114841 1635221 1213932 1678514 2468173 3561518 4977080 6613152
32868 6613152 7459306 5985795 2675361 455418 747994 1064418 -1135744 -4274208 -5190022
32859 -5190022 -3850536 -2188632 -66419 3548605 6545853 5371370 787234 -2260962
32851 -2260962 -1314397 666853 206015 -1995073 -2922646 -1593064 103304 -353061 -3905542
32842 -3905542 -8932821 -12143546 -11474839 -8020276 -4206032 -1042492 1279158 1587617
32834 1587617 -686443 -3046381 -2257021 1221033 4279402 6146997 8477296 10613410
32826 10613410 9549824 5664964 3482554 4453442 3891845 -1306046 -6300216 -4665287
32818 -4665287 2008499 6675303 7294887 8403555 12142214 14002173 9802553 2201527
32810 2201527 -2841609 -2973815 -120352 2944806 3812758 758244 -4699232 -7350547
32802 -7350547 -4056164 1305859 2496002 -402855 -1532327 1477386 4050189 2293572
32794 2293572 -887048 -878837 1243718 1124338 -1351060 -2083813 423809 3214599 4176121
32785 4176121 4557588 4933169 3025451 -1967549 -6265455 -5921232 -2327127 -316993 -1942811
32776 -1942811 -4764861 -5673272 -4077246 -1428448 641411 1529601 1979599 3069540 4460988
32767 4460988 4494954 2661339 885239 1472406 4688435 8903595 11783311 10887273 5262851
32758 5262851 -2293556 -6714428 -6141012 -3960722 -3559922 -3458473 -411728 4776530 8105782
32749 8105782 7803945 5374461 2154801 -1376523 -3330667 -1588530 2273663 3951563
32741 3951563 2151622 20744 19701 900294 1038991 1190381 2022889 2174924 1070414
32732 1070414 757819 2379465 3511057 1954052 -297817 -351377 376795 -1638908 -5774793
32723 -5774793 -7636157 -5655897 -3074639 -2522440 -2637394 -1754979 -1258260 -2480886 -3103792
32714 -3103792 -250583 4314316 5858983 3321483 826007 1898521 5143509 6930476
32706 6930476 5761520 2237470 -2837555 -7758885 -9349754 -6550298 -3568685 -5527608
32698 -5527608 -10905640 -12469085 -6995796 2513 1833276 -595087 -1312414 1721121
32690 1721121 4681573 4239598 1545699 -757160 -2043282 -2933667 -3418639 -3029387 -1444877
32681 -1444877 1477702 4768168 5700817 2418666 -2737457 -5140520 -3484965 -784454
32673 -784454 549262 1184172 1424850 -672284 -5241395 -8148985 -6163630 -2226492 -1736399
32664 -1736399 -5097920 -7872871 -7504836 -5869235 -5150074 -5108163 -5325243 -6641253 -8655217
32655 -8655217 -8548983 -4669744 321274 1988243 -911991 -5444418 -7852080 -6640994
32647 -6640994 -2849061 1281820 3616231 3058967 100741 -3271269 -4683861 -3437992
32639 -3437992 -1775645 -2873278 -6638022 -8864798 -6352345 -1664436 -15386 -1856868
32631 -1856868 -2239943 1326878 4095374 127763 -9163889 -16207804 -16281240 -11941095 -8266635
32622 -8266635 -6849039 -5835652 -3750710 -1365176 -393117 -1271229 -2059557 77129 5171556
32613 5171556 8915245 7139620 1781800 -740195 1927932 4733928 2765868 -1427272
32605 -1427272 -2210042 -45770 -692731 -5674928 -9423138 -7525604 -2847166 -712636
32597 -712636 -2004513 -4216948 -5873704 -6158879 -3162043 3013886 7490980 5828992
32589 5828992 855991 -585271 2825793 5728649 4720963 2779267 3453356 5438288
32581 5438288 5462937 2915786 -751774 -3860419 -3679422 2208745 10742093 13545143 6385408
32572 6385408 -4502131 -9741264 -7740698 -3760164 -949874 1573939 3234851 1538691
32564 1538691 -2291089 -3413456 -707528 1396071 226641 -1505742 -1938244 -4078942
32556 -4078942 -9382267 -12431440 -7972357 -9575 2601744 -1779090 -6194008 -5630482
32548 -5630482 -2787712 -1852812 -2039412 -455032 2443521 4050119 4194035 4980762 6792955
32539 6792955 7425381 5535915 2958685 2661117 5125207 7423600 6044992 711236
32531 711236 -4888230 -6656754 -4157669 -508830 1291479 744592 -1086591 -3062670
32523 -3062670 -4037971 -3127256 -1012577 18821 -1581572 -4706583 -6618375 -5496056
32515 -5496056 -1866346 1734288 2578980 459319 -1309044 911577 6536816 11078121
32507 11078121 11470697 9088490 6640913 4513423 1947308 -347987 -1321186 -1885154
32499 -1885154 -3407705 -4824905 -4015998 -1574607 -419047 -1614039 -3162936 -3284442
32491 -3284442 -2458051 -1595817 -433694 1312064 3020434 4357157 5855211 7457442
32483 7457442 7910481 6471826 4010416 1745584 96346 -728268 -412267 589696 1272732
32474 1272732 1755529 3165176 5180090 5511277 2988062 -442638 -2155566 -1896558 -970074
32465 -970074 238461 2035522 3518388 2898181 -201434 -3986536 -6192085 -5993879 -4463691
32456 -4463691 -3474205 -3675491 -3464987 -968207 2774287 4153172 1333545 -3199967 -5585857
32447 -5585857 -4843859 -2942948 -1743131 -1354304 -865941 539588 2767141 4401346 3902374
32438 3902374 1675488 -339074 -1582419 -3358651 -5499258 -5314866 -2034553 404820
32430 404820 -1493428 -4628885 -2698126 4511351 9666665 7073567 -142556 -4176095
32422 -4176095 -1607833 3836089 6171124 2784701 -4020267 -9266438 -9212733 -4387835
32414 -4387835 960761 3035799 2155644 1792295 4056570 7020753 7258112 4596381 2851862
32405 2851862 5000347 8827180 9161445 4058746 -3173967 -8129830 -9301403 -7531301
32397 -7531301 -4049216 -463531 1351108 1140202 667636 901937 360218 -2441252 -6597814
32388 -6597814 -10160853 -11903435 -10559981 -5150791 1840402 4641053 708156 -5218799
32380 -5218799 -6753633 -3299367 1404876 5346367 8414820 8968756 5752048 2021880
32372 2021880 2251319 5278823 6086913 3890298 2612971 3379391 2970710 664397 49094
32363 49094 2149209 3049931 910907 -721924 380824 1173868 -259658 -429145 2785273
32354 2785273 4873203 2008202 -1433795 520948 5229940 5328047 367929 -3127460
32346 -3127460 -2253435 -957458 -2378732 -4665264 -5708908 -6261256 -6531766 -4612630 -379118
32337 -379118 3068762 3755128 3085482 2178741 -379536 -5049527 -8855705 -8932074 -6337798
32328 -6337798 -4192331 -3683636 -3599035 -2395887 487934 4075849 5957620 4591320 1861688
32319 1861688 1196811 2695172 2791322 -262941 -3403524 -2879242 1017918 5131698 7134013
32310 7134013 6110004 1733950 -4507229 -8850083 -8798029 -6278579 -4908864 -5013993 -3955157
32301 -3955157 -774182 2480929 4230728 5285188 6397904 6446194 4665964 2833509
32293 2833509 3140932 4834757 4977263 2322656 -1222039 -3050202 -2285020 463898 4197529
32284 4197529 7611522 9360362 9383513 9208205 9877289 10228035 8392892 4547439 945031
32275 945031 -570001 -57043 1224362 2017576 1922389 1910895 3253725 5035955 4357411
32266 4357411 885838 -828603 2927092 8441294 8628734 3588552 1272753 5793053
32258 5793053 11076657 10127775 5345100 3781526 5849257 5888297 2413361 270951 1846047
32249 1846047 2906490 -326522 -5374407 -7954011 -7947083 -7381369 -5954822 -2644373 641806
32240 641806 1253043 268563 772079 2416285 1842456 -1346542 -3226515 -1550292 603937
32231 603937 -243788 -2209317 -801399 3933662 7063100 5737477 2636746 1016782
32223 1016782 -48124 -2556365 -4554080 -2606215 1708036 2450892 -2724827 -9133529
32215 -9133529 -11048807 -7915746 -2959801 1101996 2670369 760837 -2900049 -3696047
32207 -3696047 349328 4600263 3196237 -2735607 -6355925 -4239807 -29188 1641228
32199 1641228 854398 248006 242163 -841605 -3235533 -4758701 -3596181 -835246 560862
32190 560862 -638059 -2177454 -1357166 801878 903301 -1095150 -1080731 2463987 4765811
32181 4765811 1424714 -4386864 -6228675 -3753403 -2137218 -3211567 -3433897 -1178367
32173 -1178367 160257 -1763015 -4520848 -5777562 -6863959 -8387706 -7064070 -1138201
32165 -1138201 4826839 5388826 1863091 -197110 817297 1889391 1728852 2451712 4547244
32156 4547244 5045239 2408458 -490336 -639646 474642 -791297 -4659581 -7373612
32148 -7373612 -6096552 -2309584 389277 625711 178653 868711 1839758 774703 -2732220
32139 -2732220 -6181940 -6828542 -4574688 -1690397 -66846 534017 1352872 2446001 2692025
32130 2692025 2172134 2974985 6041039 8437666 6640151 2263229 834238 3892916
32122 3892916 6464516 4760317 2063088 2813706 4619175 2113553 -3353936 -4777933
32114 -4777933 -165057 4422962 3823658 -82067 -3233421 -4972949 -5890441 -4768854
32106 -4768854 -1165533 2413291 3882811 4024583 3314106 219926 -4527671 -6233174
32098 -6233174 -2635242 1769568 2156256 701368 2491411 6968676 9192798 7899984
32090 7899984 6374021 5880019 4024236 244643 -2225112 -1423460 297340 67672 -1579250
32081 -1579250 -2078410 7495 4033577 7601190 7746242 4093333 710950 1982337
32073 1982337 6452563 7962295 3632407 -2492720 -5098171 -3879554 -2175155 -1786377
32065 -1786377 -1820416 -1441413 -1258625 -2083231 -3836088 -5772343 -6957012 -6614538 -4591904
32056 -4591904 -1430091 2129449 5235721 6396007 3803863 -2685848 -9861204 -12561746
32048 -12561746 -8196748 -194250 4401557 2131056 -2933900 -4264845 -1088328 1446787
32040 1446787 357147 -961403 1334488 5010973 4896239 432946 -4044465 -5676668
32032 -5676668 -5624448 -5255510 -3864073 -1374401 100056 -546584 -986113 1455350 5562470
32023 5562470 7276682 4636689 -4708 -2901332 -2804739 -1206282 544056 2797450
32015 2797450 5651884 6950914 4439280 -281051 -2525967 -258665 3168157 3582313
32007 3582313 1391422 340106 2354336 6001720 9064256 10081478 7917550 2643250
31999 2643250 -2796955 -4291423 -1136636 2531259 2092934 -2429875 -6609123 -6839063
31991 -6839063 -4327134 -2973961 -3747921 -3307095 575393 4593288 4040649 -44462 -2115844
31982 -2115844 -278497 1602038 800902 -512661 -503828 -1227349 -3508502 -3452886 1143499
31973 1143499 5359446 3874169 -501495 -1479045 409644 -460119 -4417021 -5830266
31965 -5830266 -2940632 -580714 -1476253 -1928522 1041384 4332475 4121745 1780617 725304
31956 725304 1077762 948104 76474 -903777 -2305624 -3723901 -2826372 1529527 6767077
31947 6767077 9390774 8816429 6854401 5083986 4023340 3134321 822973 -3396901
31939 -3396901 -6322804 -3852753 2606750 6217624 3230077 -1963797 -2936704 528378
31931 528378 3376433 2259314 -1613543 -5227152 -6552717 -5378212 -3446147 -3079567
31923 -3079567 -4310580 -4528983 -2150627 1006502 2427284 2204547 1855882 1377668 -419532
31914 -419532 -3377709 -5425370 -4402020 -52297 5114952 7219524 4796849 927128
31906 927128 -364687 702100 747900 -1146050 -2676053 -3093658 -4134324 -5304464 -3311919
31897 -3311919 1742665 4586991 2281488 -1047233 -867634 418746 -2369057 -8616590
31889 -8616590 -12722203 -12042023 -9380751 -8083309 -8415395 -8722394 -7409789 -3967800 122944
31880 122944 2331274 2219937 1883315 1996057 324767 -3743310 -6579298 -5359618 -2612121
31871 -2612121 -1997487 -2418601 -647778 2527313 3493679 1647571 -265414 -397859 1383807
31862 1383807 5172702 9534156 10475530 6448419 2180250 2381170 3993438 1031832
31854 1031832 -4769801 -5938044 -1588957 597119 -3548225 -8551894 -8568375 -5707805
31846 -5707805 -4397957 -3244924 1541017 8308196 11617720 10124384 7747347 7422157
31838 7422157 7761091 6399937 3787499 2482473 3735759 5525168 4444273 36383
31830 36383 -3840645 -3791363 -1906748 -2894565 -6724478 -8329423 -5324162 -1455635 -357560
31821 -357560 -232633 1947085 4486444 3533074 -398752 -2849403 -1890819 -604023 -2583193
31812 -2583193 -7304310 -10743801 -9615658 -4784975 -589839 -51813 -1079495 604955
31804 604955 4903361 7092678 5252026 3818038 6682144 10356030 8735776 2558051
31796 2558051 -1403160 -242740 1439306 -809563 -4705957 -5116143 -1362093 2689029
31788 2689029 4227615 4106938 4244803 4780521 4210363 1259632 -3330444 -6330022 -4358277
31779 -4358277 1973557 7273054 6809244 2296139 -207805 1798022 4507801 3995411
31771 3995411 1668741 774398 355182 -2862565 -7796457 -9359128 -6127816 -2884233
31763 -2884233 -3548988 -5779241 -5541109 -3561193 -3401824 -5434590 -6717144 -5598801 -2958308
31754 -2958308 123076 2628568 2545699 -958632 -4838362 -4914718 -1004563 3443058 5870628
31745 5870628 5691817 2380413 -3247179 -6828050 -4507530 925869 2981094 709052
31737 709052 -520995 1759509 3393517 1275507 -1442347 -1410619 -870401 -2841691 -5130470
31728 -5130470 -4339818 -2229373 -2511798 -4017394 -2810138 670645 2343288 1422848 1031772
31719 1031772 2058930 1829447 -445993 -1909176 -1095802 -270101 -813280 -251343 3444367
31710 3444367 7582651 7917009 4465431 1284391 919050 1382500 -815451 -5844973 -9763152
31701 -9763152 -8697094 -3205520 2457857 5132659 5079310 3336017 -437234 -5658792
31693 -5658792 -9006275 -8060420 -5149123 -4107458 -4417647 -2613531 1064639 2192695
31685 2192695 -862661 -4111722 -4061524 -2624433 -3073263 -4427113 -3488829 -257297 2567028
31676 2567028 4288690 6538163 9029754 8685297 4158539 -1319317 -3249112 -698762
31668 -698762 3383611 5758396 5637176 4299445 3118403 2394833 1863690 1735147 2535748
31659 2535748 3919627 4647849 4351079 4309798 5386072 6101422 4518256 1607801 535382
31650 535382 2200974 3708742 2386638 -704279 -2994540 -4273852 -5746688 -6486886
31642 -6486886 -4315800 -297934 1203406 -1673586 -5425061 -6164929 -4865098 -4787171 -5734016
31633 -5734016 -4666369 -1344075 689605 -457531 -2034287 -871067 1866948 2448657
31625 2448657 -235849 -3481453 -4383488 -2900628 -1047973 -150393 363111 1566751 3130025
31616 3130025 3668204 2983968 2536979 2833504 1964602 -1418708 -4951423 -4949072 -1385011
31607 -1385011 2216586 3576101 3375330 2206932 -614504 -4254790 -5815683 -4247271
31599 -4247271 -1953815 -935969 -294485 722205 540243 -1489236 -3010094 -2829496 -3849605
31590 -3849605 -8024575 -11456403 -9344963 -3588703 -36514 367728 1598927 4107936
31582 4107936 3235756 -2190086 -6046178 -3454286 1534778 1443152 -4257882 -8922457 -7644971
31573 -7644971 -2309649 2168723 3346706 2238795 977642 611329 514433 -372224 -1651365
31564 -1651365 -1622211 51369 958760 -1391201 -6133607 -9707888 -9699458 -6740645 -2774368
31555 -2774368 1025160 4105304 5551660 4465597 1300243 -1854777 -2805803 -1244837
31547 -1244837 819928 801542 -2089121 -6031682 -8068008 -6592541 -2840206 19753
31539 19753 -197958 -2410841 -3438980 -1762018 703864 1257513 -83895 -1040855 -496416
31530 -496416 287837 114384 -220058 454844 1217248 -114862 -3578459 -5859348 -3583928
31521 -3583928 2518364 7907517 9022876 6719300 4226012 3072462 2822471 3759932
31513 3759932 6718663 9821585 8754255 2405685 -4115780 -4908575 -479701 3251598
31505 3251598 2595753 -29670 -200260 2793645 5466158 4479103 646649 -1663430 412039
31496 412039 4212274 4429866 291776 -2911549 -1041240 3092085 3960418 790140 -2949160
31487 -2949160 -5492940 -7517933 -7995364 -4699435 690821 3112162 1215857 -611518
31479 -611518 697053 2204553 220999 -3505842 -4535274 -2208808 177117 120925 -2174575
31470 -2174575 -5334149 -7432611 -6129204 -920695 5209191 8430566 7802192 4943064
31462 4943064 1387989 -1694705 -2572502 -460546 2578542 3566301 2154371 426857
31454 426857 -198916 88288 967044 2166170 2529005 1049347 -1266264 -2439472 -2207059
31445 -2207059 -1860785 -1814941 -1445915 -1117422 -2027395 -3866691 -4881180 -4713229 -5059281
31436 -5059281 -6786571 -8280824 -7570955 -4628013 -853056 2298976 3617346 2645362
31428 2645362 614398 -657103 -1425067 -3688359 -7253783 -8502080 -5168395 -454329
31420 -454329 618034 -1957811 -3393090 -1301129 1072132 565749 -332990 2675782 7939798
31411 7939798 8602431 1978028 -5820469 -7185215 -2237623 2590624 3554768 3073779 4298237
31402 4298237 6399293 6932910 5703584 3813519 1094558 -2680482 -5427016 -4690088
31394 -4690088 -1607132 -116295 -1811219 -3923107 -3265149 -263598 2177065 2432906
$$ [...]
##END NTUPLES=NMR SPECTRUM
##END=
