##TITLE=31Pdec_DPAH1702-12
 CDCl3, 24 sc
 11.3.2022
##JCAMPDX= 6.0         $$ Bruker NMR JCAMP-DX V2.0
##DATA TYPE= NMR SPECTRUM
##DATA CLASS= NTUPLES
##ORIGIN= UXNMR, Bruker Analytische Messtechnik GmbH
##OWNER= root
$$ XWIN-NMR		Version 3.5
$$ Fri Mar 11 11:05:10 2022 Russian Standard Time (UT+4h)  she@DPX200
##.OBSERVE FREQUENCY= 81.013821
##.OBSERVE NUCLEUS= ^31P
##.ACQUISITION MODE= SIMULTANEOUS
##.ACQUISITION SCHEME= undefined
##.AVERAGES= 24
##.DIGITISER RES= 16
##SPECTROMETER/DATA SYSTEM= spect
##.PULSE SEQUENCE= zgpg30
##.SOLVENT NAME= CDCl3
##.SHIFT REFERENCE= (INTERNAL, CDCl3, 0, 248.564)
##AUDIT TRAIL= $$ (NUMBER, WHEN, WHO, WHERE, WHAT)
$$ ##TITLE= Audit trail, XWIN-NMR		Version 3.5
$$ ##JCAMPDX= 5.01
$$ ##ORIGIN= Bruker BioSpin GmbH
$$ ##OWNER= she
$$ F:/spectra/data/she/nmr/P31/1/pdata/1/auditp.txt
$$ ##AUDIT TRAIL=  $$ (NUMBER, WHEN, WHO, WHERE, WHAT)
(   1,<2022-03-11 11:04:19.35 +0400>,<she>,<DPX200>,
      <created by zg, POWCHK disabled, PULCHK disabled
       configuration hash MD5:
       00 E9 B6 7A A2 85 ED C7 34 08 36 98 17 FE 4E 26
       data hash MD5: 32K
       91 0B 77 23 4F 56 39 97 00 2A E7 D0 A1 CF 6B 8B>)
(   2,<2022-03-11 11:04:21.87 +0400>,<she>,<DPX200>,
      <Start of raw data processing
       efp BC_mod = 2 LB = 1 FT_mod = 6 PKNL = 1 PHC0 = -9178.347 PHC1 = 96.07451 SI = 64K 
       data hash MD5: 64K
       3B 7C A2 A1 3C C2 17 93 BE 46 E9 25 0F 73 7F 04>)
(   3,<2022-03-11 11:04:36.43 +0400>,<she>,<DPX200>,
      <pk PHC0 = -20.79283 PHC1 = 51.39999 
       data hash MD5: 64K
       B5 A0 52 C5 87 25 E8 B2 7F 35 C8 D4 03 FC 63 20>)
(   4,<2022-03-11 11:04:39.76 +0400>,<she>,<DPX200>,
      <abs ABSG = 5 
       data hash MD5: 64K
       FE 58 E9 42 2C 4C 34 54 9A 3C 93 4D 43 7B AF DC>)
$$ ##END=
$$ 
$$ hash MD5
$$ B8 B0 2F 95 11 F5 0C 8C 70 AC 2C D0 63 54 5F 3D
##$RELAX= 
##$RELAX= 
##$RELAX= 
##$RELAX= 
##$RELAX= 
##$RELAX= 
##$RELAX= 
##$RELAX= 
$$ Bruker specific parameters
$$ --------------------------
##$DU= <F:/spectra>
##$EXPNO= 1
##$NAME= <P31>
##$PROCNO= 1
##$TYPE= <nmr>
##$USER= <she>
##$AMP= (0..31)
100 100 100 100 100 100 100 100 100 100 100 100 100 100 100 100 100 100 
100 100 100 100 100 100 100 100 100 100 100 100 100 100 
##$AQSEQ= 0
##$AQ_mod= 1
##$AUNM= <au_zg>
##$AUTOPOS= <>
##$BF1= 81.014009
##$BF2= 200.13
##$BF3= 200.13
##$BF4= 200.13
##$BF5= 200.13
##$BF6= 200.13
##$BF7= 200.13
##$BF8= 200.13
##$BYTORDA= 1
##$CFDGTYP= 0
##$CFRGTYP= 5
##$CHEMSTR= <none>
##$CNST= (0..31)
1 1 145 1 1 1 1 1 1 1 1 1 1 1 1 1 1 1 1 1 1 1 1 1 1 1 1 1 1 1 1 1 
##$CPDPRG= <waltz16>
##$CPDPRG1= <>
##$CPDPRG2= <waltz16>
##$CPDPRG3= <>
##$CPDPRG4= <mlev>
##$CPDPRG5= <mlev>
##$CPDPRG6= <mlev>
##$CPDPRG7= <mlev>
##$CPDPRG8= <mlev>
##$CPDPRGB= <>
##$CPDPRGT= <>
##$D= (0..31)
0 1 0 0 0 0 0 0 0 0 0 0.03 2e-05 3e-06 0 0 0 0 0 0 0 0 0 0 0 0 0 0 0 0 
0 0 
##$DATE= 1646982258
##$DBL= (0..7)
120 120 120 11 120 120 24 19 
##$DBP= (0..7)
150 150 150 150 150 150 150 150 
##$DBP07= 0
##$DBPNAM0= <>
##$DBPNAM1= <>
$$ [...]
##$SUBNAM3= <"">
##$SUBNAM4= <"">
##$SUBNAM5= <"">
##$SUBNAM6= <"">
##$SUBNAM7= <"">
##$SUBNAM8= <"">
##$SUBNAM9= <"">
##$SW= 501.771253377433
##$SWIBOX= (0..15)
0 1 3 0 0 0 0 0 0 0 0 0 0 0 0 0 
##$SW_h= 40650.406504065
##$TD= 32768
##$TD0= 1
##$TE= 0
##$TE2= 300
##$TE3= 300
##$TEG= 300
##$TL= (0..7)
0 120 53 12 22 120 120 120 
##$TP= (0..7)
150 150 150 150 150 150 150 150 
##$TP07= 0
##$TPNAME0= <>
##$TPNAME1= <>
##$TPNAME2= <>
##$TPNAME3= <>
##$TPNAME4= <>
##$TPNAME5= <>
##$TPNAME6= <>
##$TPNAME7= <>
##$TPOAL= (0..7)
0.5 0.5 0.5 0.5 0.5 0.5 0.5 0.5 
##$TPOFFS= (0..7)
0 0 0 0 0 0 0 0 
##$TUNHIN= 0
##$TUNHOUT= 0
##$TUNXOUT= 0
##$USERA1= <user>
##$USERA2= <user>
##$USERA3= <user>
##$USERA4= <user>
##$USERA5= <user>
##$V9= 5
##$VALIST= <valist>
##$VCLIST= <CCCCCCCCCCCCCCC>
##$VD= 0
##$VDLIST= <DDDDDDDDDDDDDDD>
##$VPLIST= <PPPPPPPPPPPPPPP>
##$VTLIST= <TTTTTTTTTTTTTTT>
##$WBST= 1024
##$WBSW= 4
##$XGAIN= (0..3)
0 0 0 0 
##$XL= 0
##$YL= 0
##$YMAX_a= 9773
##$YMIN_a= -11880
##$ZGOPTNS= <>
##$ZL1= 120
##$ZL2= 120
##$ZL3= 120
##$ZL4= 120
##$ABSF1= 248.5645
##$ABSF2= -253.2056
##$ABSG= 5
##$ABSL= 3
##$ALPHA= 0
##$AQORDER= 0
##$ASSFAC= 0
##$ASSFACI= 0
##$ASSFACX= 0
##$ASSWID= 0
##$AUNMP= <proc_1d>
##$AZFE= 0.1
##$AZFW= 0.5
##$BCFW= 0
##$BC_mod= 2
##$BYTORDP= 0
##$COROFFS= 0
##$CY= -3
##$DATMOD= 1
##$DC= 0
##$DFILT= <>
##$DTYPP= 0
##$F1P= 0
##$F2P= 0
##$FCOR= 1
##$FTSIZE= 65536
##$FT_mod= 6
##$GAMMA= 0
##$GB= 0
##$INTBC= 1
##$INTSCL= 5.30512e-09
##$ISEN= 30
##$LB= 1
##$LEV0= 0
##$LPBIN= 0
##$MAXI= 10000
##$MC2= 0
##$MEAN= 0
##$ME_mod= 0
##$MI= 50
##$NCOEF= 0
##$NC_proc= -7
##$NLEV= 6
##$NOISF1= 182.463
##$NOISF2= 159.3651
##$NSP= 0
##$NTH_PI= 0
##$NZP= 0
##$OFFSET= 248.5645
##$PC= 4
##$PHC0= -9199.14
##$PHC1= 147.4745
##$PH_mod= 1
##$PKNL= yes
##$PPARMOD= 0
##$PSCAL= 0
##$PSIGN= 0
##$REVERSE= no
##$SF= 81.014009
##$SI= 65536
##$SIGF1= 159.3651
##$SIGF2= -187.1042
##$SINO= 113.3802
##$SIOLD= 16384
##$SREGLST= <1H.CDCl3>
##$SSB= 0
##$STSI= 65536
##$STSR= 0
##$SW_p= 40650.406504065
##$SYMM= 0
##$S_DEV= 0
##$TDeff= 32768
##$TDoff= 0
##$TI= <>
##$TILT= no
##$TM1= 0
##$TM2= 0
##$TOPLEV= 0
##$USERP1= <user>
##$USERP2= <user>
##$USERP3= <user>
##$USERP4= <user>
##$USERP5= <user>
##$WDW= 1
##$XDIM= 65536
##$YMAX_p= 306716258
##$YMIN_p= -43567261
$$ End of Bruker specific parameters
$$ ---------------------------------
##NTUPLES= NMR SPECTRUM
##VAR_NAME=  FREQUENCY,     SPECTRUM/REAL,   SPECTRUM/IMAG
##SYMBOL=    X,             R,               I
##VAR_TYPE=  INDEPENDENT,   DEPENDENT,       DEPENDENT
##VAR_FORM=  AFFN,          ASDF,            ASDF
##VAR_DIM=   65536,         65536,           65536
##UNITS=     HZ,            ARBITRARY UNITS, ARBITRARY UNITS
##FACTOR=    0.620285442955139, 1,           1
##FIRST=     20137.2065510759, 0,            0
##LAST=      -20513.1999529892, 0,           0
##MIN=       -20513.1999529892, -43567261,   0
##MAX=       20137.2065510759, 306716258,    0
$$ Real data points
##PAGE= N=1
##DATA TABLE= (X++(R..R)), XYDATA
$$ [...]
$$ plain form
39472 -1227326 -2402760 -4019611 -3798758 -2009135 -1390843 -2920147 -4239119 -3555415 -2604356
39463 -2604356 -3647253 -5496458 -5206891 -2598699 -363493 -149311 -1114508 -2260313 -3624289
39454 -3624289 -4740906 -4277608 -2104131 111630 1279424 2237092 3790324 4972372
39446 4972372 4494982 2746257 1092759 82766 -533300 -807914 -784544 -1065582 -2121060
39437 -2121060 -3512331 -4668448 -5752689 -6734284 -6379715 -3654123 222350 2692585
39429 2692585 2924886 2550266 3052385 3839063 3613444 2423753 1184419 -76686 -2054600
39420 -2054600 -4342603 -5115998 -3208822 264882 2988022 3664376 2655034 996208
39412 996208 -336817 -560477 335317 1029155 305 -2435225 -4253746 -4299703 -3543285
$$ packed form
39472a227326j175434j616851K20853J789623O18292j529304j318972O83704R51059
39463b604356j042897j849205K89567K608192K235206K14182r65197j145805j363976
39454c624289j116617M63298K173477K215761J167794R57668J553232J182048
39446D972372m77390j748725j653498j009993o16066k74614K3370k81038j055478
39437b121060j391271j156117j084241r81595L54569K725592L876473K470235
39429B692585K32301l74620N02119P86678k25619j189691j239334j261105j977914
39420b054600k288003p73395J907176L473704K723140O76354j009342j658826
39412I96208j333025k23660Q95794O93838j028850k435530j818521m5957P56418
$$ plain form
39403 -3543285 -3157772 -2827612 -2151438 -2191861 -3672869 -4757742 -3157899 -9999 1148309
39394 1148309 -463648 -1575566 283082 3268425 4186892 2801930 1173650 382508
39386 382508 89651 95670 106735 -1065588 -3762562 -5716303 -4560625 -1707159 -993953
39377 -993953 -3286583 -5126395 -3578682 -34204 2148307 1894365 692032 -60069 -279271
39368 -279271 -445528 -1040677 -2461425 -4501143 -6127695 -6465447 -5751993 -4877145 -4397559
39359 -4397559 -4379768 -4623442 -4609819 -3882159 -2905833 -2761805 -3465754 -3515961 -1856775 613233
39349 613233 2381934 3243385 3773272 3828483 3085498 2430792 3039081 4273008 4289210 2850816
39339 2850816 1742840 1930308 2059241 673790 -1562121 -2985658 -3061220 -2157555 -325583
$$ packed form
39403c543285L85513L30160O76174m0423j481008j084873J599843L147900J158308
39394A148309j611957j111918J858648K985343R18467j384962j628280p91142
39386C82508k92857O019J1065j172323k696974j953741J155678K853466P13206
39377i93953k292630j839812J547713L544478K182511k53942j202333p52101k19202
39368b79271j66257n95149j420748k039718j626552l37752P13454Q74848M79586
39359d397559J7791k43674J3623P27660R76326J44028p03949n0207J659186K470008
39349F13233J768701Q61451N29887N5211p42985o54706O08289J233927J6202j438394
39339B850816j107976J87468J28933j385451k235911j423537p5562R03665J831972
$$ plain form
39330 -325583 2133874 3666341 2848266 550102 -952772 -1021129 -1110725 -1960570 -2210123
39321 -2210123 -702174 1462362 2509722 2421176 2238571 1916634 781095 -395668 -37167
39312 -37167 1311763 989208 -1869723 -4431504 -3834488 -1266714 -234942 -1618166 -2928630
39303 -2928630 -2457939 -1603147 -2162043 -3437272 -3599252 -2519175 -1491615 -974211 -318448
39294 -318448 701349 1678126 2586505 3438995 3231083 1144367 -1162706 -743297 2364853
39285 2364853 4243128 1992440 -2242878 -4189704 -3118464 -2110860 -3179876 -4848303
39277 -4848303 -5088071 -4288641 -3984430 -4196354 -3595259 -1577738 1023700 2888570 3057274
39268 3057274 1367617 -1133837 -2718203 -2752107 -2465297 -3041025 -3514429 -1955916 1334297
$$ packed form
39330c25583K459457J532467q18075k298164j502874o8357q9596q49845k49553
39321b210123J507949K164536J047360q8546j82605l21937j135539j176763L58501
39312c7167J348930l22555k858931k561781N97016K567774J031772j383224j310464
39303b928630M70691Q54792n58896j275229j61980J080077J027560N17404O55763
39294c18448J019797R76777R08379Q52490k07912k086716k307073M19409L108150
39285B364853J878275k250688m235318j946826J071240J007604j069016j668427
39277d848303k39768P99430L04211k11924O01095K017521K601438J864870J68704
39268C057274j689657k501454j584366l3904K86810n75728m73404J558513L290213
$$ plain form
39259 1334297 3386792 2057984 -1081619 -2461507 -699587 2053473 3041334 2040078
39251 2040078 819021 292721 -320719 -1433464 -1792258 -284283 2058566 3308627 3252610
39242 3252610 3134623 3206402 2535590 1342118 1298292 2750071 3720363 2846156 1367064
39233 1367064 719237 108959 -1512037 -2844221 -2232188 -963102 -1564208 -3509372 -3830284
39224 -3830284 -1870203 -106905 198532 774181 2618834 3777161 2767745 1513447
39216 1513447 2416762 4534625 5196766 3896128 2051382 196375 -1855490 -2927020
39208 -2927020 -1502325 1340029 2692199 1718613 388264 -43564 -818402 -3038957 -5401305
39199 -5401305 -5930174 -4515095 -2475774 -806826 -40638 -710503 -2482024 -3525841 -2241738
$$ packed form
39259A334297K052495j328808l139603j379888J761920K753060R87861j001256
39251B040078j221057n26300o13440j112745l58794J507975K342849J250061n6017
39242C252610j17987P1779o70812j193472m3826J451779R70292q74207j479092
39233A367064o47827o10278j620996j332184O12033J269086o01106j945164l20912
39224c830284J960081J763298L05437N75649J844653J158327j009416j254298
39216A513447R03315K117863O62141j300638j844746j855007k051865j071530
39208b927020J424695K842354J352170r73586j330349m31828p74838k220555k362348
39199e401305n28869J415079K039321J668948P66188o69865j771521j043817J284103
$$ plain form
39190 -2241738 604387 2630929 2631812 1595654 958806 928013 909999 745326 781157 1035067
39180 1035067 990912 365818 -352971 -497252 -188119 -236783 -906054 -1245632 -239409 1521908
39170 1521908 2055456 235936 -2632233 -4048049 -2957136 -599536 1263280 2192976
39162 2192976 2677334 2612655 1347260 -767326 -2152198 -2020414 -1626241 -2404954 -3565731
39153 -3565731 -3017154 -512628 1731956 1963368 1039644 869171 1749157 2246439 1161877
39144 1161877 -1170924 -3177141 -3172615 -767790 2394061 3922441 3140705 1546532 477853
39135 477853 -499090 -2059138 -3273157 -2817430 -1295836 -663499 -1534810 -2625951 -2968627
39126 -2968627 -3142119 -3737713 -3873323 -2350910 192959 1439143 57533 -2399951 -3124915
$$ packed form
39190b241738K846125K026542Q83j036158o36848l0793j8014j64673L5831K53910
39180A035067m4155o25094p18789j44281L09133m8664o69271l39578J006223J761317
39170A521908N33548j819520k868169j415816J090913K357600J862816R29696
39162B192976M84358o4679j265395k114586j384872J31784L94173p78713j160777
39153c565731N48577K504526K244584K31412r23724j70473Q79986M97282j084562
39144A161877k332801k006217M526K404825L161851J528380p81736j594173j068679
39135D77853r76943j560048j214019M55727J521594O32337q71311j091141l42676
39126b968627j73492n95594j35610J522413K543869J246184j381610k457484p24964
$$ plain form
39117 -3124915 -1578071 -290906 -1413007 -3600644 -3934897 -2148542 -637081 -440754
39109 -440754 -53419 1117037 1201983 -582485 -1762013 -423391 1302275 605341 -1269490
39100 -1269490 -1287239 -56246 -757589 -3256768 -3745844 -782252 2355970 2586025 878048
39091 878048 -320682 -571602 -609131 -401792 233213 877098 1566539 2825100 3918909
39082 3918909 3354208 1896765 2371287 5227019 7156910 5844411 3334114 2565326 3113253
39073 3113253 2905461 2027005 2025573 2903662 3317946 2700388 1277988 -713617 -2254273
39064 -2254273 -1802905 -28342 -721 -2580340 -4207235 -1981364 1671493 2711948 1419860
39055 1419860 791071 1207538 1089223 1071246 2647078 3866469 1616750 -2388604 -3307377
$$ packed form
39117c124915J546844J287165j122101k187637l34253J786355J511461J96327
39109d40754L87335J170456Q4946j784468j179528J338622J725666o96934j874831
39100a269490j7749J230993p01343k499179m89076K963592L138222K30055j707977
39091H78048j198730k50920l7529K07339O35005O43885O89441J258561J093809
39082C918909n64701j457443M74522K855732J929891j312499k510297p68788N47927
39073C113253k07792q78456j432Q78089M14284o17558j422400j991605j540656
39064b254273M51368J774563K7621k579619j626895K225871L652857J040455j292088
39055A419860o28789M16467j18315j7977J575832J219391k249719m005354r18773
$$ plain form
39046 -3307377 -839776 347998 -1582505 -3202794 -2496652 -2115674 -3672648 -4387331 -2583563
39037 -2583563 -1380015 -3004599 -4047133 -1005991 3263082 3772984 1158510 -152833
39029 -152833 563437 227218 -1706104 -2291158 -599803 589277 -575445 -2529989 -3321571
39020 -3321571 -2905500 -1687269 276614 1917452 1702181 161942 -646914 -574456 -1541745
39011 -1541745 -3865205 -5413716 -5205180 -4795426 -4930653 -3890062 -924947 1400241 620192
39002 620192 -1890915 -2958156 -1945358 -792039 -726256 -1146571 -1348540 -1495590 -1783395
38993 -1783395 -1802792 -946458 873076 2657692 2650271 265851 -2383647 -2492998 -317607
38984 -317607 1016482 -30115 -1494717 -1502881 -1099183 -1544044 -1306458 1371386 4704455
$$ packed form
39046c307377K467601J187774j930503j620289P06142L80978j556974p14683J803768
39037b583563J203548j624584j042534L041142M269073N09902k614474j311343
39029a52833P16270l36219j933322n85054J691355J189080j164722j954544p91582
39020c321571M16071J218231J963883J640838k15271j540239q08856P2458r67289
39011a541745k323460j548511K08536M09754j35227J040591K965115K325188p80049
39002F20192k511107j067241J012798J153319O5783m20315k01969j47050k87805
38993a783395j9397Q56334J819534J784616p421k384420k649498j09351K175391
38984c17607J334089j046597j464602q164M03698m44861K37586K677844L333069
$$ plain form
38975 4704455 5448990 3722390 2429412 2447673 1854236 -30000 -1358109 -1247752 -1282523
38966 -1282523 -2297616 -2662923 -1417188 -359521 -904510 -1277767 531598 2911659 2763819
38957 2763819 402157 -794746 699118 2862395 3510473 2706756 1197781 -1068125
38949 -1068125 -3685143 -5011333 -4078072 -1945734 7374 1795998 3566919 4105470
38941 4105470 2508639 425953 444044 2454936 3691057 2604058 762023 230276 870937
38932 870937 1398031 1614612 1959171 1769699 -54401 -2797442 -4063428 -2580262 360991
38923 360991 2673313 3512672 3043336 1491374 -463589 -1304849 -190147 1448668 1260560
38914 1260560 -907364 -2531232 -1586298 830498 1893984 426433 -2057650 -3424416
$$ packed form
38975D704455P44535j726600j292978J8261n93437j884236j328109J10357l4771
38966a282523j015093l65307J245735J057667n44989l73257J809365K380061j47840
38957B763819k361662j196903J493864K163277O48078q03717j508975k265906
38949a068125k617018j326190R33261K132338J953108J788624J770921N38551
38941D105470j596831k082686J8091K010892J236121j086999j842035n31747O40661
38932H70937N27094K16581L44559j89472j824100k743041j265986J483166K941253
38923C60991K312322Q39359m69336j551962j954963q41260J114702J638815j88108
38914A260560k167924j623868R44934K416796J063486j467551k484083j366766
$$ plain form
38906 -3424416 -3167871 -2524521 -2974266 -4777348 -6577119 -6417057 -3655738 9267 1963557
38897 1963557 1376786 -25042 -218923 722407 1215215 636452 13304 163397 437356
38888 437356 25764 -572666 -649832 -1153634 -3653657 -7332781 -8937748 -6788947 -3352860
38879 -3352860 -2186458 -3323405 -3857672 -2784322 -2572722 -4949178 -7491650 -6573614 -2391177
38870 -2391177 1436263 2855578 3379007 4699984 5891869 5436247 4091550 3637971 3892116
38861 3892116 3276258 1889022 1575393 2709141 3294012 2198124 1129024 1814767 2974561
38852 2974561 2268805 169411 -642646 576436 1682403 1260663 720498 1594751 2818769
38843 2818769 2500036 995948 154508 234125 -281284 -1894630 -3097687 -2629273 -1204413
$$ packed form
38906c424416K56545O43350m49745j803082j799771J60062K761319L665005J954290
38897A963557n86771j401828j93881R41330M92808n78763o23148J50093K73959
38888D37356m11592n98430p7166n03802k500023l679124j604967K148801L436087
38879c352860J166402j136947n34267J073350K11600k376456k542472R18036M182437
38870b391177L827440J419315N23429J320977J191885m55622j344697m53579K54145
38861C892116o15858j387236l13629J133748N84871j095888j069100O85743J159794
38852B974561p05756k099394q12057J219082J105967m21740n40165Q74253J224018
38843B818769l18733j504088q41440P9617n15409j613346j203057M68414J424860
$$ plain form
38834 -1204413 -293175 -309159 -736372 -1138198 -1247250 -751568 153856 424095 -800415
38825 -800415 -2915412 -4213862 -3621100 -1816697 -607843 -1238454 -3197588 -4705990 -4526971
38816 -4526971 -3121655 -1746824 -831488 45839 911349 1280113 1376303 2213804 3924608
38807 3924608 5111294 4681562 3453957 2986395 3466669 3774899 3171774 1910489 474330
38798 474330 -813476 -1565600 -1576468 -1218581 -927807 -541029 140793 542497 78371 -559093
38788 -559093 -108786 1238344 1781026 574643 -1386488 -2712293 -3210656 -3195989 -2259385
38779 -2259385 6424 2492505 3151671 1389478 -1037482 -2068363 -1698134 -1553835 -2439681
38770 -2439681 -3399050 -3514980 -3454965 -4135931 -4697976 -3550293 -1271825 -425097 -1879697
$$ packed form
38834a204413R11238j5984m27213m01826j09052M95682R05424K70239j224510
38825h00415k114997j298450N92762J804403J208854o30611j959134j508402J79019
38816d526971J405316J374831R15336Q77327Q65510L68764R6190Q37501J710804
38807C924608J186686m29732j227605m67562M80274L08230o03125j261285j436159
38798D74330j287806p52124j0868L57887K90774L86778O81822M01704m64126o37464
38788e59093M50307J347130N42682j206383j961131j325805m98363J4667R36604
38779b259385K265809K486081O59166j762193k426960j030881L70229J44299q85846
38770b439681r59369j15930O0015o80966n62045J147683K278468Q46728j454600
$$ plain form
38761 -1879697 -3329687 -2701091 -1173306 -972194 -1708514 -1315376 356135 1550645 1755011
38752 1755011 2048282 2364287 1418744 -79387 715488 4301831 6981881 5555170 1671462
38743 1671462 -876560 -1478164 -2542125 -4968889 -6705575 -5936800 -3479176 -1455365
38735 -1455365 -1060650 -2043208 -3249322 -3353622 -1888570 268364 1925062 2768752 2939577
38726 2939577 2178027 549305 -631653 -171207 912424 294891 -2441454 -4945771 -4954445
38717 -4954445 -2848237 -711406 245647 458548 628026 486877 -641866 -2285918 -2613347
38708 -2613347 -571107 2171359 2814218 1118899 -199951 547510 1685891 1312078 737038
38699 737038 2255840 4837062 5182078 2698435 296367 -50400 431264 240188 -67548
$$ packed form
38761a879697j449990O28596J527785K01112p36320L93138J671511J194510K04366
38752A755011K93271L16005r45543j498131P94875L586343K680050j426711l883708
38743A671462k548022o01604j063961k426764j736686P68775K457624K023811
38735a455365L94715r82558j206114j04300J465052K156934J656698Q43690J70825
38726B939577p61550j628722j180958M60446J083631o17533k736345k504317q674
38717d954445K106208K136831R57053K12901J69478j41149j128743j644052l27429
38708b613347K042240K742466O42859j695319j318850P47461J138381l73813n75040
38699G37038J518802K581222L45016k483643k402068l46767M81664j91076l07736
$$ plain form
38690 -67548 180667 -33448 -1515420 -3009908 -3046409 -2195420 -1867456 -2198067 -2727561 -3853324
38680 -3853324 -5767517 -7019357 -6106917 -3836788 -2318085 -2178695 -2514386 -3034321 -4252592
38671 -4252592 -5674565 -5743012 -3954406 -1565389 167480 1236021 2083665 2720005 3057773
38662 3057773 3279936 3534434 3840310 4284465 4670022 4213862 2458250 227954 -1279358
38653 -1279358 -1991853 -2377232 -1865443 357569 3060024 3623772 1669403 42787 994539
38644 994539 3087929 3566317 2509897 2557029 4983677 8039281 9348812 8487208 6844416
38635 6844416 6092564 7116328 9462482 11490594 11913743 11458942 12131780 14612802 17456092
38626 17456092 19284079 20536215 22223023 24155158 25685173 27227336 29333139 30824405
$$ packed form
38690f7548K48215k14115j481972j494488l6501Q50989L27964l30611n29494j125763
38680c853324j914193j251840R12440K270129J518703J39390l35691n19935j218271
38671d252592j421973o8447J788606K389017J732869J068541Q47644O36340L37768
38662C057773K22163K54498L05876M44155L85557m56160j755612k230296j507312
38653a279358p12495l85379N11789K223012K702455N63748j954369j626616R51752
38644I94539K093390M78388j056420M7132K426648L055604J309531q61604j642792
38635F844416p51852J023764K346154K028112M23149m54801O72838K481022K843290
38626A7456092J827987J252136J686808J932135J530015J542163K105803J491266
$$ plain form
38618 30824405 29919305 27310539 25971446 27090327 28124726 26279777 22347200 19229497
38610 19229497 17774001 16400149 14472601 13466179 14125542 14644295 13108925 10415048
38602 10415048 9106004 9880470 10759045 9757726 7262547 5330780 5233793 6186001 6399147
38593 6399147 5062923 3045731 1687197 1340071 1420869 1442264 1324744 971575 409688
38584 409688 288700 1291879 2917647 3768956 3289259 2319251 1698483 1335408 1037630
38575 1037630 1161751 1819395 2387132 2411652 2075232 1301403 -305153 -1919480 -1527109
38566 -1527109 1154152 3278900 2300247 -313991 -1014694 885726 2725095 2779959 2310007
38557 2310007 2684801 3022385 2134359 947716 1166000 2570140 3357906 2728833 1810184
$$ packed form
38618C0824405r05100k608766j339093J118881J034399j844949l932577l117703
38610A9229497j455496j373852j927548j006422O59363N18753j535370k693877
38602A0415048j309044P74466Q78575j001319k495179j931767r6987R52208K13146
38593F399147j336224k017192j358534l47126Q0798K1395j17520l53169n61887
38584D09688j20988J003179J625768Q51309m79697r70008o20768l63075k97778
38575A037630J24121O57644N67737K4520l36420p73829j606556j614327L92371
38566a527109K681261K124748r78653k614238p00703J900420J839369N4864m69952
38557B310007L74794L37584q88026j186643K18284J404140P87766o29073r18649
$$ plain form
38548 1810184 2148177 4110720 6552278 7490681 5649145 2055506 -454666 -221086 1230585
38539 1230585 1179033 -691948 -2031273 -1232688 334143 326664 -1272450 -2120093 -658970
38530 -658970 1866514 3132244 2763736 2604076 3968229 5711662 5728865 3719221 1462942
38521 1462942 536899 802951 1368969 2050930 3168920 4401813 4696033 3459940 1491475
38512 1491475 449761 1273360 3105313 4034297 3126218 1463799 822654 1609571 2648528
38503 2648528 2785076 2015163 1075060 586286 660086 795681 225895 -1042965 -1709627
38494 -1709627 -485110 2172223 4441548 5093527 4154183 2027622 -598270 -2186774
38486 -2186774 -1596512 -129906 -247875 -1653117 -1103347 2568006 5804381 4961927 1497825
$$ packed form
38548A810184L37993J962543K441558R38403j841536l593639k510172K33580J451671
38539A230585n1552j870981j339325P98585J566831p479j599114q47643J461123
38530f58970K525484J265730l68508j59660J364153J743433J7203k009644k256279
38521A462942r26043K66052N66018O81961J117990J232893K94220j236093j968465
38512A491475j041714Q23599J831953R28984r08079j662419o41145P86917J038957
38503B648528J36548p69913r40103m88774P3800J35595n69786j268860o66662
38494a709627J224517K657333K269325O51979r39344k126561k625892j588504
38486b186774N90262J466606j17969j405242N49770L671353L236375q42454l464102
$$ plain form
38477 1497825 -386906 255942 990028 1079883 2639950 6082555 8146394 6258055 2229897
38468 2229897 -328288 -334274 825109 1933070 2560782 2368735 1714189 1981168 3609507
38459 3609507 4771999 3731854 1553812 599160 1173612 1709697 1590894 1524885 1467136
38450 1467136 562090 -781199 -1038774 -146824 194222 -729073 -1656869 -1713001 -1611659
38441 -1611659 -1694151 -991291 559862 1192921 282565 167855 2770666 6011155 6251872
38432 6251872 3368283 637927 -46303 -77321 -981913 -1976387 -1693566 -424857 651781
38423 651781 1243076 1744998 2039811 1504744 -65914 -2036076 -3185808 -2419390 122858
38414 122858 2630167 3089820 1308830 -1212566 -3239794 -4578150 -5034495 -4102528 -2063517
$$ packed form
38477A497825j884731O42848P34086Q9855J560067L442605K063839j888339m028158
38468B229897k558185n986J159383J107961O27712j92047o54546K66979J628339
38459C609507J162492j040145k178042r54652N74452N36085j18803o6009n7749
38450A467136r05046j343289k57575Q91950L41046r23295r27796n6132J01342
38441a611659q2492P02860J551153O33059r10356j14710K602811L240489K40717
38432F251872k883589k730356o84230l1018r04592r94474K82821J268709J076638
38423F51781N91295N01922K94813n35067j570658j970162j149732P66418K542248
38414A22858K507309M59653j780990k521396k027228j338356m56345R31967K039011
$$ plain form
38405 -2063517 -55768 1475253 3107550 4674990 4679576 2482187 -204575 -1261254 -631096
38396 -631096 353591 1168354 2222004 3494310 4503644 5182598 5477785 4599923 2161925
38387 2161925 -350409 -974341 -46831 237013 -700794 -723868 1754928 5091615 6473137
38378 6473137 5634252 4828821 5467385 6484632 6375640 5395327 4739010 4409058 3290916
38369 3290916 1256599 -205872 -63242 684613 587109 139312 1095148 3595580 5606767
38360 5606767 5561299 4113579 2699615 1769023 1282993 1570939 2482559 2855066 2211077
38351 2211077 1942480 3176620 4397166 3291976 573697 -370309 1976029 5089378
38343 5089378 5696811 3726944 1817746 1824203 3015842 3457083 2333655 769262 546234
$$ packed form
38405b063517K007749J531021J632297J567440M586k197389k686762j056679O30158
38396f31096R84687Q14763J053650J272306J009334O78954K95187q77862k437998
38387B161925k512334o23932R27510K83844r37807k3074K478796L336687J381522
38378F473137q38885q05431O38564J017247j08992r80313o56317l29952j118142
38369C290916k034317j462471J42630P47855r7504m47797R55836K500432K011187
38360E606767m5468j447720j413964r30592m86030K87946R11620L72507o43989
38351B211077k68597J234140J220546j105190k718279r44006K346338L113349
38343E089378O07433j969867j909198O457J191639M41241j123428j564393k23028
$$ plain form
38334 546234 2113352 4122099 5080893 4902583 4338440 3635169 2713474 2076479 2286668
38325 2286668 2866581 2981260 2916511 3461689 4065609 3346354 1581830 895227 2367722
38316 2367722 4484019 5207356 4385125 3413379 3598905 5415375 8285584 10593777 11055443
38307 11055443 10550954 11406592 14472492 18323521 21732467 25100883 28688820 31554121
38299 31554121 33745555 37714137 45540126 55976197 66173206 75227312 83743936 90532704
38291 90532704 92335429 87368402 77520116 66467127 56585701 47972235 39678281 31594234
38283 31594234 25279768 22497254 22684183 22921703 21165228 18370486 16362522 14934234
38275 14934234 12745681 10041591 8336589 7856245 7351543 6326984 5540192 5261661 4861457
$$ packed form
38334E46234J567118K008747R58794j78310n64143p03271r21695o36995K10189
38325B286668N79913J14679o4749N45178O03920p19255j764524o86603J472495
38316B367722K116297P23337q22231r71746J85526J816470K870209K308193M61666
38307A1055443n04489Q55638L065900L851029L408946L368416L587937K865301
38299C1554121K191434L968582P825989J0436071J0197009R054106Q516624O788768
38291I0532704J802725m967027r848286j1052989r881426q613466q293954q084047
38283C1594234o314466k782514J86929K37520j756475k794742k007964j428288
38275A4934234k188553k704090j705002m80344n04702j024559p86792k78531m00204
$$ plain form
38266 4861457 4276876 4160159 4347382 3872642 2820790 2527190 3500180 4622655 4800382
38257 4800382 3976886 2269287 -235381 -2382915 -2389353 -137408 2384009 3564346 3699503
38248 3699503 3571942 3204690 2748428 2864482 3289038 2721741 1179168 622691 1893273
38239 1893273 2901764 1725838 -109156 262573 2724491 4386511 3652547 1841814
38231 1841814 805717 886461 1473650 2018674 2202921 2249505 3052343 4869633 6159824
38222 6159824 5126409 2280097 -21810 -542457 -109053 448545 1507737 3298211 4961327
38213 4961327 5807643 6299741 6950982 7234709 6408358 4684470 2929224 1815068 1685905
38204 1685905 2521307 3638094 4190020 4288118 4781267 5692776 5988295 5281751 4472261
$$ packed form
38266D861457n84581j16717J87223m74740j051852k93600R72990J122475J77727
38257D800382q23496j707599k504668k147534o438K251945K521417J180337J35157
38248C699503j27561l67252m56262J16054M24556n67297j542573n56477J270582
38239A893273J008491j175926j834994L71729K461918J662020p33964j810733
38231A841814j036097Q0744N87189N45024J84247M6584Q02838J817290J290191
38222F159824j033415k846312k301907n20647M33404N57598J059192J790474J663116
38213D961327Q46316M92098O51241K83727q26351j723888j755246j114156j29163
38204A685905Q35402J116787N51926R8098M93149R11509K95519p06544q09490
$$ plain form
38195 4472261 4025562 2998138 799578 -1330037 -1964968 -1681462 -2119598 -3466273 -4313057
38186 -4313057 -3665907 -1844373 270679 1725270 1728916 729390 718068 2856345 5214267
38177 5214267 4827782 1942441 -12001 811068 2168381 1185704 -1529477 -2974566 -1852160
38168 -1852160 169832 847083 -383013 -2361800 -3416288 -2703939 -978982 235850
38160 235850 527796 878094 1707802 1961480 1085353 463518 1268769 2106327 961199
38151 961199 -1265947 -1682548 312299 2293546 2707868 2787452 3563222 3620061 1696278
38142 1696278 -503443 -394548 1847270 3947795 4903384 5386252 5411413 4191923 2415510
38133 2415510 2207406 4089896 5971927 6131639 5489981 5727298 6639174 6928570 6607717
$$ packed form
38195D472261m46699j027424k198560k129615o34931K83506m38136j346675q46784
38186d313057O47150J821534K115052J454591L646r99526j1322K138277K357922
38177E214267l86485k885341j954442Q23069J357313r82677k715181j445089J122406
38168a852160K021992O77251j230096j978787j054488P12349J724957J214832
38160B35850K91946L50298Q29708K53678q76127o21835Q05251Q37558j145128
38151I61199k227146m16601J994847J981247M14322P9584P75770N6839j923783
38142A696278k199721J08895K241818K100525R55589M82868K5161j219490j776413
38133B415510k08104J882490J882031J59712o41658K37317R11876K89396l20853
$$ plain form
38124 6607717 6857448 7893648 8558112 8061847 6880466 5776304 5030428 4846275 5409407
38115 5409407 6145796 5997959 5109998 5243216 7449783 10001389 10016229 7064601 3842743
38106 3842743 2942278 4131156 5451684 5856554 5603120 4822277 3302771 1665302 1234743
38097 1234743 2191149 2980785 2341471 1052645 731748 1498860 1950564 1238043 84542
38088 84542 -407700 -96004 353449 292976 -530545 -1809082 -2513691 -1544793 837797 2722726
38078 2722726 2521875 1015362 441149 1451575 2133834 754316 -1516479 -1937337 140239
38069 140239 2494487 3159433 2789357 3059388 4045575 4649285 4851746 5806399 7757827
38060 7757827 9412493 9725715 9135505 8644536 8719315 9479712 10953426 12695508 14145800
$$ packed form
38124F607717K49731J036200O64464m96265j181381j104162p45876j84153N63132
38115E409407P36389j47837q87961J33218K206567K551606J4840k951628l221858
38106C842743r00465J188878J320528M04870k53434p80843j519506j637469m30559
38097A234743R56406P89636o39314j288826l20897P67112M51704p12521j153501
38088H4542m92242L11696M49453o0473q23521j278537p04609R68898K382590J884929
38078B722726k00851j506513n74213J010426O82259j379518k270795m20858K077576
38069A40239K354248O64946l70076K70031R86187O03710K02461R54653J951428
38060G757827J654666L13222n90210m90969P4779P60397J473714J742082J450292
$$ plain form
38051 14145800 15785570 18747429 22582051 24697356 23268947 19885267 17898475 18475507
38043 18475507 19535559 18598480 15649383 12856354 11972571 12342829 11583008 8471280 4919731
38034 4919731 4185444 6980251 10460125 11545100 10049836 7795725 6008096 4948051
38026 4948051 5058945 6692177 9004315 10539199 10796226 10257722 9327115 8328619 7987628
38017 7987628 8630293 9383515 9416343 9334511 9889071 10077025 8497832 6152305 5625360
38008 5625360 7386538 9047261 8704423 7070103 5735519 5152496 5002439 4892820 4041555
37999 4041555 1931374 -75165 444863 3684155 6865532 7799986 7482869 7923870 9036478
37990 9036478 9292242 8271114 6908384 5941813 5487960 5598338 6103350 6364605 6014007
$$ packed form
38051A4145800J639770K961859L834622K115305j428409l383680j986792N77032
38043A8475507J060052r37079k949097k793029q83783L70258p59821l111728l551549
38034D919731p34287K794807L479874J084975j495264k254111j787629j060045
38026D948051J10894J633232K312138J534884K57027n38504r30607r98496l40991
38017G987628O42665P53222L2828q1832N54560J87954j579193k345527n26945
38008E625360J761178J660723l42838j634320j334584n83023j50057j09619q51265
37999D041555k110181k006539N20028L239292L181377R34454l17117M41001J112608
37990I036478K55764j021128j362730r66571m53853J10378N05012K61255l50598
$$ plain form
37981 6014007 5437180 5018247 4704186 4742362 5755791 7542695 8952597 9411320 9231897
37972 9231897 8160588 5617622 3000689 3250095 6740226 10001009 10310658 9165403
37964 9165403 8997878 9005010 7303683 5072051 4736924 5408148 4235886 1708681 1343480
37955 1343480 3874486 5876568 5182113 3937113 4653754 6402255 6954826 6219930 5408068
37946 5408068 4652021 3491053 2398429 2128817 2534878 3202808 4131495 4841177 4212502
37937 4212502 2260826 632136 266041 130138 -522626 -412779 1521442 3640738 3515197
37928 3515197 1495125 338138 1590153 4038220 5732116 6205175 6484920 7655138
37920 7655138 9538119 10706405 10237215 9247295 9460587 10270298 9141530 5538440 2263204
$$ packed form
37981F014007n76827m18933l14061L8176J013429J786904J409902M58723j79423
37972I231897j071309k542966k616933K49406L490131L260783L09649j145255
37964I165403j67525P132j701327k231632l35127O71224j172262k527205l65201
37955A343480K531006K002082o94455j245000P16641J748501N52571p34896q11862
37946E408068p56047j160968j092624k69612M06061O67930R28687P09682o28675
37937D212502j951676j628690l66095j35903o52764J09847J934221K119296j25541
37928C515197k020072j156987J252015K448067J693896M73059K79745J170218
37920G655138J882981J168286m69190r89920K13292Q09711j128768l603090l275236
$$ plain form
37911 2263204 1620069 2410766 2586914 2858269 5153813 8970593 12041735 13724096 14970467
37902 14970467 15597637 14516386 12475702 11651697 12264837 12331973 11197311 10540118 11103618
37893 11103618 11207334 9847036 8796527 9839143 11871562 12734953 12431033 12466072 13086379
37884 13086379 13334381 13335964 14408694 16669172 18135052 16925148 13629448 10935897 11057914
37875 11057914 13701022 16583181 17887008 17772486 17192967 16098470 14024384 11920778
37867 11920778 11576399 13030380 14300028 14196383 13720326 13980827 14541971 14858532 15515890
37858 15515890 16637523 16809102 15367227 14188254 15080400 16743148 16788318 15722437 16019876
37849 16019876 17757155 18381337 17088241 16250758 17434829 18840075 18430033 17363064
$$ packed form
37911B263204o43135P90697J76148K71355K295544L816780L071142J682361J246371
37902A4970467O27170j081251k040684q24005O13140O7136j134662o57193N63500
37893A1103618J03716j360298j050509J042616K032419Q63391l03920L5039O20307
37884A3086379K48002J583J072730K260478J465880j209904l295700k693551J22017
37875A1057914K643108K882159J303827j14522n79519j094497k074086k103606
37867A1920778l44379J453981J269648j03645m76057K60501N61144L16561O57358
37858A5515890J121633J71579j441875j178973Q92146J662748M5170j065881K97439
37849A6019876J737279O24182j293096q37483J184071J405246m10042j066969
$$ plain form
37841 17363064 18173134 21027618 23932168 25732941 26934416 28109377 29369329 31142017
37833 31142017 33704194 35930511 36188072 34831770 34326546 36209943 39115989 40741223
37825 40741223 40940938 41724123 44488826 48447416 52091119 55301973 59193999 64177189
37817 64177189 69159169 73058707 76517040 81437689 88924184 98107120 106972759 114078837
37809 114078837 119641809 125256639 132280265 140140694 146706790 150870235 154038048 157949524
37801 157949524 161603176 162114727 158717280 153986911 150310334 146900728 141694289 134774805
37793 134774805 127970736 121799831 115004135 107210324 100018263 94559735 89458220 82685163
37785 82685163 74889427 69330954 68024977 68890363 67730603 62876168 56819209 52903875
$$ packed form
37841A7363064Q10070K854484K904550J800773J201475J174961J259952J772688
37833C1142017K562177K226317K57561j356302n05224J883397K906046J625234
37825D0741223J99715P83185K764703L958590L643703L210854L892026M983190
37817F4177189M981980L899538L458333M920649P486495R182936Q865639P106078
37809A14078837N562972N614830P023626P860429O566096M163445L167813L911476
37801A57949524L653652N11551l397447m730369l676577l409606n206439o919484
37793A34774805o804069o170905o795696p793811p192061n458528n101515o773057
37785H2685163p795736n558473j305977Q65386j159760m854435o056959l915334
$$ plain form
37777 52903875 51502281 50440758 48235909 45206879 41811481 38061263 34957889 34271764
37769 34271764 35760024 36507539 34539837 31420077 29487936 28201559 25660079 22474341
37761 22474341 21038062 21379386 21006690 19298017 18820102 20953251 23046564 22145290 19604084
37752 19604084 19337262 22327140 25393905 25498681 23246534 21424000 21425865 22206367 22255473
37743 22255473 21598814 21579653 23151650 25891333 28558691 29997924 29415046 26699144 23058380
37734 23058380 20473696 19607203 18991745 17318281 15558746 15219198 15355640 13664996 10381541
37725 10381541 8527694 9707838 11991578 12933174 12491224 11668445 10395124 8570029
37717 8570029 7444240 7836433 8246726 6975893 5215518 5648130 8326315 10256780 9330075
$$ packed form
37777E2903875j401594j061523k204849l029030l395398l750218l103374o86125
37769C4271764J488260P47515j967702l119760j932141j286377k541480l185738
37761B2474341j436279L41324l72696j708673m77915K133149K093313r01274k541206
37752A9604084k66822K989878L066765J04776k252147j822534J865P80502M9106
37743B2255473o56659j9161J571997K739683K667358J439233n82878k715902l640764
37734B3058380k584684q66493o15458j673464j759535l39548J36442j690644l283455
37725A0381541j853847J180144K283740R41596m41950q22779j273321j825095
37717H570029j125789L92193M10293j270833j760375M32612K678185J930465r26705
$$ plain form
37708 9330075 6767409 5093341 5122046 5725718 5713289 5151692 4949784 5382181 5358501 3861061
37698 3861061 2053738 2543328 5817447 8897216 8872185 6506094 4631274 4113962 3667037
37689 3667037 2992260 3431596 5276201 6844407 7017260 6739931 7030181 7174181 6163543
37680 6163543 4716481 4478593 5757391 7066301 6691987 4227628 938152 -1095633
37672 -1095633 -742231 981711 2036232 1807173 1597895 2446837 3589000 3837492 3522790
37663 3522790 3851774 4783601 4894462 3567762 2198469 2462420 4003403 4858744 4075385
37654 4075385 2734809 1944757 1104805 -571100 -1792469 -500596 2720819 4818656
37646 4818656 4439715 3694378 4595048 5938403 5645578 4396032 4413330 5708315 6184844
$$ packed form
37708I330075k562666j674068K8705O03672j2429n61597k01908M32397k3680j497440
37698C861061j807323M89590L274119L079769k5031k366091j874820n17312m46925
37689C667037o74777M39336J844605J568206J72853k77329K90250J44000j010638
37680F163543j447062k37888J278798J308910l74314k464359l289476k033785
37672a095633L53402J723942J054521k29059k09278Q48942J142163K48492l14702
37663C522790L28984R31827J10861j326700j369293K63951J540983Q55341p83359
37654D075385j340576p90052q39952j675905j221369J291873L221415K097837
37646D818656l78941p45337R00670J343355k92825j249546J7298J294985M76529
$$ plain form
37637 6184844 5066566 3745186 3239515 3041528 2684094 2444010 2185729 1336846 339449
37628 339449 411248 1529004 2264922 1920236 1247728 832853 399768 -2389 254518 1155097
37618 1155097 2045279 2884033 3871026 4083441 2604708 834901 1069187 2625168 2374418
37609 2374418 -221315 -1844818 -415285 1749426 1863350 857289 1020201 1827909 1195135
37600 1195135 -645305 -1532516 -779445 449407 1542204 2800270 3812995 3770145 3327995
37591 3327995 4220955 6841627 9554869 10412788 8686358 5277473 2555342 2857957 5937588
37582 5937588 8775909 9032316 7474958 5831421 4024617 1499310 -400625 -37057
37574 -37057 1585655 2139254 1454540 1036656 824460 -555058 -2560109 -2897112 -1254909
$$ packed form
37637F184844j118278j321380n05671j97987l57434k40084k58281q48883r97397
37628C39449P1799J117756P35918l44686o72508m14875m33085m02157K56907R00579
37618A155097Q90182Q38754R86993K12415j478733j769807K34286J555981k50750
37609B374418k595733j623503J429533K164711J13924j006061J62912Q07708o32774
37600A195135j840440q87211P53071J228852J092797J258066J012725m2850m42150
37591C327995Q92960K620672K713242Q57919j726430l408885k722131L02615L079631
37582E937588K838321K56407j557358j643537j806804k525307j899935L63568
37574c7057J622712N53599o84714m17884k12196j379518k005051l37003J642203
$$ plain form
37565 -1254909 -49406 -803274 -2267652 -2825992 -2449476 -1562505 -192036 1015463 1055517
37556 1055517 506232 1038844 2423468 2510762 956363 117735 975570 1214543 -587370
37547 -587370 -1775740 431606 4069957 5058249 3368577 2736411 4530478 5741567 3929834
37538 3929834 905204 -261416 468938 971013 661533 955117 2404171 3497490 2841469
37529 2841469 1157728 223998 566619 1188355 1353685 1600037 2578086 3645809 3494762
37520 3494762 2028986 757103 1004358 2325602 3155617 2629358 1199141 -281410 -1342008
37511 -1342008 -1737520 -1339823 -663771 -827072 -2116501 -2950246 -1463516 1716521 3581256
37502 3581256 2355204 -133820 -838710 692708 2409051 2955334 2791129 2298263 1070805
$$ packed form
37565a254909J205503p53868j464378n58340L76516Q86971J370469J207499M0054
37556A055517n49285N32612J384624Q7294j554399q38628Q57835K38973j801913
37547e87370j188370K207346L638351R88292j689672o32166J794067J211089j811733
37538C929834l024630j166620P30354N02075l09480K93584J449054J093319o56021
37529B841469j683741r33730L42621O21736J65330K46352R78049J067723j51047
37520C494762j465776j271883K47255J321244Q30015n26259j430217j480551j060598
37511a342008l95512L97697O76052j63301j289429q33745J486730L180037J864735
37502C581256j226052k489024p04890J531418J716343N46283j64205m92866j227458
$$ plain form
37493 1070805 -295580 204785 3394072 7380211 9753345 10040550 8993663 6963383
37485 6963383 4397589 2662749 2697453 3640341 4131874 4122644 4173472 4076944 3654735 3836644
37475 3836644 5258333 6725264 6815078 6123148 6087873 6442609 5845148 4373770 3371402
37466 3371402 3327264 3803621 4808932 6245442 6747016 5313603 3433446 3222549 4164827
37457 4164827 4293459 3827020 4515706 5885546 5709884 4247232 4236656 6083862 6860114
37448 6860114 5229939 3646546 3970793 4444907 3240408 1849344 2262761 3347141 2901564
37439 2901564 1367939 700575 1024684 1031313 597288 700173 1571027 2788318 4273443
37430 4273443 5645899 5844978 4958650 4915322 6573911 7768221 6406892 4035000 3864685
$$ packed form
37493A070805j366385N00365L189287L986139K373134K87205j046887k030280
37485F963383k565794j734840L4704R42888M91533r230N0828r6528m22209J81909
37475C836644J421689J466931Q9814o91930l5275L54736n97461j471378j002368
37466C371402m4138M76357J005311J436510N01574j433413j880157k10897R42278
37457D164827J28632m66439O88686J369840j75662j462652j0576J847206P76252
37448F860114j630175j583393L24247M74114j204499j391064M13417J084380m45577
37439B901564j533625o67364L24109O629m34025J02885Q70854J217291J485125
37430D273443J372456J99079q86328m3328J658589J194310j361329k371892j70315
$$ plain form
37421 3864685 6402244 9521207 11971815 14225508 16346653 17538762 17784015 17967524
37413 17967524 18401287 18737741 18968328 19064377 18295678 16463486 14959080 14825485 14686779
37404 14686779 12663711 9551536 7828070 8075184 8707280 8819165 8862193 8707505 7583298
37395 7583298 6095732 5921807 7129933 8017688 8008057 8432895 9794816 10549232 9743407
37386 9743407 8898965 9749643 11491601 11919884 10558757 9166485 9266832 10304574 10593902
37377 10593902 9531527 8246382 7936815 8203552 7859776 7056467 7221257 8662129 9790979
37368 9790979 9451432 8545423 8389072 8890051 9459247 10255517 11271629 11696737 11511211
37359 11511211 12014820 13305710 13301601 11222680 9803453 11424035 14154331 14834100 14234047
$$ packed form
37421C864685K537559L118963K450608K253693K121145J192109K45253J83509
37413A7967524M33763L36454K30587R6049p68699j832192j504406j33595j38706
37404A4686779k023068l112175j723466K47114O32096J11885M3028j54688j124207
37395G583298j487566j73925J208126Q87755r631M24838J361921P54416q05825
37386I743407q44442Q50678J741958M28283j361127j392272J00347J037742K89328
37377A0593902j062375j285145l09567K66737l43776q03309J64790J440872J128850
37368I790979l39547r06009j56351N00979N69196P96270J016112M25108j85526
37359A1511211N03609J290890m109k078921j419227J620582K730296O79769o00053
$$ plain form
37350 14234047 15420606 18376283 20334001 20610073 20926102 21488535 21178923 21421109 25028329
37341 25028329 30734158 33796165 33170017 33207801 36543424 40268842 41789781 43788377
37333 43788377 49713433 58043153 65055131 70519551 76621582 83343147 88934762 93591577
37325 93591577 98882856 104280996 107573757 108413023 108842608 110713085 114778776 121636395
37317 121636395 131267352 142253506 153512884 166055223 181016987 196976387 211435720
37310 211435720 223771666 233955729 239320599 236059635 224137064 207800194 190712216
37303 190712216 173190366 154938942 137732408 123586629 111898953 100389587 88480359
37296 88480359 78320589 72090049 68894986 65148723 58476970 50613817 45198575 42962453
$$ packed form
37350A4234047J186559K955677J957718K76072L16029N62433l09612K42186L607220
37341B5028329N705829L062007o26148L7784L335623L725418J520939J998596
37333D3788377N925056Q329720P011978N464420O102031O721565N591615M656815
37325I3591577N291279N398140L292761Q39266M29585J870477M065691O857619
37317A21636395R630957J0986154J1259378J2542339J4961764J5959400J4459333
37310B11435720J2335946J0184063N364870l260964j1922571j6336870j7087978
37303A90712216j7521850j8251424j7206534j4145779j1687676j1509366j1909228
37296H8480359j0159770o230540l195063l746263o671753p863153n415242k236122
$$ plain form
37288 42962453 41003006 37225166 33141455 30893149 29742544 27781485 25481128 24825361
37280 24825361 25757176 26108826 24770563 22686051 20911146 19774528 19751358 21004588 22057616
37271 22057616 21025342 18368414 16491534 16351511 16385886 15280669 13992054 14191697 15988414
37262 15988414 17999343 18956920 18865572 19030427 20738521 23317916 24161475 21693614 17610428
37253 17610428 14937917 14610365 15353783 16018314 16193121 15313056 13336995 11877741 12507487
37244 12507487 14252444 14854950 14048984 13207161 12237651 9782180 6520841 5140177 6371493
37235 6371493 7943988 8307503 8544583 9521089 10061969 9513143 9414739 10683810 11476473
37226 11476473 10054550 7868827 7476629 8840455 9939149 9975977 9864139 10233582 10747810
$$ packed form
37288D2962453j959447l777840m083711k248306j150605j961059k300357o55767
37280B4825361R31815L51650j338263k084512j774905j136618k3170J253230J053028
37271B2057616j032274k656928j876880j40023L4375j105217j288615J99643J796717
37262A5988414K010929R57577r1348J64855J708094K579395Q43559k467861m083186
37253A7610428k672511l27552P43418O64531J74807q80065j976061j459254O29746
37244A2507487J744957O02506q05966q41823r69510k455471l261339j380664J231316
37235F371493J572495L63515K37080R76506N40880n48826r8404J269071P92663
37226A1476473j421923k185723l92198J363826J098694L6828j11838L69443N14228
$$ plain form
37217 10747810 10915886 10304027 8629188 6643790 5859508 6347186 6183186 4359812 2697961
37208 2697961 3223784 5144120 6363499 6592735 6688238 6169293 4156945 2102757 2632495
37199 2632495 5591533 7868062 7629188 6400354 6147100 6375384 5416766 3234099 1598549
37190 1598549 1998165 4137736 6254992 6715742 5662379 4984839 6127795 8218367 9142622
37181 9142622 8178558 6590636 5779320 5858741 6052703 5584226 4145521 2264261 1181897
37172 1181897 1738844 3546629 5701109 7681925 8936699 8673966 7266428 6708542 7944551
37163 7944551 8797222 6873854 3771477 3395702 6088239 7777890 6015351 3614101
37155 3614101 4175644 6605704 7064495 4898210 3366597 4673357 7158066 8214846
$$ packed form
37217A0747810J68076o11859j674839j985398p84282M87678j64000j823374j661851
37208B697961N25823J920336J219379K29236R5503n18945k012348k054188N29738
37199B632495K959038K276529k38874j228834k53254K28284r58618k182667j635550
37190A598549L99616K139571K117256M60750j053363o77540J142956K090572R24255
37181I142622r64064j587922q11316P9421J93962m68477j438705j881260j082364
37172A181897N56947J807785K154480J980816J254774k62733j407538n57886J236009
37163G944551Q52671j923368l102377l75775K692537J689651j762539k401250
37155C614101N61543K430060M58791k166285j531613J306760K484709J056780
$$ plain form
37147 8214846 7894077 8210936 9939010 11545315 11283621 9432655 7917466 7927081 8595322
37138 8595322 8423505 7374991 6637059 6681586 6896410 7175990 8301282 10186665 11308078
37129 11308078 10877127 10244827 10932317 12488998 13705073 14723915 16148523 17111356 16543631
37120 16543631 15830525 17643016 22018593 26098846 28340275 30549706 34653030 39750086
37112 39750086 44102855 48207377 53682877 60210735 65885112 70258694 75054954 81755632
37104 81755632 89947161 98063146 104364610 107160674 105605728 100805027 95109818 89893605
37096 89893605 84693800 78489285 70882740 62192972 53655004 47459879 44972101 44562778
37088 44562778 42829208 38549164 33813691 30546213 27855869 24221174 20491278 18650176
$$ packed form
37147H214846l20769L16859J728074J606305k61694j850966j515189R615O68241
37138H595322j71817j048514p37932M4527K14824K79580J125292J885383J121413
37129A1308078m30951o32300O87490J556681J216075J018842J424608R62833n67725
37120A6543631p13106J812491M375577M080253K241429K209431M103324N097056
37112C9750086M352769M104522N475500O527858N674377M373582M796260O700678
37104H1755632Q191529Q115985O301464K796064j554946m800701n695209n216213
37096H9893605n199805o204515p606545q689768q537968o195125k487778m09323
37088D4562778j733570m280044m735473l267478k690344l634695l729896j841102
$$ plain form
37080 18650176 18719159 19021753 18831223 18664682 18435399 17515612 16472965 16537781 17227439
37071 17227439 16677468 14674176 13183106 13308739 13934945 14158291 14717324 15790128 15740126
37062 15740126 13826995 12041266 12044980 12157671 10050393 6951117 6021010 7397472 8264402
37053 8264402 7661463 7606250 8801880 8873542 6547619 4432203 5182820 7324483 7795399
37044 7795399 6878353 7229148 8905053 9069443 6937539 5500691 6892979 8899300 8360554
37035 8360554 6125033 5793526 8299661 10560243 9845751 7148151 5181656 4830570 5108654
37026 5108654 5511113 6560537 8275089 9706650 10294744 10513047 10784846 10764215 10212805
37017 10212805 9708888 9818450 10262023 10590431 11006759 11682401 11894466 10962463 9679674
$$ packed form
37080A8650176O8983L02594j90530j66541k29283r19787j042647O4816O89658
37071A7227439n49971k003292j491070J25633O26206K23346N59033J072804n0002
37062A5740126j913131j785729L714J12691k107278l099276r30107J376462Q66930
37053H264402o02939n5213J195630P1662k325923k115416P50617K141663M70916
37044G795399r17046L50795J675905J64390k131904j436848J392288K006321n38746
37035H360554k235521l31507K506135K260582p14492k697600j966495l51086K78084
37026E108654M02459J049424J714552J431561N88094K18303K71799k0631n51410
37017A0212805n03917J09562M43573L28408M16328O75642K12065r32003j282789
$$ plain form
37008 9679674 9552096 10654420 11528589 11457787 11492061 12474454 13185379 11730430 8373599
36999 8373599 5773155 6168831 8997783 11553942 11653970 9525499 7356448 7138195 8842082
36990 8842082 10675408 11112870 10439083 10120029 10953104 12261248 12831659 12232544 11134259
36981 11134259 10628262 11278881 12558921 13189784 12413367 11050599 10853396 12484543 14548439
36972 14548439 15154207 14136288 12961794 12540875 12205355 11291259 10632362 11376045 12967186
36963 12967186 13756323 13475157 13510401 14333342 14334188 12316217 9796288 9154132 10250716
36954 10250716 10812342 10042726 9856614 11938098 15262963 17637918 18509353 18935471 19514109
36945 19514109 19769969 19397809 18842745 18435269 17863702 16845618 15715937 15057693 15199705
$$ packed form
37008I679674j27578J102324Q74169p0802L4274R82393P10925j454949l356831
36999H373599k600444L95676K828952K556159J00028k128471k169051k18253J703887
36990H842082J833326M37462o73787l19054Q33075J308144N70411n99115j098285
36981A1134259n05997O50619J280040O30863p76417j362768j97203J631147K063896
36972A4548439O05768j017919j174494m20919l35520r14096o58897P43683J591141
36963A2967186P89137k81166L5244Q22941Q46k017971k519929o42156J096584
36954A0250716N61626p69616j86112K081484L324865K374955Q71435M26118N78638
36945A9514109K55860l72160n55064m07476n71567j018084j129681o58244J42012
$$ plain form
36936 15199705 16266338 18213643 20500448 22161558 22671382 22515935 22472377 22475341 21788803
36927 21788803 20448850 19902763 21517174 24557068 26431173 25393652 22586132 20860567
36919 20860567 21809433 24544469 27235362 28994841 29989440 30497803 30604502 30582213 30930824
36910 30930824 31883525 33074348 33772932 33541397 32879747 33095320 35010796 37759362 39560509
36901 39560509 39940387 40317046 41795177 43362063 43504395 43020880 44516256 48858803 53651220
36892 53651220 56009531 55812468 55285583 56178199 58443355 61220865 63930690 66422330
36884 66422330 68960210 72135543 76095688 79949238 82769076 85113762 88482384 93088986
36876 93088986 97415460 100580686 103994928 109598993 117218785 124856772 131187815 136625370
$$ packed form
36936A5199705J066633J947305K286805J661110N09824j55447m3558K964o86538
36927B1788803j339953n46087J614411L039894J874105j037521k807520j725565
36919B0860567R48866K735036K690893J759479R94599N08363J06699k2289L48611
36910C0930824R52701J190823O98584k31535o61650K15573J915476K748566J801147
36901C9560509L79878L76659J478131J566886J42332m83515J495376M342547M792417
36892E3651220K358311j97063n26885Q92616K265156K777510K709825K491640
36884F6422330K537880L175333L960145L853550K819838K344686L368622M606602
36876I3088986M326474L165226L414242N604065P619792P637987O331043N437555
$$ plain form
36868 136625370 142202280 148623867 156389328 165634193 175599962 185174363 194091440 202772531
36860 202772531 211191730 219181243 227709774 238015483 249077050 257990817 263860801 269321088
36852 269321088 276678973 284462139 289963814 293630987 298058436 303379011 306716258 306326781
36844 306326781 303536066 300029800 295732133 290228721 284076327 277675027 270738641 263708843
36836 263708843 257608360 251596752 243132778 231988253 221572759 214250869 207742966 198808303
36828 198808303 188360142 179532997 172134598 163044424 151882440 142349078 137040165 134110818
36820 134110818 130431705 125497538 120620583 116249248 111835747 107112618 102119708 96873602
36812 96873602 91907664 88094931 85163313 81578664 76770227 72285108 69731231 68612908
$$ packed form
36868A36625370N576910O421587P765461R244865R965769R574401Q917077Q681091
36860B02772531Q419199P989513Q528531J0305709J1061567Q913767N869984N460287
36852B69321088P357885P783166N501675L667173M427449N320575L337247l89477
36844C06326781k790715l506266m297667n503412o152394o401300o936386p029798
36836B63708843o100483o011608q463974j1144525j0415494p321890o507903q934663
36828A98808303j0448161q827145p398399r090174j1161984r533362n308913k929347
36820A34110818l679113m934167m876955m371335m413501m723129m992910n246106
36812I6873602m965938l812733k931618l584649m808437m485119k553877j118323
$$ plain form
36804 68612908 67253654 65017730 62608775 60771167 59458407 57818610 54734966 50206440
36796 50206440 46260154 45145854 46372154 47199081 46504064 46045719 46931450 47228644 44958174
36787 44958174 41488961 39589437 39514960 39510970 39087575 39028567 38747462 36569737 32833152
36778 32833152 30169698 30073223 31143335 31357396 30441470 29392372 29013520 29433291 30043739
36769 30043739 29809682 28645986 28106861 29273099 30499186 29291344 26180617 24355421
36761 24355421 25238308 26852818 27098499 26157350 24792737 22798650 20482258 19372342
36753 19372342 19793019 19756833 18046431 16467240 16992426 18432396 18342168 16851857 15970751
36744 15970751 16019462 15521845 14281030 13888362 14963078 16137539 16220261 15484774 14371360
$$ packed form
36804F8612908j359254k235924k408955j837608j312760j639797l083644m528526
36796E0206440l946286j114300J226300Q26927o95017m58345Q85731K97194k270470
36787D4958174l469213j899524p4477l990m23395n9008k81105k177725l736585
36778C2833152k663454r6475J070112K14061r15926j049098l78852M19771O10448
36769C0043739k34057j163696n39125J166238J226087j207842l110727j825196
36761B4355421Q82887J614510K45681r41149j364613j994087k316392j109916
36753A9372342M20677l6186j710402j579191N25186J439970r0228j490311q81106
36744A5970751M8711m97617j240815l92668J074716J174461Q2722p35487j113414
$$ plain form
36735 14371360 12692298 10776689 9862682 10497946 11642868 12115347 12115210 12680913 14177419
36726 14177419 15742879 15927662 13906046 10511524 7846636 7238162 7861844 8070104 7591240
36717 7591240 7446908 8168529 9319604 10467972 11298669 10985734 8980163 6492171 5668769
36708 5668769 6942953 8515288 8877932 8607599 9089111 10503224 11756026 11787521 10560544
36699 10560544 9136506 8662905 8814380 7893197 5461890 3931625 5705849 9338862
36691 9338862 10907910 9212752 7063857 6867106 7564390 7160803 5915006 5297362 5596065
36682 5596065 6338548 7622328 9294750 10092122 9309910 8213645 8167478 8478087 7755131
36673 7755131 6284253 5244562 4602682 3697724 2987857 3185061 3451710 2602493 1481067
$$ packed form
36735A4371360j679062j915609r14007O35264J144922M72479j37N65703J496506
36726A4177419J565460J84783k021616l394522k664888o08474O23682K08260m78864
36717G591240j44332P21621J151075J148368Q30697l12935k005571k487992q23402
36708E668769J274184J572335L62644k70333M81512J414113J252802L1495j226977
36699A0560544j424038m73601J51475r21183k431307j530265J774224L633013
36691I338862J569048j695158k148895j96751O97284m03587j245797o17644K98703
36682E596065P42483J283780J672422P97372p82212j096265m6167L10609p22956
36673G755131j470878j039691o41880r04958p09867J97204K66649q49217j121426
$$ plain form
36664 1481067 1923776 3778972 5180112 5500189 5764658 6250616 6025321 5051288 4550690
36655 4550690 4962080 5524166 6034271 6884942 7256573 5768172 3318690 2601429 4042777
36646 4042777 5002460 4122827 3521277 4898703 6335955 5512943 3800042 4073132 5995206
36637 5995206 6685229 5271691 3710064 3364580 3635557 4028480 4841792 5373750 4041273
36628 4041273 1143385 -739674 -191698 1148886 1369133 1110552 1970789 3528184 4026216
36619 4026216 3354404 3310064 4821250 6552353 6800027 5637972 4462579 4098150 4120140
36610 4120140 3769097 2821445 1498840 105190 -870891 -650002 1185290 3807371 5458592
36601 5458592 5092125 3492520 2409923 2729339 3798768 4364375 3783673 2483286 1649155
$$ packed form
36664A481067M42709J855196J401140L20077K64469M85958k25295r74033n00598
36655D550690M11390N62086N10105Q50671L71631j488401k449482p17261J441348
36646D042777R59683q79633o01550J377426J437252q23012j712901K73090J922074
36637E995206O90023j413538j561627l45484K70977L92923Q13312N31958j332477
36628D041273k897888j883059N47976J340584K20247k58581Q60237J557395M98032
36619D026216o71812m4340J511186J731103K47674j162055j175393l64429K1990
36610D120140l51043r47652j322605j393650r76081K20889J835292K622081J651221
36601E458592l66467j599605j082597L19416J069429N65607n80702j300387q34131
$$ plain form
36592 1649155 2318039 4287822 6047157 6338671 5673683 5570237 6313664 6500139 5241403
36583 5241403 3792617 3972946 5568723 6614679 6181403 5471755 5622434 5741426 4395945
36574 4395945 2317094 1957769 4264760 7387965 9153986 9461285 9260178 8445922 6417806
36565 6417806 4050382 3135244 3759332 3984819 2604233 627756 -671416 -1586316 -2681195
36556 -2681195 -3072997 -1721315 331747 845797 -601219 -2009270 -1554101 449620 2460717
36547 2460717 3470378 3368884 2443541 1209468 364472 383074 1119472 1848274 1743343
36538 1743343 704691 -113027 741060 3002554 4388084 3199012 580576 -957152
36530 -957152 -696189 55102 468345 1092267 2130445 2692973 2376579 2022106 2198411
$$ packed form
36592A649155O68884J969783J759335K91514o64988j03446P43427J86475j258736
36583E241403j448786J80329J595777J045956m33276p09648J50679J18992j345481
36574D395945k078851l59325K306991L123205J766021L07299k01107q14256k028116
36565F417806k367424r15138O24088K25487j380586j976477j299172r14900j094879
36556b681195l91802J351682K053062N14050j447016j408051M55169K003721K011097
36547B460717J009661j01494r25343j234073q44996J8602P36398P28802j04931
36538A743343j038652q17718Q54087K261494J385530j189072k618436j537728
36530i57152K60963P51291M13243O23922J038178N62528l16394l54473J76305
$$ plain form
36521 2198411 2412533 2568307 3577818 5443150 6342873 5124243 3352359 3139965 4058406
36512 4058406 4192269 3407046 3242352 3858598 3505467 1397204 -949915 -1922051 -1628397
36503 -1628397 -811269 391352 1636305 1843417 722288 -309294 9152 947611 1102168
36494 1102168 661623 823233 1526670 1493221 436235 -400806 -220421 244590 221202 256290
36484 256290 1169206 2469471 2915887 2329975 1839432 2249858 2997458 3084869 2476651 1934893
36474 1934893 1694034 1128963 64265 -355699 951939 3058260 3752363 2562962 1692710
36465 1692710 2920379 4741023 4319357 1712734 -43221 657346 1738338 763764 -1396838
36456 -1396838 -2156432 -1211537 -520603 -676086 60683 2444909 4274435 3247257 295853
$$ packed form
36521B198411K14122J55774J009511J865332Q99723j218630j771884k12394R18441
36512D058406J33863p85223j64694O16246l53131k108263k347119r72136K93654
36503a628397Q17128J202621J244953K07112j121129j031582L18446R38459J54557
36494A102168m40545J61610P03437l3449j056986q37041J80385M65011k3388L5088
36484B56290R12916J300265M46416n85912m90543M10426P47600Q7411o08218n41758
36474A934893k40859n65071j064698m19964J307638K106321O94103j189401q70252
36465A692710J227669J820644m21666k606623j755955P00567J080992r74574k160602
36456a396838p59594R44895O90934j55483P36769K384226J829526j027178k951404
$$ plain form
36447 295853 -1689517 -1561273 -495910 597345 2065346 3620924 3631812 1581469 -250165
36438 -250165 657626 3567632 5450346 5265495 5141263 6647591 8050533 7032709 4665434
36429 4665434 4107415 5689051 6036474 2910095 -1420903 -3230711 -2033912 -219536
36421 -219536 799511 1633309 2546959 2568538 1380058 75309 -619105 -1156267 -1562389
36412 -1562389 -835805 1073502 2398532 1970718 1059933 1407846 2754112 3834196 4510583
36403 4510583 5112804 4915011 3463709 2397943 3357706 4721862 3404404 -137144 -1886324
36394 -1886324 784 2549846 2532668 897667 515652 1771259 3038217 3947603 5219700
36385 5219700 6046395 4673046 1641477 -245236 183418 897892 -13157 -1439300 -1169515
$$ packed form
36447B95853j985370J28244J065363J093255J468001J555578J0888k050343j831634
36438b50165R07791K910006J882714j84851j24232J506328J402942j017824k367275
36429D665434n58019J581636L47423l126379m330998j809808J196799J814376
36421b19536J019047Q33798R13650K1579j188480j304749o94414n37162m06122
36412a562389P26584J909307J325030m27814r10785L47913J346266J080084O76387
36403D510583O02221j97793j451302j065766R59763J364156j317458l541548j749180
36394a886324J887108K549062j7178j635001l82015J255607J266958R09386J272097
36385E219700Q26695j373349l031569j886713M28654P14474r11049j426143K69785
$$ plain form
36376 -1169515 656137 1861130 1486738 971929 1775556 3134151 3139369 1530576 247122
36367 247122 818437 2088195 1618042 -882196 -2902726 -2396374 -406623 655557 374571
36358 374571 351715 1251212 1706967 656991 -771199 -755583 745043 2180336 2697884
36349 2697884 3081874 4180088 5237813 4537543 1603297 -1861704 -3617632 -3122705 -1559808
36340 -1559808 87383 1908549 3752908 4352596 2924890 923955 739941 2751048
36332 2751048 4930273 5498350 4767017 4019998 3735844 3617787 3544919 3629042 3694075 3348931
36322 3348931 2452872 1211981 29490 -606775 -476149 -19004 104158 71296 938236
36313 938236 3142182 5385103 5712755 3776083 1514948 1133669 2430181 2780448 412321
$$ packed form
36376a169515J825652J204993l74392n14809Q03627J358595N218j608793j283454
36367B47122N71315J269758m70153k500238k020530N06352J989751J062180k80986
36358C74571k2856Q99497M55755j049976j428190J5616J500626J435293N17548
36349B697884L83990J098214J057725p00270k934246l465001j755928M94927J562897
36340a559808J647191J821166J844359N99688j427706k000935j84014K011107
36332B751048K179225N68077p31333p47019k84154j18057p2868Q4123O5033l45144
36322C348931q96059j240891j182491o36265J30626M57145J23162l2862Q66940
36313I38236K203946K242921L27652j936672k261135l81279J296512L50267k368127
$$ plain form
36304 412321 -2822909 -3379325 -880341 896525 -831863 -3597864 -3007766 803728 3221294
36295 3221294 1617598 -1563235 -3127262 -3251008 -3303221 -2418190 690371 4196291 4819192
36286 4819192 2511104 546101 892546 2117759 2309370 1646048 1156262 919212 709205
36277 709205 958586 1824399 2349720 1761577 884626 1129976 2480185 3486977 3195427
36268 3195427 2317475 2304706 3584740 4938238 4728219 2771403 700643 177077 1015707
36259 1015707 1525440 524892 -1412641 -2577169 -1703531 736179 2615988 2183715 290833
36250 290833 -463299 610730 1030398 -1136476 -3923761 -4103003 -1979408 -609455 -735607
36241 -735607 56781 2670342 4504921 3606867 1743533 1266672 1523795 917166 350060
$$ packed form
36304D12321l235230n56416K498984J776866j728388k766001N90098L811494K417566
36295C221294j603696l180833j564027j23746n2213Q85031L108561L505920O22901
36286D819192k308088j965003L46445J225213J91611o63322m89786k37050k10007
36277G09205K49381Q65813N25321n88143q76951K45350J350209J006792k91550
36268C195427q77952j2769J280034J353498k10019j956816k070760n23566Q38630
36259A015707N09733j000548j937533j164528Q73638K439710J879809m32273j892882
36250B90833p54132J074029M19668k166874k787285j79242K123595J369953j26152
36241g35607P92388K613561J834579q98054j863334m76861K57123o06629n67106
$$ plain form
36232 350060 1598091 3717780 4269897 3353796 3342243 4882355 6125992 6064874 5765875
36223 5765875 5740564 4822579 2718332 1275624 1746856 2686778 2206823 841700 402431
36214 402431 1009009 1149683 295606 -251820 656419 2340154 3083505 2094594 303214
36205 303214 -704647 -381482 360763 513261 272057 407003 749156 274740 -1380972
36196 -1380972 -3450979 -5067215 -5764705 -5033868 -2710755 -18811 1262322 1190312 1738049
36187 1738049 3733884 5301130 4523681 2227849 566402 17024 -379499 -675134 -37904
36178 -37904 1229681 1801008 1515369 1492194 1820352 1240875 -160835 -93703 2651199 5722689
36168 5722689 5976659 3713945 1966709 1925863 1521446 -803434 -3155483 -2800726 -390014
$$ packed form
36232C50060J248031K119689N52117r16101j1553J540112J243637o1118k98999
36223E765875k5311r17985k104247j442708M71232R39922m79955j365123m39269
36214D02431O06578J40674q54077n47426R08239J683735P43351r88911j791380
36205C03214j007861L23165P42245J52498k41204J34946L42153m74416j655712
36196a380972k070007j616236o97490P30837K323113K691944J281133p2010N47737
36187A738049J995835J567246p77449k295832j661447n49378l96523k95635O37230
36178c7904J267585N71327k85639k3175L28158n79477j401710O7132K744902L071490
36168E722689K53970k262714j747236m0846m04417k324880k352049L54757K410712
$$ plain form
36159 -390014 829303 -97336 -286627 2404274 5333290 4135744 -903705 -4475565 -2899215
36150 -2899215 1461877 4038797 4076727 4207374 5387567 5660541 4046651 2440774 2418908
36141 2418908 2726906 1717467 264379 85075 654865 275284 -684805 -278086 1582225
36132 1582225 2848654 2739090 2718430 3306162 2683671 157550 -1444790 564155 4253907
36123 4253907 5296549 3044030 1245177 2396107 4414889 4252526 2342017 1373408
36115 1373408 2137193 2832809 1936911 -114851 -1975518 -2702550 -2148830 -1222041 -1474362
36106 -1474362 -3191589 -4306313 -2806700 55797 987324 -726974 -2099897 -845403
36098 -845403 1319228 1474091 -164689 -1024785 -289312 376786 73090 78258 1262927
$$ packed form
36159c90014J219317r26639j89291K690901K929016j197546n039449l571860J576350
36150b899215M361092K576920L7930J30647J180193K72974j613890j605877k1866
36141B418908L07998j009439j453088j79304N69790l79581r60089M06719J860311
36132A582225J266429j09564k0660N87732o22491k526121j602340K008945L689752
36123D253907J042642k252519j798853J150930K018782j62363j910509r68609
36115A373408P63785O95616q95898k051762j860667p27032N53720R26789k52321
36106a474362j717227j114724J499613K862497R31527j714298j372923J254494
36098h45403K164631J54863j638780q60096P35473O66098l03696N168J184669
$$ plain form
36089 1262927 2163052 1044745 -1372970 -2811201 -2477449 -1777202 -1995594 -2508009 -1880401
36080 -1880401 -61593 1413941 1459394 917612 1383548 2908104 3846025 3118214 1554772
36071 1554772 455030 -33958 -83559 1081709 3811824 6059921 5119854 1535635 -1025132
36062 -1025132 -584897 739403 556362 155058 2130794 5480926 6268234 3140975 -701631
36053 -701631 -1889248 -839749 22583 46822 330997 979313 630718 -1193411 -2915515
36044 -2915515 -2703713 -628769 1470497 1888449 618986 -701749 -428873 1251455 2354774
36035 2354774 1410678 -622666 -1534475 -696770 411636 648620 824871 2069879 3671281
36026 3671281 3896950 2538024 1246847 1274056 2067115 2439537 2058537 1243886 290967
$$ packed form
36089A262927R00125j118307k417715j438231L33752P00247k18392n12415O27608
36080a880401J818808J475534M5453n41782M65936J524556R37921p27811j563442
36071A554772j099742m88988m9601J165268K730115K248097r40067l584219k560767
36062a025132M40235J324300j83041m01304J975736L350132P87308l127259l842606
36053g01631j187617J049499Q62332K4239K84175O48316l48595j824129j722104
36044b915515K11802K074944K099266M17952j269463j320735K72876J680328J103319
36035B354774r44096k033344r11809Q37705J108406K36984J76251J245008J601402
36026C671281K25669j358926j291177K7209P93059L72422l81000q14651r52919
$$ plain form
36017 290967 -197530 835499 3545666 6120943 6365236 4366219 2393997 1857605 1599957
36008 1599957 56372 -1853316 -1461737 1996975 5758773 6367338 3598451 578391
36000 578391 -56242 875763 692477 -1262326 -2694915 -1563604 1106010 2584830 1791896
35991 1791896 5073 -1367017 -2226607 -2865158 -3046345 -2676708 -2357489 -2485920 -2552812
35982 -2552812 -2056503 -1428894 -1287039 -1410027 -1324195 -1306517 -1759028 -2026323 -1082662 678075
35972 678075 1555442 730909 -614183 -828694 206613 1074852 489376 -1296958 -2582928
35963 -2582928 -1811124 606133 2329870 1578940 -656537 -1723123 -548517 1225247
35955 1225247 1537511 291656 -1073524 -1527458 -1226923 -894265 -1134501 -2097097 -3276897
$$ packed form
36017B90967m88497J033029K710167K575277K44293j999017j972222n36392k57648
36008A599957j543585j909688L91579L458712L761798O08565k768887l020060
36000E78391o34633R32005j83286j954803j432589J131311K669614J478820p92934
35991A791896j786823j372090q59590o38551j81187L69637L19219j28431o6892
35982b552812M96309O27609J41855j22988Q5832J7678m52511k67295R43661J760737
35972F78075Q77367q24533j345092k14511J035307Q68239n85476j786334j285970
35963b582928P71804K417257J723737p50930k235477j066586J174606J773764
35955A225247L12264j245855j365180m53934L00535L32658k40236r62596j179800
$$ plain form
35946 -3276897 -3815311 -3344180 -2373982 -1700135 -1683953 -2095934 -2189005 -1042116 1332538
35937 1332538 3221651 2753352 603505 -196609 1959335 4926271 5536113 3557644 1267066
35928 1267066 -83377 -1177038 -2196968 -1904885 38149 1750155 1445004 -168433
35920 -168433 -1111920 -840106 -327300 -61194 515623 1615656 2504833 2659373 2566159 2854126
35910 2854126 3293808 3275089 2887270 2811894 3163147 3119690 2104295 861092 616829 1280411
35900 1280411 1466635 678352 323479 1484892 2615544 1289897 -1939314 -3581968 -1815345
35891 -1815345 914150 1304014 -348699 -1052251 488571 2641276 3734302 3909763 3717246
35882 3717246 2911686 1558339 712493 866558 973447 185386 -541154 90423 1568664
$$ packed form
35946c276897n38414M71131R70198O73847J6182m11981r3071J146889K374654
35937A332538J889113m68299k149847q00114K155944K966936O09842j978469k290578
35928A267066j350443j093661j019930K92083J943034J712006l05151j613437
35920a68433r43487K71814N12806K66106N76817J100033Q89177J54540r3214K87967
35910B854126M39682j8719l87819p5376L51253m3457j015395j243203k44263O63582
35900A280411J86224p88283l54873J161413J130652j325647l229211j642654J766623
35891a815345K729495L89864j652713p03552J540822K152705J093026J75461j92517
35882C717246q05560j353347q45846J54065J06889p88061p26540O31577J478241
$$ plain form
35873 1568664 2416722 2503789 2764156 2956156 1760336 -511661 -1267482 1154558 4912496
35864 4912496 6652427 5346911 2889390 1363361 1086006 1234786 1040221 62332 -1553893
35855 -1553893 -2613205 -1737761 590380 1891849 679589 -1272318 -1168686 779362
35847 779362 1526196 -370163 -2578220 -2384154 -480003 462030 -177126 -608013 163637
35838 163637 1181346 1802477 2777091 4211254 4523332 2777523 426081 -785823 -1256261
35829 -1256261 -2192291 -3128335 -2861593 -1995258 -2224774 -3410979 -3625683 -2159383 -356661
35820 -356661 771427 1633045 2299241 1836727 230945 -1007133 -1167118 -1402574 -2345850
35811 -2345850 -2587365 -1010195 1124066 2126043 2293107 2494322 1966411 -123488 -2209805
$$ packed form
35873A568664Q48058Q7067K60367J92000j195820k271997p55821K422040L757938
35864D912496J739931j305516k457521j526029k77355J48780j94565r77889j616225
35855a553893j059312Q75444K328141J301469j212260j951907J03632J948048
35847G79362P46834j896359k208057J94066J904151R42033o39156m30887P71650
35838A63637J017709O21131R74614J434163L12078j745809k351442j211904m70438
35829a256261r36030r36044K66742Q66335k29516j186205k14704J466300J802722
35820c56661J128088Q61618O66196m62514j605782j238078j59985k35456r43276
35811b345850k41515J577170K134261J001977J67064K01215n27911k089899k086317
$$ plain form
35802 -2209805 -2126276 -576295 -45062 -753952 -686556 415090 307225 -1793900 -3521198
35793 -3521198 -2987141 -1576104 -1392911 -1984263 -1603298 -272687 482469 146798 -313260
35784 -313260 -105838 564284 1095773 1094234 724303 855668 2105971 3487707 3281925 1726018
35774 1726018 1176661 2678555 4129465 3253661 798464 -897765 -1051008 -270222 1294330
35765 1294330 3338861 4121496 2464723 358762 796164 3304140 4484910 3094888
35757 3094888 1593916 1920967 2607715 1561803 -528585 -1364826 -126490 2193502 4421809
35748 4421809 5761882 5595576 4031217 2134225 749201 -344779 -1536757 -2487976
35740 -2487976 -2796753 -2705400 -2450067 -1718352 -416454 818642 1469778 1688135 1526063
$$ packed form
35802b209805Q3529J549981N31233p08890O7396J101646j07865k101125j727298
35793c521198N34057J411037J83193n91352L80965J330611P55156l35671m60058
35784c13260K07422O70122N31489j539l69931J31365J250303J381736k05782j555907
35774A726018n49357J501894J450910q75804k455197j696229j53243P80786J564552
35765A294330K044531P82635j656773k105961M37402K507976J180770j390022
35757C094888j500972L27051O86748j045912k090388q36241J238336K319992K228307
35748D421809J340073j66306j564359j896992j385024j093980j191978r51219
35740b487976l08777R1353K55333P31715J301898J235096O51136K18357j62072
$$ plain form
35731 1526063 672939 -434168 -394412 1386786 3664199 4905714 4944399 4339859 3217033
35722 3217033 1722418 611047 310451 290486 298762 1109259 2875312 3912317 2710348
35713 2710348 372565 -582787 600621 2377685 3165677 2784797 1898941 1289518 1604064
35704 1604064 2853159 4218453 4878823 4579621 3135274 559075 -1743798 -1636917 658913
35695 658913 1927161 187698 -2138893 -1567105 1467057 3649764 3598068 2621886 1642454
35686 1642454 692175 845825 2943778 4601247 2533021 -1813062 -3293694 -747892
35678 -747892 973166 -1363193 -4321535 -3607229 -925876 -733331 -2968336 -3835706 -2280049
35669 -2280049 -903102 -885098 -401611 1469804 3029890 3081506 2713968 2869691 2666573
$$ packed form
35731A526063q53124j107107L9756J781198K277413J241515L8685o04540j122826
35722C217033j494615j111371l00596j9965Q276Q10497J766053J037005j201969
35713B710348k337783r55352J183408J777064P87992l80880q85856o09423L14546
35704A604064J249095J365294O60370k99202j444347k576199k302873J06881K295830
35695F58913J268248j739463k326591N71788L034162K182707n1696r76182r79432
35686A642454r50279J53650K097953J657469k068226m346083j480632K545802
35678g47892J721058k336359k958342P14306K681353J92545k235005q67370J555657
35669b280049J376947J8004M83487J871415J560086N1616l67538J55723k03118
$$ plain form
35660 2666573 1334445 -196419 -728530 -249833 718851 1656506 1527318 -374806 -2533872
35651 -2533872 -2269139 420777 2175084 726654 -1903869 -2371405 -545891 984753
35643 984753 871911 187047 16435 46369 -129640 -32036 600962 894848 -20840 -1559165
35633 -1559165 -2277635 -1733702 -880786 -445893 243149 2081919 4353441 5227890 4140583
35624 4140583 2410710 1070662 -430963 -2335741 -3003791 -1265985 677039 -570203
35616 -570203 -4528178 -6725769 -4538434 -645154 898815 -98928 -881454 -382296 -126086
35607 -126086 -879460 -1220903 -217128 671924 -116982 -1386102 -538711 2462314 4388924
35598 4388924 2781988 -666692 -2272025 -1230339 -271132 -1169311 -2009952 -530627 1804363
$$ packed form
35660B666573j332128j530864n32111M78697R68684R37655j29188j902124k159066
35651b533872K64733K689916J754307j448430k630523m67536J825514J530644
35643I84753j12842o84864j70612K9934j76009R7604O32998K93886r15688j538325
35633a559165p18470N43933Q52916M34893O89042J838770K271522Q74449j087307
35624D140583j729873j340048j501625j904778o68050J737806J943024j247242
35616e70203l957975k197591K187335L893280J543969r97743p82526M99158K56210
35607a26086p53374l41443J003775Q89052p88906j269120Q47391L001025J926610
35598D388924j606936l448680j605333J041686R59207q98179q40641J479325K334990
$$ plain form
35589 1804363 1789745 -471861 -1722377 -723949 103543 -846047 -1575876 -119264 1838261
35580 1838261 1650734 -10042 -547535 269433 507084 -268526 -663041 -494624 -1117860
35571 -1117860 -2562087 -3190747 -2595670 -2074586 -1693041 207930 3575131 5601332 4647269
35562 4647269 2631231 1727561 1172632 -396962 -1715753 -894653 956304 1267189 245470
35553 245470 371706 1977935 2546461 875667 -919237 -620405 1118656 2267501 2185534
35544 2185534 1627756 1233347 1140273 1228342 975280 -69286 -1174951 -906297 765395
35535 765395 2120435 2164135 2042048 2993509 4263542 4392620 3476962 2653446 2208465
35526 2208465 1785928 1815209 3008228 4697566 5250114 4141523 2405204 1178392 966776
$$ packed form
35589A804363j4618k261606j250516R98428Q27492r49590p29829J456612J957525
35580A838261j87527j660776n37493Q16968K37651p75610l94515J68417o23236
35571a117860j444227o28660N95077N21084L81545J900971L367201K026201r54063
35562D647269k016038r03670n54929j569594j318791Q21100J850957L10885j021719
35553B45470J26236J606229N68526j670794j794904K98832J739061J148845q1967
35544B185534n57778l94409r3074Q8069k53062j044566j105665K68654J671692
35535G65395J355040M3700j22087R51461J270033J29078r15658q23516m44981
35526B208465m22537K9281J193019J689338N52548j108591j736319j226812k11616
$$ plain form
35517 966776 1960722 3602608 4131732 2290310 -544123 -1706091 -789899 147718 193880
35508 193880 940588 3228265 4984504 4219547 2312800 1951255 3007086 3038869 1333687
35499 1333687 -157723 -42051 697354 713466 196510 -117277 -309560 -671376 -893725
35490 -893725 -767218 -697070 -701911 74217 1860530 3175662 2434210 65845 -2064724
35481 -2064724 -2856582 -2454248 -1027884 1393673 3823327 4593044 3396801 1954220 1778600
35472 1778600 2124188 1259113 -747841 -1958804 -1419605 -612508 -1146197 -2088107 -1177724
35463 -1177724 1629195 3672226 3194234 1786947 1983608 3658201 4620686 4158199 3863688
35454 3863688 4802819 5902813 5970701 5624332 5950326 6413953 5563294 3256148 963712
$$ packed form
35517I66776R93946J641886N29124j841422k834433j161968R16192R37617M6162
35508A93880P46708K287677J756239p64957j906747l61545J055831L1783j705182
35499A333687j491410J15672P39405J6112n16956l13787j92283l61816k22349
35490h93725J26507P0148m841P76128J786313J315132p41452k368365k130569
35481b064724p91858M02334J426364K421557K429654P69717j196243j442581j75620
35472A778600L45588q65075k006954j210963N39199Q07097n33689r41910R10383
35463a177724K806919K043031m77992j407287J96661J674593R62485m62487k94511
35454C863688R39131J099994O7888l46369L25994M63627q50659k307146k292436
$$ plain form
35445 963712 55971 528016 1121790 285336 -2274597 -4532195 -3789659 -241167 2492915
35436 2492915 1800631 -346450 -299664 1946970 3127749 1955550 806923 1612102 3111485
35427 3111485 3526636 3276043 3179751 2283384 -174438 -2432765 -2538733 -1763385 -2778201
35418 -2778201 -5082419 -5378975 -2713977 -286730 -1048859 -3738854 -4809076 -2935822
35410 -2935822 -203263 547380 -1357505 -3803983 -3941068 -1334622 1219642 1033986 -878141
35401 -878141 -1355022 72138 528892 -1379215 -2958457 -1394906 2000433 3846029 3261767
35392 3261767 1834306 373841 -1380408 -2598716 -2013250 -636977 -870067 -2561728
35384 -2561728 -2843585 -613816 1675650 1949764 1487427 2117066 2842301 1782487 -179805
$$ packed form
35445I63712r07741M72045N93774q36454k559933k257598P42536L548492K734082
35436B492915o92284k147081M6786K246634J180779j172199j148627Q05179J499383
35427C111485M15151k50593r6292q96367k457822k258327j05968P75348j014816
35418b778201k304218k96556K664998K427247p62129k689995j070222J873254
35410b935822K732559P50643j904885k446478j37085K606446K554264j85656j912127
35401h78141m76881J427160M56754j908107j579242J563551L395339J845596n84262
35392C261767j427461j460465j754249j218308N85466J376273k33090j691661
35384b561728k81857K229769K289466K74114m62337O29639P25235j059814j962292
$$ plain form
35375 -179805 -516901 946346 1786200 569379 -1591876 -3179095 -3829177 -3339791 -1178612
35366 -1178612 1982437 3762096 2473643 -653148 -2716371 -2285101 -559344 370255
35358 370255 -247489 -1367503 -1537080 -564588 247330 -402884 -2253687 -3697454 -3488475
35349 -3488475 -1929612 -375966 182953 63759 572261 2582097 5255872 6537442 5322234
35340 5322234 2838004 1334168 1598368 2402487 2391432 1840615 2143223 3788093 5324363
35331 5324363 4776838 2194640 165101 1025329 3960477 6042889 5949808 4963260 4066694
35322 4066694 2346658 -462307 -2097005 -750331 1573288 1430432 -1160105 -3034023
35314 -3034023 -2700798 -1797429 -1592168 -1234571 -338941 -274055 -1433643 -1924912 -815748
$$ packed form
35375a79805l37096J463247Q39854j216821k161255j587219o50082M89386K161179
35366a178612L161049J779659j288453l126791k063223M31270J725757R29599
35358C70255o17744j120014j69577R72492Q11918o50214j850803j443767K08979
35349c488475J558863J553646N58919j19194N08502K009836K673775J281570j215208
35340E322234k484230j503836K64200Q04119j1055n50817L02608J644870J536270
35331E324363n47525k582198k029539Q60228K935148K082412r3081r86548q96566
35322D066694j720036k808965j634698J346674K323619j42856k590537j873918
35314c034023L33225R03369K05261L57597Q95630O4886j159588m91269J109164
$$ plain form
35305 -815748 -259991 -2083159 -4217820 -3255992 616698 3845710 4087125 2316417 683646
35296 683646 263980 900161 1717092 1796257 1332601 1558818 2552975 2330686 -271419 -3058453
35286 -3058453 -3046770 -701442 892460 573973 98398 660061 1261109 1069434 792251
35277 792251 796360 148684 -1388099 -2415931 -2102480 -1531004 -1750225 -2221832 -2342637 -2709612
35267 -2709612 -3512987 -3395902 -1512378 792122 2038496 2913892 4594344 6013559 5066276
35258 5066276 1884838 -1180468 -2499782 -2228564 -836663 1350741 3133927 2992271
35250 2992271 1195679 -131621 400372 1946053 2866717 2549372 1401220 64290 -891564
35241 -891564 -1241599 -1350902 -1527137 -1231457 108120 1584509 1413026 -631780 -2563772
$$ packed form
35305h15748N55757j823168k134661R61828L872690L229012K41415j770708j632771
35296F83646m19666O36181Q16931P9165m63656K26217R94157k22289k602105k787034
35286c058453J1683K345328J593902l18487m75575N61663O01048j91675k77183
35277G92251M109o47676j536783j027832L13451N71476k19221m71607j20805l66975
35267b709612q03375J17085J883524K304500J246374Q75396J680452J419215r47283
35258E066276l181438l065306j319314K71218J391901K187404J783186j41656
35250B992271j796592j327300N31993J545681R20664l17345j148152j336930r55854
35241h91564l50035j09303j76235K95680J339577J476389j71483k044806j931992
$$ plain form
35232 -2563772 -2515286 -803138 802549 1015867 -156968 -1625757 -1823183 -144448 1692309
35223 1692309 919622 -2777134 -6177037 -6186433 -3668457 -2035780 -2587957 -3241340 -2138364
35214 -2138364 -504457 -592594 -2015551 -2092453 110784 1902030 348234 -3396261 -5018545
35205 -5018545 -2582700 681076 507123 -2730366 -4671515 -2993364 -170866 635442
35197 635442 -52794 177004 1253016 973488 -770191 -1170075 1374015 4708548 5743543
35188 5743543 3996957 1023026 -1927213 -3886209 -3324827 204058 4179147 5291770
35180 5291770 3504480 1744289 1437640 888757 -1109231 -2729379 -2065381 -627342 -1341452
35171 -1341452 -4077124 -5754392 -4635761 -2116472 -53389 1383114 2456909 2530346
$$ packed form
35232b563772M8486J712148J605687K13318j172835j468789j97426J678735J836757
35223A692309p72687l696756l399903r396K517976J632677n52177o53383J102976
35214b138364J633907q8137j422957p6902K203237J791246j553796l744495j622284
35205e018545K435845L263776j73953l237489j941149J678151K822498Q06308
35197F35442o88236K29798J076012k79528j743679l99884K544090L334533J034995
35188E743543j746586k973931k950239j958996N61382L528885L975089J112623
35180E291770j787290j760191l06649n48883j997988j620148O63998J438039p14110
35171a341452k735672j677268J118631K519289K063083J436503J073795P3437
$$ plain form
35163 2530346 1316795 95705 257539 1449938 2366210 2712921 3159129 3690978 3245583
35154 3245583 1177167 -1555074 -2920401 -1569664 1637863 3985997 3562411 1589694
35146 1589694 973670 2339637 3168018 1710907 -95949 594530 3251643 4790196 3992247
35137 3992247 2610057 2141600 2018609 1528637 1220919 1361931 936103 -470177 -1333794
35128 -1333794 -266156 1680711 2284325 998316 -793076 -1777320 -1741055 -1083158 -475490
35119 -475490 -629189 -1320404 -1044934 1218630 4220843 5631256 4877609 3588522 3178545
35110 3178545 3246597 2774975 1886613 1657298 2609262 3996354 4590419 3951761 2762917
35101 2762917 1801624 873298 -610820 -2092623 -2003649 66451 2375910 3037820 2155849
$$ packed form
35163B530346j213551j221090J61834J192399R16272L46711M46208N31849m45395
35154C245583k068416k732241j365327J350737L207527K348134m23586j972717
35146A589694o16024J365967Q28381j457111j806856O90479K657113J538553p97949
35137C992247j382190m68457j22991m89972l07718J41012m25828j406280q63617
35128a333794J067638J946867O03614j286009j791392r84244L6265O57897O07668
35119d75490j53699o91215K75470K263564L002213J410413p53647j289087m09977
35110C178545O8052m71622q88362k29315R51964J387092N94065o38658j188844
35101B762917r61293r28326j484118j481803Q8974K070100K309459O61910q81971
$$ plain form
35092 2155849 1036122 198227 -589726 -1068286 -739362 122524 1032899 2244779 3671471
35083 3671471 3744097 1459786 -1031020 -554881 2322314 3526805 1191043 -1685480 -1674231
35074 -1674231 503453 1729619 786969 -1201185 -2991822 -3721502 -2601109 -387560
35066 -387560 101299 -2539001 -5345020 -4365884 -400464 1812175 228778 -1929942 -1224909
35057 -1224909 1303236 2290872 846742 -946331 -1249587 -299188 603365 595586 -162432
35048 -162432 -668573 -32710 1415385 2486496 2793475 3097952 3549593 2813893 32836
35039 32836 -3241401 -4472413 -3164158 -1170014 -7401 851597 2510525 4448092 4832286
35030 4832286 2934143 346055 -741215 -67352 656794 183281 -778650 -939940 -318556
$$ packed form
35092B155849j119727q37895p87953m78560L28924Q61886R10375J211880J426692
35083C671471P2626k284311k490806M76139K877195J204491k335762k876523J1249
35074a674231K177684J226166r42650j988154j790637p29680J120393K213549
35066c87560M88859k640300k806019R79136L965420K212639j583397k158720P05033
35057a224909K528145R87636j444130j793073l03256R50399R02553p779p58018
35048a62432n06141O35863J448095J071111L06979L04477M51641p35700k781057
35039C2836l274237j231012J308255J994144J162613Q58998J658928J937567L84194
35030D832286j898143k588088j087270O73863P24146m73513r61931j61290O21384
$$ plain form
35021 -318556 206839 532852 1247654 2170905 2273521 1210006 -50829 -339554 631314
35012 631314 2234710 3337252 3056554 1832567 1131607 1175452 76345 -3099962 -5606958
35003 -5606958 -4051004 361100 2834282 1538547 -267338 297136 1686493 1372766
34995 1372766 142871 85203 719340 363608 -385386 119722 1084498 397263 -1453233
34986 -1453233 -1906789 -495881 717825 856482 1149074 1762241 952601 -1603299 -3503663
34977 -3503663 -3071379 -1771263 -1675902 -2518381 -2851489 -2414427 -1629855 -131559 2355344
34968 2355344 4532218 4695859 3107146 1864038 2396548 3899357 4300064 2394946 -914015
34959 -914015 -3401227 -3664056 -2257595 -453738 1322068 2936173 3423040 2147506 570773
$$ packed form
35021c18556N25395L26013P14802R23251J02616j063515j260835k88725R70868
35012F31314J603396J102542k80698j223987p00960M3845j099107l176307k506996
35003e606958J555954M412104K473182j295735j805885N64474J389357l13727
34995A372766j229895n7668O34137l55732p48994N05108R64776o87235j850496
34986a453233m53556J410908J213706J38657K92592O13167q09640k555900j900364
34977c503663M32284J300116R5361q42479l33108M37062P84572J498296K486903
34968B355344K176874J63641j588713j243108N32510J502809M00707j905118l308961
34959i14015k487212k62829J406461J803857J775806J614105M86867j275534j576733
$$ plain form
34950 570773 751024 2106337 1929660 -433750 -2254029 -1286141 1082994 2013841 988675
34941 988675 -161571 64936 1581611 3424889 4525430 4198718 2663778 770013 -955054
34932 -955054 -2282371 -2518549 -1222352 239150 -301173 -2704721 -4265217 -3321122 -1323683
34923 -1323683 -417257 -834057 -1753845 -2791990 -3268180 -1859269 1399722 4304738 5116443
34914 5116443 4485693 3582959 2344344 1057502 1304503 3204406 3998547 1952180 -437395
34905 -437395 -51136 1997942 2496380 1436380 1317754 2287682 2200913 1111361 1395668
34896 1395668 3067124 3086672 337707 -2375103 -2638053 -1539035 -1011333 -979705 -776749
34887 -776749 -836923 -1282947 -1013786 249367 1020116 503643 -72384 100516 -132643 -1457738
$$ packed form
34950E70773J80251J355313j76677k363410j820279R67888K369135R30847j025166
34941I88675j150246K26507J516675J843278J100541l26712j534940j893765j725067
34932i55054j327317k36178J296197J461502n40323k403548j560496R44095J997439
34923a323683R06426m16800r19788j038145m76190J408911L258991K905016Q11705
34914E116443o30750r02734j238615j286842K47001J899903P94141k046367k389575
34905d37395L86259K049078M98438j060000j18626R69928q6769j089552K84307
34896A395668J671456J9548k748965k712810k62950J099018N27702L1628K02956
34887g76749o0174m46024K69161J263153P70749n16473n76027J72900k33159j325095
$$ plain form
34877 -1457738 -2350232 -1597953 -510045 -587411 -875084 109280 1414508 1080592 -614805
34868 -614805 -1699429 -1481341 -803238 -27752 1052706 1773204 1221554 155068 335379
34859 335379 1868447 2914769 2278167 826487 5601 137796 608704 858922 746574
34850 746574 398182 -2516 -325528 -298967 585373 2294811 3512281 2843022 982327
34841 982327 278297 1572568 2953851 2496174 738352 -629225 -1013835 -558326 850553
34832 850553 2501841 2316000 -423276 -2928713 -1992388 1400520 3084608 1234283 -1572475
34823 -1572475 -2200059 -707827 607694 403324 -469088 -224418 1788980 3963098 3748923
34814 3748923 736733 -2402775 -3179023 -2456417 -2608297 -3439324 -2552366 307308 2116387
$$ packed form
34877a457738q92494P52279J087908p7366k87673R84364J305228l33916j695397
34868f14805j084624K18088O78103P75486J080458P20498n51650j066486J80311
34859C35379J533068J046322o36602j451680q20886J32195M70908K50218j12348
34850G46574l48392m00698l23012K6561Q84340J709438J217470o69259j860695
34841I82327p04030J294271J381283m57677j757822j367577l84610M55509J408879
34832H50553J651288j85841k739276k505437R36325L392908J684088j850325k806758
34823a572475o27584J492232J315521k04370q72412K44670K013398K174118k14175
34814C748923l012190l139508p76248P22606j51880q31027Q86958K859674J809079
$$ plain form
34805 2116387 767909 -1850999 -2508813 -869821 602530 280482 -638948 44469 2526106
34796 2526106 4426961 3492790 519504 -1448067 -1071286 -352230 -1326012 -2844854 -2590659
34787 -2590659 -889971 79737 8034 367787 972185 -13870 -2219494 -2649870 -330335
34778 -330335 1711975 854210 -1348881 -1846700 -425704 792471 539445 -906203 -2785793
34769 -2785793 -3804856 -2436189 918678 3466960 3456431 2485430 2498834 2367650 64329
34760 64329 -3312740 -4796658 -3929548 -2763638 -2019054 -498331 1673275 2519975 1611590
34751 1611590 1056310 1981252 2544966 935598 -1622736 -2495233 -961545 1483950 3252723
34742 3252723 3956298 4144355 4429315 4488332 3007130 -448316 -3773830 -4145138 -1648419
$$ packed form
34805B116387j348478k618908o57814J638992J472351l22048r19430O83417K481637
34796B526106J900855r34171k973286j967571L76781P19056r73782j518842K54195
34787b590659J700688R69708p1703L59753O04398r86055k205624m30376K319535
34778c30335K042310q57765k203091m97819J420996J218175k53026j445648j879590
34769b785793j019063J368667L354867K548282j0529r71001J3404j31184k303321
34760F4329l377069j483918Q67110J165910P44584J520723K171606Q46700r08385
34751A611590n55280R24942N63714j609368k558334q72497J533688K445495J768773
34742C252723P03575J88057K84960N9017j481202l455446l325514l71308K496719
$$ plain form
34733 -1648419 629979 533130 -977466 -2163624 -2948985 -3744766 -3651485 -1671767 1264555
34724 1264555 3099501 2938756 1441542 -395457 -1782791 -2140537 -1606834 -1040592 -796539
34715 -796539 -254343 764572 1201525 340159 -920654 -1501788 -1737331 -2243867 -2391403
34706 -2391403 -1562164 -898368 -1815706 -3486987 -3917952 -3076099 -2696255 -3135192 -2846082
34697 -2846082 -1279465 129827 640915 1530254 3448285 4540985 3077599 479028
34689 479028 -389739 891702 2221837 2390017 2354532 2839547 2778357 1274487 -386462
34680 -386462 -295492 1207614 1882082 713755 -935746 -1736986 -2296336 -3467617 -4118969
34671 -4118969 -2571362 261571 1453164 129097 -1192316 -299186 1597678 1990229
$$ packed form
34733a648419K278398r6849j510596j186158p85361p95781R3281J979718K936322
34724A264555J834946j60745j497214j836999j387334l57746N33703N66242K44053
34715g96539N42196J018915M36953q61366j260813n81134k35543n06536j47536
34706b391403Q29239O63796r17338j671281m30965Q41853L79844m38937K89110
34697b846082J566617J409292N11088Q89339J918031J092700j463386k598571
34689D79028q68767J281441J330135J68180l5485M85015o1190j503870j660949
34680c86462R0970J503106O74468j168327j649501q01240n59350j171281o51352
34671d118969J547607K832933J191593j324067j321413Q93130J896864L92551
$$ plain form
34663 1990229 793200 -33784 348927 954732 1024726 828418 458574 -425297 -1492900
34654 -1492900 -1858795 -1412325 -697762 398779 2227079 3713099 3077997 574524 -1396198
34645 -1396198 -1497429 -925715 -895522 -630755 834159 2516830 2798558 1759576 661321
34636 661321 -45187 -719309 -1227647 -1142440 -875816 -1267069 -2136726 -2326739 -1252278 275313
34626 275313 827960 -298979 -2282049 -3262875 -2243292 -447602 172029 -296000 3523
34617 3523 1416596 1869048 280323 -1171691 -17355 2790689 4210535 3126399 971456
34608 971456 -852686 -2008830 -2165811 -1116237 95781 73987 -831499 -979960 52143
34599 52143 1124106 1683835 2444489 3639516 4283854 3630648 1999671 -104209 -2272203
$$ packed form
34663A990229j197029q26984L82711O05805O9994j96308l69844q83871j067603
34654a492900l65895M46470P14563J096541J828300J486020o35102k503473j970722
34645a396198j01231N71714L0193K64767J464914J682671K81728j038982j098255
34636F61321p06508o74122n08338Q5207K66624l91253q69657j90013J074461J527591
34626B75313N52647j126939j983070r80826J019583J795690O19631m68029K99523
34617C523J413073M52452j588725j452014J154336K808044J419846j084136k154943
34608I71456j824142j156144j56981J049574J212018k1794r05486j48461J032103
34599E2143J071963N59729P60654J195027O44338o53206j630977k103880k167994
$$ plain form
34590 -2272203 -3374138 -2120350 922009 3243083 3086599 1262974 -238424 -482479
34582 -482479 48391 449708 251458 -190703 -65395 636696 661951 -776852 -2372631
34573 -2372631 -2207451 -455806 988750 1256817 1026547 520643 -828550 -2536661 -3143403
34564 -3143403 -2586803 -2249387 -2072207 -204567 3355843 5429595 3851297 848836 -40903
34555 -40903 1165822 1565634 -145997 -2336612 -3193903 -2644198 -1461485 -188776 763533
34546 763533 1157439 1346025 1920513 2918474 3840455 4148797 3418650 1689333 83554
34537 83554 32936 1166974 1166108 -1197362 -4017054 -4655660 -3246245 -2154386 -2582263 -3482533
34527 -3482533 -3667097 -3351759 -3351996 -3887076 -4477428 -4418947 -3468835 -2509354 -2915874 -4559758
$$ packed form
34590b272203j101935J253788L042359K321074j56484j823625j501398k44055
34582d82479N30870M01317j98250m42161J25308P02091K5255j438803j595779
34573b372631J65180J751645J444556K68067k30270n05904j349193j708111o06742
34564c143403N56600L37416J77180J867640L560410K073752j578298l002461q89739
34555d0903J206725L99812j711631k190615q57291N49705J182713J272709R52309
34546G63533L93906J88586N74488R97961R21981L08342p30147j729317j605779
34537H3554n0618J134038q66k363470k819692o38606J409415J091859m27877r00270
34527c482533j84564L15338k37n35080n90352N8481R50112R59481m06520j643884
$$ plain form
34517 -4559758 -5317095 -3691786 -1090644 -11934 -639219 -1070954 -676410 -1137928 -3631917
34508 -3631917 -6665029 -7740037 -6262973 -3946026 -2825394 -3457868 -4734822 -5031699
34500 -5031699 -3665129 -1424763 320722 940683 923517 1196626 2147995 3047963 2572698
34491 2572698 471758 -1551104 -1713653 -810318 -1361476 -3690027 -4786001 -2312733 1895801
34482 1895801 4011560 2716248 -115390 -2154418 -2255569 -346896 2270558 3159721
34474 3159721 1297704 -1093354 -1184181 603214 1561552 941614 528596 1030439 833104
34465 833104 -895158 -2483130 -2386924 -1445705 -1145127 -1347175 -1136992 -492257 267753
34456 267753 1472401 3162996 4177160 3536188 2001085 1018063 732044 207248 -852371
$$ packed form
34517d559758p57337J625309K601142J078710o27285m31735L94544m61518k493989
34508c631917l033112j075008J477064K316947J120632o32474j276954k96877
34500e031699J366570K240366J745485O19961j7166K73109R51369Q99968m75265
34491B572698k100940k022862j62549R03335n51158k328551j095974K473268M208534
34482A895801K115759j295312k831638k039028j01151J908673K617454Q89163
34474C159721j862017k391058r0827J787395R58338o19938m13018N01843j97335
34465H33104j728262j587972R6206R41219L00578k02048K10183O44735P60010
34456B67753J204648J690595J014164o40972j535103r83022k86019n24796j059619
$$ plain form
34447 -852371 -1715982 -1732505 -965648 133356 1055350 1361472 925066 -8487 -1040072
34438 -1040072 -1588615 -907950 989565 2479929 1620285 -1322682 -3798028 -3995244 -2787733
34429 -2787733 -1888136 -1288576 175460 2492589 4192622 4252949 3175418 2123183 1779224
34420 1779224 2047807 2202971 1372088 -483537 -2114038 -2174205 -898268 110278 -90141
34411 -90141 -708505 -607980 -56030 -200474 -1094215 -1447882 -756901 -545086 -2366169 -5173433
34401 -5173433 -6159900 -4258712 -1391820 178982 378287 428921 682596 528529 -241458
34392 -241458 -1040557 -1075062 208468 2478751 3870905 2354230 -1291969 -3393199 -1742704
34383 -1742704 1383880 2397174 1118655 -82152 -636869 -2062607 -4232160 -4752681
$$ packed form
34447h52371q63611j6523P66857J099004R21994L06122m36406r33553j031585
34438a040072n48543O80665J897515J490364q59644k942967k475346j97216J207511
34429b787733Q99597N99560J464036K317129J700033O0327j077531j052235l43959
34420A779224K68583J55164q30883j855625j630501o0167J275937J008546k00419
34411i0141o18364J00525N51950j44444q93741l53667O90981K11815j821083k807264
34401e173433r86467J901188K866892J570802J99305N0634K53675j54067p69987
34392b41458p99099l4505J283530K270283J392154j516675l646199k101230J650495
34383a742704L126584J013294j278519j200807n54717j425738k169553n20521
$$ plain form
34375 -4752681 -2769479 -551906 -200588 -1118557 -1863818 -2284328 -2456864 -1503997 894319
34366 894319 3285618 4214103 3980630 3436244 2414369 756461 -438503 -290461 77127
34357 77127 -1021911 -3130469 -4019491 -2664679 -519078 393849 -260686 -1158568 -1153072
34348 -1153072 -567734 -407648 -619002 -200016 568779 -406191 -3779995 -6372608 -4636961
34339 -4636961 13722 2394355 398933 -2426689 -2242444 122208 1433380 843240
34331 843240 -26 -55540 284957 646698 1068487 1503687 2179306 3593773 5108760
34322 5108760 4871294 2523818 594498 1423546 3839387 4776273 3304237 1145058 -113500
34313 -113500 -365359 13703 619420 566716 -812116 -2713132 -3475492 -2470844 -558743
$$ packed form
34375d752681J983202K217573L51318r17969p45261m20510j72536R52867K398316
34366H94319K391299R28485k33473n44386j021875j657908j194964J48042L67588
34357G7127j099038k108558q89022J354812K145601R12927o54535q97882N496
34348a153072N85338J60086k11354M18986P68795r74970l373804k592613J735647
34339d636961M650683K380633j995422k825622J84245K364652J311172n90140
34331H43240q43266n5514L40497L61741M21789M35200O75619J414467J514987
34322E108760k37466k347476j929320Q29048K415841R36886j472036k159179j258558
34313a13500k51859L79062O05717n2704j378832j901016p62360J004648J912101
$$ plain form
34304 -558743 1064137 1722612 1468965 1192107 1898167 3151976 3080787 827349 -1870828
34295 -1870828 -2550774 -713605 2162434 4313087 4540294 2582371 -217173 -1618337
34287 -1618337 -888918 495932 1233128 1708291 2278557 2090595 1015796 617960 1352517
34278 1352517 1006762 -1728084 -4283145 -3726235 -1399479 -672345 -1518438 -1144139 825757
34269 825757 1872663 1226551 1019504 2203334 2944207 2127920 1175571 989457 102789
34260 102789 -2264263 -3753155 -1738651 2758593 5969027 5499659 2309530 -891064
34252 -891064 -2257929 -1984925 -1260936 -362526 1289900 2913455 2169367 -1184131 -3443138
34243 -3443138 -1536103 2101301 2822606 927854 1036759 4237626 5919706 3205391
$$ packed form
34304e58743J622880O58475k53647k76858P06060J253809p1189k253438k698177
34295a870828o79946J837169K876039K150653K27207j957923k799544j401164
34287a618337P29419J384850P37196M75163N70266j87962j074799l97836P34557
34278A352517l45755k734846k555061N56910K326756P27134q46093L74299J969896
34269H25757J046906o46112k07047J183830P40873q16287r52349j86114q86668
34260A02789k367052j488892K014504M497244L210434m69368l190129l200594
34252h91064j366865K73004P23989Q98410J652426J623555p44088l353498k259007
34243c443138J907035L637404P21305j894752J08905L200867J682080k714315
$$ plain form
34235 3205391 -35261 1225743 5830501 8339542 6348235 2456293 -40234 -338028
34227 -338028 698117 2026062 2798100 2807960 2769383 3268057 3684435 2912588 765414 -1867372
34217 -1867372 -3689786 -3575177 -1534786 496474 196970 -2149652 -3606684 -2367579
34209 -2367579 -90699 689882 59348 95067 1715130 3739085 4680584 4270904 3318557
34200 3318557 2686740 2265674 993767 -1434261 -3267126 -2566808 -205800 1005180 365421
34191 365421 35373 1079055 1567914 155949 -1167628 -232759 1598862 1684775 472217
34182 472217 515304 2018632 2551177 1114905 -407219 -405570 259638 173695 -307535 152627
$$ packed form
34235C205391l240652J261004M604758K509041j991307l891942k496527k97794
34227c38028J036145J327945P72038R860l8577M98674M16378p71847k147174k632786
34217a867372j822414J14609K040391K031260k99504k346622j457032J239105
34209b367579K276880P80581o30534L5719J620063K023955R41499m09680r52347
34200C318557o31817m21066j271907k428028j832865P00318K361008J210980o39759
34191C65421l30048J043682M88859j411965j323577R34869J831621Q5913j212558
34182D72217M3087J503328N32545j436272j522124J649O65208q5943m81230M60162
$$ [...]
##END NTUPLES=NMR SPECTRUM
##END=
