##TITLE=31Pdec_DPAH1603
 CDCl3, 24 sc
 17.3.2022
##JCAMPDX= 6.0         $$ Bruker NMR JCAMP-DX V2.0
##DATA TYPE= NMR SPECTRUM
##DATA CLASS= NTUPLES
##ORIGIN= UXNMR, Bruker Analytische Messtechnik GmbH
##OWNER= root
$$ XWIN-NMR		Version 3.5
$$ Thu Mar 17 10:11:46 2022 Russian Standard Time (UT+4h)  she@DPX200
##.OBSERVE FREQUENCY= 81.013821
##.OBSERVE NUCLEUS= ^31P
##.ACQUISITION MODE= SIMULTANEOUS
##.ACQUISITION SCHEME= undefined
##.AVERAGES= 24
##.DIGITISER RES= 16
##SPECTROMETER/DATA SYSTEM= spect
##.PULSE SEQUENCE= zgpg30
##.SOLVENT NAME= CDCl3
##.SHIFT REFERENCE= (INTERNAL, CDCl3, 0, 248.564)
##AUDIT TRAIL= $$ (NUMBER, WHEN, WHO, WHERE, WHAT)
$$ ##TITLE= Audit trail, XWIN-NMR		Version 3.5
$$ ##JCAMPDX= 5.01
$$ ##ORIGIN= Bruker BioSpin GmbH
$$ ##OWNER= she
$$ F:/spectra/data/she/nmr/P31/1/pdata/1/auditp.txt
$$ ##AUDIT TRAIL=  $$ (NUMBER, WHEN, WHO, WHERE, WHAT)
(   1,<2022-03-17 10:10:28.46 +0400>,<she>,<DPX200>,
      <created by zg, POWCHK disabled, PULCHK disabled
       configuration hash MD5:
       00 E9 B6 7A A2 85 ED C7 34 08 36 98 17 FE 4E 26
       data hash MD5: 32K
       23 33 C8 78 D9 EB 82 DA 7E 7C 2F 96 06 15 7C C7>)
(   2,<2022-03-17 10:10:31.17 +0400>,<she>,<DPX200>,
      <Start of raw data processing
       efp BC_mod = 2 LB = 1 FT_mod = 6 PKNL = 1 PHC0 = -9186.38 PHC1 = 112.6757 SI = 64K 
       data hash MD5: 64K
       57 F4 A7 0C 47 16 C5 EE 90 6A 00 30 37 F3 77 BE>)
(   3,<2022-03-17 10:10:50.45 +0400>,<she>,<DPX200>,
      <pk PHC0 = -34.48333 PHC1 = 86.8 
       data hash MD5: 64K
       C8 D7 A5 03 E4 F2 22 9C CF D5 D5 24 45 32 91 73>)
(   4,<2022-03-17 10:11:16.06 +0400>,<she>,<DPX200>,
      <pk PHC0 = 127.3783 PHC1 = -287.0001 
       data hash MD5: 64K
       B9 C4 63 48 4F BA A8 0A 45 BE DE 92 D8 1C C0 79>)
$$ ##END=
$$ 
$$ hash MD5
$$ C1 0B 1B 43 AA 59 5D 44 EF E7 24 12 70 AB 23 1C
##$RELAX= 
##$RELAX= 
##$RELAX= 
##$RELAX= 
##$RELAX= 
##$RELAX= 
##$RELAX= 
##$RELAX= 
$$ Bruker specific parameters
$$ --------------------------
##$DU= <F:/spectra>
##$EXPNO= 1
##$NAME= <P31>
##$PROCNO= 1
##$TYPE= <nmr>
##$USER= <she>
##$AMP= (0..31)
100 100 100 100 100 100 100 100 100 100 100 100 100 100 100 100 100 100 
100 100 100 100 100 100 100 100 100 100 100 100 100 100 
##$AQSEQ= 0
##$AQ_mod= 1
##$AUNM= <au_zg>
##$AUTOPOS= <>
##$BF1= 81.014009
##$BF2= 200.13
##$BF3= 200.13
##$BF4= 200.13
##$BF5= 200.13
##$BF6= 200.13
##$BF7= 200.13
##$BF8= 200.13
##$BYTORDA= 1
##$CFDGTYP= 0
##$CFRGTYP= 5
##$CHEMSTR= <none>
##$CNST= (0..31)
1 1 145 1 1 1 1 1 1 1 1 1 1 1 1 1 1 1 1 1 1 1 1 1 1 1 1 1 1 1 1 1 
##$CPDPRG= <waltz16>
##$CPDPRG1= <>
##$CPDPRG2= <waltz16>
##$CPDPRG3= <>
##$CPDPRG4= <mlev>
##$CPDPRG5= <mlev>
##$CPDPRG6= <mlev>
##$CPDPRG7= <mlev>
##$CPDPRG8= <mlev>
##$CPDPRGB= <>
##$CPDPRGT= <>
##$D= (0..31)
0 1 0 0 0 0 0 0 0 0 0 0.03 2e-05 3e-06 0 0 0 0 0 0 0 0 0 0 0 0 0 0 0 0 
0 0 
##$DATE= 1647497427
##$DBL= (0..7)
120 120 120 11 120 120 24 19 
##$DBP= (0..7)
150 150 150 150 150 150 150 150 
##$DBP07= 0
##$DBPNAM0= <>
$$ [...]
##$SUBNAM2= <"">
##$SUBNAM3= <"">
##$SUBNAM4= <"">
##$SUBNAM5= <"">
##$SUBNAM6= <"">
##$SUBNAM7= <"">
##$SUBNAM8= <"">
##$SUBNAM9= <"">
##$SW= 501.771253377433
##$SWIBOX= (0..15)
0 1 3 0 0 0 0 0 0 0 0 0 0 0 0 0 
##$SW_h= 40650.406504065
##$TD= 32768
##$TD0= 1
##$TE= 0
##$TE2= 300
##$TE3= 300
##$TEG= 300
##$TL= (0..7)
0 120 53 12 22 120 120 120 
##$TP= (0..7)
150 150 150 150 150 150 150 150 
##$TP07= 0
##$TPNAME0= <>
##$TPNAME1= <>
##$TPNAME2= <>
##$TPNAME3= <>
##$TPNAME4= <>
##$TPNAME5= <>
##$TPNAME6= <>
##$TPNAME7= <>
##$TPOAL= (0..7)
0.5 0.5 0.5 0.5 0.5 0.5 0.5 0.5 
##$TPOFFS= (0..7)
0 0 0 0 0 0 0 0 
##$TUNHIN= 0
##$TUNHOUT= 0
##$TUNXOUT= 0
##$USERA1= <user>
##$USERA2= <user>
##$USERA3= <user>
##$USERA4= <user>
##$USERA5= <user>
##$V9= 5
##$VALIST= <valist>
##$VCLIST= <CCCCCCCCCCCCCCC>
##$VD= 0
##$VDLIST= <DDDDDDDDDDDDDDD>
##$VPLIST= <PPPPPPPPPPPPPPP>
##$VTLIST= <TTTTTTTTTTTTTTT>
##$WBST= 1024
##$WBSW= 4
##$XGAIN= (0..3)
0 0 0 0 
##$XL= 0
##$YL= 0
##$YMAX_a= 5666
##$YMIN_a= -6741
##$ZGOPTNS= <>
##$ZL1= 120
##$ZL2= 120
##$ZL3= 120
##$ZL4= 120
##$ABSF1= 0
##$ABSF2= 0
##$ABSG= 0
##$ABSL= 0
##$ALPHA= 0
##$AQORDER= 0
##$ASSFAC= 0
##$ASSFACI= 0
##$ASSFACX= 0
##$ASSWID= 0
##$AUNMP= <proc_1d>
##$AZFE= 0.1
##$AZFW= 0.5
##$BCFW= 0
##$BC_mod= 2
##$BYTORDP= 0
##$COROFFS= 0
##$CY= -3
##$DATMOD= 1
##$DC= 0
##$DFILT= <>
##$DTYPP= 0
##$F1P= 0
##$F2P= 0
##$FCOR= 1
##$FTSIZE= 65536
##$FT_mod= 6
##$GAMMA= 0
##$GB= 0
##$INTBC= 1
##$INTSCL= 5.30512e-09
##$ISEN= 30
##$LB= 1
##$LEV0= 0
##$LPBIN= 0
##$MAXI= 10000
##$MC2= 0
##$MEAN= 0
##$ME_mod= 0
##$MI= 50
##$NCOEF= 0
##$NC_proc= -8
##$NLEV= 6
##$NOISF1= 182.463
##$NOISF2= 159.3651
##$NSP= 0
##$NTH_PI= 0
##$NZP= 0
##$OFFSET= 248.5645
##$PC= 4
##$PHC0= -9093.485
##$PHC1= -87.5244
##$PH_mod= 1
##$PKNL= yes
##$PPARMOD= 0
##$PSCAL= 0
##$PSIGN= 0
##$REVERSE= no
##$SF= 81.014009
##$SI= 65536
##$SIGF1= 159.3651
##$SIGF2= -187.1042
##$SINO= 113.3802
##$SIOLD= 16384
##$SREGLST= <1H.CDCl3>
##$SSB= 0
##$STSI= 65536
##$STSR= 0
##$SW_p= 40650.406504065
##$SYMM= 0
##$S_DEV= 0
##$TDeff= 32768
##$TDoff= 0
##$TI= <>
##$TILT= no
##$TM1= 0
##$TM2= 0
##$TOPLEV= 0
##$USERP1= <user>
##$USERP2= <user>
##$USERP3= <user>
##$USERP4= <user>
##$USERP5= <user>
##$WDW= 1
##$XDIM= 65536
##$YMAX_p= 448567644
##$YMIN_p= -292452703
$$ End of Bruker specific parameters
$$ ---------------------------------
##NTUPLES= NMR SPECTRUM
##VAR_NAME=  FREQUENCY,     SPECTRUM/REAL,   SPECTRUM/IMAG
##SYMBOL=    X,             R,               I
##VAR_TYPE=  INDEPENDENT,   DEPENDENT,       DEPENDENT
##VAR_FORM=  AFFN,          ASDF,            ASDF
##VAR_DIM=   65536,         65536,           65536
##UNITS=     HZ,            ARBITRARY UNITS, ARBITRARY UNITS
##FACTOR=    0.620285442955139, 1,           1
##FIRST=     20137.2065510759, 0,            0
##LAST=      -20513.1999529892, 0,           0
##MIN=       -20513.1999529892, -292452703,  0
##MAX=       20137.2065510759, 448567644,    0
$$ Real data points
##PAGE= N=1
##DATA TABLE= (X++(R..R)), XYDATA
$$ [...]
38588f139250P61198J914764K840371K569933O05850j374425o78434K412259L834596
38579F746862R90207l019693l335422k62574J346564p13613l297077l089719q87189
38570e521654Q27425J535650J888473J628016N53799p1762Q01267K029537J762882
38561E433633Q8309j296099j357958m65697M89477O97777j58232j246685j081522
38552A103003N82508K148459K111007O96639r65765k170745k476365j541884q6949
38543f00092K30616r33092j577143P3634K841956L931170K447565J04353j354483
38534E164484j888365k012372j304347Q04688L209189L525769J089713j337824
38526G250935m57310L033193M816230K731562m2298L88996K697129K261645j550302
$$ plain form
38588 -6139250 -5378052 -3463288 -622917 1947016 2552866 1178441 500007 2912266 6746862
38579 6746862 7737069 4717376 1381954 1119380 2465944 1752331 -1544746 -4634465 -5521654
38570 -5521654 -4694229 -3158579 -1270106 357910 911709 839947 1641214 3670751 5433633
38561 5433633 5521942 4225843 2867885 2402188 2891665 3589442 3431210 2184525 1103003
38552 1103003 1685511 3833970 5944977 6641616 5675851 3505106 1028741 -513143 -600092
38543 -600092 -369476 -1302568 -2879711 -2806077 35879 3967049 6414614 6518967 5164484
38534 5164484 3276119 1263747 -40600 764088 3973277 7499046 8588759 7250935
38526 7250935 6793625 9826818 14643048 17374610 17332312 17721308 20418437 22680082 21129780
38517B1129780l658313J36241P459493J1896665R843906L778845l20994J665199
38509E1930822Q152342J3084348J1955639O265821P81193k427802m673080o421999
38501G8647284o397111n337357o406604r994542j1774178q590453l304170o93793
38493B6149076r86246j048823k72945j092533l952648n667126l910978p08900
38485H508877J85214j910747l870781k621336J115196L587408K656313N63800
38477H213944O13827K017826R53128l004511n205688k586694J475206K231224
38469D708262O32802Q39639K450743R10391m077318o378841k216835L542735L929732
38460D341310l50778k535451R0722K931800J727265j260982j496403O63491J129060
$$ plain form
38517 21129780 17471467 17607708 25067201 36963866 46807772 50586617 50265623 51930822
38509 51930822 60083164 73167512 85123151 91388972 92170165 89742363 85069283 78647284
38501 78647284 72250173 66912816 60506212 50511670 38737492 30147039 26842869 26149076
38493 26149076 25162830 24114007 23841062 22748529 18795881 13128755 9217777 8508877
38485 8508877 8694091 6783344 2912563 291227 1406423 4993831 7650144 8213944
38477 8213944 8827771 10845597 11798725 8794214 3588526 1001832 2477038 4708262
38469 4708262 5341064 6180703 8631446 9541837 5464519 -914322 -3131157 411578 4341310
38460 4341310 3990532 1455081 1545803 4477603 6204868 4943886 3447483 4110974 5240034
38451E240034q61804j340611J798648M610126K255242l783120p081935m455738
38443c619158M52097K511269J195847n26960j180207j562625j319958J539481
38435b510214O380285Q275372L619672m063382p439626m333139J81071J338118
38427A448157L17389K03724M10295q55035j684781N68309L154393R82084m386728
38418A57807n486149j94258M368866K325315k591734l642929r42563Q65726Q81046
38409d258873J603448K781704J982697J59720O72720L006905K961938m73770l362673
38400E073816k861931q33125k13179j153645j967331j472575K81651J913685J666843
38391D34209j5360l83488J247621J619940j110953l395032j788398R63471P09044
$$ plain form
38451 5240034 4378230 3037619 4836267 9446393 11701635 7918515 836580 -3619158
38443 -3619158 -3167061 -655792 540055 13095 -1167112 -2729737 -4049695 -2510214
38435 -2510214 3870071 12145443 15765115 11701733 4262107 -71032 110039 1448157
38427 1448157 1765546 1969270 2379565 1524530 -160251 408058 3562451 4544535 157807
38418 157807 -5328342 -5522600 -1153734 1171581 -1420153 -5063082 -6005645 -5139919 -4258873
38409 -4258873 -2655425 126279 2108976 2268696 2941416 5948321 8910259 8436489 5073816
38400 5073816 2211885 1378760 1165581 11936 -1955395 -3427970 -3146319 -1232634 434209
38391 434209 418849 35361 1282982 2902922 1791969 -1603063 -3391461 -2427990 -1718946
38382a718946m92775J743495N207023L942320j330530l990604k347885j116149
38374a04051j707114k08974L372137L243495j718230m478872r40667L501110L105442
38365D064276M3352j414398j860700k551063r90052L375634N125247O95780n013747
38356A474329n702280k341045O39787K476811L737155K464845j170316j897147
38348c17861K493215N630607K160401l049268l204504j135329l128173o352626
38340f903538l317746M351282P647129M113888l01440k328385m075536n019802
38332e834148j673311L875782M844475P60834j444894Q83779K286885n57538l310398
38323a68534k007113Q85100J915542J664355J246246k30977k140161j977841m08992
$$ plain form
38382 -1718946 -2211721 -468226 4738797 8681117 7350587 3359983 1012098 -104051
38374 -104051 -1811165 -2020139 1351998 4595493 2877263 -1601609 -2542276 958834 4064276
38365 4064276 4107628 2693230 832530 -1718533 -2708585 667049 5792296 6488076 1474329
38356 1474329 -4227951 -6568996 -5929209 -3452398 284757 2749602 1579286 -317861
38348 -317861 2175354 7805961 9966362 6917094 3712590 2577261 -550912 -6903538
38340 -6903538 -10221284 -5870002 1777127 5891015 5589575 3261190 -814346 -5834148
38332 -5834148 -7507459 -3631677 1212798 1973632 528738 1412517 3699402 3141864 -168534
38323 -168534 -2175647 -1290547 624995 2289350 3535596 3304619 1164458 -813383 -1222375
38314a222375o78519j783948O30955N142719M730397j214742m067079M69788M836520
38305F843716J818438l681907k905949K811621N031434J445356k160041j553762
38297G648906J218310K360034N58623k983488n362571l946101k9413J720743k11444
38288I73599j635571M81938K802324J353875j648593j910235n03571j273408l293036
38279d652678k254471J768514L944374K006796j120357k384698k015553j291889
38271e999962l85362Q49978K226642L400392L291921P44360k608681k731243J002082
38262b09873L534627J246090k102594j431411R51922p03355n004168m625404J743340
38253f600826O429892L941759j549551l241111q33924J405078J667508J320435
$$ plain form
38314 -1222375 -1900894 -3684842 -3053887 2088832 6819229 5604487 1537408 2007196 6843716
38305 6843716 8662154 4980247 2074298 4885919 9917353 11362709 9202668 7648906
38297 7648906 8867216 11227250 11785873 8802385 3439814 -506287 -535700 1185043 973599
38288 973599 -661972 -180034 2622290 3976165 2327572 417337 -86234 -1359642 -4652678
38279 -4652678 -6907149 -5138635 -1194261 812535 -307822 -2692520 -4708073 -5999962
38271 -5999962 -6385324 -5535346 -3308704 91688 3383609 4127969 1519288 -1211955 -209873
38262 -209873 3324754 4570844 2468250 1036839 1988761 1285406 -3718762 -8344166 -6600826
38253 -6600826 -170934 3770825 2221274 -1019837 -1853761 -448683 1218825 2539260
38245B539260J098356N22886j07296K3644Q54312K019195L458818M142140K221167
38236A6772482j821590m332880k934162J14036J251227L71341m40857j072077
38228G907520k792623m526661l567638j33507K321252K112707J374859J780860
38220D476769J462212j374916m311967l596353K4677J879579j96013l167181l310928
38211h114121o49568K372730M099529L811380J077542k581833l390660J68488
38203c206513L871150K449838k782005n071818j415628L592319M586802K087536
38195D111681k08674j195161j783911j258594J330505L466213J547482l013198
38187B996343m454767n68004L802657L137011j714498n276015m335177n82517
$$ plain form
38245 2539260 3637616 4160502 4053206 4076850 4931162 6950357 10409175 14551315 16772482
38236 16772482 14950892 10618012 7683850 7797886 9049113 9420454 8979597 7907520
38228 7907520 5114897 588236 -2979402 -3112909 -791657 1321050 2695909 4476769
38220 4476769 5938981 4564065 252098 -3344255 -3319578 -1439999 -1636012 -4803193 -8114121
38211 -8114121 -8763689 -6390959 -2291430 1519950 2597492 15659 -3375001 -3206513
38203 -3206513 664637 3114475 332470 -4739348 -6154976 -2562657 2024145 4111681
38195 4111681 3903007 2707846 923935 -334659 995846 4462059 6009541 2996343
38187 2996343 -1458424 -2026428 1776229 4913240 3198742 -2077273 -6412450 -6994967
38179f994967K566575L397488K365378R62784M03451N66950L75476l22306j83114
38170C137715J325145K286031Q87862j242639r02880J487535J651335k289147
38162F340957o209051n212482m56310K620841J893268M43345O32355N73878j448868
38153h22067k761689j67705M088337M537501K71999l524055k676182P97190K337216
38144B080545R60693o78501n93528P97877K431626L639074L567832J703609p24331
38135A3184896j656135j006808q76429k233274l150587j754477M82818M74163
38127C464167j984780l634013k030550J340270L062723J754328p37296j360006
38119a25157J221424M825562N006020k07970o716829p902488k583686L273942
$$ plain form
38179 -6994967 -4428392 -1030904 1334474 2297258 2700709 3267659 3643135 3320829 3137715
38170 3137715 4462860 6748891 7636753 6394114 5491234 6978769 8630104 6340957
38162 6340957 131906 -5080576 -5536886 -2916045 -1022777 -579432 52923 626801 -822067
38153 -822067 -3583756 -3751461 336876 4874377 5146376 1622321 -1053861 -256671 2080545
38144 2080545 3041238 2362737 1769209 2567086 4998712 8637786 12205618 13909227 13184896
38135 13184896 11528761 10521953 9645524 7412250 4261663 2507186 2990004 3464167
38127 3464167 1479387 -2154626 -4185176 -2844906 217817 1972145 1234849 -125157
38119 -125157 1096267 5921829 10927849 10719879 4003050 -3899438 -6483124 -3209182
38111c209182M164573J220181j397523k593601l072975j456683K864905N362418
38103A882113J431564n178065o142479r16981K431292J83536j690032J390521
38095f608531M638766K720458q91986p46931O26837j681694m271782n00008O490305
38086b24566O728579p80215n826272k553582K536909J967337j896778k804381
38078b852969o34348P83466J032714J979021K494339L56528k462432j965350J208747
38069f0284K256381n13980l163039j947144J613454L215778J320699j634299k702699
38060a615133j401879Q82805K974340M213659L597347P26509k242771k109062
38052E025815P90094K075714o60290l905771l096445Q06395L107487K069381j0481
$$ plain form
38111 -3209182 955391 2175572 778049 -1815552 -4888527 -6345210 -3480305 1882113
38103 1882113 3313677 -1864388 -8006867 -8923848 -6492556 -6309020 -7999052 -6608531
38095 -6608531 -1969765 750693 -141293 -888224 -261387 -1943081 -6214863 -6714871 -224566
38086 -224566 6504013 5723798 -102474 -2656056 -119147 1848190 -48588 -2852969
38078 -2852969 -3487317 -2703851 -1671137 307884 2802223 3158751 696319 -1269031 -60284
38069 -60284 2196097 1682117 -1480922 -3428066 -1814612 1401166 2721865 1087566 -1615133
38060 -1615133 -3017012 -2134207 840133 5053792 8651139 9377648 7134877 5025815
38052 5025815 5815909 7891623 7231333 3325562 229117 1035512 4142999 6212380 6201899
38043F201899j206431j484776o64675J173025J912287k2736k093632q24445K324929
38034E315445K923653O45057p98617l01331k75742j027816l37563R44236o20414
38025F466908m008145l974905M8379K335828M01625j143294O28207J775341p21487
38016A808457l150460k094953m80048r23142J64968M969387P232468J394449o248608
38007B672518n245937L085468P363441K860002k994807k889063R83403K567468
37999H402493O00161j837340k353445r07946J244807K544412K307642J161037
37991A1161821n25968l136164n365329m098324O84773M061925K764612K76692
37983E824038R59440K645516Q21579k843835l033455O7342J445795J62554R9364
$$ plain form
38043 6201899 4995468 3510692 2846017 4019042 5931329 5908593 3814961 2990516 5315445
38034 5315445 8239098 8884155 8085538 7784207 7508465 6480649 6143086 7087322 6466908
38025 6466908 2458763 -1516142 -1467763 868065 1269690 126396 754603 2529944 1808457
38016 1808457 -1342003 -3436956 -3917004 -4840146 -4675178 294209 7526677 8921126 2672518
38007 2672518 -2573419 512049 7875490 10735492 7740685 4851622 5835025 8402493
37999 8402493 9002654 7165314 4811869 3903923 5148730 7693142 10000784 11161821
37991 11161821 10635853 7499689 2134360 -1963964 -1279191 2782734 5547346 5824038
37983 5824038 6783478 9428994 10250573 7406738 4373283 4440625 5886420 6048974 6148338
37974F148338J832444J366143j918418l325489q85897J262908Q8080j678971q99064
37965A990074J256605K654655L272997K474719j461398o305552o058891J39750
37957b037041M829860K602094j504021J24395N498828N891453r20976p297806
37949G186786o172196N02166N285611L710565k225402o777773n786764p10932
37941d987939K722464J217498j779411p43406L991690O425637L281755j437934
37933H690354k100919J188320L847855L972707M501429P672019J0723529R780542
37925D8275836O376729O668288J3690783K2946007K6876836K2051656J0966286
37918A57852421j382565j1113010j6936171j9701814k0261642j7875754j2280749
$$ plain form
37974 6148338 7980782 9346925 7428507 4103018 3217121 4480029 4568109 2889138 1990074
37965 1990074 3246679 5901334 9174331 11649050 10187652 3882100 -2176791 -2037041
37957 -2037041 2792819 5394913 3890892 4015287 9514115 15405568 14484592 7186786
37949 7186786 1014590 1516756 6802367 10512932 8287530 1509757 -4277007 -4987939
37941 -4987939 -2265475 -1047977 -2827388 -3570794 420896 6846533 10128288 8690354
37933 8690354 6589435 7777755 11625610 15598317 20099746 27771765 38495294 48275836
37925 48275836 54652565 61320853 75011636 97957643 124834479 146886135 157852421
37918 157852421 156469856 145356846 128420675 108718861 88457219 70581465 58300716
37911E8300716o810337n931663q804494r442387n390402j740111l023972n716611
37903A1440739m105913J36891J009036j544793k020469N91918R96574k896655
37895C607328n836460l307997K067442N231355M970829K692687n66408k979774
37887E879002j946613J721955L367859R57173j853844j797720q42931j617395
37879C867486k298374l63422K140195J792543m67143j413849j022229j231669
37871A003538j192610J317185M850590N378480K061454j974674m189156m350206
37863B904601k428661J252621M016058K919603q63688l187334k632657j603605
37855C76938j462015m46705K337168M315095K881047q50554l618646l752854j848171
$$ plain form
37911 58300716 51490379 45558716 36754222 27311835 21921433 20181322 17157350 11440739
37903 11440739 7334826 7471717 8480753 6935960 4915491 5507409 6503983 3607328
37895 3607328 -2229132 -5537129 -3469687 1761668 6732497 9425184 8858776 5879002
37887 5879002 3932389 5654344 9022203 9979376 8125532 6327812 5484881 3867486
37879 3867486 1569112 1205690 3345885 5138428 4671285 3257436 2235207 1003538
37871 1003538 -189072 1128113 5978703 11357183 13418637 11443963 7254807 2904601
37863 2904601 475940 1728561 5744619 8664222 7800534 4613200 1980543 376938
37855 376938 -1085077 -1531782 805386 5120481 8001528 7150974 3532328 -220526 -2068697
37846b068697Q37800L025368L389079J574796q42059j542844q942J607166P71257
37837F742924k204978m042060k323873J389908L609771L189144J478504q83836
37829F955504m015688n770033k994222K874399N805002L109376p09373r38194
37821D316771Q00733Q13058j94820K5005j82426k807625m399753r97552L580174
37812I53565K460042k656401l559917Q77981L014049k9482j535978K179267M540274
37803F243400M46621l928752j454366L386953K122707l133328l619754J093025
37795A156506L434742J664276J872869N572154O502097K531345L90026M039076
37787B7163091P368319M269196j615786l783334l193272m414064o341636m695799
$$ plain form
37846 -2068697 -1230897 1794471 5183550 6758346 5916287 4373443 4364501 5971667 6742924
37837 6742924 4537946 495886 -1827987 -438079 3171692 6360836 7839340 6955504
37829 6955504 2939816 -2830217 -5824439 -2950040 2854962 5964338 5254965 4316771
37821 4316771 5117504 5930562 5735742 5760747 5578321 2770696 -1629057 -2626609 953565
37812 953565 3413607 757206 -2802711 -1924730 1089319 1059837 -476141 1703126 6243400
37803 6243400 6690021 2761269 1306903 4693856 6816563 3683235 63481 1156506
37795 1156506 4591248 6255524 8128393 13700547 20202644 22733989 23124015 27163091
37787 27163091 34531410 38800606 37184820 33401486 30208214 25794150 19452514 14756715
37779A4756715q13297j67631l247998m719497j674944K815317M712194L100050
37771A4760909p49893m418333m755825j157959K117006Q55979k742690l102392
37763H06802J58041K022285L82574j273526n27611L79822k75902k85890J715314
37754C101909K699510K13352k772669k083022J192256K492199M23105k076050
37746C190590k376518r41874K29496j64929j780668k728271j487249O33788P79765
37737d645870r14138q46309K323828M663612K595274j263837j823010Q17694J995750
37728B902994J03242j177111R27934L966590M138318J598923n10186o00697J80863
37719A1530870N33205N69698O42150K14160j275420l194927m196412l622895j828494
$$ plain form
37779 14756715 13943418 13775787 10527789 5808292 4133348 6948665 11660859 14760909
37771 14760909 14011016 9592683 4836858 3678899 5795905 6651884 3909194 806802
37763 806802 964843 2987128 3369702 2096176 1568565 1948387 1672485 1386595 3101909
37754 3101909 5801419 6014771 3242102 1159080 2351336 4843535 5266640 3190590
37746 3190590 814072 -127802 101694 -63235 -1843903 -4572174 -6059423 -5425635 -4645870
37737 -4645870 -5560008 -6406317 -4082489 581123 3176397 1912560 89550 907244 2902994
37728 2902994 3006236 1829125 2757059 6723649 10861967 12460890 11950704 11350007 11530870
37719 11530870 12064075 12633773 13275923 13490083 12214663 9019736 4823324 1200429 -628065
37710f28065M95011K407656K600811P00011j478497j948098j768040l293857m783164
37701g696232j282156O650947J0257729L839785n365294n852743J872733O295009
37693H719778K039072l365756k509048J049952K89227l850536n231255k282749
37685e141315J338637L065042L075509J825244K69018L20682J542774M36465l426835
37676C305221m713900m37046L714659J390653l870070l682844J947951M774952
37668B429576J298987k518135j131947K838629L640163K74077l664339m899327
37660a732316k897886N80950K854243K446739L44499j499740k042144r17233J520355
37651a342533K943369J084787j555362L59719N919447O792780m11704p106199
$$ plain form
37710 -628065 -133054 2274602 4875413 5575424 4096927 2148829 380789 -2913068 -7696232
37701 -7696232 -8978388 -2327441 7930288 11770073 6404779 552036 2424769 8719778
37693 8719778 10758850 7393094 4884046 5933998 6223225 2372689 -2858566 -5141315
37685 -5141315 -3802678 -737636 2337873 4163117 4432135 4752817 6295591 6732056 3305221
37676 3305221 -1408679 -1845725 1868934 3259587 -610483 -4293327 -2345376 2429576
37668 2429576 3728563 1210428 78481 2917110 6557273 6831350 3167011 -1732316
37660 -1732316 -4630202 -4049252 -1195009 1251730 1596229 96489 -1945655 -2862888 -1342533
37651 -1342533 1600836 2685623 1130261 1489980 7409427 14202207 13790503 6684304
37643F684304m850353J469537J550331l888865n212933J12101M753271M228083
37635D845476J701302m62676l527146n408666j217566O798186R582826M458670
37627A6770406j248205k495558k560441l382106n97793O352707R242831L174776
37619B5256617m819065o455733l750962k609913k424341k54861J235247j197724
37611D979265l763796j586633K352580K472768M23308J215375L426255J999490
37603A1518612k176468l939262k665863j515080m11485K290968L785142Q12723
37595G699287k703044p88613L882675L713663r61199k716242r3618P03767k113208
37586F623468k805970O91433K650266J33984j761231K63725J421122k073029n366632
$$ plain form
37643 6684304 1833951 3303488 4853819 964954 -4247979 -4135878 617393 4845476
37635 4845476 6546778 6084102 2556956 -2851710 -4069276 2728910 12311736 16770406
37627 16770406 15522201 13026643 10466202 7084096 6486303 12839010 22081841 25256617
37619 25256617 20437552 13981819 10230857 7620944 5196603 4941742 6176989 4979265
37611 4979265 1215469 -371164 1981416 4454184 4877492 6092867 9519122 11518612
37603 11518612 9342144 5402882 2737019 1221939 810454 3101422 6886564 7699287
37595 7699287 4996243 4207630 8090305 11803968 10842769 8126527 8032909 8736676 6623468
37586 6623468 3817498 4508931 7159197 7293181 5531950 5795675 7216797 5143768 -222864
37577b22864k891756K339899M021649K118633O40264O7327j391433k237423N5635
37568B499931L347651L366069M68203j360412q56561J11584R96876K331053K350029
37559A3254423p14517l862654k554805J675990K949278O83781P70430N348131
37551A7550057Q322816M807060j002066k549176p25363p22067k523555j725238
37543B1432468J705139K899369O13537o98916J017017J717135j526998n388158
37535B1770593o041191m923503m404650k555409K222232N388780J907739m652417
37527H712174n827960l96568M060526K363588j815543k570553L46286K818995
37519G690945K042909j187069l572905j984139K740885N252545K021133l039410
$$ plain form
37577 -222864 -3114620 -774721 3246928 5365561 6005825 6073152 4681719 2444296 2499931
37568 2499931 5847582 9213651 9681854 8321442 7464881 7576465 8573341 10904394 13254423
37559 13254423 12539906 8677252 6122447 7798437 10747715 11431496 12201926 17550057
37551 17550057 25872873 30679933 29677867 27128691 26403328 25681261 23157706 21432468
37543 21432468 23137607 26036976 26650513 25951597 26968614 28685749 27158751 21770593
37535 21770593 15729402 10805899 6401249 3845840 6068072 11456852 13364591 8712174
37527 8712174 2884214 2487646 6548172 8911760 7096217 4525664 4871950 7690945
37519 7690945 9733854 8546785 4973880 2989741 5730626 10983171 13004304 9964894
37511I964894l481949N10980L242876K674777J891040J695408o61409m293046
37503A1543571m102025K62730K484826k93446k886840j291782J014346M44662
37495G176042m79903M99661J69341k958947l547045J373383N122863J589529l650854
37486E294070j925499M121415N168598M27755k721145j928566j635583k580962
37478D220083n56761L672345L528274k252122o636420m981727q83195J066484
37470b823039J085637L68375j634470l519979j907272K384864M093964J644556
37462c07364m05522R21056K978233L299407L161355K970983M99434l515888m387371
37453E214323j159742J071234k73975j123597J005498J850982j370776l574213
$$ plain form
37511 9964894 6482945 6993925 10236801 12911578 14802618 16498026 15836617 11543571
37503 11543571 7441546 7704276 10189102 9895656 7008816 5717034 6731380 7176042
37495 7176042 6696139 7195800 7365141 4406194 859149 2232532 7355395 8944924 5294070
37486 5294070 3368571 7489986 12658584 13086339 10365194 8436628 6801045 4220083
37478 4220083 3663322 7335667 10863941 8611819 1975399 -3006328 -3889523 -2823039
37470 -2823039 -1737402 -1369027 -3003497 -6523476 -8430748 -6045884 -1951920 -307364
37462 -307364 -712886 208170 3186403 6485810 9647165 12618148 13117582 9601694 5214323
37453 5214323 4054581 5125815 4851840 3728243 4733741 6584723 5213947 1639734
37445A639734k02801M104057K925989q69962k07264L547901K680728l311599o018557
37436D288226j448380L600642K183732k545932k985288J333057L803696R86030
37428I215783k721289j867007K421447M471066K052208j120865j256664L55989
37420A1550668J37956k110664l376313k128857K82534K340289L333119K141260
37412A2169992j345261l785990j526902L363304M677100Q40565k667970j723976
37404A0000862N63470k27754k480067j834743J240851K447464O47718j116544
37396I241257j048303m80704j82950R77016K709382K365088q91686l792453l113494
37387E783153l08607M72795j770690l511838j632326K211496L744467J754619
$$ plain form
37445 1639734 1436933 5540990 8466979 7597017 7389753 10937654 13618382 10306783 4288226
37436 4288226 2839846 6440488 8624220 6078288 3093000 4426057 8229753 9215783
37428 9215783 6494494 4627487 7048934 11520000 13572208 12451343 11194679 11550668
37420 11550668 11688624 9577960 6201647 4072790 4355324 6695613 10028732 12169992
37412 12169992 10824731 7038741 5511839 8875143 13552243 14392808 11724838 10000862
37404 10000862 10564332 10336578 7856511 6021768 7262619 9710083 10357801 9241257
37396 9241257 8192954 7712250 7529300 8506316 11215698 13580786 12689100 8896647 5783153
37387 5783153 5474546 5947341 4176651 664813 -967513 1243983 4988450 6743069
37379F743069m77881J32659K349679K740987O33393j267191q74394Q28848J749916
37370A2559085J394085Q62447J197470K302803K924275J702437j080928l166265
37362A8695409k687434m45962J294125J708769J680090J646866R64155m90015
37354B2366003j470238m91082K755134O805930Q954717P535420M414241L776081
37346E4646206P566508J3872480K0410001K6432665K9437796K4105343Q694231
37339A85165230j0056917k2846429k6973910k5810711k1783806j5354326r284697
37332E3054434p473025r256313j0124997q337498n912812l344965Q39830M883088
37324A4327742M382341m99092m118318l295584p12368J079836K933759M304640
$$ plain form
37379 6743069 6265188 6397847 8747526 11488513 12121906 10854715 9980321 10809169 12559085
37370 12559085 13953170 14815617 16013087 18315890 21240165 22942602 21861674 18695409
37362 18695409 16007975 15562013 16856138 18564907 20244997 21891863 22856018 22366003
37354 22366003 20895765 20404683 23159817 29965747 38920464 46455884 50870125 54646206
37346 54646206 62212714 76085194 96495195 122927860 152365656 176470999 185165230
37339 185165230 175108313 152261884 125287974 99477263 77693457 62339131 53054434
37332 53054434 45581409 36325096 26200099 17862601 11949789 8604824 9444654 14327742
37324 14327742 18710083 18210991 14092673 10797089 10084721 11164557 14098316 18402956
37316A8402956J819459l885564o115925j480153L952877K916825k965986o530987
37308F113502m840761m02562M167830P183789O052574J51275n713348n905987
37300F806312j505861J174550p45771l716963l619558r34590R12468L3285j967170
37291c563298j617449K478517O870223O250904M06678m326074k822982K003397
37283E679916L379173k4062k900603j126757K989098M449440K032876r23611j336658
37274A2218812j08259k84985k469609l972299k893830p81589K33134N43538R96751
37265C481664L78969j576425j397421L030026O837257L908000k979361m939780
37257F742929N6207M697899M016543J476478Q07429j08533k991332m201695j290302
$$ plain form
37316 18402956 20222415 16336851 10220926 8740773 12693650 15610475 12644489 6113502
37308 6113502 1272741 870179 5038009 12221798 18274372 18425647 12712299 6806312
37300 6806312 5300451 6475001 5729230 2012267 -1607291 -2541881 -1629413 -1596128 -3563298
37291 -3563298 -5180747 -2702230 4167993 10418897 10825575 6499501 3676519 5679916
37283 5679916 9059089 9035027 6134424 5007667 7996765 12446205 14479081 13555470 12218812
37274 12218812 12110553 11825568 9355959 5383660 2489830 1708241 1941375 2484913 3481664
37265 3481664 3860633 2284208 886787 3916813 10754070 14662070 11682709 6742929
37257 6742929 6799136 11497035 15513578 16990056 17797485 17688952 14697620 10495925 9205623
37248I205623J763198J267790n686J134683J907458o48516l074194j599497K49880
37239A0200739k190984n399821k942175L218983N476381K604290L89802J286225
37231A2643440J854089N24830M3797J264902J394556l39447j155423J65426J899593
37222A8295763L520366N849243O876908L227222l445358p037766n063212j265567
37214B0957599M99646J18844j478117l691524m298022j286789K698129K933174
37206A6452940O4296p41389J337455J364496k272869m268170r95816L427028L671035
37197A8039006P28981j290421j630222j786376j396785M49896K366306K895873
37189A8376258L321592M885935N568135L253956K09509O56102M987204R657668
$$ plain form
37248 9205623 10968821 12236611 12230925 13365608 15273066 14624550 11550356 9950859 10200739
37239 10200739 8009755 2609934 -332241 2886742 8363123 10967413 11357215 12643440
37231 12643440 14497529 15022359 15066156 16331058 17725614 17386167 16230744 16396170 18295763
37222 18295763 21816129 27665372 34542280 37769502 34324144 27286378 22223166 20957599
37214 20957599 21457245 21576089 20097972 16406448 12108426 10821637 13519766 16452940
37206 16452940 16517236 15775847 17113302 18477798 16204929 11936759 10940943 14367971 18039006
37197 18039006 18767987 17477566 15847344 14060968 12664183 13114079 15480385 18376258
37189 18376258 21697850 26583785 32151920 35405876 35615385 36271487 41258691 50916359
37181E0916359J2141103J3257926J5124479J9168140K5617886L2484090L4995433
37174B03705416K8328273J2257221p111071k0833739k3469099j7303228j0218341
37167A65355432q171072r881974j0005023o530822k666035j797598l639996o025423
37159A16637489p775910q566964q105829o858946o140395o470092o976830o840780
37151E8901743o050086m704457l140945k547141l530108m415599l320746j542728
37143B9649933j908479l782811l286261O44992L914281K706660j453922l955809
37135B2528584k376618J920137N546430N369988J162505l038104k581934J769005
37127C0299993M226464J672234k262515k927745j147620o49844j560260p88193
$$ plain form
37181 50916359 63057462 76315388 91439867 110608007 136225893 168709983 203705416
37174 203705416 232033689 244290910 237179839 216346100 192877001 175573773 165355432
37167 165355432 157184360 147302386 137297363 130766541 128100506 126302908 122662912 116637489
37159 116637489 108861579 100294615 92188786 85329840 79189445 72719353 65742523 58901743
37151 58901743 52851657 48147200 45006255 42459114 38929006 34513407 31192661 29649933
37143 29649933 27741454 23958643 20672382 21317374 25231655 27938315 26484393 22528584
37135 22528584 20151966 22072103 27618533 32988521 34151026 31112922 28530988 30299993
37127 30299993 34526457 36198691 33936176 31008431 29860811 29210967 27650707 26862514
37119B6862514K072208L567077J707351r61480j086346J024353K425015J633173
37111C7243865j01132j041213q07168J15044J286721K125883J933586J092440
37103D1848026J292617L184636M660594L522586J409457K319388O816477J0701834
37095G5755615J0749861Q930524Q987707J1387828J4074686J6002127J7187220
37088A63075568J7039886J5245946J2621925Q838374J764247q063635j5310198
37081A95212113j6251416j4643406j6232529j9691347j9082968j4008727j0275162
37074H5026558j0160308r239807n000488j982086m565126r649153j0882238o874104
37066B6673248j319670K493462L661786K110747j335053m159397m149151j900594
$$ plain form
37119 26862514 28934722 32501799 34209150 33247670 32161324 33185677 35610692 37243865
37111 37243865 37142733 36101520 35294352 35409396 36696117 38822000 40755586 41848026
37103 41848026 43140643 46325279 50985873 54508459 55917916 58237304 65053781 75755615
37095 75755615 86505476 95436000 104423707 115811535 129886221 145888348 163075568
37088 163075568 180115454 195361400 207983325 216821699 218585946 210522311 195212113
37081 195212113 178960697 164317291 148084762 128393415 109310447 95301720 85026558
37074 85026558 74866250 65626443 60625955 58643869 54078743 44429590 33547352 26673248
37066 26673248 25353578 27847040 31508826 33619573 32284520 28125123 23975972 22075378
37058B2075378J70956N99451m34000k035406l054593k574455q96984P12534J622684
37049A6185565K152606K285389J537402K19657o89614j000620j219448j271963
37041A8198974q99828p98798j560033k197343j692845r71233j072471p66645J192812
37032I432590L018225K492072R77825Q51529P12218j934392m772164l388893R28513
37023H317523K671430J268822J560634M285780L981524j138210m893664k724722
37015A3329117J210102J399002m04686N23692L653421N032262L868645J916877
37007C0528432q67998m920178p486374n319115K05110M253620L811057l33505
36999A9871049m820846n392939n95275M584815L216505l348941n490761R49864
$$ plain form
37058 22075378 22246334 22845785 22411785 20376379 17321786 14747331 13850347 14562881 16185565
37049 16185565 18338171 20623560 22160962 22380619 21691005 20690385 19470937 18198974
37041 18198974 17299146 16500348 14940315 12742972 11050127 10078894 9006423 8239778 9432590
37032 9432590 12450815 14942887 15920712 16772241 17484459 15550067 10777903 7389010 8317523
37023 8317523 10988953 12257775 13818409 18104189 22085713 20947503 16053839 13329117
37015 13329117 14539219 15938221 15533535 16057227 19710648 24742910 28611555 30528432
37007 30528432 29660434 24740256 17253882 11934767 12139877 16393497 20204554 19871049
36999 19871049 15050203 9657264 9061989 13646804 16863309 13514368 8023607 8973471
36991H973471P452570N015561k377264m160526J181480N596354M517199J829301
36983B8028146J833823L732490N303019O129886N743525L211216k38533j888204
36975E1855368j393840q19290r81843q40590J10084J751394M251746O006653L092464
36966F3032146n019299j1773216j0894766n361585k985240m726984m544708m84472
36958A7241876J828526j449065o149182o265578j657084L260067N137165L856321
36950A5803046J617015J148829K917639M169454K771087O11785L98622J385373
36942C0822850K054203L956656P879698J0037826Q918026J1431035K2240076L0453156
36934A27793526K0510464l566275j9592418j6352336o207907k175026J244475
$$ plain form
36991 8973471 16426041 21441602 19064338 14903812 16085292 21681646 26198845 28028146
36983 28028146 29861969 33594459 38897478 45027364 50770889 53982105 53743572 51855368
36975 51855368 50461528 49642238 48660395 47819805 47929889 49681283 53933029 59939682 63032146
36966 63032146 58012847 46239631 35344865 29983280 26998040 22271056 17726348 17241876
36958 17241876 19070402 17621337 11472155 5206577 3549493 6809560 11946725 15803046
36950 15803046 17420061 18568890 21486529 25655983 28427070 29038855 29437477 30822850
36942 30822850 32877053 36833709 44713407 54751233 63669259 75100294 97340370 127793526
36934 127793526 148303990 144737715 125145297 108792961 102585054 100410028 101654503
36927A01654503J1921187J8896259N971678k0094333l4136084k5167765q283777
36920E0761668j412464m538200p528942o695739n298325m957272m559211m043645
36912A1727870l733797k493523j68949J000166K12958M1672J830109K714936K89499
36903A1420941l063637l716438j763653N84206K635435M078429L208974l9155
36895A3345102j948774R7416K877120J795607j847762k967789q83671O1210j772524
36886H755935k422101J025608N251215N037565J60248m662867n212879j359101
36878F573623L497813N185491K253074k068157k663051J610918O243796O432806
36870B7066313K675169m77996m8374K620736L918550J364104m259554q914512
$$ plain form
36927 101654503 113575690 132471949 138443627 118349294 84213210 59045445 50761668
36920 50761668 49349204 44811004 37282062 30586323 25287998 20330726 15771515 11727870
36912 11727870 7994073 5500550 5331601 6331767 6544725 6586397 8416506 11131442 11420941
36903 11420941 8357304 4640866 2877213 3461419 6096854 10175283 13384257 13345102
36895 13345102 11396328 11493744 14370864 16166471 14318709 11350920 10467249 10528459 8755935
36886 8755935 6333834 7359442 12610657 17648222 17808470 13145603 7932724 6573623
36878 6573623 10071436 15256927 17510001 15441844 12778793 14389711 20633507 27066313
36870 27066313 29741482 29263486 29215112 31835848 35754398 37118502 32858948 23944436
36862B3944436q470554l327397J203513Q80271k259317k970789j17418K245856
36854A1128601J143500j363560j776724J12510K069517K808368K205804j31088
36846A6196928l683451n520159l250895P75749J710698p87791j615797J831877
36838E657159M726833J748501l863092l930925K503012O999901L728619k217563
36830A5352445k768840J454258L419795R10282j510976j174772q31000k140334
36822A2710858k275163J10463J412810m63796j430592J948413N396789K964447
36814B0374229k955021m666025q07673K242218P97204j258848J01706K768063
36806A6595853K864667J043385P65075K870822M827445L970728j03575m963781
$$ plain form
36862 23944436 15473882 12146485 13349998 14230269 11970952 9000163 8882745 11128601
36854 11128601 12272101 10908541 9131817 9244327 11313844 14122212 16328016 16196928
36846 16196928 12513477 6993318 3742423 4518172 6228870 5441079 3825282 5657159
36838 5657159 10383992 12132493 8269401 4338476 6841488 13841389 17570008 15352445
36830 15352445 12583605 14037863 17457658 18367940 16856964 15682192 14851192 12710858
36822 12710858 10435695 10546158 11958968 11495172 10064580 12012993 17409782 20374229
36814 20374229 17419208 12753183 11945510 14187728 14984932 13726084 13827790 16595853
36806 16595853 19460520 20503905 21268980 24139802 28967247 32937975 32834400 27870619
36798B7870619o579910l198740J846874L841217K958147L120896M759611L942937
36790C8561651p6735k353615j56511K265149J020211m88151K534593P665033R095926
36781E8067551P161039O928252Q865593Q382789M739120L209266O786199J1933556
36773A16073365J4863859J6542744J8658163J9506649J7180809J2786714P368897
36766B22981200k85812r342589j4800571j4328790j3352809j7525044k3109256
36759A30236329k1859518j3981478q339930r156128j0540466p110527k565898
36752E6682384k619598n383190n383702l001436k522122l282967p81864L978989
36744C7686494M445163p86691m855964l195526k44421j235459l420947j432162
$$ plain form
36798 27870619 21290709 18091969 19938843 23780060 26738207 29859103 34618714 38561651
36790 38561651 38484916 36131301 35974790 38239939 39260150 38771999 41306592 48971625 58067551
36781 58067551 65228590 72156842 81022435 89405224 94144344 97353610 104139809 116073365
36773 116073365 130937224 147479968 166138131 185644780 202825589 215612303 222981200
36766 222981200 222695388 213352799 198552228 184223438 170870629 153345585 130236329
36759 130236329 108376811 94395333 86055403 76899275 66358809 59248282 56682384
36752 56682384 54062786 48679596 43295894 40294458 37772336 34489369 33707505 37686494
36744 37686494 42131657 41344966 36489002 33293476 33049055 31813596 28392649 26960487
36736B6960487L158335M472906J874485K2682N04918K3873k651156l773077m28049
36727C0165404M900355P507627N610359J281343j699858p14087L062123N410418
36719E5523684M386968L298628N647833R445141J0751916J0695502J3334796J7863644
36711A30948112J9611806J8873426K1607902K9491239L5597003L2738893K0965209
36704C09833590M556399j2719657k6420175l1454970k7954210k3006837k2340276
36697A70493864k3649580k1688273j6191141j0784351p416351n900186o032326
36690G8831656o411796m043544J312727N345714N039435K839125J495974r74278
36682H3435013o482498j1132015j0188286n679330k841577j568086J735883N457290
$$ plain form
36736 26960487 30118822 34591728 36466213 36488895 36993813 37017686 34366530 30593453 30165404
36727 30165404 35065759 42573386 48183745 49465088 47765230 47051143 50113266 55523684
36719 55523684 59910652 63209280 68857113 78302254 89054170 99749672 113084468 130948112
36711 130948112 150559918 169433344 191041246 220532485 256129488 288868381 309833590
36704 309833590 314389989 301670332 275250157 243795187 215840977 192834140 170493864
36697 170493864 146844284 125156011 108964870 98180519 90764168 84863982 78831656
36690 78831656 72419860 68376316 69689043 75034757 80074192 82913317 84409291 83435013
36682 83435013 76952515 65820500 55632214 49952884 47111307 45543221 47279104 52736394
36674E2736394L632194m081813j0197539r077169l540469K65520K21081j800330
36666B8157869l745841m532482l554143j255523P40383J159989J59881j227615
36658A5902518j991943j759168j141860q83363m84823Q27406J683724k31639l841180
36649H079672m865339j910450J161896J073528l99458m99150j02382p76987r80741
36640G80589O82368J809463K77549j157106Q21678L904058L367309o44586l820688
36631F020634l775015j250588K407215M943193L409790j015664k206035K057461
36623A0590991N047519J135512m108913k003229N182029P734865L421123r86418
36615B6013479j549889n65992J150573N358533R697049R597171P128921Q463355
$$ plain form
36674 52736394 56368588 52286775 42089236 33012067 29471598 29737118 29958199 28157869
36666 28157869 24412028 19879546 16325403 15069880 15810263 16970252 17130133 15902518
36658 15902518 13910575 12151407 11009547 10126184 9641361 10468767 12152491 11920852 8079672
36649 8079672 3214333 1303883 2465779 3539307 3139849 2640699 2538317 1761330 780589
36640 780589 1462957 3272420 3549969 2392863 3214541 7118599 10485908 9841322 6020634
36631 6020634 2245619 995031 3402246 8345439 11755229 10739565 8533530 10590991
36623 10590991 15638510 16774022 12665109 10661880 15843909 23578774 26999897 26013479
36615 26013479 24463590 23897598 25048171 30406704 40103753 49700924 56829845 65293200
36607F5293200J3034323J5921885J9923949L1223070M1724742L2294284J59906
36600B19575359l1687171m1773116l4292023k5843139k0623510j2851982m455694
36593D8048724l445077q239523q822405l235977n9590l288047o220923l293112
36585A1444070J537004K254685n12006k466610k282805j536682j321949j705348
36577E410359k408111k498343j118867R64301K165574K144546J395044j40859
36569E913644j913703j773623J026642L279759J577559k447024m067448j949215
36561c53409P54605J487015J100386J246707J724088J277565m60040k264362k152134
36552B360421K73995K154415J75958m251480n633373j831731K472412K332284
$$ plain form
36607 65293200 78327523 94249408 114173357 145396427 187121169 219415453 219575359
36600 219575359 187888188 146115072 111823049 85979910 65356400 52504418 48048724
36593 48048724 44603647 36364124 27541719 24305742 24246152 20958105 14737182 11444070
36585 11444070 12981074 15235759 14723753 12257143 9974338 8437656 7115707 5410359
36577 5410359 3002248 503905 -614962 349339 2514913 4659459 6054503 5913644
36569 5913644 3999941 2226318 3252960 6532719 8110278 5663254 1595806 -353409
36561 -353409 401196 1888211 2988597 4235304 5959392 7236957 6776917 4512555 2360421
36552 2360421 2634416 4788831 4964789 713309 -4920064 -6751795 -4279383 -1947099
36544a947099o96214j781971p4814J321193Q03457l08358p79751n17787N44221
36535c437123J905025J977890M61236m27050O20307J559602N43367p79426n45792
36526A878036k63713j456810j880444M57461K530970Q50610j818344l84007L737737
36517C651496M368653M29700k662905j779473J77456M55113M06916J416003K073970
36508H536929J544537J257162J352938k18208l164535l812130q45509K087790
36500F738974K043591J065582J872474K945099J433943j873230m043079m317746
36492E865608l670700j930699J244815L802806L029705o14732l954577m941151
36484a168925l910842j724087R79083L012088L345814K523096J623603K97995
$$ plain form
36544 -1947099 -2643313 -4425284 -4500098 -3178905 -2375448 -2683806 -3463557 -3981344 -3437123
36535 -3437123 -1532098 445792 907028 479978 1100285 2659887 3203254 2423828 1878036
36526 1878036 1614323 157513 -1722931 -1265470 1265500 2116110 297766 -86241 3651496
36517 3651496 8020149 8449849 5786944 4007471 4184927 4640040 5046956 6462959 8536929
36508 8536929 10081466 11338628 12691566 12473358 9308823 5496693 4651184 6738974
36500 6738974 8782565 9848147 11720621 14665720 16099663 14226433 10183354 5865608
36492 5865608 2194908 264209 1509024 5311830 8341535 7726803 3772226 -1168925
36484 -1168925 -5079767 -6803854 -5824771 -2812683 533131 3056227 4679830 4977825
36476D977825k036485l562155j625706K612679M338950J533833j697919r67377
36468C573645J742389J331563j908379k365967J703914M685900K009402k976859
36460G795608m774348l994347m123554l641848J053747O689364N904849m94204
36452D415267l127824J580956N607284K489285k300084j055494L346929L173594
36444A4129913p74234j324201K391934M393227L041381L122869O052421P108651
36436C8141961M602686L525021O693379R471679P539438L944826L697387O040581
36428H3656958O898416N418217L482318J374637j863854n626661q670692j1116449
36420G3552890j2807114j1901334q049167m703891m920586o726324o141642l220113
$$ plain form
36476 4977825 2941340 -620815 -2246521 366158 4705108 6238941 4541022 3573645
36468 3573645 5316034 6647597 4739218 2373251 4077165 8763065 10772467 7795608
36460 7795608 3021260 -973087 -5096641 -8738489 -7684742 -995378 4909471 4415267
36452 4415267 1287443 2868399 8475683 10964968 8664884 7609390 10956319 14129913
36444 14129913 13355679 12031478 14423412 18816639 21858020 24980889 31033310 38141961
36436 38141961 42744647 46269668 52963047 62434726 69974164 73918990 77616377 83656958
36428 83656958 90555374 95973591 99455909 100830546 98966692 93340031 84669339 73552890
36420 73552890 60745776 48844442 40795275 36091384 31170798 24444474 18302832 15082719
36412A5082719j315443j367323r54256R59656K056006M59014k233732l164263
36404I522378j842804k87361l12312j554306k109777r61834N02283J79311j549208
36395A586370j832759O77672L567302L833439J816444k8227r73099j938112k278179
36386D430851m6437L910483N376809K184824k189665k995833o13133M12281j902434
36377H567746m525479m246213j862577O1753J083014K151753K783042J779060
36369E792099j03440r55007p76897j092676j737391r55633J063303J791721K99710
36360C325789j281743j296553p12845m03702P12827K848137L464157Q05628k852457
36351D609238m124977k903863j307529m4788J327330J972751O78364j585032k628978
$$ plain form
36412 15082719 13767276 12399953 11445697 12405353 14461359 14920373 12686641 9522378
36404 9522378 7679574 7392213 7079901 5525595 3415818 2453984 2956267 3135578 1586370
36395 1586370 -246389 431283 3998585 7832024 9648468 9620241 8647142 6709030 4430851
36386 4430851 4384414 8294897 13671706 15856530 13666865 10671032 10057899 10470180 8567746
36377 8567746 4042267 -203946 -2066523 -2004770 -921756 1229997 4013039 5792099
36369 5792099 5688659 4733652 3956755 2864079 1126688 171055 1234358 3026079 3325789
36360 3325789 2044046 747493 34648 -369054 343773 3191910 6656067 7461695 4609238
36351 4609238 484261 -2419602 -3727131 -3771919 -2444589 -471838 206526 -1378506 -4007484
36342d007484j949483n02036J405527L645306M747509L441025J007868k37087
36334G551145p4857J23341n4962k70809q73351j642550o58690K546677M265838
36325A0911782Q12501n448300q228028n223528j69554K925700L694704L119093
36317B394370J236849j437085l069080k590430q80933P03564J391921P78865n35891
36308b007850o55154J071386K177082M63375j979700j632547O79984J143673n52505
36299a292256j006874M43396L67367k399403m140440k203696Q98084J979117J848652
36290e506053K480147K874601J155126j576037k655609j586362R8335J297596
36282c418256J715400J190433K98170K32924Q94511P63690l63672o30634P80894
$$ plain form
36342 -4007484 -5956967 -6459003 -5053476 -1408170 3339339 6780364 7788232 7551145
36334 7551145 7476288 7599629 7544667 7273858 6400507 4757957 4099267 6645944 10911782
36325 10911782 11724283 6275983 -1952045 -7175573 -7345127 -4419427 -724723 2394370
36317 2394370 3631219 2194134 -874946 -3465376 -4346309 -3642745 -2250824 -1471959 -2007850
36308 -2007850 -2663004 -1591618 585464 1048839 -930861 -2563408 -1883424 -739751 -1292256
36299 -1292256 -2299130 -1855734 -1488367 -3887770 -8028210 -10231906 -9333822 -7354705 -5506053
36290 -5506053 -3025906 -151305 1003821 -572216 -3227825 -4814187 -4715852 -3418256
36282 -3418256 -1702856 -512423 -214253 18671 913182 1676872 1313200 682566 1463460
36273A463460K011778J188184j342568m222203o088077m954736m0830M908292
36265g076700M356010j129493m191535o78640M221957L763125o76259k841281
36257d252816j238173N57930J272573L092716N826797O092045L221866O07267
36249A5180205j79696j469345l853966l761237R0042K510231j148300p007320
36241C60614p266805j363317L269599J940861j397690j205290J448200J712084
36233b501744r96427k567654q74667J587113K142891J311754P17555P18097J306414
36224H43332K592806L262215J508159j281292j284600J512452J948245k393576
36216F707741o054697l121578L513014O028530K798104n91966o63166Q4799p07424
$$ plain form
36273 1463460 3475238 4663422 3320854 -901349 -6989426 -11944162 -11984992 -7076700
36265 -7076700 -2720690 -3850183 -8041718 -8720358 -4498401 -735276 -1411535 -4252816
36257 -4252816 -5490989 -4933059 -3660486 -567770 5259027 11351072 14572938 15180205
36249 15180205 15000509 13531164 9677198 5915961 6006003 8516234 7367934 360614
36241 360614 -6906191 -8269508 -4999909 -3059048 -4456738 -5662028 -4213828 -2501744
36233 -2501744 -3498171 -6065825 -6940492 -5353379 -3210488 -1898734 -1181179 -463082 843332
36224 843332 3436138 6698353 8206512 6925220 5640620 7153072 9101317 6707741
36216 6707741 653044 -2468534 1044480 7073010 9871114 9279148 8615982 8700781 7993357
36207G993357j356572l20943O52524j00904j513899k368929k903236k445214M32397
36198a931419L810165L112532j743489m625119j844007K047658J400140j697716
36190a471255j309083K374272L432761k1401k800071r03884K290249J381601k617463
36181C55726l413024J453494O431797M908939j812748n882154l127427J965030
36173H79633L330741J555304J119245K283350J348995j915310l206509r14502
36165D480947J189901L48389j236626j292566j363716k571333k097206J908332
36157f33878N592468M212634r03482m523479m448452k202150R26282L960394M284626
36148F264963O92612k808309j499288K390418K236561k532870m866971r74524
$$ plain form
36207 7993357 6636785 6315842 6968366 6867462 5353563 2984634 81398 -2363816 -1931419
36198 -1931419 1878746 4991278 3247789 -1377330 -3221337 -1173679 226461 -1471255
36190 -1471255 -2780338 -406066 3026695 3005294 205223 -698661 1591588 2973189 355726
36181 355726 -3057298 -1603804 4827993 9736932 7924184 2042030 -1085397 879633
36173 879633 4210374 5765678 6884923 9168273 10517268 8601958 5395449 4480947
36165 4480947 5670848 6019237 4782611 3490045 2126329 -445004 -2542210 -633878
36157 -633878 4958590 9171224 8267742 3744263 -704189 -2906339 -1980057 1980337 6264963
36148 6264963 6957575 4149266 2649978 5040396 7276957 4744087 -122884 -1097408
36140a097408L366452J479740m068760n649706j928281J479281J768176K338123
36132b312383M978392N507040J250206k755853j096400K457948L48326n801996
36124B575280o530709M94766O090369L502114j844981k121377Q55253Q08698j516852
36115B312561p70401K697645L688818J450521Q2210P34845Q30730L05799J572733
36106A2905461L791486L761995J906662J305445K028013K242865K647664L827218
36098C4416809L038109L50249K152020R985514J3950910R121686Q476658K2230009
36090A03721964L5331428L1048234K8056684N7120524R8854048Q8898915N535847
36083D48567644q6072148j09626774o9827525l1465936k7516666l3192480k3774514
$$ plain form
36140 -1097408 2269044 3748784 -319976 -5969682 -7897963 -6418682 -4650506 -2312383
36132 -2312383 2666009 8173049 9423255 6667402 5571002 8028950 8377276 2575280
36124 2575280 -3955429 -3460663 2629706 6131820 4286839 2165462 3020715 3829413 2312561
36115 2312561 1542160 4239805 7928623 9379144 9461354 10196199 11026929 11332728 12905461
36106 12905461 16696947 20458942 22365604 23671049 25699062 27941927 30589591 34416809
36098 34416809 37454918 37805167 39957187 49942701 63893611 73015297 81491955 103721964
36090 103721964 139053392 170101626 198158310 255278834 354132882 443031797 448567644
36083 448567644 362495496 252868722 183041197 151575261 124058595 90866115 67091601
36076F7091601j0614601j0006818j3923711r441361j740845o74291k839312j633735
36068A6216927l91144l018369m354668p44273J581021j555695l463682Q43650
36060E113767M532290J137816l751421l009366k86681j542515l394699n96746
36052a797555K907680J191947k350519j472180J345626K41264k555813j126829
36044c616379K731579K843207p2168l73311J863107J623157j318484k131600M94657
36035B043765K940394L057790J694655r30831m560235o203498l690892j42334
36027e791186L33858q14101L75587L235690L898704J698425j033245l250256m475973
36018e822497k800445J388654L198649K33779k209406P58813M710605K849047
$$ plain form
36076 67091601 56477000 46470182 32546471 23105110 21364265 20689974 17850662 16216927
36068 16216927 15825783 12807414 8452746 7708473 9289494 7733799 4270117 5113767
36060 5113767 9646057 10783873 7032452 4023086 3736405 2193890 -1200809 -1797555
36052 -1797555 1110125 2302072 -48447 -1520627 -175001 66263 -2489550 -3616379
36044 -3616379 -884800 1958407 1886239 1512928 3376035 4999192 3680708 1549108 2043765
36035 2043765 4984159 8041949 9736604 8805773 4245538 -1957960 -5648852 -5791186
36027 -5791186 -5457328 -6271429 -5895842 -2660152 1238552 2936977 1903732 -1346524 -5822497
36018 -5822497 -8622942 -7234288 -4035639 -3801860 -6011266 -5252453 -541848 2307199
36010B307199k037546j853437L004372M268653j97965l108599j08880L601247
36002E875044K240606k174422m257051k720445R5485K213217K691635J280165
35994E244234o54920j189374n77348m96840p56011J05429J282320M89081j705180
35985A741391k102714J12603J978004J057507j477347k551474k89538M100705
35977B569137O392138L222498k690420m559549r42759J495787j713280n315535
35969a541983k913043K251215K874465l59031j417449l35384j697312l716355
35961f854877k81530O196689N981850j936317o710170k335135L692792L716170
35953A469472J274355K005122K671750j744254p145331o127846l1519L636279
$$ plain form
36010 2307199 269653 -1583784 1420588 5689241 5491276 2382677 2273797 5875044
36002 5875044 8115650 5941228 1684177 -1036268 -940783 1272434 3964069 5244234
35994 5244234 4589314 3399940 2822592 2325752 1569741 1675170 2957490 3446571 1741391
35985 1741391 -361323 -248720 1729284 2786791 1309444 -1242030 -1531568 2569137
35977 2569137 8961275 12183773 9493353 4933804 3991045 5486832 3773552 -1541983
35969 -1541983 -4455026 -2203811 670654 311623 -1105826 -1441210 -3138522 -6854877
35961 -6854877 -7136407 -939718 5042132 3105815 -3604355 -5939490 -2246698 1469472
35953 1469472 2743827 4748949 7420699 5676445 -1468886 -7596732 -7628251 -3991972
35945c991972K516201K25692j331017k886981l193387o77655J907196J170300
35937f261623k60916K367627O855483O354057L53727m208323l565081j527912
35929A07039j516479j306077R65402J762769k035657o593004n789603k09002L643383
35920a0971229K488692J11647J126835M413529N081037J327876l262217m321606
35912d005436j567641J874662L464817K902522Q33665j775283l127868j837788
35904c238350Q37571K045082J084563l5904k11309p04583k046025k418181q15720
35895e502856R16241J256930J603362L230006M137672J994373j633940l171495
35887B830293j893737n3195O93427L07766r49825k192416j571864J039601K607632
$$ plain form
35945 -3991972 -1475771 -1250079 -2581096 -5468077 -8661464 -9339119 -7431923 -6261623
35937 -6261623 -6522539 -4154912 2700571 9054628 9408355 5200032 1634951 107039
35929 107039 -1409440 -2715517 -1750115 12654 -2023003 -8616007 -14405610 -14614612 -10971229
35920 -10971229 -8482537 -8370890 -7244055 -2830526 2250511 3578387 316170 -4005436
35912 -4005436 -5573077 -3698415 -233598 2668924 3502589 1727306 -1400562 -3238350
35904 -3238350 -2400779 -355697 728866 692962 481653 -222930 -2268955 -4687136 -5502856
35895 -5502856 -4586615 -3329685 -1726323 1503683 5641355 7635728 6001788 2830293
35887 2830293 936556 883361 1576788 1884554 934729 -1257687 -2829551 -1789950 817682
35878H17682J131118o16508Q20847L672491L665771J134678j7679L26376j533713
35869I401063n311791n652032j020261K736914J262774j671535j055473J014176
35861b96165j17010k790672j927568J473635J526281k182752l224006J094585
35853f443672N036399L579738r2326q27334J23714j159883l190570j720657J775945
35844b918646J812372j347453j363490L292864N698061J242794m603372m498879
35836b685749L8327K413534J640358J987690L965129L327456q23278l915964l326375
35827B621128j906717k038171j564637J540592M906605N209925K512057j203851
35819A0076931m555080n970763m119415r81189l92470j789282m83515L617199
$$ plain form
35878 817682 1948800 1332292 2153139 5825630 9491401 10626079 10608400 10934776 9401063
35869 9401063 4089272 -1562760 -2583021 153893 1416667 -254868 -1310341 -296165
35861 -296165 -413175 -3203847 -5131415 -3657780 -2131499 -4314251 -7538257 -6443672
35853 -6443672 -1407273 2172465 2080139 1252805 1376519 216636 -2973934 -4694591 -2918646
35844 -2918646 -1106274 -2453727 -3817217 -524353 5173708 6416502 1813130 -2685749
35836 -2685749 -2647422 -233888 1406470 3394160 7359289 10686745 9863467 5947503 2621128
35827 2621128 714411 -1323760 -2888397 -1347805 3558800 8768725 11280782 10076931
35819 10076931 5521851 -448912 -4568327 -5549516 -5941986 -7731268 -8214783 -4597584
35811d597584M022629j609372n611072j416966N479111N583564k86767l734916
35803b171373k448505j276846j480778O38396M342887M013501l59847k049825
35795g92390O30363J184053k928008m863034l06527M459067L144787j21993J040506
35786A446824L746118J693310k827478k743050J299420K131515j703726m155785
35778a112852k057804R06540J465829Q66542M69896o15323k125017k017903k81960
35769d502052J015023J548058K176845J433330k083291m866927k467077K382755
35761e363336K840535r63900k097232J076733K053951j980277m753726j807496
35753a0994748J864554J020540p96940J362386M252773K604084n73589P85527
$$ plain form
35811 -4597584 -574955 -2184327 -7795399 -9212365 -3733254 1850310 1563543 -2171373
35803 -2171373 -4619878 -5896724 -7377502 -6739106 -2396219 1617282 1257435 -792390
35795 -792390 -162027 1022026 -1905982 -6769016 -7075543 -2616476 528311 406318 1446824
35786 1446824 5192942 6886252 4058774 1315724 2615144 4746659 3042933 -1112852
35778 -1112852 -3170656 -2264116 -798287 68255 538151 -77172 -2202189 -4220092 -4502052
35769 -4502052 -3487029 -1938971 237874 1671204 -412087 -5279014 -7746091 -5363336
35761 -5363336 -2522801 -3486701 -5583933 -4507200 -2453249 -4433526 -9187252 -10994748
35753 -10994748 -9130194 -8109654 -8906594 -7544208 -3291435 -687351 -1260940 -475413
35745d75413M176326K260031l714313m767564J037744M778414O20501n060229
35737a144503l624728K973018N527815N81884n853424p009611l183796N08044
35729a1225301J432983J714544L311811L852174L00713m674895m838793K91921
35721i834843L700241J284407j616411Q67314M942253L350724j853535k072054
35713a231904L361189N524018M33106m414922k225523K684233K695922j326184
35705E499935l152673j726212j184608k639992k810024k75064K468839L300511
35697e19288K536982Q76139r84804j217519R27358K555793P83545j958511j027701
35688A971994K557442L041614o62744k771394j38525K213894o40684m902088l658782
$$ plain form
35745 -475413 3700913 5960944 2246631 -2520933 -1483189 3295225 3915726 -1144503
35737 -1144503 -4769231 -1796213 3731602 4313486 -1539938 -8549549 -11733345 -11225301
35729 -11225301 -9792318 -8077774 -4765963 -913789 -613076 -5287971 -10126764 -9834843
35721 -9834843 -6134602 -4850195 -6466606 -5599292 -657039 2693685 840150 -1231904
35713 -1231904 2129285 7653303 8086409 3671487 1445964 4130197 6826119 5499935
35705 5499935 2347262 621050 -563558 -3203550 -6013574 -6288638 -3819799 -519288
35697 -519288 2017694 2893833 1909029 691510 1618868 4174661 4958206 2999695 1971994
35688 1971994 4529436 7571050 6908306 4136912 3998387 6212281 5571597 669509 -2989273
35679b989273K146610N166204K805511L1422M14857R87565j403822m162278l350670
35670c53874j42403J492715R00523K97037K59552k4360L43344K235412K986214
35661G994160k60661m512272m078737K19423J577853j810881l514778L40858M294711
35652B49676K745340n29326Q34093M364506K686983l831870p383946n045977k013120
35643g923641j489139M4737M423162O375325J633496m977422n402911O88884O003666
35634f23843N186057K7251m337786n018522k811527k09932J190073J681040K041997
35625b875192K000821J204476O47078J074038R78489j063031l039557k033663
35617c106541O17279J006115p19328m92597K261108K960110m21579l379995j753237
$$ plain form
35679 -2989273 -842663 4323541 7129052 7160474 7575331 8562896 7159074 2996796 -353874
35670 -353874 -496277 996438 1896961 2193998 2453550 2429190 2772534 5007946 7994160
35661 7994160 7733499 3221227 -857510 -638087 939766 -871115 -4385893 -4045035 249676
35652 249676 2995016 2465690 3299783 7664289 10351272 6519402 -864544 -5910521 -7923641
35643 -7923641 -9412780 -9368043 -4944881 1430444 3063940 -1913482 -7316393 -6627509 -623843
35634 -623843 4562214 4589465 251679 -4766843 -7578370 -7788302 -6598229 -4917189 -2875192
35625 -2875192 -874371 330105 977183 2051221 3029710 1966679 -1072878 -3106541
35617 -3106541 -2489262 -1483147 -2202475 -2695072 -433964 2526146 2104567 -1275428 -3028665
35608c028665J994560L018279R50987j145904j666273q57243J031463K879742
35600C176946K430160l77766k316923j458984P0821J43856r1150M83255K80356
35591B340571j329129j738220J19647R78454r24742j766228J441027M782528L297400
35582G201308j019303k930125k113357j533259j141746K71526L38085k656398
35574c583269m078943N25559O119363M441932k381992m431450M65922M169130
35566A246252K065831r18191n64453K37574r84847j259045R74933J929111j31185
35557B595980j057019J091177J717638j512457l294655j17409K499337n84668
35549A337924m506297k708138J171744m19621n157662m158808K945594P071556
$$ plain form
35608 -3028665 -1034105 1984174 2935161 1789257 122984 -734259 297204 3176946
35600 3176946 5607106 5229340 2912417 1453433 1524254 1668110 1576960 2060215 2340571
35591 2340571 1011442 -726778 -607131 371323 -553419 -2319647 -878620 3903908 7201308
35582 7201308 6182005 3251880 1138523 -394736 -1536482 -1264956 -926871 -3583269
35574 -3583269 -7662212 -7136653 -1017290 3424642 1042650 -3388800 -2922878 1246252
35566 1246252 3312083 2393892 1829439 2067013 1082166 -176879 798054 2727165 2595980
35557 2595980 1538961 2630138 4347776 2835319 -459336 -576745 1922592 1337924
35549 1337924 -3168373 -5876511 -4704767 -5124388 -10282050 -14440858 -11495264 -4423708
35541d423708M096322K63845J046350L232019J783202k120711m219996l695565
35533d038242k530826j504868k10815R45609J241204Q30158K04469j56864O85405
35524d534770K888420M087313J673014k839037m813682k674648O3854J45552j210215
35515g214199j216879K33192J496316J983012J616135l80199l348285l711983
35507a0542890Q09929O410053O594580P69080m408515l778140j97676N56322j528836
35498e316093j627732J469765L156086M22890l307690l541279j053281Q10696
35490h986638J983076M112412N419787K786596j820264k909426J04581J826811
35482B516935m05074k572146j218597R95770P13486j09439J638313L942081K834573
$$ plain form
35541 -4423708 -327386 -63541 982809 4214828 5998030 3877319 -342677 -4038242
35533 -4038242 -6569068 -8073936 -8284751 -7339142 -6097938 -5267780 -5063311 -5220175 -4534770
35524 -4534770 -1646350 2440963 4113977 1274940 -3538742 -6213390 -6149536 -6003984 -7214199
35515 -7214199 -8431078 -8197886 -6701570 -4718558 -3102423 -3482622 -6830907 -10542890
35507 -10542890 -9732961 -3322908 3271672 4040752 -367763 -4145903 -4343579 -3787257 -5316093
35498 -5316093 -6943825 -5474060 -2317974 -1895084 -5202774 -8744053 -9797334 -8986638
35490 -8986638 -7003562 -2891150 2528637 5315233 3494969 585543 690124 2516935
35482 2516935 2111861 -460285 -1678882 -683112 30374 -79065 1559248 5501329 8335902
35473H335902q47000l082158l050880k815353k285846R7953K629475J872129j115902
35464b61680j482360J803618M149757K531440k96391r04435k64011q24828j848194
35455B602916j101734P86613J007067j125142l101872k457311N02385L291638
35447D04560L692472J647570q42898j818089j306231p57032q75463j010352o34298
35438a499761k60567m60411p33384M2840K069290L694431K570006j429387m859606
35429h66549l972759M82442L742731K880725j89654k429663l341174l154986q26515
35420g675402L051665M453884J211526k345818r91762K892201K297231l325579
35412d32054o376381k107056M401277N445491P47460l483946l060973K31498K278378
$$ plain form
35473 8335902 7488902 4406744 1355864 -1459489 -3745335 -3647382 -1017907 854222 -261680
35464 -261680 -1744040 59578 4209335 6740775 6444384 5539949 5275938 4451110 2602916
35455 2602916 1501182 2287795 3294862 2169720 -932152 -3389463 -2887078 404560
35447 404560 4097032 5744602 4901704 3083615 1777384 1020352 144889 -865463 -1499761
35438 -1499761 -1760328 -2220739 -2954123 -2911283 -841993 2852438 5422444 3993057 -866549
35429 -866549 -4839308 -4356866 -614135 2266590 2076936 -352727 -3693901 -6848887 -7675402
35420 -7675402 -4623737 -169853 1041673 -1304145 -2295907 596294 2893525 -432054
35412 -432054 -6808435 -8915491 -4514214 931277 1678737 -1805209 -4866182 -4634684 -2356306
35403b356306J552770J65163Q94201L305366L633035k55535n100314o052435l215608
35394g429663p91565j91449J373586M652552N716513K083395k520046k864320
35386B9003R20653M217824L770200J68820l793700n108126k536521J552154L042958
35377B263265J174682n10626K27437Q39258j491245m804605n122031k093790J370937
35368h146718L348771L580816J619087k135420m668463l173838Q67821L454350
35360e253594L393217K978076L755511M481441L357298J75845l567611n225019
35352D095164k884436J465000K634399j188097m786196k668257K464319L075714
35344B207610k131413o198086l844856J873086M925579L858086J227960r06155
$$ plain form
35403 -2356306 -803536 -638373 255828 3561194 7194229 6938694 1838380 -4214055 -7429663
35394 -7429663 -8221228 -8412677 -7039091 -2386539 3329974 5413369 2893323 29003
35386 29003 949656 5167480 8937680 9106500 5312800 204674 -2331847 -779693 2263265
35377 2263265 3437947 2927321 3154758 3994016 2502771 -2301834 -7423865 -9517655 -8146718
35368 -8146718 -4797947 -1217131 401956 -1733464 -6401927 -9575765 -8707944 -5253594
35360 -5253594 -1860377 1117699 4873210 9354651 12711949 12887794 9320183 4095164
35352 4095164 1210728 2675728 5310127 4122030 -664166 -3332423 -868104 2207610
35344 2207610 76197 -6121889 -9966745 -8093659 -3168080 690006 1917966 1011811
35336A011811j742424n74109J940946K998194Q54390k346864l144552j066817
35328b069425J486740K445899J316320j442736m158637m146722n14909L773305
35320c310165M728006J898211j667886l431308l184183j329933J830350M535898
35312F8990M070047M78156k286895j207767J177775p6282m846182p003015k405182
35303a2030355M955232P583799L709691j457635l179269k062052o68073P52813
35295b395849K520886K564945q86455m979528m672377K81038M254110K897580
35287d15650j255508k322325J199639M559040K924064k167992m388258q81216
35279b748206L456960K528632j893727k487428K018306L932497j412152p059515
$$ plain form
35336 1011811 -730613 -1304722 636224 3634418 4488808 2141944 -1002608 -2069425
35328 -2069425 -582685 1863214 3179534 1736798 -2421839 -6568561 -7083470 -3310165
35320 -3310165 1417841 3316052 1648166 -1783142 -4967325 -6297258 -4466908 68990
35312 68990 4139037 4617193 2330298 1122531 2300306 2224024 -2622158 -9625173 -12030355
35303 -12030355 -7075123 508676 4218367 2760732 -418537 -2480589 -3148662 -2395849
35295 -2395849 125037 2689982 1803527 -3176001 -7848378 -7567340 -3313230 -415650
35287 -415650 -1671158 -3993483 -2793844 1765196 4689260 2521268 -1866990 -2748206
35279 -2748206 708754 3237386 1343659 -1143769 874537 4807034 3394882 -3664633
35271c664633m271312L621462N866269O72535k906548j52097K434038p97159m833696
35262d031141k721530K785594M048434N54870j792003q23586O2077q16724j236036
35253c970045k39289M38272N65896J755144L127985J828288j360913k078304O19781
35244F86815K332519L07297k389153k328443j065723j560565k592435q72258L026469
35235d455477M748918J995937k380693l679008n82359L377125L720728M69190
35227C214361j648882K33643K437375j3239m997429n343429N15367N726843M868409
35218D993019R86216o64939o74411k228898l990916k535022N49972O71230j574104
35209d467853q62618L736506O516061L865665n00289j999433j774118k694974
$$ plain form
35271 -3664633 -7935945 -4314483 1551786 2224321 -682227 -834324 1599714 802555 -4031141
35262 -4031141 -6752671 -3967077 81357 636227 -1155776 -1979362 -1917285 -2734009 -3970045
35253 -3970045 -4209334 -3771062 -3205166 -1450022 1677963 3506251 2145338 67034 686815
35244 686815 3019334 3326631 937478 -1390965 -2456688 -4017253 -6609688 -7481946 -4455477
35235 -4455477 293441 2289378 -91315 -3770323 -4352682 -975557 2745171 3214361
35227 3214361 1565479 1799122 4236497 4223258 -774171 -6117600 -5602233 124610 4993019
35218 4993019 5979235 5314296 4639885 2410987 -1579929 -4114951 -3564979 -2893749 -4467853
35209 -4467853 -5330471 -1593965 4922096 8787761 8287472 6288039 4513921 1818947
35201A818947k962468O78251N544803N160789r23992n234540k588188K534190
35193D027792K796464j265490l003148q03003m75148m667696o889142j476040
35185a1755411N675375M413675l894241p294218r04737N961205M453713q99059
35177d243698j065240K736782K696960j398586k356182J187836K320882j850456
35169a971702n079198k511498J991504L480733L471014M486896L666079j509309
35161F024519o207853m388339J439886L869059J651732j87347K05360l34548k406043
35152c33574k202679J090231K711095j23978l546595l112012m9091J930967K209403
35143a426233K008045Q41691j720573l155842j108973K034074J868391j373969
$$ plain form
35201 1818947 -1143521 -465270 5079533 10240322 9316330 4081790 1493602 4027792
35193 4027792 6824256 5558766 2555618 1752615 1277467 -3390229 -10279371 -11755411
35185 -11755411 -6080036 -1666361 -5560602 -12854820 -13759557 -7798352 -3344639 -4243698
35177 -4243698 -5308938 -2572156 124804 -1273782 -3629964 -2442128 -121246 -1971702
35169 -1971702 -7050900 -9562398 -7570894 -4090161 -619147 3867749 7533828 6024519
35161 6024519 -183334 -4571673 -3131787 737272 2389004 2201657 2407017 2072469 -333574
35152 -333574 -2536253 -1446022 1265073 1141095 -2405500 -5517512 -5566603 -3635636 -1426233
35143 -1426233 581812 1423503 -297070 -3452912 -4561885 -2527811 -659420 -2033389
35135b033389k982745q47385J538532N88168k064640k249223O73430L382373L638750
35126c56129K705137J988185K11050l598999o257251l514099K965630N960027
35118A03551J930253l813997m365476m61480J998268J380296J433944L520900
35110A726259M076782J315914j286815r72944j73694j501277k740081j194508
35102g50364P68657l05637k366642j075508K234455K203883j365585k474476J650527
35093a480690N870618M450234j345349n871745o010428k710283J622374M523920
35085i51349M313030J901707J87551J50530k32338j811315k169659l4099J527365
35076B881423k92168l107485l141579j527846j799758k781319j03858N246811
$$ plain form
35135 -2033389 -5016134 -5863519 -4324987 -3736819 -5801459 -8050682 -7377252 -3994879 -356129
35126 -356129 2349008 4337193 4548243 949244 -5308007 -8822106 -5856476 103551
35118 103551 2033804 -1780193 -6145669 -6607149 -4608881 -3228585 -1794641 1726259
35110 1726259 5803041 7118955 5832140 4859196 4685502 3184225 444144 -750364
35102 -750364 18293 -287344 -2653986 -3729494 -1495039 708844 -656741 -3131217 -1480690
35093 -1480690 4389928 8840162 7494813 1623068 -4387360 -7097643 -5475269 -951349
35085 -951349 3361681 5263388 5450939 5601469 5369131 3557816 1388157 1354058 2881423
35076 2881423 2589255 -518230 -3659809 -5187655 -6987413 -9768732 -9872590 -4625779
35068d625779O477604J145022m112170k754214K317370L483118n11428l728976
35060b309453k228991J266952K591734J621528P16723P60477R77885Q58597L22047
35051D577499q44170k158212k057301J92133K943228L866592K599921M93965j563867
35042H049788l483559m475497l079898O98655M370904M856982J289450l908202
35034D318623o464038l664362K485182O190337L734570j875068m282505j829307
35026a386568O83081o32600k946255j275288L417108M984922P85477m389101m483502
35017e242726M53231M928598M437633l01404m536312l957795J026157N066637
35009A874019L423905j938625m115804l5726N376941N829366J639141k125158
$$ plain form
35068 -4625779 1851825 2996847 -1115323 -3869537 -1552167 1930951 1419523 -2309453
35060 -2309453 -4538444 -3271492 -679758 941770 1658493 2418970 3396855 4255452 4577499
35051 4577499 3733329 1575117 -482184 -290051 2653177 6519769 9119690 9613655 8049788
35042 8049788 4566229 90732 -2989166 -2290511 2080393 6937375 8226825 4318623
35034 4318623 -2145415 -5809777 -3324595 2865742 6600312 4725244 442739 -1386568
35026 -1386568 -703487 -1336087 -4282342 -5557630 -2140522 2844400 3629877 -759224 -5242726
35017 -5242726 -4789495 139103 4576736 4275332 -260980 -4218775 -3192618 1874019
35009 1874019 5297924 3359299 -756505 -792231 4584710 10414076 12053217 9928059
35001I928059l225835l565526l853040k064565J745158L650182J355369j841300
34993B128502j643655J014803J745065o31118k791735k135388K3340J311374J576878
34984E98066J672831J027334j181056l363184k745487L87931K161856K85532k259462
34975c415639j267933K168871K845590n88180l042421n52382L412606L136841
34967B697353o21984k294975n15911N54007q01972r94401J568217K501126j131798
34958I59662m627962k494327K276368K400163k239637m374043m76259M572183
34950d003852N356249K602308l82825k779318m499998l644175K76499L576809
34942c498303K969800P83464J452990M200365L774456j441922o297609n487196
$$ plain form
35001 9928059 6702224 3136698 -716342 -2780907 -1035749 2614433 3969802 2128502
34993 2128502 484847 1499650 3244715 2613597 -178138 -2313526 -2290186 -978812 598066
34984 598066 2270897 3298231 2117175 -1246009 -3991496 -3603565 -1441709 -1156177 -3415639
34975 -3415639 -4683572 -2514701 330889 -257291 -3299712 -3852094 -439488 2697353
34967 2697353 2075369 -219606 -735517 -181510 -983482 -1977883 -409666 2091460 959662
34958 959662 -3668300 -6162627 -3886259 -1486096 -3725733 -8099776 -8576035 -4003852
34950 -4003852 1352397 3954705 3571880 792562 -3707436 -7351611 -7075112 -3498303
34942 -3498303 -528503 254961 1707951 5908316 9682772 8240850 1943241 -3543955
34934c543955m35110K825521J351459j664171j850210M56246J314878n31016j635578
34925c711936M29358K479296M42741l395796l067864J543580L874238R27200j869942
34916b349125M04789M109826L305912m64887j392262O56376R45053q76671m03916
34907C935095K418165K030921k809743n598714k345354J610372K55647l336601
34899c840212k452968J996701L011919j311301n095227l549420J165893M313372
34891e761243M396272K780664P97429p20019j002055j05783Q52348R07390P552
34882B152555j226778j633424k02985K135400K635960L12618k050477j554834
34874E68035Q18182K427250L090480L417348J268695m871961j0209655p805387
$$ plain form
34934 -3543955 -3979065 -1153544 197915 -1466256 -3316466 -2860220 -1545342 -2076358 -3711936
34925 -3711936 -3282578 -803282 -360541 -3756337 -6824201 -5280621 -1406383 -479183 -2349125
34916 -2349125 -1944336 2165490 5471402 5006515 3614253 4270629 5215682 4339011 3935095
34907 3935095 6353260 8384181 5574438 -24276 -2369630 -759258 -503611 -3840212
34899 -3840212 -6293180 -4296479 -1284560 -2595861 -7691088 -11240508 -10074615 -5761243
34891 -5761243 -1364971 1415693 2213122 1493103 491048 385265 1237613 2145003 2152555
34882 2152555 925777 -707647 -910632 1224768 3860728 4173346 2122869 568035
34874 568035 1386217 3813467 6903947 10321295 11589990 6718029 -3491626 -11297013
34866a1297013R57202O663181M628932P82480J378948L526205J687771j877941
34858F449765j026880K938221K570606l238396o469051k160223L664635K849722
34850E578399l067460n759600k429843J024379m54017l818118l029620J980553
34842i975327N575383M512514J526620J06716k66662j265802j521135P38243L031749
34833B462299J589147j817644j517404K950810N120866J197731m055006m639835
34825A290964j886606r65750k343116k167509O64188K949836K138854r61218l883007
34816e163364m139978o23000M009520M663724M86215k943800j687529M47303j045581
34807e996490k906894j2888M263355K884101k142454k449387K122449L216490
$$ plain form
34866 -11297013 -10339811 -3676630 952302 1734782 3113730 6639935 8327706 6449765
34858 6449765 5422885 8361106 10931712 7693316 1224265 -935958 2728677 5578399
34850 5578399 2510939 -3248661 -5678504 -4654125 -5108142 -8926260 -11955880 -9975327
34842 -9975327 -4399944 112570 1639190 1745906 1479244 213442 -1307693 -569450 2462299
34833 2462299 4051446 2233802 716398 3667208 8788074 9985805 5930799 1290964
34825 1290964 -595642 -1561392 -3904508 -6072017 -5407829 -2457993 -319139 -1280357 -5163364
34816 -5163364 -9303342 -9926342 -5916822 -1253098 -766883 -3710683 -5398212 -4950909 -5996490
34807 -5996490 -8903384 -8916272 -4652917 -1768816 -3911270 -6360657 -4238208 -1021718
34799a021718p10342j155052M727804P636054J729380m682087k785525K158370
34791E896884M51493n449436n794731l983L718207K565886J451562K013920J97783
34782E047585m193129n183296l55819M724567M568921L92201l430935m561642
34774b991547k782811P01120K923627J839377m51305o39740O46036O73537k66967
34765c48673n08359j428885m179113m623356Q37499O607647M251813l544079n665688
34756h601194L68224N086004K880986l90279K53573M57349l204461n076941r09379
34747i136118K627214j156022n897654j369658R092917J2302643M572120l815063
34739G220379m172340K15320J917306J4098j096904Q80556L598045L350824p04722
$$ plain form
34799 -1021718 -1732060 -2887112 1840692 9476746 11206126 6524039 3738514 5896884
34791 5896884 6348377 898941 -4895790 -4899773 -1181566 1384320 2835882 4849802 5047585
34782 5047585 854456 -4328840 -4684659 39908 4608829 5001030 1570095 -2991547
34774 -2991547 -5774358 -5073238 -2149611 -310234 -761539 -1401279 -755243 -81706 -348673
34765 -348673 -857032 -2285917 -6465030 -11088386 -10250887 -3643240 608573 -2935506 -8601194
34756 -8601194 -8232970 -3146966 -265980 -656259 -402686 54663 -3149798 -8226739 -9136118
34747 -9136118 -6508904 -7664926 -13562580 -14932238 -5839321 6463322 11035442 7220379
34739 7220379 3048039 3263359 5180665 5194763 4097859 4978415 8576460 11927284 11222562
34730A1222562n155779n664279k276122N74702L84429l49207O52931J249912o70851
34721c1702k488140j104601J366489J094690j043199j566828m30658J55647N20291
34712c528011J821769K012477p10340k830522l79974L199530J447706m036272
34704c003637m981332P68575N832789M443904j45499k133279r35946P22026J528887
34695B096488J212663o21385k641345k200902M13102J615349M6188j304056k53938
34686a637836J207012R13387K28989J165872K752102K786755R68862j641916m186102
34677B557125n536730m398355j233568J657447K706551K063208K35489j900323
34669c849156k308959l9192K350767J986038L23180N08418J387526m18379l337583
$$ plain form
34730 11222562 6066783 402504 -1873618 -1298916 -914487 -1263694 -610763 639149 -31702
34721 -31702 -2519842 -3624443 -2257954 -1163264 -2206463 -3773291 -4203949 -4048302 -3528011
34712 -3528011 -1706242 306235 -404105 -3234627 -3614601 -415071 1032635 -3003637
34704 -3003637 -7984969 -7216394 -1383605 3060299 2914800 781521 -154425 567601 2096488
34695 2096488 3309151 2687766 46421 -2154481 -1741379 -126030 -79842 -1383898 -1637836
34686 -1637836 -430824 482563 711552 1877424 4629526 7416281 8385143 6743227 2557125
34677 2557125 -2979605 -7377960 -8611528 -6954081 -4247530 -2184322 -1948833 -3849156
34669 -3849156 -6158115 -6197307 -3846540 -1860502 -1537322 -1028904 358622 -59757 -3397340
34660c397340k489912J251798J417549l114323n206684q86972L871516K741570
34652e812798j206303j459449J538859K706966J215347K71316N14282m6015j075767
34643c353562n87696N41377j20771j594408p12872K154770L178155R38973j657015
34634a213049j708526M37493K489327K556795M61742j688319j284270J059783
34626A110976J583873j138167l603725k655830j49260Q45650J132382K516234
34618c57867K984989l3328l848304l636335j55224J331054o38933k047003l47259
34609f748210K063595K371176J044917j44375l21824R84828L321872M114266J446239
34600H132484k040548k001220P86944J023797k903343o102543m372543J43768
$$ plain form
34660 -3397340 -5887252 -4635454 -3217905 -6332228 -11538912 -12425884 -8554368 -5812798
34652 -5812798 -7019101 -8478550 -6939691 -4232725 -3017378 -2746062 -2231780 -2277795 -3353562
34643 -3353562 -3941258 -3399881 -3520652 -5115060 -5827932 -3673162 -495007 443966 -1213049
34634 -1213049 -2921575 -2484082 5245 2562040 3023782 1335463 51193 1110976
34626 1110976 2694849 1556682 -2047043 -4702873 -4852133 -4006483 -2874101 -357867
34618 -357867 2627122 2593794 -1254510 -4890845 -5046069 -3715015 -4353948 -6400951 -6748210
34609 -6748210 -4684615 -2313439 -1268522 -1412897 -1734721 -749893 2571979 6686245 8132484
34600 8132484 6091936 4090716 4877660 5901457 2998114 -3104429 -7476972 -7333204
34592g333204L007472L436451L151085K255705j24120k737897l117904j147351
34584b609763P36656Q57387m2593o55971j034459j741752j943797q925L415833
34575c027384M652404J451639k825718k809371J129135K957562N0129k736983
34567a158587j011530K053040J333184j644746j851736M04313P37652q29439l0474
34558a998323L225949L930263M62051k762201k725833j531142q44504Q83461L177528
34549A817249K121402k361310m098906P9370M410225K667437k434255m110746
34541a909534j667154M73682P62841J038864J141787n09425k083685l33070K925174
34532a60520K386585k156016m553188j155212M074521N598973L416108J290768
$$ plain form
34592 -7333204 -4325732 -889281 2261804 4517509 4393389 1655492 -1462412 -2609763
34584 -2609763 -1873107 -1015720 -1058313 -1714284 -2748743 -4490495 -6434292 -6443217 -3027384
34575 -3027384 1625020 3076659 250941 -2558430 -1429295 1528267 1578396 -1158587
34567 -1158587 -2170117 -117077 1216107 -428639 -2280375 -1876062 -1138410 -1967849 -1998323
34558 -1998323 1227626 5157889 5619940 2857739 131906 -1399236 -2243740 -1360279 1817249
34549 1817249 3938651 1577341 -2521565 -2442195 1968030 4635467 2201212 -1909534
34541 -1909534 -3576688 -3103006 -2340165 -1301301 -159514 -668939 -2752624 -3085694 -160520
34532 -160520 2226065 70049 -4483139 -5638351 -1563830 4035143 7451251 8742019
34524H742019P39033j15441k878153o352445p566190m678004O66695M071034K717239
34515d654213j231654l134189j522946Q21660J438226J125658J345752J314345
34507d497361j72296j646054m10518L176597N284766L323452n99401k407404j301884
34498G49897k37299j093844j797876J17630K893872K400695j643595m341235j786148
34489d737903L466531N034306J98536o661725q470611l084369L919763N164375
34481e171097L09126l350267o06894M458286M667464L77746j930886m42070L0298
34472a658294k206692k148600K211739M418801k62974n706848l669964L103027
34464e919805N305066J570754r32028P25153J697300l95128j141375J739580L469342
$$ plain form
34524 8742019 9481052 9365611 6487458 135013 -7431177 -12109181 -11442486 -7371452 -4654213
34515 -4654213 -5885867 -9020056 -10543002 -9721342 -8283116 -7157458 -5811706 -4497361
34507 -4497361 -4669657 -6315711 -6726229 -3549632 1735134 5058586 4459185 2051781 749897
34498 749897 512598 -581246 -2379122 -2261492 632380 3033075 1389480 -2951755 -4737903
34489 -4737903 -1271372 3762934 3961470 -2700255 -11170866 -14255235 -10335472 -5171097
34481 -5171097 -4861971 -8212238 -8819132 -4360846 306618 684364 -1246522 -1688592 -1658294
34472 -1658294 -3864986 -6013586 -3801847 616954 353980 -5352868 -9022832 -5919805
34464 -5919805 -614739 956015 23987 749140 2446440 2051312 909937 2649517 6118859
34455F118859N54739k899936k304243k01987j174537l791976l625066q89528P93134
34446g420541Q54125J422952K273053J477643j9985M54134K259789K245785J89617
34437C736572j071363p29927p76004j636374j491672l04853j21143p36560L67059
34428b764265K704841K237141j836478m289793r53784M957830P004511L445934
34420A0505937k068458n521085n272006j832662K002216K438310r57796l712414
34412d417958k086175J558596K387043L15171o46002O91080J241355n01207j744016
34403c202113j80463K085198J688263j149734k959321j088714L541902O849430
34395E584448M953061j235678n545154l351749J869079K601645k231652n690555
$$ plain form
34455 6118859 6673598 3773662 1469419 1267432 92895 -3699081 -7324147 -8213675 -7420541
34446 -7420541 -6566416 -5143464 -2870411 -1392768 -1412753 -958619 1301170 3546955 3736572
34437 3736572 2665209 1935282 1159278 -477096 -1968768 -2273621 -2394764 -3131324 -2764265
34428 -2764265 -59424 2177717 341239 -3948554 -4902338 55492 7060003 10505937
34420 10505937 8437479 2916394 -2355612 -4188274 -2186058 252252 -705544 -4417958
34412 -4417958 -6504133 -4945537 -2558494 -2243323 -2889325 -2198245 -956890 -1458097 -3202113
34403 -3202113 -3382576 -1297378 390885 -758849 -3718170 -4806884 -1264982 5584448
34395 5584448 10537509 9301831 3756677 404928 2274007 4875652 2644000 -3046555
34387c046555k937628K185506L467234P22250j822934j943502k11835K640798
34379i46666N071256M088865n30311l896342k230204J173207J077561j344794
34371B462572j252464J056883J153047r39284r32499J003300k0896l910950m228837
34362e609128O72608L714095O69802k567573l65177K659217P5646m157673j810733
34353f718916N082469O524533M40367m135097j370091L059364J677323l948783
34345F11169o866752m428954K89212L678924M310397K412840l55378j814747j652302
34336c815591j524019j988111j557554L44264K101423K615574K567855K014975
34328G58816j0745k174577r30158L725113O236718K515577l919567o446461l739781
$$ plain form
34387 -3046555 -5984183 -3798677 -331443 390807 -1432127 -3375629 -3587464 -946666
34379 -946666 4124590 8213455 7683144 3786802 1556598 2729805 3807366 2462572
34371 2462572 1210108 2266991 3420038 2480754 1548255 2551555 2530659 -1380291 -5609128
34362 -5609128 -4936520 -1222425 -552623 -3120196 -3485373 -826156 -750510 -4908183 -6718916
34353 -6718916 -1636447 4888086 5328453 1193356 -176735 2882629 4559952 611169
34345 611169 -6255583 -10684537 -10395325 -6716401 -2406004 6836 -348542 -2163289 -3815591
34336 -3815591 -5339610 -7327721 -8885275 -8541011 -6439588 -3824014 -1256159 758816
34328 758816 748071 -1426506 -2356664 1368449 7605167 10120744 6201177 -245284 -3985065
34319c985065O4243J783809J745940R77578k12275j081529j064197j199956k195898
34310e167350k064861R05858L929857K871991p92901j346184K137959L791867
34302D266236L02135l339921j652207K388484K065546k281773m017735j027465
34294c296700J271085q04911l423523k147994P53648R00529k09973J909885N792518
34285G44564M998640j416481o111931l811299J188523K042375n83942j061881
34277d011432J415297K184692l37670k038538n03960Q09065j127864l163366q47126
34268g620902M033232N603496K151741k192785l543486k063180K79595J917651
34260a434638J177419k576024o107947m408835K301790P053398M563682j470809
$$ plain form
34319 -3985065 -3920822 -2137013 -391073 586505 374230 -707299 -1771496 -2971452 -5167350
34310 -5167350 -7232211 -6326353 -2396496 475495 -317406 -1663590 474369 4266236
34302 4266236 4568371 1228450 -423757 1964727 4030273 1748500 -2269235 -3296700
34294 -3296700 -2025615 -2830526 -6254049 -8402043 -7648395 -6747866 -6957839 -5047954 744564
34285 744564 5743204 4326723 -1785208 -5596507 -4407984 -2365609 -2949551 -4011432
34277 -4011432 -2596135 -411443 -749113 -2787651 -3291611 -2482546 -3610410 -6773776 -7620902
34268 -7620902 -3587670 2015826 4167567 1974782 -1568704 -3631884 -3352289 -1434638
34260 -1434638 -257219 -2833243 -8941190 -13350025 -11048235 -3994837 568845 -901964
34252i01964l165467J220683N847172N532591J195442l401874o210456o526682
34244f410555l678655J096974L898769K492224j1473R76277M736365N787406J465117
34235A0352449m351027o361283m024002p40741J052565J470386R76263n53156
34227b178546k317740k438188m48209J426045Q95203j129477j511125P13266K577280
34218d411491J077867k320232l229472k40849L287227M208956L570530L514044
34210E456580K871507n21621m723776n443124k672408q79950j818661k016419
34202i747872P14182L141539K086095k95184n72846M41689O98889J725206M932968
34193C124666O357837J860764m560508n353007j362521o19248m546076m931606
$$ plain form
34252 -901964 -4067431 -2846748 3000424 8533015 9728457 6326583 116127 -6410555
34244 -6410555 -10089210 -8992236 -5093467 -2601243 -2612716 -1636439 3099926 8887332 10352449
34235 10352449 6001422 -359861 -4383863 -5124604 -4072039 -2601653 -1625390 -2178546
34227 -2178546 -4496286 -6934474 -7382683 -5956638 -5061435 -6190912 -7702037 -6988771 -4411491
34218 -4411491 -3333624 -5653856 -8883328 -9124177 -5836950 -1627994 1942536 5456580
34210 5456580 8328087 7806466 3082690 -2360434 -5032842 -5912792 -7731453 -9747872
34202 -9747872 -9033690 -5892151 -3806056 -4101240 -4674086 -4232397 -3533508 -1808302 3124666
34193 3124666 9482503 11343267 6782759 1429752 67231 -552017 -5098093 -10029699
34185a0029699K007844P835369M364520l509800n373883m81391L300493K560883
34177F74336J316397J886437J471664j079543k489531j173605m5477q29005j035912
34168a304239P12349J523993l21051j557361L46280J853657j093257n195718l583426
34159h618773L432579P445809L113682m549782o809435k103512L127897L328675
34151a632860Q9072j266648J112409L988423L852992R54307k108082l785306m039306
34142b834999k840711l51382J943133K306356R10428n88925j297139j369161p63997
34133d886397L12420N16780o69817j044540J094325K801703R399m943212m883674
34124a1693013J523456O493828L883670k022104l361487r8803J553884n03497
$$ plain form
34185 -10029699 -8021855 -186486 4178034 668234 -4705649 -5187040 -1886547 674336
34177 674336 1990733 3877170 5348834 4269291 1779760 606155 560678 -268327 -1304239
34168 -1304239 -591890 932103 611052 -946309 -600029 1253628 160371 -5035347 -8618773
34159 -8618773 -5186194 2259615 5373297 823515 -5985920 -8089432 -4961535 -1632860
34151 -1632860 -1543788 -2810436 -1698027 2290396 6143388 7097695 4989613 1204307 -2834999
34142 -2834999 -5675710 -6027092 -4083959 -1777603 -867175 -1456100 -2753239 -4122400 -4886397
34133 -4886397 -4573977 -4057197 -4727014 -5771554 -4677229 -1875526 -1866127 -6809339 -11693013
34124 -11693013 -10169557 -3675729 207941 -1814163 -5175650 -5274453 -3720569 -4224066
34116d224066k176605p58403J572163K436764K280550J655301q1801k135650k224024
34107c655771l27138J002715Q73845R39543J448796O59010q53491n7816K728220
34098B757913L033946j89494j565615K128716N393699J673147o038495q877414
34090a683597m553979O19687J792341J012555J357519J739986M90312o01912L70837
34081E43749J287297o84839l598749k962634J019183K817160n22095m498258l155456
34072i754642K211821M521214R56923l026529j932764J689048J802151j232739
34064d765517j491599K372214M706636K286819n65953P3245Q90796k074828n201559
34055c769746k823295K455637L093089j290037l466077m01416K699842J891930
$$ plain form
34116 -4224066 -6400671 -7159074 -5586911 -3150147 -869597 785704 703903 -1431747 -3655771
34107 -3655771 -3982909 -2980194 -2106349 -1166806 281990 941000 87509 29693 2757913
34098 2757913 5791859 5602365 4036750 6165466 11559165 13232312 7193817 -1683597
34090 -1683597 -6237576 -5617889 -3825548 -2812993 -1455474 284512 774824 172912 543749
34081 543749 1831046 1146207 -2452542 -5415176 -4395993 -1578833 -2100928 -6599186 -9754642
34072 -9754642 -7542821 -3021607 -2064684 -5091213 -7023977 -5334929 -3532778 -4765517
34064 -4765517 -6257116 -3884902 821734 3108553 2542600 2615845 3506641 1431813 -3769746
34055 -3769746 -6593041 -4137404 -1044315 -2334352 -5800429 -6201845 -3502003 -1610073
34047a610073L26648J411164K864796J789999J02284K86458L64716k080472m712343
34038a256823m160259j731746n94761j39878J836954L839791K955631O36502O88444
34029B073855K519344J845669k095444n116631m257413j055660J737609K776415
34021a572256J327304k102425m194805k044097J837560K148029j236715k858995
34013h696400j50601L044285L284365K495590L159129L446766J063884k032509
34005E614509k922831k355897j897991J18672M744226P485232L446665m138197
33997A0094388p049016l525845k9941o48171j533982J273176M671755L883796
33989G136160N60250k02353J608776J307843k350002m996955l406908J69006J994196
$$ plain form
34047 -1610073 -1283425 127739 2992535 4782534 4884818 5171276 5535992 3455520 -1256823
34038 -1256823 -5417082 -7148828 -7743589 -7883467 -6046513 -2206722 748909 1385411 2073855
34029 2073855 4593199 6438868 4343424 -773207 -5030620 -6086280 -4348671 -1572256
34021 -1572256 -244952 -2347377 -6542182 -8586279 -6748719 -4600690 -5837405 -8696400
34013 -8696400 -8847001 -5802716 -2518351 -22761 3136368 6583134 7647018 5614509
34005 5614509 2691678 335781 -1562210 -1443538 3300688 10785920 14232585 10094388
33997 10094388 3045372 -480473 -510414 -1158585 -2692567 -1419391 3252364 7136160
33989 7136160 7696410 7494057 9102833 10410676 8060674 3063719 -343189 -174183 1820013
33980A820013J546161M54761j76255M24616K626092M172309J251328n467845r093295
33971b442115m765182K860469N242862J455976j630256k63161J560954j2500k359601
33962c52554j495854J235257J959836L75337j250643k427994l460167k573180
33954g989962J270632M626745L557107j35051j736281j272500k434150m631065
33946h744525l028044K584978N841098L152837j102941j989234r46322j227861
33938e460014j515139P13021L323093K716527K70840M5166J849347K079410L31967
33929D354218l55487M84685N6435j785830j346922K347463M516918J173691m564838
33920D880333o163353k026826K872218L291803o12032m270923m037564o85906
$$ plain form
33980 1820013 3366174 3820935 3644680 4069296 6695388 10867697 12119025 6651180 -2442115
33971 -2442115 -7207297 -4346828 896034 2352010 721754 458593 2019547 2007047 -352554
33962 -352554 -1848408 -613151 1346685 1722022 471379 -1956615 -5416782 -7989962
33954 -7989962 -6719330 -2092585 1464522 1329471 -406810 -1679310 -4113460 -8744525
33946 -8744525 -11772569 -9187591 -3346493 -193656 -1296597 -3285831 -4232153 -5460014
33938 -5460014 -6975153 -6262132 -2939039 -222512 48328 93494 1942841 4022251 4354218
33929 4354218 3998731 4483416 4539851 2754021 1407099 3754562 8271480 9445171 4880333
33920 4880333 -1283020 -3309846 -437628 2854175 2242143 -2028780 -6066344 -6752250
33912f752250K269556K905799K435517K484038K595512J505850n95330k515177
33904D333515l478397k757758K54020L650570L001568k985926q555746o887621
33896a3425775P13243O123861N027536J490946P90577K403205K627984M07448
33888F159025k525321m588769m610666j520233L370535N866035L608268m39224
33880E319650k065128j541855j970141l435328k865292O18441M016524M663200
33872B740071L058391Q25073j349751k785526k368554l94439J039563O94874l21827
33863A137875o68189o42707q33916o24829M61915J377846J215630J049984K091041
33854D564650K855214P30303l490709n204141j579020M056321N562628J431635
$$ plain form
33912 -6752250 -4482694 -1576895 858622 3342660 5938172 7444022 6848692 4333515
33904 4333515 855118 -1902640 -1648620 2001950 5003518 2017592 -6538154 -13425775
33896 -13425775 -12712532 -6588671 -1561135 -70189 720388 3123593 5751577 6159025
33888 6159025 3633704 -955065 -5565731 -7085964 -3715429 2150606 5758874 5319650
33880 5319650 3254522 1712667 -257474 -3692802 -6558094 -5939653 -1923129 2740071
33872 2740071 5798462 6623535 5273784 2488258 119704 -274735 764828 1459702 1137875
33863 1137875 469686 -173021 -1006937 -1631766 -1169851 207995 1423625 2473609 4564650
33854 4564650 7419864 8150167 4659458 -544683 -2123703 1932618 7495246 8926881
33846H926881l273448l352842j12538O61307l087046o459837m120906K257137
33838h561292O009312M066611J16786j252370j06246Q89685J041718J196008P77005
33829D177217j143942k773327j388319J811399K457790n53985l112590k004473
33821b530230N81469J178941M49735R45115J879824M50523k740150l897081j635933
33812e317787J387095K737390K584517J439160q01908k748628k211088k03168
33804c134417l89323k905444k980483J605734N854569M292732q74177l053976
33796a584785n97741K080888J681324m24570j695603j366178L66561K560021K778070
33787C797987m59801m353616m400728n17930K875775L073848J594643J03784j883827
$$ plain form
33846 8926881 5653433 2300591 2188053 2849360 -237686 -6697523 -10818429 -8561292
33838 -8561292 -2551980 1514631 1631417 379047 272801 1162486 2204204 3400212 4177217
33829 4177217 3033275 259948 -1128371 683028 3140818 2586833 -525757 -2530230
33821 -2530230 -1948761 -769820 -320085 625030 2504854 2955377 215227 -3681854 -5317787
33812 -5317787 -3930692 -1193302 1391215 2830375 2028467 -720161 -2931249 -3134417
33804 -3134417 -3523740 -6429184 -9409667 -7803933 -1949364 2343368 1469191 -1584785
33796 -1584785 -2182526 -101638 1579686 1155116 -540487 -1906665 -1540104 1019917 3797987
33787 3797987 3338186 -1015430 -5416158 -5934088 -3058313 15535 1610178 1713962 -169865
33778a69865m000999l859035q45393K250895L168760K616170J476096o94913k756911
33769b815195j806895J728434L115065M06970j890789m2872K526963J139116j824293
33760E36504q96180K924978L792540R02057p48297L59264j18806l651261n065342
33751a964543j190239K957000J663733k495863k992353M62497K333404N06124
33743g20240j154729O0704J630119Q24847o74829j78205J206688P21109j034070
33734F81394j055861Q34471J549023r5814j379326k39408J430553J335529P22220
33725C782781J452009J458749k283432p205876o911521m52265N228383M568655
33717c62517O86275k04759J963904K346162l86843k299808q64510J393105J268446
$$ plain form
33778 -169865 -4170864 -8029899 -8875292 -6624397 -3455637 -839467 636629 -58284 -2815195
33769 -2815195 -4622090 -2893656 221409 628379 -1262410 -1305282 1221681 2360797 536504
33760 536504 -359676 2565302 6357842 7259899 6511602 6870866 6752060 3100799 -1964543
33751 -1964543 -3154782 -197782 1465951 -1029912 -4022265 -3559768 -1226364 -720240
33743 -720240 -1874969 -1814265 -184146 640701 -34128 -212333 994355 1715464 681394
33734 681394 -374467 460004 2009027 1913213 533887 294479 1725032 3060561 3782781
33725 3782781 5234790 6693539 4410107 -2795769 -9707290 -10159555 -4931172 -362517
33717 -362517 323758 118999 2082903 4429065 4042222 1742414 877904 2271009 3539455
33708C539455o60630j827169j441041m85336L92640J033945P40275j014008k941559
33699b663428k650250J87961K412666Q26126k948376l471252J132196N381886
33691a792471L434646k059451l286470R72440L422348j24942m122491k513914
33683f070305J619047J889712o95450m66364K506152K941511L2845j531171l64777
33674a38800m20376k997803m046444j620427O20726J09130m66666J157503K443966
33665e359191Q76892j520839j922122q35121M54517K407241M393712L745368N58460
33656B798917j126045O7958J26868k975932m744382j629909K353971K176875J21293
33647b830386J007093L176769J696085k239685k877155M77325K785225J797594
$$ plain form
33708 3539455 2878825 1051656 -389385 -874721 -482081 551864 1292139 278131 -2663428
33699 -2663428 -5313678 -5125717 -2713051 -1886925 -4835301 -8306553 -7174357 -1792471
33691 -1792471 1642175 -417276 -3703746 -2731306 691042 566100 -3556391 -6070305
33683 -6070305 -4451258 -2561546 -3256996 -3723360 -1217208 1724303 1757148 225977 -138800
33674 -138800 -559176 -3556979 -7603423 -9223850 -8603124 -8493994 -8960660 -7803157 -5359191
33665 -5359191 -4482299 -6003138 -7925260 -8760381 -8305864 -5898623 -1504911 2240457 2798917
33656 2798917 1672872 1740830 1867698 -1108234 -5852616 -7482525 -5128554 -2951679 -2830386
33647 -2830386 -1823293 1353476 3049561 809876 -2067279 -1589954 1195271 2992865
33639B992865L79206J42628o90779k210664j695031Q92664J660293r60675l257531
33630b747024j756697J910009L807895K656766K23439j293972j127002m45159
33622A228255j071750k637989k336142P17310L049593J628913j267204j746665
33614b435679m74724m21800o41357J765315M723177K950785l103342o620059m108534
33605h366218M7416P10153j385430k381567n81182K940121N673218M742240J19509
33596A518260l276296j055324L551953L672794m91215k034689Q55873J813727
33588D555083k288124n314959k151248K443718J613170k834783m384903k160530
33580a0522576l47981l92042l57273J02889P2186Q09879L382683M724560J616870
$$ plain form
33639 2992865 3372071 3514699 2823920 613256 -1081775 -189111 1471182 510507 -2747024
33630 -2747024 -4503721 -2593712 1214183 3870949 4094388 2800416 1673414 1228255
33622 1228255 156505 -2481484 -4817626 -4100316 -1050723 578190 -689014 -2435679
33614 -2435679 -2910403 -3332203 -3973560 -2208245 2514932 5465717 2362375 -4257684 -8366218
33605 -8366218 -8318802 -7608649 -8994079 -11375646 -11956828 -9016707 -3343489 1398751 1518260
33596 1518260 -1758036 -2813360 738593 4411387 3920172 1885483 2741356 4555083
33588 4555083 2266959 -3048000 -5199248 -2755530 -1142360 -3977143 -8362046 -10522576
33580 -10522576 -10870557 -11262599 -11619872 -11516983 -11444797 -10634918 -7252235 -2527675 -910805
33571i10805k971361l201013R86695M030047K958583J45364j855456k931837k617751
33562f367534J83871L654391L743763p2515l341905k479572Q67162K690503J463881
33553C42045j088522k205474l12326L348423M997267J962228l680965o770997
33545c408321m681320Q9904L125658K673450P63069M31549K018581K593585K3827
33536C629982l154033k530611J454247L206604j93083m577322m666953j174907
33528h006076J377703J345591P42714J001634J407437R56594n23974k098408j438238
33519e235023K749889O932975N332174j640491o261050l984236J67533J12786
$$ plain form
33571 -910805 -3882166 -7083179 -6096484 -2066437 892146 1037510 -817946 -3749783 -6367534
33562 -6367534 -6183663 -2529272 1214491 1141976 -2199929 -4679501 -3812339 -1121836 342045
33553 342045 -746477 -2951951 -3264277 84146 5081413 7043641 3362676 -3408321
33545 -3408321 -8089641 -7999737 -4874079 -2200629 -1437560 -1006011 1012570 3606155 3629982
33536 3629982 475949 -2054662 -600415 2606189 2413106 -2164216 -6831169 -8006076
33528 -8006076 -6628373 -5282782 -4540068 -3538434 -2130997 -1174403 -1698377 -3796785 -5235023
33519 -5235023 -2485134 4447841 9780015 8139524 1878474 -2105762 -1938229 -1825443
$$ [...]
##END NTUPLES=NMR SPECTRUM
##END=
