##TITLE=31Pdec_DPAH1403
 CDCl3, 24 sc
 15.3.2022
##JCAMPDX= 6.0         $$ Bruker NMR JCAMP-DX V2.0
##DATA TYPE= NMR SPECTRUM
##DATA CLASS= NTUPLES
##ORIGIN= UXNMR, Bruker Analytische Messtechnik GmbH
##OWNER= root
$$ XWIN-NMR		Version 3.5
$$ Tue Mar 15 11:15:32 2022 Russian Standard Time (UT+4h)  she@DPX200
##.OBSERVE FREQUENCY= 81.013821
##.OBSERVE NUCLEUS= ^31P
##.ACQUISITION MODE= SIMULTANEOUS
##.ACQUISITION SCHEME= undefined
##.AVERAGES= 24
##.DIGITISER RES= 16
##SPECTROMETER/DATA SYSTEM= spect
##.PULSE SEQUENCE= zgpg30
##.SOLVENT NAME= CDCl3
##.SHIFT REFERENCE= (INTERNAL, CDCl3, 0, 248.564)
##AUDIT TRAIL= $$ (NUMBER, WHEN, WHO, WHERE, WHAT)
$$ ##TITLE= Audit trail, XWIN-NMR		Version 3.5
$$ ##JCAMPDX= 5.01
$$ ##ORIGIN= Bruker BioSpin GmbH
$$ ##OWNER= she
$$ F:/spectra/data/she/nmr/P31/1/pdata/1/auditp.txt
$$ ##AUDIT TRAIL=  $$ (NUMBER, WHEN, WHO, WHERE, WHAT)
(   1,<2022-03-15 11:14:18.68 +0400>,<she>,<DPX200>,
      <created by zg, POWCHK disabled, PULCHK disabled
       configuration hash MD5:
       00 E9 B6 7A A2 85 ED C7 34 08 36 98 17 FE 4E 26
       data hash MD5: 32K
       51 2C D6 5D DF D0 DB 06 94 94 C0 8C B3 C2 01 6E>)
(   2,<2022-03-15 11:14:24.00 +0400>,<she>,<DPX200>,
      <Start of raw data processing
       efp BC_mod = 2 LB = 1 FT_mod = 6 PKNL = 1 PHC0 = -9185.651 PHC1 = 80.4745 SI = 64K 
       data hash MD5: 64K
       CA C5 6F 18 AD 0F 10 D7 59 23 77 65 EE 5F 07 83>)
(   3,<2022-03-15 11:14:37.62 +0400>,<she>,<DPX200>,
      <pk PHC0 = 13.11399 PHC1 = 0 
       data hash MD5: 64K
       0D C4 27 9A 10 C9 76 32 12 79 41 33 53 3A 15 6F>)
(   4,<2022-03-15 11:14:49.85 +0400>,<she>,<DPX200>,
      <abs ABSG = 5 
       data hash MD5: 64K
       3E F5 04 6D CB 90 46 C1 3C E6 81 06 80 6B B0 52>)
(   5,<2022-03-15 11:15:02.25 +0400>,<she>,<DPX200>,
      <pk PHC0 = -1.404473 PHC1 = 0 
       data hash MD5: 64K
       C5 99 2E FD 0A 22 B1 46 31 23 CD 67 3A D6 17 95>)
$$ ##END=
$$ 
$$ hash MD5
$$ E0 D1 E9 27 A5 65 2E 84 E7 45 A7 E4 18 E1 30 AD
##$RELAX= 
##$RELAX= 
##$RELAX= 
##$RELAX= 
##$RELAX= 
##$RELAX= 
##$RELAX= 
##$RELAX= 
$$ Bruker specific parameters
$$ --------------------------
##$DU= <F:/spectra>
##$EXPNO= 1
##$NAME= <P31>
##$PROCNO= 1
##$TYPE= <nmr>
##$USER= <she>
##$AMP= (0..31)
100 100 100 100 100 100 100 100 100 100 100 100 100 100 100 100 100 100 
100 100 100 100 100 100 100 100 100 100 100 100 100 100 
##$AQSEQ= 0
##$AQ_mod= 1
##$AUNM= <au_zg>
##$AUTOPOS= <>
##$BF1= 81.014009
##$BF2= 200.13
##$BF3= 200.13
##$BF4= 200.13
##$BF5= 200.13
##$BF6= 200.13
##$BF7= 200.13
##$BF8= 200.13
##$BYTORDA= 1
##$CFDGTYP= 0
##$CFRGTYP= 5
##$CHEMSTR= <none>
##$CNST= (0..31)
1 1 145 1 1 1 1 1 1 1 1 1 1 1 1 1 1 1 1 1 1 1 1 1 1 1 1 1 1 1 1 1 
##$CPDPRG= <waltz16>
##$CPDPRG1= <>
##$CPDPRG2= <waltz16>
##$CPDPRG3= <>
##$CPDPRG4= <mlev>
##$CPDPRG5= <mlev>
##$CPDPRG6= <mlev>
##$CPDPRG7= <mlev>
##$CPDPRG8= <mlev>
##$CPDPRGB= <>
##$CPDPRGT= <>
##$D= (0..31)
0 1 0 0 0 0 0 0 0 0 0 0.03 2e-05 3e-06 0 0 0 0 0 0 0 0 0 0 0 0 0 0 0 0 
0 0 
$$ [...]
##$SUBNAM3= <"">
##$SUBNAM4= <"">
##$SUBNAM5= <"">
##$SUBNAM6= <"">
##$SUBNAM7= <"">
##$SUBNAM8= <"">
##$SUBNAM9= <"">
##$SW= 501.771253377433
##$SWIBOX= (0..15)
0 1 3 0 0 0 0 0 0 0 0 0 0 0 0 0 
##$SW_h= 40650.406504065
##$TD= 32768
##$TD0= 1
##$TE= 0
##$TE2= 300
##$TE3= 300
##$TEG= 300
##$TL= (0..7)
0 120 53 12 22 120 120 120 
##$TP= (0..7)
150 150 150 150 150 150 150 150 
##$TP07= 0
##$TPNAME0= <>
##$TPNAME1= <>
##$TPNAME2= <>
##$TPNAME3= <>
##$TPNAME4= <>
##$TPNAME5= <>
##$TPNAME6= <>
##$TPNAME7= <>
##$TPOAL= (0..7)
0.5 0.5 0.5 0.5 0.5 0.5 0.5 0.5 
##$TPOFFS= (0..7)
0 0 0 0 0 0 0 0 
##$TUNHIN= 0
##$TUNHOUT= 0
##$TUNXOUT= 0
##$USERA1= <user>
##$USERA2= <user>
##$USERA3= <user>
##$USERA4= <user>
##$USERA5= <user>
##$V9= 5
##$VALIST= <valist>
##$VCLIST= <CCCCCCCCCCCCCCC>
##$VD= 0
##$VDLIST= <DDDDDDDDDDDDDDD>
##$VPLIST= <PPPPPPPPPPPPPPP>
##$VTLIST= <TTTTTTTTTTTTTTT>
##$WBST= 1024
##$WBSW= 4
##$XGAIN= (0..3)
0 0 0 0 
##$XL= 0
##$YL= 0
##$YMAX_a= 22273
##$YMIN_a= -25305
##$ZGOPTNS= <>
##$ZL1= 120
##$ZL2= 120
##$ZL3= 120
##$ZL4= 120
##$ABSF1= 248.5645
##$ABSF2= -253.2056
##$ABSG= 5
##$ABSL= 3
##$ALPHA= 0
##$AQORDER= 0
##$ASSFAC= 0
##$ASSFACI= 0
##$ASSFACX= 0
##$ASSWID= 0
##$AUNMP= <proc_1d>
##$AZFE= 0.1
##$AZFW= 0.5
##$BCFW= 0
##$BC_mod= 2
##$BYTORDP= 0
##$COROFFS= 0
##$CY= -3
##$DATMOD= 1
##$DC= 0
##$DFILT= <>
##$DTYPP= 0
##$F1P= 0
##$F2P= 0
##$FCOR= 1
##$FTSIZE= 65536
##$FT_mod= 6
##$GAMMA= 0
##$GB= 0
##$INTBC= 1
##$INTSCL= 5.30512e-09
##$ISEN= 30
##$LB= 1
##$LEV0= 0
##$LPBIN= 0
##$MAXI= 10000
##$MC2= 0
##$MEAN= 0
##$ME_mod= 0
##$MI= 50
##$NCOEF= 0
##$NC_proc= -5
##$NLEV= 6
##$NOISF1= 182.463
##$NOISF2= 159.3651
##$NSP= 0
##$NTH_PI= 0
##$NZP= 0
##$OFFSET= 248.5645
##$PC= 4
##$PHC0= -9173.941
##$PHC1= 80.4745
##$PH_mod= 1
##$PKNL= yes
##$PPARMOD= 0
##$PSCAL= 0
##$PSIGN= 0
##$REVERSE= no
##$SF= 81.014009
##$SI= 65536
##$SIGF1= 159.3651
##$SIGF2= -187.1042
##$SINO= 113.3802
##$SIOLD= 16384
##$SREGLST= <1H.CDCl3>
##$SSB= 0
##$STSI= 65536
##$STSR= 0
##$SW_p= 40650.406504065
##$SYMM= 0
##$S_DEV= 0
##$TDeff= 32768
##$TDoff= 0
##$TI= <>
##$TILT= no
##$TM1= 0
##$TM2= 0
##$TOPLEV= 0
##$USERP1= <user>
##$USERP2= <user>
##$USERP3= <user>
##$USERP4= <user>
##$USERP5= <user>
##$WDW= 1
##$XDIM= 65536
##$YMAX_p= 284940756
##$YMIN_p= -52442401
$$ End of Bruker specific parameters
$$ ---------------------------------
##NTUPLES= NMR SPECTRUM
##VAR_NAME=  FREQUENCY,     SPECTRUM/REAL,   SPECTRUM/IMAG
##SYMBOL=    X,             R,               I
##VAR_TYPE=  INDEPENDENT,   DEPENDENT,       DEPENDENT
##VAR_FORM=  AFFN,          ASDF,            ASDF
##VAR_DIM=   65536,         65536,           65536
##UNITS=     HZ,            ARBITRARY UNITS, ARBITRARY UNITS
##FACTOR=    0.620285442955139, 1,           1
##FIRST=     20137.2065510759, 0,            0
##LAST=      -20513.1999529892, 0,           0
##MIN=       -20513.1999529892, -52442401,   0
##MAX=       20137.2065510759, 284940756,    0
$$ Real data points
##PAGE= N=1
##DATA TABLE= (X++(R..R)), XYDATA
$$ [...]
39783D92250j50863l1859m5849n3455O2934J65276J26709M1776J6358j9463j22438
39772D81376j55657J531J92249J46509j40182l76247l25505n4344J83308J96334
39762A49372j9309k94999l94912k01501J54537M02685L83946J39492k05437m98033
39752c84159n15926j12113M89146P71697M98950J9844k21541k68373m03571n13281
39742f39327k14446L96999O97789M11649N301p9176q1135l68498o59298m06905
39732i37047K60710O21752L44474j58635l97410l32112j49611L7591J31545O0699
39722e18044k8910P0182K18077P6417k51418k18805L07834O71526K77341n27497
39712G6703q68142m50460J63478L37249O6905j70289o4893J80901J74542q9393
$$ y = [492250, 341387, 309528, 263679, 210224, 273158, 438434, 565143, 606919, 623277, 603814, 481376, 325719, 327250, 519499, 666008, 525826, 149579, -175926, -230270, -46962, 149372, 130063, -164936, -559848, -761349, -606812, -204127, 179819, 319311, 113874, -384159, -900085, -1012198, -523052, 248645, 747595, 767439, 545898, 277525, -126046, -639327, -853773, -456774, 241015, 652664, 657965, 578789, 497654, 129156, -530142, -937047, -676337, -54585, 289889, 131254, -266156, -598268, -747879, -710288, -578743, -518044, -546954, -476772, -258695, -182278, -433696, -652501, -344667, 326859, 604200, 76703, -791439, -1241899, -1078421, -741172, -674267, -844556, -909449, -728548, -554006, -643399]
39702f43399j85262J04390L93975K62944m2559L884K85005J91411k95426m67065
39692c92102o5240K14160j50138o09280m25342J51061L65313J87059J82809M01468
39682a40232L06594j72860l83381K2414M72318K72748m11654p78253l97879L03321
39672i06864N76211K26393j59282L2735N72292O21199r8311q30765p53383L172
39662g16603O70865Q02090M77373q2932n92648o68018k58033J19291N6603j18403
39652c10415O3561L47502J78355k82551l60992M4367L64686K99273J06308k2086
39642D28008j51519j86232L0231K26898M0787k38665o4556L25063K02251l42234
39632B70032m52514K5722K72145n2141k41550J27176M38958J97801j13532j8912
$$ y = [-643399, -828661, -724271, -330296, -67352, -109911, -106027, 178978, 370389, 74963, -392102, -457342, -243182, -393320, -1002600, -1427942, -1276881, -911568, -724509, -541700, -140232, 166362, -6498, -389879, -367465, 104853, 377601, -34053, -812306, -1210185, -906864, -330653, -104260, -263542, -230807, 341485, 962684, 864373, 33608, -719775, -716603, -45738, 756352, 1233725, 1150793, 558145, -109873, -367906, -248615, -192012, -310415, -246854, 100648, 279003, -3548, -364540, -320173, 44513, 343786, 450094, 428008, 276489, 90257, 120488, 347386, 388173, 149508, 84952, 410015, 612266, 270032, -182482, -156760, 115385, 63244, -178306, -51130, 387828, 585629, 472097, 453185]
39622D53185Q2022k04104m16861j14344K23313M0152k90419k04241J7289j11767
39612e25775k84415n3015J57099k11792o48537l05252M89034O84302K01016p6943
39602e74278J46533K67331J6056j60805o4247l2381j24702Q398L01959K58889
39592D2753j11685k59053j04914j33276l45695j69849L68983M70240q5158m43409
39582g71063j6917O45059Q42168O68070M24540K163n28684n92064q0466J83736
39572G76542k71006o62354k27415M16699K85856k73830j90258M63290N96241k1439
39562H92326l96520j8193L40881j0713n68310n23373J353L01342J57861q6211
39552I0443j79557j32829M2240K98188M13166K61673P0513P5569J04002j37168
$$ y = [453185, 535207, 331103, -85758, -200102, 23211, 63363, -227056, -431297, -414008, -525775, -810190, -863205, -706106, -917898, -1566435, -1871687, -1382653, -698351, -497335, -574278, -427745, -160414, -144358, -305163, -369410, -401791, -526493, -518095, -216136, 42753, -68932, -327985, -432899, -566175, -911870, -1081719, -712736, -242496, -327654, -771063, -787980, -142921, 699247, 1367317, 1791857, 1794020, 1265336, 673272, 592806, 776542, 505536, -156818, -384233, 32466, 318322, 44492, -145766, 317524, 913765, 892326, 495806, 477613, 818494, 807781, 239471, -283902, -282549, 18793, 176654, 90443, -89114, -221943, -179703, 118485, 531651, 793324, 863837, 939406, 1043408, 906240]
39542I06240n06842n72315k46773J02646J92715J22201Q3335R4222J09289J21837
39532D06555N6836j83949m65539m68110j26610K21742K71237Q1112j58481l79241
39522g44448m63584k03484K57962L43095j53295n54122j94063N05100O14772J33154
39512d58913q5396K16739L73765J01526M1L07794K93850l69869p02468P8136J034401
39501G89606P92464k80997o49344k5014L50676j33401n91661l27489M3384j46002
39491a77778m14408r0143M32202L78402p9721j65941K05264L90690J13789j96311
39481C96045j63698N4229J30070j5338k31168l05583j24373J56494K02535o5536
39471C3677l03049j93463J34220L41899L14725J42313r4995k76149j98076J53451
$$ y = [906240, 399398, -172917, -419690, -317044, -124329, -2128, 81207, 175429, 284718, 406555, 463391, 279442, -186097, -654207, -780817, -559075, -287838, -206726, -365207, -744448, -1208032, -1411516, -1153554, -810459, -963754, -1517876, -1711939, -1206839, -592067, -458913, -544309, -327570, 46195, 147721, 147762, 455556, 749406, 379537, -322931, -244795, 789606, 1582070, 1301073, 651729, 626715, 977391, 843990, 252329, -75160, -31776, -177778, -592186, -682329, -250127, 128275, 48554, -117387, 87877, 478567, 592356, 396045, 232347, 286576, 416646, 401308, 170140, -135443, -259816, -103322, 99213, 33677, -269372, -462835, -328615, 13284, 328009, 470322, 375327, 99178, -98898, 54553]
39461E4553M69783M78224K57919K2415j82521l69664m44846l69698k72682k15416
39451e71933q5801J20341K00594R8292L4353J09140J27550J1967j7653R4546N6875
39440A78271j94271k27423J80302N52142M07336P036j47223j53262l89164o60386
39430d46642m12101L04532P59796N01439j20845m67564k90199J33986L08784J3959
39420B85145l77253l06189J42278K83690p1434k27816K22595N74766J23496n55067
39410I4211m51678K27820M42127N9650p2618K44080K30380l35182n71225J995
39400a30440N74023L50824k20914l21877n7046m2117l08651m61005m60322m59833
39390a537358k45199L74555R15707P44187P3285k88212q2113J76768P9038k06391
$$ y = [54553, 524336, 1002560, 1260479, 1282894, 1100373, 730709, 285863, -83835, -356517, -571933, -657734, -537393, -336799, -238507, -204154, -95014, 32536, 44503, 26850, 121396, 178271, -16000, -243423, -63121, 489021, 896357, 903393, 756170, 602908, 213744, -446642, -858743, -554211, 205585, 707024, 586179, 118615, -171584, -37598, 271186, 285145, -92108, -398297, -256019, 27671, -43763, -271579, -48984, 525782, 649278, 94211, -357467, -129647, 312480, 372130, 299512, 543592, 773972, 438790, -132435, -130440, 443583, 794407, 573493, 251616, 194570, 152453, -156198, -617203, -1077525, -1537358, -1782557, -1408002, -492295, 251892, 325177, 36965, -45148, 131620, 210658, 4267]
39380D267l64438k99467k7072L32440M41063Q1548l87464l87597M8070L05209
39370b53441J22296n1121J69917M86098M13813J9356k58013k72208k33889k32973
39360i0165j28584O9659J03888j00762k14208M8546M63945N88702L90442K19682
39350A351145J70483p1088n66714p85778l30629L45722M94042J36277o0360R3707
39340G76807O9675l34799n00519j845N32630K65508n44449q59884l33624L09782
39330f20718M20675K33978K55217M20481L34742J3816j27672M8790J77631o0546
39320A096394m54076n32680j98238J45132J16614j73524l21409j82407l264p9
39310e07537n6846J7697J32164N0576j95539k95279r3933J75886K10345L1269
$$ y = [4267, -360171, -659638, -686710, -354270, 86793, 168341, -219123, -606720, -558650, -253441, -131145, -182266, -12349, 473749, 887562, 906918, 648905, 376697, 142808, -90165, -218749, -149090, -45202, -145964, -360172, -311626, 152319, 741021, 1131463, 1351145, 1521628, 1450540, 883826, 98048, -232581, 113141, 607183, 743460, 683100, 776807, 846482, 511683, 11164, 9319, 541949, 807457, 263008, -596876, -930500, -620718, -200043, 33935, 289152, 709633, 1044375, 1058191, 930519, 979309, 1156940, 1096394, 642318, 109638, -88600, 56532, 173146, -378, -321787, -504194, -507458, -507537, -564383, -546686, -414522, -363946, -559485, -854764, -948697, -772811, -562466, -531197]
39300e31197q9997k4176R1420J23767J34826J95033J88532J5715j30565R097K84975
39289B67430K48925j66282m58038k56916J42810K64612J19249j5024j56146m12761
39279d22141m63559O1014P54910P56623N843n62158l37089J63868K22185r315
39269A70181N0188L75723M33938P5132k91012l30486j23267Q2310R6099j43703
39259C95103m34087l99969k216K89845J55460o8857L1708K19728N4250k24482
39249A6483l1250M60338M14220l37777q81479m85395L84493P74628M61657n1467
39239G24451l88943n85984o80541n37260j28079L18084N26177M13683J35899l8007
39229b40520K6124J65624J50533P9890K74197O78406P31329J12643o65792q24671
$$ y = [-531197, -621194, -645370, -553950, -430183, -295357, -100324, 88208, 103923, -26642, -17545, 267430, 516355, 350073, -107965, -364881, -222071, 42541, 161790, 146766, -9380, -422141, -885700, -824686, -69776, 686847, 692690, 130532, -206557, -42689, 179496, 170181, 220369, 596092, 1030030, 1105162, 814150, 483664, 360397, 442707, 538806, 395103, -38984, -438953, -441169, -151324, 4136, -64721, -33013, 186715, 240965, 16483, -14767, 445571, 859791, 522014, -359465, -844860, -460367, 314261, 775918, 724451, 335508, -250476, -931017, -1468277, -1596356, -1278272, -752095, -338412, -202513, -240520, -214396, -48772, 101761, 181651, 455848, 1134254, 1865583, 1978226, 1312434, 487763]
39219D87763l30814J07858N5731j30995L609K41074N1450m76221o34095j28404
39209g53044M07901K95732j76925j85637L52590O25589J70464m10661l62073J49260
39199A13196M07718J97935j37568m03918o27468n87256l1363O32432O20490q7899
39189I6299n91736l08927K73293M32228J76811p7538k55051m61156m79848o8732
39179a264357M62283N54007J76567j85563k41773j31417j9842Q3366J10173l9253
39169d95809k13926j16571K53198N56226N44216K73898q1522l44263k99886R6944
39159A72505M76666L74257j40763m84719l03605J07883K50092J4620k97946l49593
39149a80603n0338L57866M62971J18423k91870k72875J16885L43069J50850j50753
$$ y = [487763, 156949, 264807, 320538, 189543, 193152, 434226, 485676, 9455, -624640, -753044, -345143, -49411, -226336, -411973, -59383, 566206, 736670, 326009, -36064, 113196, 520914, 718849, 581281, 177363, -450105, -1037361, -1068724, -436292, 184198, 96299, -495437, -804364, -531071, -98843, 77968, 430, -254621, -715777, -1195625, -1264357, -802074, -248067, -71500, -257063, -498836, -630253, -650095, -566729, -456556, -495809, -709735, -826306, -573108, -16882, 527334, 801232, 719710, 375447, 75561, 172505, 649171, 1023428, 882665, 397946, 94341, 202224, 452316, 466936, 168990, -180603, -230941, 126925, 589896, 708319, 416449, 143574, 260459, 603528, 754378, 603625]
39139F03625k53560k68605l67328l98343j72720J62375L51720L92087L61375J41339
39129E51965l16605o47715m33508J67020N47235M18031R5652j3892J00262J79440
39119F47885O0395j98660l98715l39931p144L55892M66352K87787N185k04067
39109F74979k44274q0373J47109J20395k57047n68599l49939K01580M02001J6565
39099F2397m15022l52701M7489K78959K07021J05300J55708K45921K13027N4164
39089F02263j07264j50786p7481k2329o3589p0624O6730J42972q7728l82079k36134
39078c86049K81716M99918J63783j43188K1581K21474k7626l14075m3692L93506
39068F67348J89063m29362m53995K15675N34166R847n07494k50016K83084K86027
$$ y = [603625, 350065, 81460, -285868, -684211, -856931, -694556, -342836, 49251, 410626, 551965, 235360, -412355, -845863, -678843, -131608, 286423, 382075, 368183, 468445, 647885, 708280, 509620, 110905, -229026, -236170, 119722, 586074, 873861, 879046, 674979, 430705, 350332, 497441, 617836, 360789, -207810, -557749, -356169, 45832, 62397, -352625, -705326, -657837, -378878, -171857, -66557, 89151, 335072, 548099, 602263, 494999, 344213, 266732, 244403, 180814, 110190, 176920, 319892, 232164, -149915, -386049, -104333, 395585, 559368, 416180, 437761, 659235, 631609, 317534, 273842, 667348, 856411, 427049, -26946, 188729, 722895, 732742, 225248, -24768, 258316, 544343]
39058E44343m5754l4550K57318K40519j29723l45038k10284m02J04159J28778
39048E09366K2152j74851j09686L41612N99644J42136n32129n23613O5360K79930
39038F19921j66169n07867k29269K13387L03096K26265K74295K47930j0665j52854
39028H18070L8127J26991k44249o26284m35621P1664K27884L3346K9623K76938
39018C16489K69008j19903l59480j27101J73212O2988k98675m24088k30793q1595
39008h19938j89377l09981j05705L66699O92688O04083K86964R3123Q7567P4881
38998G81004l1231j38779k26220l40461l60319j30981J46274R2950k07030k46252
38988f61045R0022L22505K27812K23258M89751M24624l47757j031046o47387L95858
$$ y = [544343, 498589, 464039, 721357, 961876, 832153, 487115, 276831, 276429, 380588, 509366, 531518, 356667, 246981, 588593, 1188237, 1330373, 798244, 274631, 339991, 619921, 453752, -54115, -283384, -69997, 233099, 459364, 733659, 981589, 970924, 818070, 856197, 983188, 738939, 112655, -322966, -251302, -23418, 9928, 39551, 316489, 585497, 465594, 106114, -20987, 152225, 215213, -83462, -507550, -738343, -819938, -1009315, -1319296, -1425001, -1058302, -365614, 238469, 525433, 618556, 706123, 781004, 749773, 610994, 384774, 44313, -316006, -446987, -300713, -207763, -414793, -661045, -571023, -248518, -20706, 202552, 692303, 1116927, 769170, -261876, -909263, -513405]
38978e13405P61484R6408n51840l69887J60630K30825q7577j85872P9563L45156
38968c4515L97467L36952K27394J1486k54990l83417k89339q9709M3810O1163
38958B6302P7597K26076M17359L52328q1207n46365o16343l00934L2718J61493
38948b50976J38031K4329j53772k34168n8480K21567K97297J40157j6361o5812
38938D1812p7452n0619L7066O1881j8909J5068K05242J34789l46115n49743O3806
38927d83174P33165L55398o37370p46987K07176P43213J48897l97513M6776N51536
38917E21117O2150o04960j64838P54016N32176o82609j110510j56886P74067N96231
38907E19954M241r326K81156J09038m25496o50935l80517J7247K03277P2377k53712
$$ y = [-513405, 248079, 344487, -207353, -577240, -416610, -185785, -273362, -459234, -379671, -34515, 362952, 699904, 927298, 938784, 683794, 300377, 11038, -78671, -34861, 26302, 103899, 329975, 747334, 1099662, 1018455, 472090, -144253, -445187, -412469, -250976, -112945, -88616, -242388, -476556, -535036, -313469, -16172, 123985, 107624, 41812, -35640, -86259, -49193, 12688, -6221, 8847, 214089, 348878, 2763, -546980, -483174, 249991, 605389, -31981, -778968, -571792, 171421, 320318, -77195, -30419, 521117, 583267, -21693, -186531, 567485, 1099661, 417052, -693458, -850344, -76277, 519954, 524195, 514869, 796025, 905063, 479567, -171368, -551885, -534638, -331361, -258984, -512696]
38896e12696l70463L1833N76941N47474m4630m08767j68000J81413K53918L29259
38886D16282N12689K84353m72021q68257k83342M91175L56314l98140n84165M2203
38876e02909N64243M36494J38104J52561K63018J81188Q3521J16242L290m07653
38866A028099p14384n43288j75280j09393k85868k49374P2896K77778J74700Q9970
38856d34144L14079O09687N54816J61635j72286k41947k29601l06309l71671l06506
38846d22247j82967m8845K02045N11838N21688Q4200l67205l65567p2399P2602
38836f6857R0875K48377L32445p2279o65802o75094j08205J63622j67515l17055
38826a237488K20564P33409M53475j59889k03523K17841L12641m0523k60118j48375
$$ y = [-512696, -883159, -851326, -274385, 273089, 228459, -180308, -348308, -166895, 87023, 416282, 928971, 1213324, 741303, -126954, -410296, 80879, 437193, 39053, -545112, -502909, 61334, 497828, 635932, 788493, 1051511, 1232699, 1316220, 1432462, 1435752, 1028099, 313715, -229573, -404853, -514246, -800114, -1049488, -976592, -698814, -524114, -434144, -120065, 489622, 1044438, 1206073, 1033787, 791840, 562239, 255930, -115741, -422247, -605214, -654059, -452014, 59824, 581512, 665712, 298507, -67060, -139459, -66857, 24018, 272395, 604840, 532561, -133241, -808335, -916540, -752918, -920433, -1237488, -1016924, -283515, 169960, 10071, -193452, 24389, 337030, 296507, 36389, -111986]
38816a11986n7950r3313k9013M7797j34265l14707O227N62444N45533n9167l30003
38805C1597J29194N30875J62496n21150o55386j79863L20393N04877M16056J05031
38795H44120l09286m72603j94328J78444J99145o6311k37248j94849o3319J53573
38785a62662M54622N24299N2646o47994q35813k74066M09132N06128J02023j37787
38775i472O5087K32607j09122o18736n47054J06254M59954N2181l42361J73105
38765e37557J119881J161148K8863j008223q38467J28247O95182L59673l98234
38756G10513q50804o26222P8399N86008L84022j52432j68552L98401O60785J87802
38746A207920k78657p7349K48730p9304o85705o55633n9184K62140J47113J87962
$$ y = [-111986, -169936, -263249, -292262, -244465, -378730, -693437, -687210, -124766, 420767, 361600, 31597, 160791, 691666, 854162, 333012, -322374, -502237, -181844, 323033, 739089, 844120, 534834, 62231, -132097, 46347, 245492, 179181, -58067, -252916, -316235, -162662, 291960, 816259, 868905, 220911, -614902, -888968, -479836, 26292, 128315, -9472, 55615, 288222, 179100, -439636, -986690, -880436, -420482, -368301, -710662, -537557, 582324, 1743472, 1772335, 764112, -74355, 53892, 749074, 1108747, 710513, -140291, -766513, -688114, -102106, 281916, 129484, -39068, 359333, 1020118, 1207920, 929263, 851914, 1100644, 1021340, 335635, -319998, -379182, -117042, 30071, 218033]
38736B18033M54870L47568j56850k73167K33793N19153N156o55472o19206j14894
38726d1016Q3470r9194j31151J04595J73353r0903k84010o6584L40148M71008
38716D59716J98185j53358k08430J2708J25082q5133l12201j59963K14905K88775
38706C80286k4360k29095j0695L31644M02987K24564J219j95861k63671k9099
38696E87919L28284K79056k69611o69978m61541j07818k24854n36751l57527K09982
38686a222839M35571J91493R9002L73754M36285l7161m91193l75044J4146J16969
38676d59017J1674J17256L82539M15553J86335j5096j68216m49298o47640l26276
38666i52186L50182O05057J29673l86762k04907M20558O46937K25933k75885l61029
$$ y = [218033, 672903, 1020471, 863621, 590454, 824247, 1343400, 1348556, 693084, 73878, -41016, 42454, -56740, -187891, -83296, 90057, -846, -284856, -351440, -11292, 459716, 657901, 504543, 296113, 308821, 433903, 348770, 36569, -123394, 91511, 380286, 355926, 126831, 116136, 447780, 850767, 1075331, 1076550, 880689, 617018, 587919, 916203, 1195259, 925648, 255670, -205871, -313689, -538543, -1075294, -1432821, -1222839, -787268, -595775, -496773, -123019, 313266, 276105, -215088, -590132, -575986, -459017, -447343, -330087, 52452, 468005, 654340, 639244, 471028, 21730, -625910, -952186, -602004, 3053, 132726, -254036, -458943, -38385, 608552, 834485, 558600, 197571]
38656A97571j65369k9713M0604K15959M08313L19860j24453o05141p09146l32607
38646g84122K17095M97483L38923j5466k09022j60522n5100o240P7957K62695
38636A63681M20857M03051K33183L3840j26375k21790k21280j46540r0755j11649
38626C36223j77652k24195j62469R4364M15224L82870j92821p63785n72178K44975
38616f19444P05750L59868r0723K4464K86693K7697m16672k62427L22438M59856
38606G97500K4939k42702q4031m9020l25141l72933n1625J5380l22983k61232
38596h71848N35853J083416N46192l55112m55829P3264K20114j43506k75139R186
38586C66591J44870m3105j36619o4442j99861m51558k66604L13000N56375K09295
$$ y = [197571, 32202, 2489, 43093, 259052, 667365, 987225, 862772, 257631, -451515, -784122, -567027, -69544, 269379, 253913, 44891, -115631, -170731, -176971, -99014, 163681, 584538, 987589, 1220772, 1254612, 1128237, 906447, 685167, 538627, 447872, 336223, 158571, -65624, -228093, -133729, 281495, 664365, 471544, -292241, -864419, -619444, 86306, 446174, 355451, 379915, 666608, 694305, 277633, 15206, 337644, 797500, 822439, 579737, 495706, 446686, 121545, -251388, -303013, -287633, -610616, -871848, -335995, 747421, 1293613, 938501, 482672, 555936, 776050, 632544, 357405, 366591, 511461, 468356, 331737, 267295, 67434, -384124, -650728, -337728, 218647, 427942]
38576D27942j54804j74022j74575l23277k31569J91350L70471M8848j71547J56461
38566c4722N20251L16880j25673j40670J71502K09153r3342k38585j3013K59290
38556H31071K51855j2886k86683l01714j2353K11506m7196n53231n86363k3681
38546e29675L85819J85584q8538P3781K18913j74482n46911p0221Q34588R58149
38536A247007J05819o83239p16450l83049j84250m1115J58998K10533J13966J92533
38526B0753L92900K14638l62555o45712k87004J71819K29099J44679K27282J58612
38516B64511l01197n94893j67493N00068N25360k0433k81115J122J67388j97623
38506a04305n79281l25611M12398R11085P56680J95066k61825l57156k25385j10585
$$ y = [427942, 273138, 99116, -75459, -398736, -630305, -438955, -68484, -19636, -191183, -34722, 485529, 802409, 676736, 536066, 707568, 916721, 823379, 584794, 571781, 831071, 1082926, 1070040, 783357, 481643, 469290, 680796, 633600, 80369, -505994, -529675, -143856, 41728, -46810, 26971, 245884, 71402, -475509, -545730, 288858, 1247007, 1352826, 669587, -46863, -429912, -614162, -655277, -496279, -285746, -171780, 20753, 413653, 628291, 265736, -379976, -666980, -495161, -266062, -121383, 105899, 264511, -36686, -631579, -799072, -299004, 226356, 205923, -75192, -74070, 93318, -104305, -683586, -1009197, -596799, 314286, 1070966, 1266032, 1004207, 647051, 421666, 311081]
38496C11081n3044L3205N7804j55439m19291k46211L93805Q00585M43841k15559
38486I50777l43700P7171L15110L3626l20962l34872j56012q083J97043M34376
38476H44474L16165k72023p26521m65775J83276M24285J32310q1876R1548K44254
38466F90117M4559j88342r1143O8659j31815m52037k96879K72881N26417J65132
38456F07549k08074k7535L72978L08492k23726o07276n02669j47410J49760L07976
38446C0065K81055M6598j62149n5725K10987J77944j85177l50224q845M65898
38436D50427N69855K83742j06956m20058n28377k86725J64407L65985J49496o2981
38426E78815P0793K22735m7867m77047m31001J21944N70794N34495K36034Q117
$$ y = [311081, 258037, 291242, 349046, 193607, -225684, -471895, -78090, 722495, 1166336, 950777, 607077, 684248, 999358, 1032984, 712022, 377150, 221138, 213055, 410098, 844474, 1160639, 888616, 162095, -303680, -120404, 303881, 436191, 354315, 445863, 690117, 734676, 546334, 455191, 523850, 392035, -60002, -356881, -84000, 442417, 607549, 399475, 371940, 744918, 1053410, 829684, 222408, -280261, -427671, -277911, 30065, 311120, 357718, 195569, 139844, 350831, 528775, 343598, -6626, -15471, 450427, 1020282, 1304024, 1197068, 777010, 248633, -38092, 126315, 492300, 641796, 578815, 649608, 872343, 824476, 347429, -83572, 38372, 609166, 1143661, 1379695, 1387812]
38416A387812p8428n5610K5340k6009l33130o10926m62436k7992J52157k0899
38406e0121n6693K64590M64795J38974l40391l61875J6442K18169L8549j33991
38396A98448J1106K55269K20974r0274l29151k42999O9327L13713L05372R9558
38386H11343j18371k14988j85512j05051l7392K4301J26085K38312K25751K9906
38376G94384j78477k06304j55070k60518m06587j86469L92395O89797K66471m05602
38366C44020n29288n3315L56453K97305L8984n3730N342M9219M8439K4285k9152
38355D98562m0779O1982J55536P8226n4975l8221L663j68005l27401j8301N62094
38344G12381N91910j78522q79001o27680K74931P86372M56506k02015n23329l93107
$$ y = [1387812, 1309384, 1253774, 1279114, 1253105, 919975, 309049, -153387, -181379, -29222, -50121, -106814, 157776, 622571, 761545, 421154, 59279, 75721, 293890, 332439, 198448, 209554, 464823, 685797, 595523, 266372, 23373, 92700, 406413, 711785, 811343, 692972, 477984, 292472, 187421, 150029, 174330, 300415, 538727, 764478, 794384, 615907, 409603, 254533, -5985, -412572, -599041, -206646, 483151, 749622, 344020, -185268, -238583, 117870, 415175, 454159, 400429, 405771, 454990, 503429, 527714, 498562, 457783, 519765, 675301, 753527, 698552, 660331, 663994, 495989, 168588, 150287, 712381, 1304291, 1125769, 246768, -380912, -105981, 680391, 1136897, 934882, 411553, 18446]
38334A8446j45469p6870j31714R009M58642P88562M72505k87901o40259k01816
38324B63135L80531L63856n7672j97095M802P898l10820m19307m7204K99632Q7265
38313C75021m14479m93990j852M49418L31391j01643j95238J93853N18289L27156
38303I87926j22243k96434j42508j327M6592K02174L53305R2236n05249p29568
38293a15096k16266M22496L92745k16114o26328l87934K25487O65828N98674R1547
38283H35039m01479m12390k4751J94327P778j62190O016J75615J5179j24875J41041
38272B49310L87828L0406n04588k61752O63451J070587L80150n32918o38676r5742
38262G48056K51943J22960r0595j02570k1787j126m4811j14473j41448j8484K00208
$$ y = [18446, -127023, -203893, -335607, -326598, 132044, 920606, 1393111, 1105210, 464951, 263135, 643666, 1007522, 949850, 752755, 757557, 765455, 454635, 35328, -11876, 287756, 375021, -39458, -533448, -535300, -85882, 245509, 143866, -51372, 142481, 660770, 987926, 865683, 569249, 426741, 425414, 472006, 674180, 1027485, 1119721, 614472, -115096, -331362, 91134, 483879, 267765, -358563, -746497, -521010, 144818, 743492, 835039, 433560, 21170, -3581, 190746, 198524, 36334, 42350, 217965, 233144, 108269, 249310, 637138, 667544, 162956, -98796, 564655, 1635242, 2015392, 1482474, 843798, 748056, 999999, 1122959, 1032364, 929794, 908007, 906881, 862070, 747597, 606149, 587665, 787873]
38251G87873K26923q5373m12894k84654K84667P24420N36806j41462o92414o73672
38241B70220k28366J69738K58521J47529K6254m7703o2433k1959n7804k75166
38231A78831m26277j33772M26608N65597P7341l46552j28728L16794L11419l98
38221H40863n7007N3697j37632m21913j67321M38724M91632j54407n65129j78240
38211A43267M00521M67025J89272J2186r2597k27776j62004R8760L2867m92682
38201C68839p34778j77745N46464O20071K86730K37868L20649o9751o85434o82657
38191C0256n9385K98292P2142o7512K63764M87119J11731l77336k83544K38222
38181G13749M92807K39330j61730l47842k54431Q372K17297J26666j99258l09889
$$ y = [787873, 1014796, 929423, 516529, 231875, 516542, 1240962, 1777768, 1636306, 943892, 270220, 41854, 211592, 470113, 617642, 643896, 596193, 533760, 511801, 453997, 178831, -247446, -381218, 45390, 610987, 688328, 341776, 213048, 529842, 841261, 840863, 783856, 837553, 699921, 278008, 110687, 549411, 1041043, 886636, 321507, 143267, 543788, 1010813, 1200085, 1212271, 1119674, 891898, 729894, 828654, 861521, 368839, -365939, -543684, 2780, 622851, 909581, 1147449, 1468098, 1398347, 712913, 30256, -29129, 269163, 341305, 273793, 537557, 1024676, 1136407, 759071, 475527, 713749, 1206556, 1445886, 1284156, 936314, 681883, 690255, 907552, 1034218, 834960, 525071]
38171E25071P3743N86023O36863J90786k34105k99184j92259j79757j89253n2059
38161H65869J07442L0752k43652m07714l23304j60145o3044L8184J92530K83173
38151C20091K68460K78068K71257n1057o59716q87481k45270O87401Q52763J38497
38141I73013m79733l03969K69074N17067L22729o193k77812l73561j42100K66354
38131G64869L85343R5284j69198j91074l29829o71676n68548K63964Q97285M25417
38121I01837m77078m15215N83509J087988M55951l14983k92204O1089n7211l96044
38111A137639k42646K38402K61716k57154n42990j33668M94057O38972K31699
38102A826027k38413l55069j27351J46712K10991N8203j38286k45642k59197k06034
$$ y = [525071, 598814, 1184837, 1821700, 2012486, 1778381, 1479197, 1286938, 1107181, 917928, 865869, 973311, 1004063, 760411, 352697, 29393, -130752, -193796, -155612, 36918, 320091, 588551, 866619, 1137876, 1086819, 427103, -460378, -705648, -18247, 834516, 973013, 493280, 189311, 458385, 975452, 1298181, 1291988, 1014176, 640615, 498515, 764869, 1150212, 1245496, 1076298, 885224, 555395, -116281, -684829, -420865, 476420, 901837, 424759, 9544, 593053, 1681041, 2136992, 1822009, 1529805, 1590894, 1533683, 1137639, 894993, 1133395, 1395111, 1137957, 594967, 461299, 955356, 1594328, 1826027, 1587614, 1232545, 1105194, 1251906, 1462897, 1521100, 1382814, 1137172, 877975, 671941]
38092F71941r9305j099J6102k416M4270J04860K2176j63206j71522J38584N24329
38081A084714O29704L87402M0612j35625m2871K09181L76431K53858j32703n31917
38071B138786o99435n94528l45786q7626J34595L19989M11798L17115R2188l42
38061A686754J81991L50992J21932l39059m28314J666L48293J44573k56505l15495
38051A496828j44398j18713p9551K99854O40139K77829n04266o50330R3962P23962
38041B035316M66836j31193j70227K70574M87597L37488K66760L99630L54582
38032D317363l9706m53084n83497n20627m31837k48589J05102L95917K88314j40943
38022B688413l51301O089N17641M41935k46638p04112l67518K25192K66428j05586
$$ y = [671941, 572636, 571537, 587639, 585223, 629493, 734353, 756529, 593323, 421801, 560385, 1084714, 1714418, 2101820, 2142432, 2006807, 1963936, 2173117, 2549548, 2803406, 2670703, 2138786, 1439351, 844823, 499037, 411411, 546006, 865995, 1277793, 1594908, 1687096, 1686754, 1868745, 2219737, 2341669, 2002610, 1574296, 1575962, 1924255, 2068828, 1812323, 1496828, 1352430, 1233717, 1154166, 1454020, 2094159, 2371988, 1867722, 1217392, 1311354, 2035316, 2502152, 2370959, 2200732, 2471306, 2958903, 3296391, 3563151, 3962781, 4317363, 4277657, 3824573, 3241076, 2720449, 2288612, 2040023, 2145125, 2541042, 2829356, 2688413, 2337112, 2343201, 2860842, 3302777, 3056139, 2352027, 1984509, 2209701, 2476129, 2370543]
38012B370543j67578J01123M1992m10167n19482m7949K60319l5182k51513K53234
38002A595340Q90709P00888j42337o16518l44303P3042J04117r7619j63332q698
37992A991289K18936L18653J71408n5082j0575K92613L68181Q724k74620j4058
37982C015469M52915N42619L25154K13725J46168j69564n07839m39430j62418
37973C416799j85125l67371j60200L29074M49556J37086l3963M7952j06656m97942
37963C029210m63308J21810M81751J77671k33638k28891q9284j22383k5601L35478
37953B982815L78775k03607o82223l79332J48535k0594o39722o67962J07274Q18562
37943A842521Q04404L05182j27790k31897l3648K00440P3066m21521o85733l27623
$$ y = [2370543, 2202965, 2304088, 2346080, 1935913, 1416431, 1368482, 1628801, 1593619, 1342106, 1595340, 2486049, 3186937, 3044600, 2428082, 2083779, 2156821, 2260938, 2163319, 1999987, 1991289, 2210225, 2528878, 2700286, 2645204, 2634629, 2927242, 3295423, 3304147, 3029527, 3015469, 3468384, 4011003, 4336157, 4549882, 4696050, 4526486, 4018647, 3579217, 3416799, 3231674, 2864303, 2704103, 3033177, 3482733, 3619819, 3585856, 3633808, 3527152, 3029210, 2565902, 2687712, 3169463, 3347134, 3113496, 2884605, 2795321, 2672938, 2647337, 2982815, 3361590, 3157983, 2475760, 2096428, 2244963, 2224369, 1584647, 916685, 1023959, 1842521, 2646925, 2952107, 2824317, 2592420, 2558772, 2759212, 2832278, 2410757, 1725024, 1397401]
37933A397401J39913N1540l03274j53013M20625N89933J68320j20119J00533L03749
37923B595608P9533j81278q4132M7831j70631l93342n4677O67683R94306N24549
37913D025450l20041p80471m90077J94955N40448K57394j18638J9644M12803L29292
37903D070759k01067l47441J90491O66998M74047L8967J0208K66866L88600M75394
37893F033822P38601Q06822K97013l09613k58627K68552M38968R6058j41480o9687
37883G900429j95511o71337q73044m26181J15167J08011k36803k67983J45443
37874E598191N41235N15775J00247l52183m61554j94016l796k93542p22353n44002
37864D184002K64031Q31043O31013K31652L13009N37224J29404p83607j249226
$$ y = [1397401, 1537314, 1588854, 1285580, 1132567, 1553192, 2143125, 2311445, 2191326, 2291859, 2595608, 2675141, 2493863, 2409731, 2457562, 2286931, 1893589, 1838912, 2506595, 3500901, 4025450, 3705409, 2924938, 2434861, 2629816, 3170264, 3427658, 3309020, 3328664, 3741467, 4070759, 3869692, 3522251, 3712742, 4379740, 4853787, 4892754, 4902962, 5169828, 5558428, 6033822, 6772423, 7579245, 7876258, 7566645, 7308018, 7576570, 8015538, 8111596, 7970116, 7900429, 7704918, 7033581, 6160537, 5734356, 5849523, 5957534, 5720731, 5452748, 5598191, 6139426, 6655201, 6755448, 6403265, 5941711, 5747695, 5743899, 5450357, 4728004, 4184002, 4448033, 5279076, 5910089, 6141741, 6454750, 6991974, 7121378, 6337771, 5088545]
37855E088545q26290j02957K18093J24967k1470r6116j74107k00682l2938K82522
37845D259567M66539K50576l25282q02761o36307J53715P95146N76110k11224
37836D526079n68403r6233M85422L69795k48793n78428m01912k17551k80356k01075
37826B788545K55408N79709K39571l93640m91266J8781L97058K88907J91964M23353
37816D298390M06981l54818j187807j021031J8640P32129N40829J18965J53840
37807C706118L77312K48562j41667l75351l45305r4355M43559J024116R68204
37798E811193Q9364p37192o42428J1322K54492N485J5882M87271P38004L62761
37788F396154j41295j76597J96700N78623P59696O94527M11704J36319R9513J62146
$$ y = [5088545, 4262255, 4159298, 4377391, 4502358, 4480888, 4384772, 4210665, 4009983, 3977045, 4259567, 4726106, 4976682, 4651400, 3848639, 3212332, 3366047, 4161193, 4737303, 4526079, 3957676, 3861443, 4346865, 4716660, 4467867, 3889439, 3487527, 3269976, 2989620, 2788545, 3043953, 3623662, 3863233, 3469593, 2978327, 2997108, 3394166, 3683073, 3875037, 4298390, 4705371, 4350553, 3162746, 2141715, 2160355, 2892484, 3433313, 3552278, 3706118, 4083430, 4331992, 4190325, 3814974, 3469669, 3375314, 3818873, 4842989, 5811193, 5900557, 5163365, 4520937, 4532259, 4786751, 4792236, 4808118, 5295389, 6033393, 6396154, 6254859, 6078262, 6274962, 6853585, 7613281, 8307808, 8719512, 8855831, 8955344, 9117490]
37778I117490P5974O5607N13311J076790R36893Q8991m83269k54646J02412p7027
37768A1162526l82817k01614R2867k30341r15567j007082k92705M14490M09509
37759I049266j83833p98379r43424m29536L56543N58659j43204q43731m99416
37750F122945M71533O52613k84393j057759o73223K21904N08199K07502O2176
37741F231497J65609K9037l30408l79988o9467O7117j20827j57057J44780K91784
37731E872077k4854l52901k22511R1882R8410o8657L7116L23092L11185k360j40804
37720E921675K670j112l00436m41793j33477K60759L42502K51564J95969n0632
37710F047689o03286q81322l21588N92626Q29725K54867k36592r5016K01397J00042
$$ y = [9117490, 9193464, 9259071, 9772382, 10849172, 11786065, 11875056, 11391787, 11137141, 11239553, 11162526, 10779709, 10578095, 10670962, 10440621, 9525054, 8517972, 8225267, 8639757, 9049266, 8865433, 8067054, 7123630, 6694094, 7050637, 7609296, 7466092, 6622361, 6122945, 6594478, 7247091, 6962698, 5904939, 5231716, 5453620, 5961819, 6169321, 6231497, 6397106, 6426143, 6095735, 5715747, 5646280, 5713397, 5592570, 5435513, 5580293, 5872077, 5847223, 5494322, 5271811, 5363693, 5462103, 5393446, 5430562, 5753654, 6064839, 6062479, 5921675, 5924345, 5923233, 5622797, 5181004, 5047527, 5308286, 5650788, 5902352, 6098321, 6047689, 5444403, 4563081, 4241493, 4834119, 5663844, 5918711, 5682119, 5587103, 5788500, 5888542]
37700E888542j62981j22025R4067P3193j40896j98305q6509p7043j57857l1709
37690E078477L22254N17721K93035j19149k81787n5311K83165L60648J10202j61041
37680F348214j41295J15338L19202L58686L42541K88276J04349j07966j25835
37671G501510n6123k88430q37636j165795q98721l29099N0143J31086N5170q4383
37661D077722j09510K19264P00360P03030R8508l55425r3173L52260K15948k46205
37651E562779k54168J33416J77925k03637l38780m6897P9976j78068k78157l065
37641D651324M6084m53187q38374m93023J53365L73202K75983M00006O33919M20369
37631E169668j94793n46863l52236k9323L7215l4317r004R4144J82943K72813
$$ y = [5888542, 5725561, 5603536, 5697603, 5770796, 5629900, 5431595, 5345086, 5268043, 5110186, 5078477, 5400731, 5918452, 6211487, 6092338, 5810551, 5755240, 6038405, 6399053, 6509255, 6348214, 6206919, 6322257, 6641459, 7000145, 7342686, 7630962, 7735311, 7627345, 7501510, 7445387, 7156957, 6319321, 5153526, 4254805, 3925706, 3975849, 4106935, 4162105, 4077722, 3968212, 4187476, 4887836, 5590866, 5689374, 5333949, 5240776, 5593036, 5808984, 5562779, 5308611, 5442027, 5619952, 5416315, 5077535, 5030638, 5110614, 4932546, 4654389, 4651324, 4697408, 4244221, 3405847, 2912824, 3066189, 3439391, 3715374, 4115380, 4749299, 5169668, 4974875, 4428012, 4075776, 4046453, 4083668, 4049351, 4040347, 4134491, 4317434, 4590247]
37621D590247L26744K07776n2971j71669L8175L70194M26780P9714l43818l70644
37611E100528Q3239N33996M41397j05655m64346k82064M5573j6870l68118m64858
37601D502822j25487K73985L78149K40716O4896j07816k84162l34119j40758J64804
37591D633030L03904J75438l9969j18275l5075R0912K05354L12104K85108n4709
37581E757822n48387o72283k09657K81333J37042l90231l84913L81571J022264
37572E374561P71495L2886l22642j95683j09112j67614Q64L45485K82235l21522
37562E690953p65264m82713J42278L57012N3109k60007k52768r0117l1578q3348
37552D277557o9874J51730N24806P27001M18585k76162p33832n35994k7515J58132
$$ y = [4590247, 4916991, 5124767, 5071796, 4900127, 4938302, 5308496, 5735276, 5814990, 5471172, 5100528, 5183767, 5717763, 6159160, 6053505, 5589159, 5307095, 5352668, 5335798, 4967680, 4502822, 4377335, 4651320, 5029469, 5270185, 5335081, 5227265, 4943103, 4608984, 4468226, 4633030, 4936934, 5112372, 5072403, 4954128, 4919053, 5009965, 5215319, 5527423, 5812531, 5757822, 5209435, 4537152, 4327495, 4608828, 4745870, 4355639, 3970726, 4352297, 5374561, 6146056, 6178942, 5856300, 5660617, 5551505, 5383891, 5384755, 5730240, 6012475, 5690953, 4925689, 4442976, 4585254, 4942266, 4995375, 4735368, 4482600, 4392483, 4360905, 4277557, 4207683, 4359413, 4884219, 5611220, 6029805, 5753643, 5019811, 4483817, 4456302, 4614434]
37542D614434k5753p8748J85522L47845R8416k45106k46142q893O7732m5364l2237
37531D631706J81679K99890J33537j43688k86082k33963k7685K51232L92985K15416
37521E415027j07572j93761l5825n2056l54501m08664J73023Q51121P51052r5184
37511E942660p04223m23920K61043M42979p3947o69550p17372j94509M21745O25947
37501D910853K87782k34158l89965N924N11449M87729j54380p59491o13065K20056
37491D272734R29379Q98302L97051J25635K59345L55518J67622J7783J61099L01887
37481G886355J55414O5002M78307J077004J115260N55319J57898L22827N14548
37472A2327934J51523m89670p10360l68649M7365J31660p0977l19130m41889l58472
$$ y = [4614434, 4588681, 4509933, 4695455, 5043300, 5141716, 4896610, 4650468, 4641575, 4709307, 4663943, 4631706, 4813385, 5113275, 5246812, 5103124, 4817042, 4583079, 4555394, 4806626, 5199611, 5415027, 5307455, 5113694, 5077869, 5025813, 4671312, 4262648, 4435671, 5286792, 6037844, 5942660, 5238437, 4814517, 5075560, 5518539, 5444592, 4775042, 4057670, 3863161, 4284906, 4910853, 5198635, 4964477, 4574512, 4580436, 5091885, 5579614, 5425234, 4665743, 4052678, 4272734, 5202113, 6100415, 6497466, 6623101, 6882446, 7237964, 7405586, 7423369, 7584468, 7886355, 8041769, 8106771, 8585078, 9662082, 10777342, 11332661, 11490559, 11813386, 12327934, 12479457, 11989787, 11279427, 10910778, 10958143, 11089803, 11018826, 10699696, 10257807, 9899335]
37462I899335j02767J31550J44730l7179j89259j47802L3546J73335J48107j635
37452A0051961j26079j37662j05002j36930k27755k91137k80688j88066j3703
37443H544939J48543J17699j37721m00931m95951m92163m41924j92644K40251
37434F890098M27770J09474k47146m0889N09453O71396L32929O4809O7895q2386
37424H703403m91778o31879k88393R415p0796j00883K14069L86239O4134j44211
37414G649320L90864J150534J161945M41150j78586l25880k56526j4131N33881
37405A0552571R27724M62320n81825j048988n11262J30258J6077m98960n48839
37396H899076j8163M64388M17082q3078o40352q48218n42711J6270L69317L55748
$$ y = [9899335, 9796568, 9928118, 10072848, 10035669, 9846410, 9698608, 9732154, 9905489, 10053596, 10051961, 9925882, 9788220, 9683218, 9546288, 9318533, 9027396, 8746708, 8558642, 8544939, 8693482, 8811181, 8673460, 8272529, 7776578, 7284415, 6842491, 6649847, 6890098, 7317868, 7427342, 7180196, 7139307, 7648760, 8320156, 8653085, 8717894, 8785789, 8703403, 8211625, 7579746, 7291353, 7300768, 7229972, 7129089, 7343158, 7729397, 7793531, 7649320, 8040184, 9190718, 10352663, 10793813, 10615227, 10289347, 10032821, 10018690, 10552571, 11480295, 11942615, 11360790, 10311802, 9800540, 9930798, 9946875, 9447915, 8899076, 8880913, 9345301, 9762383, 9679305, 9038953, 8190735, 7648024, 7664294, 8033611, 8389359]
37386H389359J76728j9955k49763l73795j49361K79195M18184J39342j02209K2691
37376H530416K62872L07814K83280L81494M50651L79789M88644J019254J544021
37367A3648235J454366Q74801N26269P25950J051125J049705P89329N21538K17074
37358B0858392k41238o33422n52148R202N01459M15607j11865n16477n78016o54031
37348A8497463j026020j376389j267267q85052q00718j069438j136298p34006
37340A0202275l14677l25591n39370m93438k32501j50583l06121l58435j20196
37331G361363K11912L89804L89376L21259K69540K39495J44608r8917l57278l02328
37321H568834J60721O27458O18152K01279p5078J25145N46111P12348N02302K53739
$$ y = [8389359, 8566087, 8546132, 8296369, 7922574, 7773213, 8052408, 8470592, 8609934, 8507725, 8530416, 8793288, 9101102, 9384382, 9765876, 10216527, 10596316, 11084960, 12104214, 13648235, 15102601, 15977402, 16503671, 17229621, 18280746, 19330451, 20119780, 20641318, 20858392, 20617154, 19983732, 19431584, 19440786, 19942245, 20357852, 20245987, 19729510, 19151494, 18497463, 17471443, 16095054, 14827787, 13942735, 13142017, 12072579, 10936281, 10202275, 9887598, 9562007, 9022637, 8529199, 8296698, 8146115, 7839994, 7481559, 7361363, 7573275, 7963079, 8352455, 8673714, 8943254, 9182749, 9327357, 9228440, 8871162, 8568834, 8729555, 9357013, 9975165, 10176444, 10101366, 10226511, 10772622, 11484970, 11987272, 12241011]
37311A2241011L61632Q08305J102344P80022R935m73085j85239N11285Q49588
37302A6005798N74340J33211o07J29731J76727l7114m13160p50455q57422o36590
37292A4324459k37299j5437j49286l72961l02896K5087K07554O5095j39264j80691
37282A3224361k09032l43893k88480J97540O91842N91853J12423O9542N67372
37273A4613528P36201J57424k99368K27273J155840J292572O42680K71108N57895
37264A9355153Q19543P54345R90708J763354K220049J790274J298628J792242
37256C0784296K947701L628569L540651L313902L251859L076515K858118L168896
37248E6570507M104231M962827N194489N047952N011264N142021N214097N066974
$$ y = [12241011, 12602643, 13410948, 14513292, 15293314, 15303249, 14830164, 14644925, 15156210, 16005798, 16580138, 16713349, 16712742, 16842473, 17019200, 16982086, 16568926, 15818471, 14961049, 14324459, 14087160, 14071723, 13922437, 13549476, 13246580, 13271667, 13479221, 13544316, 13405052, 13224361, 13015329, 12671436, 12382956, 12580496, 13272338, 13864191, 13976614, 14046156, 14613528, 15349729, 15507153, 15207785, 15435058, 16590898, 17883470, 18526150, 18797258, 19355153, 20174696, 20929041, 21919749, 23683103, 25903152, 27693426, 28992054, 30784296, 33731997, 37360566, 40901217, 44215119, 47466978, 50543493, 53401611, 56570507, 60674738, 65637565, 70832054, 75880006, 80891270, 86033291, 91247388, 96314362]
37240I6314362M563627L615480K477946J638479J206155P95583K01500k71747
37232A10541385m46018p77219j768548l164476m221926m657926m876496n269457
37224H5359319n708904n861188n694172n432785n151973m694458m039776l506209
37216D5269854l355481l332564k955739k271257j876637k020600k174612j873189
37208B5409775j489991j575421j819538j496981p46697m50003p88590r33242m63855
37199A5645457j00604m55122r38178p13194p0180P9424l52606o45575m95582k92875
37189A1660965k36648o1646K51745K84550q9008m27486m17939k86612k77696k35456
37179A0164769K7516L81528O44603Q03858P74791L71351k45550n21648k09653
$$ y = [96314362, 100877989, 104493469, 106971415, 108609894, 109816049, 110611632, 110813132, 110541385, 110095367, 109318148, 107549600, 104385124, 100163198, 95505272, 90628776, 85359319, 79650415, 73789227, 68095055, 62662270, 57510297, 52815839, 48776063, 45269854, 41914373, 38581809, 35626070, 33354813, 31478176, 29457576, 27282964, 25409775, 23919784, 22344363, 20524825, 19027844, 18281147, 17831144, 17042554, 16109312, 15645457, 15544853, 15089731, 14151553, 13438359, 13368179, 13447603, 13094997, 12449422, 11953840, 11660965, 11424317, 11362671, 11614416, 11898966, 11809958, 11382472, 10964533, 10677921, 10400225, 10164769, 10192285, 10573813, 11218416, 12022274, 12797065, 13168416, 12922866, 12401218, 12191565]
37170A2191565K64334M40492M51060O35328Q77603Q23508N83448P08669J402781
37161A8378788K101635K035870J134170K11805J14017O81364Q72585J21054q27349
37152B4823939r20326k86248O4567j62987k81290o3301k84787j297912k134045
37143A9457610j881144j117986r65343j345733j321111p50087m05600n91039p85310
37134A0294257p05721o78249p98086o82078k90185j17105k91565l15284j6861
37125F399123N5739l79641p18355l81130K47505L78442r3097n73874n66009q0834
37115D287869N03026P13695L53474k27110m78939l33422j65621r7395J06704L89603
37105E051884L19301j42447m43334k75717J7832J29967K07331L00306J28947k44467
$$ y = [12191565, 12455899, 12896391, 13347451, 13982779, 14860382, 15683890, 16267338, 16976007, 18378788, 20480423, 22516293, 23650463, 23862268, 23976285, 24657649, 25530234, 25651288, 24823939, 23903613, 23617365, 23681932, 23518945, 23237655, 23174354, 22889567, 21591655, 19457610, 17576466, 16458480, 15493137, 14147404, 12826293, 12076206, 11670606, 11079567, 10294257, 9588536, 8910287, 8112201, 7430123, 7139938, 7022833, 6731268, 6415984, 6399123, 6454862, 6075221, 5356866, 4975736, 5223241, 5601683, 5508586, 4934712, 4368703, 4287869, 4790895, 5504590, 5858064, 5630954, 5152015, 4818593, 4652972, 4555577, 4662281, 5051884, 5371185, 5228738, 4785404, 4509687, 4527519, 4657486, 4864817, 5165123, 5294070, 5049603]
37095E049603k74419J15514K42276j82823m74843j68287J17627j89551m96081
37086C739016n9997O21595N90322Q308k49157j29796k47929m92667j56417O08082
37076D231360P89997J35431m44235l55015j02457j91465k46398K00940P99640
37067D817798Q71131L54836k08673l54052o8671K85076L04034j9458k63980j75959
37057E542082j2774K6297K34408P11386Q00842N5682p06951l79822P03066J171329
37047H145545O08587p1939k12332j00926L8606M55217R79680R51484M12061K17051
37037A1423034N88015P57773M84895O04472J439931J982957J515963Q48932R06896
37028B0552868J134107M88014p88377j610050j696078j621842j625049j423014
$$ y = [5049603, 4775184, 4890698, 5132974, 4950151, 4475308, 4307021, 4424648, 4235097, 3739016, 3679019, 4300614, 4890936, 4899244, 4650087, 4520291, 4272362, 3779695, 3623278, 4231360, 5021357, 5156788, 4712553, 4357538, 4255081, 4063616, 3817218, 4018158, 4817798, 5688929, 6043765, 5835092, 5481040, 5412369, 5697445, 6001479, 5982021, 5718041, 5542082, 5529308, 5555605, 5790013, 6501399, 7302241, 7357923, 6650972, 6271150, 6974216, 8145545, 8754132, 8682193, 8469861, 8368935, 8407541, 8862758, 9842438, 10793922, 11205983, 11423034, 12011049, 12768822, 13253717, 13858189, 15298120, 17281077, 18797040, 19645972, 20552868, 21686975, 22174989, 21386612, 19776562, 18080484, 16458642, 14833593, 13410579]
37020A3410579r90554o33660m42763l32849l82112n76889n75017k44605q43j13843
37010I117444k34554j19911j32963l96729k48797O37437J367432J062224L04504
37001A1356087K38641P91750R98753O83896N48329P93513Q80014O23582M59413
36992A7373978N92407Q06411J087404J571227J969389J920607J765044K032954
36984B9119421K321758J727076L28933q33392j303605j631430k114957k228265
36976B5385539j646262q87275m94663l18855l342M25577P69039R52530R36687
36967B5118975Q04000R48751J622030K361624K563056K524297L074187M169800
36959D3186720M840099M712414M622352N314405O362342O863210O541678N660176
$$ y = [13410579, 12420025, 11786365, 11343602, 11010753, 10628641, 10051752, 9476735, 9232130, 9231287, 9117444, 8882890, 8762979, 8630016, 8233287, 7984490, 8621927, 9989359, 11051583, 11356087, 11594728, 12386478, 13385231, 14069127, 14617456, 15410969, 16290983, 16914565, 17373978, 17966385, 18772796, 19860200, 21431427, 23400816, 25321423, 27086467, 29119421, 31441179, 33168255, 33497188, 32663796, 31360191, 29728761, 27613804, 25385539, 23739277, 22852002, 22357339, 22038484, 22035142, 22460719, 23229758, 24182288, 25118975, 25922975, 26871726, 28493756, 30855380, 33418436, 35942733, 39016920, 43186720, 48026819, 52739233, 57361585, 62675990, 69038332, 75901542, 82443220, 88103396]
36951H8103396M334256K449642L1142k582673m812595o131543o545067o605370
36943F8241188o612970o172763n070536m065015l920897m082971l453915k240615
36935C2621506j709832k126799k350828j741079j078139j075790j232295q68097
36927B0438647k72250n2100j49940j89976j21206M5031M79269J051325J284866
36918B2513666J188391J394113K111861K769980L079569L565906M588925N705392
36910D6917803O468021P051685P771461Q866025J0880333J4123602J7829398K1497953
36902A41406281K6718113L4480914L9733283L2750046R852119j9140529l8434276
36895B27365951m1158514l3669967k5663813k0464012j6251167j2272071r880595
$$ y = [88103396, 92437652, 94887294, 94918436, 92335763, 87523168, 81391625, 74846558, 68241188, 61628218, 55455455, 50384919, 46319904, 42399007, 38316036, 34862121, 32621506, 30911674, 28784875, 26434047, 24692968, 23614829, 22539039, 21306744, 20438647, 20166397, 20114297, 19964357, 19774381, 19653175, 19698206, 20177475, 21228800, 22513666, 23702057, 25096170, 27208031, 29978011, 33057580, 36623486, 41212411, 46917803, 53385824, 60437509, 68208970, 77074995, 87955328, 102078930, 119908328, 141406281, 168124394, 202605308, 242338591, 275088637, 284940756, 265800227, 227365951, 186207437, 152537470, 126873657, 106409645, 90158478, 77886407, 68005812]
36888F8005812r187788q419225o728807n237468m818722m647891l686548k347334
36880B2932029j755742k039315k238833j697728q22581l73247n02104p78987q72072
36871A1851420q09773o63393m01269j36130j23138l41625m38663k92165k41268
36862H403996m79546o35536l59799L6929L0421k97549m12132j33464K04601L06297
36852F664218J87755k7125k10409k08805k1675J31094J60306K66468M75342M07049
36842G824218p2757l89245k1624O11030O89208J76055k32278j84201L424L8017
36832H441847q098p6668k48062m20614l51706n2203K48466M40530M53188P6686
36822H503366o20013r76702n09070K48346M19375J00704J11351N34452N49092
$$ y = [68005812, 58818024, 50398799, 43669992, 38432524, 33613802, 28965911, 25279363, 22932029, 21176287, 19136972, 16898139, 15200411, 14377830, 14004583, 13502479, 12723492, 11851420, 11041647, 10378254, 9976985, 9840855, 9717717, 9376092, 8937429, 8645264, 8403996, 7924450, 7288914, 6929115, 6966044, 6996465, 6698916, 6286784, 6153320, 6357921, 6664218, 6851973, 6824848, 6614439, 6405634, 6383959, 6515053, 6675359, 6941827, 7417169, 7824218, 7751461, 7362216, 7340592, 7951622, 8640830, 8816885, 8584607, 8400406, 8403830, 8441847, 8433749, 8357081, 8109019, 7688405, 7336699, 7284496, 7532962, 7973492, 8426680, 8503366, 7883353, 6906651, 6397581, 6645927, 7065302, 7166006, 7277357, 7811809, 8360901]
36813H360901j38342p32829o15194k69124l84833p49795p01146k16892J10229
36804D662975k8523l21680l51635r2012J49720J37835o267n31J04234q6205o19656
36793C548255q82089m15814K91616M43263Q6924r3762M6384K599l46809m93421
36783B187146k25607L8121O3532J43623L49184K39338k94740o36600l54074J42272
36773A652195L15433K71504L14077K91561m2666m50669n31246k97605p126K46965
36763A762423L95917K31995k11449m83293l15601m1151l0224j07372M0471K61965
36753A503681K34893L9754m9612p5794k19119l45239k03787J03491K79130K83563
36743A550961K45956J20321j56236l38435j50100K08478K40143j81737o44141
$$ y = [8360901, 8222559, 7489730, 6874536, 6605412, 6220579, 5470784, 4769638, 4552746, 4662975, 4634452, 4312772, 3961137, 3869125, 4018845, 4156680, 4150413, 4149882, 4254116, 4167911, 3548255, 2666166, 2250352, 2541968, 2985231, 3072155, 2978393, 3024777, 3027376, 2680567, 2187146, 1961539, 1999660, 2063192, 2206815, 2555999, 2795337, 2500597, 1863997, 1509923, 1652195, 1967628, 2239132, 2553209, 2844770, 2802104, 2351435, 1820189, 1522584, 1515458, 1762423, 2158340, 2390335, 2178886, 1695593, 1379992, 1338841, 1308617, 1201245, 1241716, 1503681, 1738574, 1778328, 1728716, 1652922, 1433803, 1088564, 884777, 988268, 1267398, 1550961, 1796917, 1917238, 1761002, 1422567, 1272467, 1480945, 1721088, 1539351, 895210]
36734H95210o95608l01295J75546L12865L5745k44233o5146M67685P74896N75664
36724A931329J93983l5661k15964m79539n76756k65503K05081M07777L17675K23869
36714A706291K35497J98848J983k62826l68551j32472K97567M00139j09211o90196
36704A277069n52081J69741N12190J12322k66208K1273N43815O15927L35475J48680
36694B918203J9100k54423m35252k80113p5788o8580P6826N12395N60336k27858
36684B744846r82996o31018L79532P35478L19041J99559O68500P90982J44022
36675D367946m29333k90345K8144m9431j61250R5239K56599j45847n78300k72872
36665B820550N30692R60833P36188K53812j91922n35086n70830k05739J15656
$$ y = [895210, 199602, -101693, 73853, 386718, 422463, 178230, 113084, 580769, 1355665, 1931329, 2125312, 2089651, 1873687, 1394148, 817392, 551889, 756970, 1164747, 1482422, 1706291, 1941788, 2140636, 2142619, 1879793, 1511242, 1378770, 1676337, 2076476, 1967265, 1277069, 724988, 894729, 1406919, 1519241, 1253033, 1274306, 1818121, 2434048, 2769523, 2918203, 2937303, 2682880, 2247628, 1967515, 1891727, 1823147, 1899973, 2412368, 2972704, 2744846, 1761850, 1130832, 1510364, 2245842, 2564883, 2764442, 3432942, 4223924, 4367946, 3938613, 3648268, 3676412, 3626981, 3465731, 3560970, 3817569, 3671722, 3093422, 2820550, 3351242, 4312075, 5048263, 5302075, 5110153, 4575067, 4004237, 3798498, 3914154]
36656C914154o7932m34300k93707K87987N21506J03190l25707j58798L34288M97249
36646D377930J79988k59891n54199o86381n97970j89376L23143M32040m1051n69648
36636B414585m83586J66288O49618N10971J02552m0069K5058j02999m05114m81219
36626B356085k82083k15634m10862m29251K2180N56847O61952M29623K99632L26086
36616C314575J96068j35685l39465k71453j81423k18279j44950J88964M32905
36607B841257J93305k85621l72221M1744L74246K42314K5097J96308N16453M25142
36597D198024j9003k26353j4953K08631K49148L98518P29732Q33749N92719N21229
36587G471441Q82008J132796Q36138M81952O81419J111042J106417Q18182Q06347
$$ y = [3914154, 3846222, 3411922, 3118215, 3406202, 3927708, 4030898, 3705191, 3546393, 3880681, 4377930, 4557918, 4298027, 3743828, 3057447, 2459477, 2270101, 2593244, 3025284, 2984233, 2414585, 1930999, 2097287, 2746905, 3257876, 3360428, 3320359, 3345417, 3242418, 2837304, 2356085, 2074002, 1858368, 1447506, 1018255, 1040435, 1597282, 2259234, 2688857, 2988489, 3314575, 3510643, 3374958, 3035493, 2764040, 2582617, 2364338, 2219388, 2408352, 2841257, 3034562, 2748941, 2376720, 2418464, 2792710, 3035024, 3060121, 3256429, 3772882, 4198024, 4179021, 3952668, 3937715, 4146346, 4395494, 4794012, 5523744, 6357493, 6950212, 7471441, 8353449, 9486245, 10322383, 10804335, 11485754, 12596796, 13703213, 14521395, 15327742]
36578A5327742Q76934M31747k64040l79138k5091j91801j027782j486681j060455
36569A2201435n92766p76944j039824p16285k67750l58001n99973l08078J91244
36560G733058J35346l07831l99265j78292k79012o25366n04247R6011L66245J8308
36550F054955l03198j68961M8103K4818Q411J18951K502l68491l76474K02817
36540E243433O05899K04071m36105m07122J36930L23183q385j54517K35870O64670
36530F407927O39183L08802K6883j26745j27526J56440N89166O85781K75801j31814
36520H703898m0645L20614M37055L49001M57084O65718M50905j37441k67988N20643
36510A1458844J520299J715114J086471N11245N70332J030000J438332J659603
$$ y = [15327742, 16204676, 16636423, 16372383, 15993245, 15968154, 15776353, 14748571, 13261890, 12201435, 11608669, 10831725, 9791901, 9075616, 8807866, 8449865, 7849892, 7541814, 7733058, 7868404, 7560573, 7161308, 6983016, 6704004, 6078638, 5574391, 5670402, 6036647, 6054955, 5751757, 5582796, 5630899, 5655717, 5664128, 5783079, 5785581, 5417090, 5040616, 5243433, 5849332, 6053403, 5617298, 5210176, 5347106, 5670289, 5661904, 5507387, 5743257, 6407927, 7047110, 7355912, 7382795, 7256050, 7128524, 7284964, 7874130, 8559911, 8835712, 8703898, 8663253, 8983867, 9420922, 9769923, 10227007, 10892725, 11343630, 11206189, 10938201, 11458844, 12979143, 14694257, 15780728, 16291973, 16862305, 17892305, 19330637, 20990240]
36502B0990240J715658J588602J393006J393542J653428J953624K216469K679210
36494C5583779L425638M073086M262586M248199M623150N530298O470906O920509
36486G5138151O877324O699837O561658O238751N455089M303847L140033K078823
36478A16493513R30779j97264o76695k36389K51186l71426j971747l292701l841581
36469A07087675m584647o215772p728032p721388o512252n735320o048349o416542
36461E6125373n816564m598060l732943l505054l483065l277211k819965k216651
36453B6675860j706284j539332j631416j583155j243337r48346r67693j023000
36445A6033297o76131K275M54334K56287m38540j012627r11305j93141M90815
$$ y = [20990240, 22705898, 24294500, 25687506, 27081048, 28734476, 30688100, 32904569, 35583779, 39009417, 43082503, 47345089, 51593288, 56216438, 61746736, 68217642, 75138151, 82015475, 88715312, 95276970, 101515721, 106970810, 111274657, 114414690, 116493513, 117424292, 117227028, 116550333, 116313944, 116565130, 116193704, 114221957, 110929256, 107087675, 102503028, 96287256, 88559224, 80837836, 74325584, 68590264, 62541915, 56125373, 50308809, 45710749, 41977806, 38472752, 34989687, 31712476, 28892511, 26675860, 24969576, 23430244, 21798828, 20215673, 18972336, 18023990, 17056297, 16033297, 15357166, 15359441, 15813775, 16070062, 15631522, 14618895, 13707590, 13514449, 14005264]
36436A4005264O71462O59301R76018J373142J107162K28737k45526K00447P50078
36427A9726085N00619j38237j24932O03771J187009J311015J571834K202201K382764
36418B9222129J338141m71775j844133k234262k146727k209788k333445k000157
36410A7319983j180881n90050q28518j486781j552767p67881n0935k57234j002320
36401I602616j257050p57798j48066Q6817P1819l9256l18070n92591m55041k9
36391F193351J13889l29309o77187m03179R3441K06699O8856J21357K23567k3134
36381E588351l84457k92930R8648N6095m87499p04746j75606L73536J28964o00336
36371C600020q57802l93392R9903L2068l47967m11847j8765L22775J11171m77496
$$ y = [14005264, 14676726, 15336027, 16312045, 17685187, 18792349, 19021086, 18775560, 18976007, 19726085, 20226704, 20088467, 19963535, 20567306, 21754315, 23065330, 24637164, 26839365, 29222129, 30560270, 30088495, 28244362, 26010100, 23863373, 21653585, 19320140, 17319983, 16139102, 15549052, 14720534, 13233753, 11680986, 10913105, 10862170, 10604936, 9602616, 8345566, 7587768, 7439702, 7526519, 7598338, 7559082, 7241012, 6648421, 6193380, 6193351, 6307240, 5977931, 5300744, 4897565, 4991006, 5197705, 5266561, 5387918, 5611485, 5588351, 5203894, 4910964, 5009612, 5065707, 4578208, 3873462, 3697856, 4071392, 4200356, 3600020, 2742218, 2348826, 2448729, 2480797, 2132830, 1720983, 1702218, 2024993, 2136164, 1658668]
36361A658668p12301j70132O71196R49726M71985j03338j94823J4521N9415n5124
36351B589793l8055J8798k43895o92069o64699O6343P86986O96135k1654m56406
36341B041277k01188J88068P6999l54272m44912k8679L67583K87184r6569l33398
36331A502093k91404j42171K4937K29742L41080J70982j34272j62296J55603L30660
36321B024954k2124n59663o17584j28546K84663J89748p7433M9468N21794P20749
36311B386026K87748m09633p31477m71946K2955K97430J76219j99123n14947m63656
36301C79596J1748N48273N99439K1811o42916o77563j5057O23687N34925j43660
36291A240283o01249l34063K56582L86488j23367o30530m78021K14449P33770
$$ y = [1658668, 946367, 776235, 1447431, 2397157, 2869142, 2765804, 2570981, 2585502, 2644917, 2589793, 2551738, 2570536, 2326641, 1634572, 969873, 1036216, 1823202, 2519337, 2497683, 2041277, 1840089, 2028157, 2105156, 1750884, 1305972, 1277293, 1644876, 1932060, 1835491, 1502093, 1210689, 1068518, 1093455, 1323197, 1664277, 1835259, 1700987, 1538691, 1694294, 2024954, 2002830, 1443167, 825583, 697037, 981700, 1171448, 1094015, 1143483, 1665277, 2386026, 2673774, 2264141, 1532664, 1060718, 1083673, 1381103, 1557322, 1358199, 843252, 379596, 391344, 939617, 1539056, 1560867, 917951, 240388, 225331, 849018, 1383943, 1240283, 639034, 304971, 561553, 948041, 824674, 194144, -283877, -69428, 664342]
36282F64342O07972M0964m28767m71509j48474K36120L78034K05545n8699j51264
36272H74264o8931J2511M7901J07760R9016j47419m56678l82469J24816N15668
36262G26439L76629N763r2589L6877j7449l27282n53545m51077o3950M35433P52502
36251H27751N41234j12773n31168k63789J90963Q8767l95156m64738j0289K73559
36241A44361R6283l1734J95927L77561K27988P2393J18113L0278l02490l60322
36231E68358R4227M28168R8504m60145n76734l52218k23829j24038J56419L22258
36221f9030J06189o5608K22030N24560K96398m8787J14163L35318j90760r89222
36211B35251q26398K28809P39730P5723p42650p43031k56558N0138K32170M97254
$$ y = [664342, 1272314, 1313278, 884511, 413002, 264528, 500648, 878682, 1084227, 1025528, 874264, 805333, 817844, 865745, 973505, 1072521, 925102, 468424, 85955, 210771, 726439, 1103068, 1108831, 1016242, 1053119, 1035670, 708388, 154843, -296234, -360184, 75249, 827751, 1368985, 1256212, 725044, 461255, 652218, 740985, 345829, -118909, -129198, 144361, 240644, 208910, 404837, 782398, 1010386, 1082779, 1200892, 1231170, 928680, 568358, 662585, 1090753, 1189257, 729112, 152378, -199840, -423669, -547707, -391288, -69030, 37159, -28449, 193581, 718141, 1014539, 965752, 1079915, 1415233, 1224473, 235251, -591147, -362338, 377392, 453115, -289535, -1032566, -1289124, -1238986, -1006816, -509562]
36201e09562N56962K36777o1472r6590k13822n03476l90665L05601P59463L42929
36191D26145l17894l13175J97787M69351M03438L70933K94282j06246m88388k84729
36181F51504K62473L61647j20972n25004m35915j27762M8787P0745p021j51330
36171B7152j75241N8663K87255J55729j88297k79106n3210Q6555q4009l17060
36161d81569k70621J05982N31662N75190P0699n11736m81638R7606L86475K5790
36151D7840k73818Q1697N44097L66205j04014o0994L52557L81797K4121j05623
36141A253865j2319k10232n38899l62439J07959L7439m29422k39329O45437R23130
36131A175190Q4730o29459k26374M56710K47555m31402m14348K53800N55318J86943
$$ y = [-509562, 47400, 284177, 222705, 126115, -87707, -591183, -981848, -676247, 83216, 426145, 108251, -204924, -7137, 462214, 865652, 1236585, 1530867, 1424621, 936233, 651504, 913977, 1275624, 1154652, 629648, 193733, 65971, 114758, 185503, 178482, 27152, -148089, -89426, 197829, 353558, 165261, -113845, -167055, -80500, -164509, -481569, -752190, -646208, -114546, 460644, 531343, 19607, -462031, -364425, 22050, 47840, -225978, -144281, 399816, 766021, 662007, 601013, 953570, 1335367, 1359488, 1253865, 1241546, 1031314, 492415, 129976, 237935, 275374, -154048, -393377, 252060, 1175190, 1259920, 630461, 404087, 860797, 1108352, 676950, 262602, 516402, 1071720, 1258663]
36121A258663k34826l55849l56943k38518J42283M32143J31315m62408n45397
36112b29537m6848K74889M9001k10855j6770L94623N44608L45609m977l32343
36102G67400m71824l00902M6283K65733K59955J78435J05163R571m0647L3268
36092H52435O3763j67501n14268o11937l86346m8639K99966O03759N42178r3009
36082E40401p52722o00832K34094O40149O8516o49017n36229J50939N00040L71893
36072c2768L45965N01128K75036l76458o56669j59009L88968K16205k87950k45152
36062c0704K48325K73612l85942q37465m33383K97436N18756K25884l8864r0195
36052b52540r4354m4098J16867J33588j57451l23926Q4866O80836P01702J63763
$$ y = [1258663, 1023837, 667988, 311045, 72527, 214810, 646953, 778268, 315860, -229537, -276385, -1496, 47505, -163350, -180120, 214503, 759111, 1104720, 1099743, 767400, 295576, -5326, 40957, 306690, 566645, 745080, 850243, 859814, 819167, 852435, 916198, 748697, 234429, -377508, -763854, -812493, -512527, 91232, 633410, 540401, -212321, -813153, -579059, 61090, 129606, -519411, -1055640, -904701, -404661, -32768, 313197, 814325, 1089361, 712903, 56234, -102775, 286193, 502398, 214448, -30704, 217621, 491233, 105291, -732174, -1165557, -868121, -349365, -123481, -162345, -252540, -346894, -390992, -274125, -140537, -297988, -621914, -537048, 143788, 845490, 1009253]
36042A009253k50138l23176m20710n23740j76121M70496O13330Q8662l17259k02797
36032c2200j21038l50334k68942L44158N66618j42206p58590k37417O87940O42914
36022C30903j71330m40299N7877L33922P0021q304L03911L06370j78491m23451
36012A81129j90421j42561m41260l07545M32929P27024K2288o26755j94992O17155
36002G6991M98259m31753r17314m39902L27197O79451N37256J00850l40086l73731
35992b82782Q5792M76108K89730j60547k73856j19980j57591l02875j01706L39218
35982b08489M29055O9998k01599q8776J28144J82483J34284M5154q5367m8814
35972C56073L15906O06654K57295n06590q14850l83992J10761J15674o1448M6991
$$ y = [1009253, 759115, 435939, 15229, -508511, -684632, -214136, 399194, 487856, 170597, -32200, -153238, -503572, -772514, -428356, 138262, -3944, -762534, -999951, -312011, 330903, 159573, -280726, -222849, 111073, 181094, 172790, 476701, 783071, 604580, 181129, -9292, -151853, -593113, -900658, -467729, 259295, 281583, -345172, -540164, 76991, 575250, 143497, -773817, -1213719, -886522, -207071, 330185, 431035, 90949, -282782, -196990, 279118, 568848, 408301, 134445, 14465, -143126, -446001, -547707, -208489, 220566, 290564, 88965, 189, 128333, 310816, 445100, 490254, 404887, 356073, 671979, 1278633, 1535928, 1029338, 214488, -169504, -58743, 56931, -4517, 42474]
35962D2474K59330J32955k73612n07982l23764J69231O90370Q63249M33517l06656
35952A179112o54740l58735K5798j8156j88607O5037N39361N11916j37496o94314
35942B69176n79318k2153L94086M29686K27542M475o9051N8316J71104m0525m74735
35931C68603n76628q1838M74377L97880j86243m89458j66115K73086K99232R1098
35921D03994Q5461K24097J35257j76849l39251k08852J809J44490K31716J65508
35911F67380j31611l42312r0438L22417K04679l64786m80763J32160M95392j21866
35901B90252q79073n31805O15597J094925M04359m36623n37360k05567m6037o464
35891b37796J50446K37041J07020Q7364L44108L87823j43598p08335n86264k862
$$ y = [42474, 301804, 434759, 161147, -346835, -670599, -501368, 189002, 1052251, 1485768, 1179112, 524372, 165637, 191435, 173279, -15328, 49709, 589070, 1100986, 963490, 269176, -310142, -332295, 61791, 491477, 719019, 723494, 654443, 712759, 883863, 843338, 368603, -208025, -289863, 184514, 582394, 396151, -93307, -259422, 13664, 312896, 403994, 489455, 713552, 848809, 671960, 332709, 123857, 125666, 270156, 501872, 667380, 535769, 193457, 103019, 425436, 630115, 265329, -215434, -83274, 412118, 290252, -588821, -1120626, -505029, 589896, 994255, 557632, 20272, -185295, -231332, -237796, -87350, 149691, 256711, 344075, 688183, 1076006, 932408, 224073, -362191, -365053]
35881c65053K34341k3730j77265O2093K88593J69969n7020o7244O6873J04262
35871B35819J4349n6733J7775K42739M06470J78784m10703p56362l81545K69648
35861b39759L26744k46073n65876j43447M41095M99709J95263M7367N8196m9515
35851C23704j62135k6441J38314k1766k69409j12201K93360L52867P1146J6570
35841F04009K07582O083o17058p37593L1922O48199J04352r22731r74746M2904
35831a607077P87231M69933k15179l73150r8366Q2609J52380L57867N49250M00944
35821E06442J3089k24023j93925p8068L3251J85523L03837K04500j35096m73097
35811A42433m69817Q2N50607M62160m36897j199126p35492N93026J212552M72166
$$ y = [-365053, -130712, -154442, -331707, -269614, 18979, 188948, 131928, 64684, 131557, 235819, 250168, 193435, 211210, 453949, 860419, 1039203, 628500, -127862, -509407, -239759, 86985, -159088, -724964, -868411, -427316, 72393, 267656, 315023, 373219, 323704, 161569, 135128, 273442, 251676, -17733, -129934, 163426, 516293, 587439, 604009, 811591, 817674, 200616, -536977, -505055, 143144, 247496, -675235, -1649981, -1607077, -819846, -349913, -565092, -938242, -1036608, -953999, -801619, -443752, 105498, 506442, 519531, 295508, 101583, 23515, 56766, 242289, 546126, 750626, 615530, 142433, -327384, -327302, 223305, 685465, 248568, -950558, -1686050, -1093024, 119528, 591694]
35801E91694m03385j41200P04787P19121j98577q77154p68956m71806l69935p3891
35791a289302M89319O31059Q2646l79350j37265K81281J44679k75076k63478J10191
35781f05296K16097j3694n2612K55630M65608K82822o7218k92642l69435l50404
35771e31144k39699j23557j13909j42622p3857K8841K3606k205J44949L92646
35761f36951M59719K54476m5136k57053l07844j78804K1083O3559o7689m8116
35751g42756K80643N21920K65215k10116l10645n4329J6904j86632j34291L51018
35741b03069O48193K47225m34817o30878k64580P9868K9974j91422j94181J27399
35731g86288N74135Q15338N90181l2467n79562n71389o4832L51227K04493l07972
$$ y = [591694, 188309, 47109, 751896, 1471017, 1272440, 395286, -373670, -845476, -1215411, -1289302, -799983, -168924, -86278, -465628, -602893, -321612, -176933, -452009, -715487, -605296, -389199, -402893, -455505, -199875, 265733, 548555, 481337, 188695, -180740, -531144, -770843, -894400, -1008309, -1150931, -1224788, -1195947, -1172341, -1174546, -1029597, -636951, -177232, 77244, 32108, -224945, -532789, -711593, -690510, -626951, -694640, -742756, -462113, 59807, 325022, 114906, -195739, -250068, -233164, -419796, -554087, -203069, 445124, 692349, 257532, -373346, -637926, -558058, -528084, -719506, -913687, -786288, -212153, 603185, 1193366, 1160899, 581337, 9948, -54884, 296343, 500836, 192864]
35721A92864n49667k15549K96303M10765J36186J0577K80104N08324K31080l17958
35711I83029n22608k49091M3881J9437j41187j29390O5382K55020L08122J82107
35701H14702q7432l34843l76989k26511m1484J00655J78610P3467k54543n03066
35691f57434l12025J98135N44995N33593L86045K43760L2936j40208k3928K26102
35681A031971J21110l31956n00926j30131J73876r8484n18639m17677O7336L00617
35671c02903J43094j9324M700P4988J11700R0911j25887m48791l62707L24363
35661e09856Q80321N35498l12614o17369k00127J73891J26230N5732J54168P9394
35651C65268j80210j28365K42785K74269j54961k75868J98270M16131j60294o77065
$$ y = [192864, -356803, -572352, -276049, 134716, 270902, 281479, 561583, 1069907, 1300987, 983029, 460421, 211330, 255211, 274648, 133461, 4071, 69453, 324473, 632595, 814702, 727270, 392427, 15438, -211073, -252557, -151902, 26708, 100175, -154368, -657434, -969459, -771324, -226329, 307264, 693309, 937069, 970005, 829797, 805869, 1031971, 1153081, 821125, 320199, 190068, 363944, 265460, -253179, -670856, -603520, -302903, -159809, -179133, -174433, -99445, 12255, 103166, -22721, -471512, -834219, -509856, 370465, 905963, 593349, -24020, -224147, -50256, 75974, 131706, 285874, 365268, 185058, 56693, 299478, 573747, 418786, 142918, 341188, 757319, 597025, -80040]
35641h0040k39725N37126N08639j38670l14985R9806J93523k98632n98196k90591
35631f21745R2401J70903K82609N60001M78178j42539n88014l33991R2874K6251
35621A6928k39876n3735M03471M03263j24083n03494l68425p3598J7527M2863
35611d79159K30921M20531K84309j62917n10634l99857N8733L81787K73365k4347
35601G2732j15303m2354j36302l46785k54567J46863K82008r5135l93412o1401
35591i43656N06027N40433M9664k66304q6811J87853J63042k9667m9087J79023
35581B50517L91758K23519l88119q92958n60548M79211J076156M68423n73236
35572D74723p38941P773N24869K64972q6584R1791M21692L22962m0768j71687
$$ y = [-80040, -319765, 217361, 726000, 587330, 272345, 372151, 565674, 267042, -331154, -621745, -529344, -358441, -75832, 484169, 962347, 819808, 231794, -102197, -9323, 16928, -222948, -276683, 126788, 530051, 405968, -97526, -465951, -539549, -522022, -479159, -248238, 172293, 456602, 293685, -216949, -616806, -558073, -176286, 97079, 72732, -42571, -84925, -221227, -568012, -822579, -675716, -393708, -488843, -882255, -943656, -437629, 102804, 152468, -113836, -200647, -12794, 150248, 120581, 71494, 250517, 642275, 865794, 477675, -415283, -975831, -496620, 579536, 1047959, 474723, -264218, -256445, 268424, 533396, 446812, 538603, 960295, 1283257, 1242489, 1070802]
35562A070802m1863L6139m8086k10681l95348m69462k42553J53911K95425J04791
35552B53075M099J75759K13657j37672m56413l23726k5284l3234k21323j76591
35542g27653P0973K26258L21814N19251N86442K24429k67213l09696O0274K42469
35532I47348N486k28944j22743O3708j15131o60277j062966p82829J43934R34961
35522h77453P96260l7329m43347J22777Q45983P17830o4410n55047m61730k43591
35512b00057j06041J71559N03333M81635J25165j33070k17143l99949n40469j91183
35502e06220M56035O21794J21270l56173l64692k29982j93128M3676N02066N68771
35492F63417J8751m16675j63874K33922K1862n07069m99514J12083N74524M22982
$$ y = [1070802, 1028939, 1065078, 1016992, 806311, 410963, -58499, -301052, -147141, 148284, 253075, 257174, 432933, 646590, 508918, 52505, -271221, -296505, -329739, -551062, -727653, -656680, -430422, -108608, 410643, 997085, 1221514, 954301, 644605, 704879, 947348, 952834, 723890, 601147, 664855, 549724, -110553, -1173519, -1956348, -1812414, -877453, -81193, -118522, -561869, -439092, 406891, 1124721, 1060311, 505264, 43534, -200057, -306098, -134539, 368794, 850429, 975594, 842524, 625381, 225432, -315037, -506220, -50185, 571609, 692879, 336706, -27986, -257968, -451096, -407420, 94646, 663417, 682168, 265493, 101619, 335541, 357403, -149666, -649180, -537097, 37427, 460409]
35482D60409o6151m23796m40683j54331J92948K78017P0283j00445n0678J7100
35472b17327n568J05299L48002K63577k70966n84095j59798M49885L91776j83658
35462A37127l80233Q8111N67032M43260j62516o84731o47127K763P25933P71464
35452H61083Q3484n04922l77735M1030Q6774j06822q8656j8251j86871j46288
35442c57174N55356J182126O70567n34930r36764k66138K03969j51532m02865
35433c7385J02190N48815J84338l25537j86155M2299m34488r70754m37394P31435
35423g82636J026153J81491m94323j88884L95025M18848R4953n1410j23920l71777
35413A03520m84738j05932M17885M84941J44542o5502l098l7963l18737m85073
$$ y = [460409, 394258, -29538, -470221, -624552, -431604, -153587, -83304, -183749, -234427, -217327, -222895, -117596, 230406, 493983, 223017, -361078, -520876, -70991, 320785, 137127, -243106, -154995, 412037, 855297, 692781, 8050, -639077, -636314, 89619, 861083, 944567, 439645, 61910, 102940, 189714, 82892, -5764, -24015, -210886, -357174, 198182, 1380308, 2050875, 1515945, 579181, 313043, 517012, 365480, -37385, 64805, 613620, 797958, 472421, 286266, 328565, -105923, -1076677, -1514071, -782636, 243517, 425008, -69315, -258199, 136826, 555674, 650627, 599217, 475297, 103520, -381218, -487150, -69265, 415676, 560218, 494716, 491618, 453655, 134918, -350155]
35403c50155k55120J18315K19140L4579j14742p6061k3576j20357k47242j71290
35393i86509J31282M24039M39223J20084k94885m16238p0743M18389M93298J8298
35383B76238n10768n74723k43820M3084J01834R7099J76416L39442N23226N03932
35373G31960k8093q55774j041632n7622J134794J081488j11916q16755k06448
35364a69998O37685N12630j73474l77485j48582j76377l21851K7453N42223L29103
35354F81327m06147n12683J73220M72389j92715q53879o15796M783J80352J41568
35344i27581M28290O38599J13738o92854p50165n8550M23414L24917K12725L66430
35334G8963L17887j18863l51223k504L92692K39301j84123k36205Q1782K33130
$$ y = [-350155, -605275, -486960, -267820, -233241, -347983, -424044, -447620, -567977, -815219, -986509, -855227, -431188, 8035, 128119, -166766, -583004, -653747, -235358, 257940, 276238, -234530, -809253, -1053073, -1009989, -908155, -811056, -634640, -295198, 228028, 731960, 703867, -151907, -1193539, -1251161, -116367, 965121, 853205, 36450, -169998, 467687, 980317, 806843, 429358, 280776, 104399, -217452, -189999, 352224, 681327, 275180, -237503, -64283, 408106, 215391, -638488, -1254284, -1249501, -1069149, -927581, -499291, 139308, 253046, -439808, -1189973, -1248523, -825109, -500192, -287467, 78963, 396850, 277987, -73236, -75740, 316952, 556253, 372130, 135925, 217707, 450837]
35324D50837n57l10300l81223j99318R2407L12554K76414j1841k51788j53367
35314a76182K03551M89030N12351L21705K2076l07609n63120o26263m20912L6530
35304e08843N13744N62652j8772o92569o16538K20189Q01178M03584l75547m90577
35294b01499N5688L58438N3880k74976k09060j27526l82528n84927k68127K55133
35284a325504L35256j3510j81160Q9927M08939M24607K95266K82152K64173j8932
35274E61214m28722m97586p1827M04389M38713J35289j6532Q8624N6239k55280
35264D14521l86400l5860L02060M0480m85609m40655K11790O28778L56113j18517
35254D86701k69546k12788j71659k1674K00960N1473n18748p62436j80794O06352
$$ y = [450837, 450280, 139980, -241243, -440561, -348154, -35600, 240814, 228973, -22815, -176182, 27369, 516399, 1028750, 1350455, 1372531, 1064922, 501802, -124461, -545373, -508843, 4901, 567553, 548781, -143788, -760326, -540137, 261041, 664625, 289078, -201499, -145811, 212627, 266507, -8469, -217529, -345055, -727583, -1312510, -1580637, -1325504, -990248, -1003758, -1184918, -1094991, -686052, -261445, 33821, 315973, 580146, 561214, 132492, -365094, -436921, -32532, 406181, 541470, 524938, 613562, 669801, 414521, 28121, -7739, 294321, 334801, -150808, -591463, -379673, 249105, 605218, 486701, 217155, 4367, -167292, -188966, 11994, 63467, -455281, -1217717, -1398511, -792159]
35244g92159P35009L22971N5744L2028q9303j80788J03684M02185M8480o45747
35234g896o17906K84393R41151O00512j11180l27741j93568k74395m33467j69413
35224c09510L26712L39501k27398o16038k64599M23388O14354P5648n88159o67309
35214h93410j25173M45383N45839K40469j19790l35791l36469l9617M20595N91673
35204C93709K52293j62641j63146J5916j52133m83020l04672L53671O68004K86628
35194G04609j49803q1219J50842Q483l69335n13687l35078k0701L17356M88866
35184B00333K19014k99596l95029R7944M44756J41511k24953K7937M53322J96899
35174H62138n07333o64653j43649J72123q6361k15521K51428O72130L35200l53402
$$ y = [-792159, -57150, 265821, 321565, 353593, 264290, 83502, 187186, 589371, 637851, -7896, -625802, -341409, 599742, 1200254, 1089074, 761333, 567765, 293370, -140097, -309510, 17202, 356703, 129305, -486733, -751332, -327944, 286410, 362058, -226101, -893410, -1018583, -573200, -27361, 213108, 93318, -242473, -578942, -618559, -197964, 393709, 646002, 483361, 320215, 336131, 183998, -299022, -603694, -250023, 417981, 704609, 554806, 473587, 624429, 632912, 263577, -250110, -585188, -605889, -288533, 200333, 419347, 119751, -275278, -177334, 267422, 408933, 183980, 211917, 665239, 862138, 354805, -309848, -453497, -281374, -367735, -583256, -331828, 340302, 675502, 322100]
35164C22100m64294Q1470M63409J63815m01920n54595k07051J83457K79570J84910
35154E0871J21648N7329j57039m00028l18316J79737O90147P24047K43999l11099
35144H81296m60364j10334L43897L67904j11460n36065l91598O6751J62069k00463
35134A1633m23022j80626J13628M7765j66417j69098m3874k2796m0529P314j7350
35123h83372j19068K7698M61903O29660K22831j92981k8194L39173J80123l72883
35113B64890n69460k32370J32468K35512J96975j2329m88522q41598n61504R4254
35103a781684L86563K29424J94916M11368L90729L5333j42273Q025J9156k26132
35093d74575k16808J69200L17649k2083k20038J20718M39390K50935L5739L06349
$$ y = [322100, -142194, -60724, 402685, 566500, 164580, -390015, -597066, -413609, -134039, 50871, 172519, 229848, 72809, -327219, -645535, -465798, 224349, 948396, 1192395, 881296, 420932, 310598, 654495, 1022399, 910939, 374874, -16724, 50027, 212096, 11633, -411389, -592015, -478387, -430622, -597039, -766137, -810011, -832807, -873336, -866022, -883372, -1002440, -974742, -512839, 116821, 339652, 146671, 118477, 457650, 637773, 264890, -304570, -536940, -404472, -168960, 28015, 15686, -472836, -1314434, -1875938, -1781684, -1395121, -1165697, -970781, -559413, -168684, -133351, -275624, -267599, -248443, -474575, -691383, -522183, -204534, -226617, -446655, -325937, 113453, 364388, 400127, 706476]
35083G06476N64895J38330n52431o01513j02921M2238l66897n52893o2409N46403
35073b40722N81961J31893k24164k00393k2830o1537l80241n90328k54730M63267
35063g97824Q31312M65248j19787k38350L3895J50322j369j07799j25368k58194
35053a67914l39337M947N37558N43670l5074l81433o2195K49638j31508p27829
35043e09477n88494K27197P22617M27746m5251o9941J18185J5632k44144j69315
35033a15245J92756K71532j23728m70459k89985J74603L39973Q2592j94396j82006
35023c14363k170J00370J01000R0359L0515j69779l96681l58896M3823N02523
35013c73299O07953L53633J30004J44374J01995k87429p10225o03491n0606K29699
$$ y = [706476, 1271371, 1409701, 857270, 255757, 152836, 195074, -171823, -724716, -787125, -240722, 341239, 473132, 248968, 48575, 25745, -35792, -416033, -1006361, -1261091, -797824, 33488, 498736, 378949, 140599, 174494, 324816, 323447, 215648, 90280, -167914, -507251, -502304, 35254, 578924, 543850, 162417, 100222, 349860, 218352, -509477, -1097971, -870774, -148157, 279589, 234338, 164397, 282582, 298214, 54070, -115245, 77511, 349043, 225315, -245144, -535129, -360526, -20553, 62039, -132357, -314363, -316533, -216163, -115163, -24804, 5711, -164068, -560749, -919645, -875822, -373299, 234654, 588287, 718291, 862665, 964660, 677231, -32994, -636485, -687091, -457392]
35003d57392n9992l12029N5038O67246P34976K04655k39386j78684J28868L13744
34993H57044L10741J51338j49959l81091k54839J08484K30752l2676k48293n0400
34983E41101L33175M48325K13134j04478k75132k36602k6873J80459J19183k70998
34973I21294o69377o74310k51610K25652L80734K16731N4488P1675K7534l34905
34963c2094o99837m46764L65244Q32518L98525l10085l91082N7357K82725J13051
34953A69558k3066m9338k30903l37446R9131O66121L93737n73570q78350r095
34943g73221P84341M08778l82201k91158M36589N37749j91072o97613m05276Q2427
34933d90657J31493o7359o8900J38924L09991K97279N7126l01549m27363j03380
$$ y = [-457392, -517384, -829413, -774375, -107129, 627847, 832502, 593116, 414432, 543300, 857044, 1167785, 1319123, 1169164, 788073, 533234, 641718, 872470, 839794, 591501, 541101, 874276, 1322601, 1535735, 1431257, 1156125, 919523, 892650, 1073109, 1192292, 921294, 251917, -422393, -674003, -448351, -67617, 149114, 203602, 275277, 302811, -32094, -731931, -1178695, -813451, 19067, 417592, 107507, -283575, -226218, 56507, 169558, 146492, 97154, -133749, -471195, -372064, 294057, 687794, 114224, -764126, -773221, 11120, 419898, 37697, -253461, 183128, 720877, 529805, -167808, -573084, -490657, -359164, -426523, -495423, -356499, -46508, 250771, 307897, 6348, -421015, -524395]
34923e24395L03558K34348k44508n21813l44164q4614k7461M3038L19384N28194
34913c18433L46559n0270j89807R0850M70690N23271J51743l26964n05379l06539
34903a14279j4087J40031K29142L55251L61227P2540l46561n66769n11080l37401
34893g31986j30230J00654K22646J02945j19851j78523n9267K9317L2966J04852
34883f26477K66043K94998N8505k33591k41273Q9743M16525L64726N804j77917
34873B17086O5688L50272J89044k26532k67473J52746M14809J28070l45345n20190
34863A58175l95327j68347J01892K41728l7144n07126m23884L54723Q88184M27229
34853F40103m12110n13113J63118O95769N73595J06111l16370n54060m35791Q1000
$$ y = [-524395, -220837, 13511, -230997, -752810, -1096974, -1181588, -1209049, -1166011, -846627, -318433, 28126, -22144, -211951, -121101, 349589, 872860, 1024603, 697639, 192260, -114279, -128366, 11665, 240807, 596058, 957285, 1029825, 683264, 116495, -394585, -731986, -862216, -761562, -538916, -435971, -555822, -734345, -793612, -764295, -731329, -626477, -360434, -65436, -6931, -240522, -481795, -392052, 24473, 389199, 395003, 217086, 282774, 633046, 822090, 595558, 328085, 480831, 895640, 1023710, 678365, 158175, -237152, -405499, -303607, -61879, -99023, -606149, -1030033, -675310, 212874, 640103, 227993, -285120, -122002, 573767, 1147362, 1253473, 937103, 383043, -52748, 28252]
34843B8252N27228L89161j05140l04387j19426j4747j37975j91246j11439j39218
34833a78937k11020M6L94123M71698J16247k59899l76759l06628p4580L22309
34823a03400N46572K54219k35374k99185Q099P6443k09132l64974k46691k00773
34813g74196k19948J10116O63298P30014J80734k50091j55261j9031k22248l91481
34803c48094j98662L8785M7758Q1161K22325N1561m38877m75297K56179Q34999
34793G1838M19154l83968m21814K70799O65287L34470j48204k86769k39584k48641
34783C2568k04235L6286L44851M84797L44324Q904k57726k29041p843J13572J06464
34772G72921J47867J19429k51641o73262m72062K52567N11653r2625o52791l61998
$$ y = [28252, 555480, 944641, 839501, 535114, 415688, 400941, 262966, 71720, -39719, -178937, -389957, -389911, 4212, 475910, 592157, 332258, -44501, -351129, -425709, -103400, 443172, 697391, 462017, 162832, 170931, 247374, 38242, -326732, -573423, -774196, -994144, -884028, -220730, 509284, 690018, 439927, 284666, 265635, 43387, -348094, -546756, -507971, -460213, -379052, -156727, -105166, -544043, -1019340, -763161, 71838, 490992, 107024, -314790, -43991, 621296, 955766, 807562, 520793, 281209, 32568, -171667, -135381, 209470, 694267, 1038591, 1047495, 789769, 560728, 552885, 666457, 772921, 920788, 1040217, 788576, 115314, -356748, -104181, 407472, 314847, -337944, -699942]
34762f99942K35386K53249n9308Q0511N02798M07977j61751l98475j57588j22772
34752a19915m68639m86264J61149P63253N85025j29898o04207m80944p090L50002
34742d37528K51016k24847n47336l25035J16217J90667j2503J11733N81428O50133
34732C53945j7134p01403o16122j671L09193P6069j71158q730L43198M37388K03878
34721B07453n3283j07792m4586k3684P6J43674K85895J76957j29475k76838j33410
34710D4987K1263j6054p9865m6138j12336l52000m14033p6915K94081L14003K06276
34699b16731L11712L70670p130m76363l81609J25316K70057p1009j89894K13616
34689e1365M98271J42170m06951m34383J6236L22440J55530k46281m79178l57251
$$ y = [-699942, -464556, -211307, -270615, -190104, 312694, 720671, 558920, 160445, 2857, -119915, -588554, -1074818, -913669, -150416, 434609, 304711, -299496, -780440, -787530, -437528, -186512, -411359, -958695, -1283730, -1167513, -976846, -989349, -877616, -296188, 353945, 336811, -364592, -980714, -982385, -673192, -597123, -768281, -777011, -433813, 3575, 207453, 154170, 46378, 1792, -21892, -21816, 121858, 407753, 584710, 455235, 178397, 44987, 66250, 50196, -29669, -75807, -188143, -540143, -954176, -1031091, -737010, -423007, -216731, 94981, 465651, 458521, -17842, -399451, -274135, -4078, -75087, -264981, -51365, 446906, 589076, 182125, -252258, -236022, 86418, 241948, -4333, -483511, -840762]
34679h40762k0471K12268K25019K76537N26394N77240J3485p20684p15643M6558
34669d20059N40783J99315k60041l6014M81451M28481p6535j59910L28804N41151
34659A567426l4549p80172q60325l50212L1109k3191j42989J3085K62069K59690
34649e8059M9911l4931Q4687J10308j44746m09188l12205O6675K76752R2256k16192
34638d94732k50291N9575M35385N66564L82259P3388j25539j72480j72305j24632
34628A77192O6865K64865Q7768n26821j009531p63341P5768Q25412J059257Q53965
34618A111399L94038j82603n84125n15263j19157J32249O3930o5880r5987j77053
34608c8452l33580k69431J50438N76494N90581K04376k40310m49034l27890L262
$$ y = [-840762, -861233, -648965, -423946, -147409, 378985, 956225, 969710, 249026, -466617, -420059, 120724, 320039, 59998, 23984, 505435, 933916, 857381, 697471, 1026275, 1567426, 1532877, 752705, -107620, -457832, -426723, -449914, -592903, -579818, -317749, -58059, -8148, -43079, 41608, 151916, 7170, -402018, -714223, -647548, -370796, -278540, -494732, -745023, -685448, -250063, 316501, 698760, 772148, 646609, 474129, 301824, 177192, 244057, 508922, 596690, 69869, -939662, -1703003, -1627235, -801823, 257434, 1111399, 1505437, 1322834, 738709, 223446, 104289, 236538, 300468, 234588, 138601, -38452, -372032, -641463, -491025, 85469, 676050, 880426, 640116, 191082, -136808, -133546]
34598a33546K46513K02158M8654P9328J93075M7649k86367l51386p8633O0180
34588B7625j01588p6121L84311O74886K31557m56627m88786Q9796M03359J31238
34578H19650r5850J36855K92588j89698q34113p21132R7963N58183P7604n90093
34568d48043m47760K91227N60683P4770k84523O1283M18838k2635p60538o77164
34558a233862J87270O72936K85016j91390j11816R8830l6746j18592K54556N12931
34548C19133M018p39480p03564n782L17437j5541k20601J06803L66409J18585
34538d52583j39478P0817L14100L4387l75720j54758N22175P00012N6808o23902
34528d8142n75143k3653K86624J17081j49757k01874j44771j32843l5680L01386
$$ y = [-133546, 112967, 315125, 363779, 443107, 636182, 683831, 397464, 46078, -32555, 27625, -73963, -150084, 234227, 909113, 1140670, 684043, 195257, 285053, 688412, 819650, 723800, 860655, 1153243, 963545, 129432, -591700, -493737, 64446, 142050, -448043, -895803, -604576, -43893, 30877, -253646, -192363, 226475, 203840, -556698, -1233862, -1046592, -373656, -88640, -280030, -391846, -293016, -329762, -448354, -193798, 319133, 323151, -416329, -1119893, -1125675, -808238, -823779, -1044380, -937577, -571168, -452583, -592061, -521244, -207144, -172757, -548477, -703235, -181060, 518952, 575760, -48142, -623285, -646938, -360314, -243233, -392990, -594864, -739635, -872478, -908158, -606772]
34518f06772O59295O11534R5320m27903m93211j47842J88180K42607J02867n918
34508B18157K1372R9420K7601k77899n29922k60048N01689R79833N22207m13734
34498H88676p15331j03515M78495K34941l73851m38383o118J02401l39374o41675
34488i13734l28760J84346L38966K12518J39013Q5616p7619j07851K07886M72265
34478B12646J67199m26023n05571M3287M41765K00418j88908j16930J95093J70709
34468A93685j25786j45554J83824L39232P5430j89626o4251K24499K41039N303
34458G37795j27823n9501j9185r5106q2813R5907J57411j23787m87741n04475
34448e09318k00856O564p371Q5873M03722N10983J03668l72586l16492Q7630J56044
$$ y = [-606772, 52523, 664057, 759377, 331474, -161737, -309579, -121399, 121208, 224075, 218157, 239529, 338949, 366550, 88651, -441271, -701319, -199630, 780203, 1302410, 888676, 173345, 69830, 548325, 783266, 409415, -28968, -35086, 67315, -272059, -913734, -1242494, -1058148, -719182, -506664, -367651, -282035, -359654, -467505, -259619, 212646, 379845, -46178, -551749, -508462, -66697, 133721, -55187, -172117, 22976, 193685, 67899, -77655, 106169, 445401, 520831, 331205, 266954, 491453, 732492, 737795, 609972, 550471, 531286, 436180, 353367, 449274, 606685, 482898, -4843, -509318, -710174, -703610, -710981, -625108, -221386, 289597, 393265, 20679, -295813, -208183, -52139]
34437e2139j93292l35097J5072L63307K72789j7287j42528j88610k90812j94849
34427g63446K57061O29267M52515l7111k75118k14079k18222l30990k62340j717
34417g64180J40994R0602R2806K28370K84743J43173p3504k34500k67422p6043
34407d34961K73054M17311J34258k41746k63249n8785p9467l07678l04224Q410
34397h57077K08785O6720j65380k22212j08477J30951M48060N70383K40973k69197
34387D3529l82146q406L60604M04351L05029K49935J30607j08871k78988k63173
34377D52471j73499j10615q5790j46191k36847r1233L16604M64567m891n58768
34367a74192m87438n0875r335k60538n6623N23671N89642L3756k18312J39804
$$ y = [-52139, -245431, -580528, -565456, -202149, 70640, 53353, -89175, -277785, -568597, -763446, -506385, 122882, 575397, 538286, 263168, 49089, -169133, -500123, -762463, -764180, -623186, -532584, -439778, -211408, 73335, 216508, 143004, -91496, -358918, -434961, -161907, 255404, 389662, 147916, -115333, -174118, -253585, -561263, -865487, -857077, -648292, -581572, -746952, -969164, -1077641, -946690, -498630, 71753, 312726, 43529, -338617, -347023, 13581, 417932, 722961, 972896, 1103503, 994632, 715644, 452471, 278972, 168357, 82567, -63624, -300471, -391704, -75100, 389467, 384576, -174192, -661630, -712505, -721840, -982378, -1039001, -515330, 74312, 108068, -110244, 29560]
34357B9560K44602l29477p44343l83179R2879J8779j23394J94507L99001r9810
34347g00875o39269l50111L35459M73628J87606J59636K05418k28708o67365k25697
34337a450278O80285P77641p772m30574N0523N39753K69578l49830o31374n13751
34327a065799j80906L19051P28601O37629J53640j74718k06192k35867j99549
34318b24110K27589P22973N67526o7867k15162K71696L89431l08159q89031n60199
34308h5313J07082K57428P3230J11101J56227k40887p01012n21785J46900N52422
34298a44607M70825K65691Q5876j82529l56669j35235K59637L09538n108k52990
34288C14429k82253k74671j90776J43513M46913K24111l35540m52277M9088L72457
$$ y = [29560, 274162, -55315, -799658, -1182837, -1089958, -1071179, -1194573, -1000066, -601065, -700875, -1340144, -1690255, -1354796, -881168, -693562, -533926, -328508, -557216, -1224581, -1450278, -769993, 7648, -124, -430698, -380175, 159578, 429156, 79326, -552048, -1065799, -1246705, -927654, -199053, 438576, 592216, 417498, 211306, -24561, -224110, 3479, 726452, 1293978, 1226111, 1010949, 1282645, 1672076, 1363917, 474886, -85313, 21769, 279197, 352427, 463528, 619755, 378868, -322144, -843929, -697029, -144607, 326218, 591909, 677785, 495256, 138587, 3352, 262989, 572527, 567419, 314429, 32176, -242495, -433271, -289758, 157155, 381266, 45726, -406551, -357463, 14994]
34278A4994m9158o38940n12650K46991Q05941P81578N17748K60808j58501o60491
34268F08320o99983j63814J53413l39760r13019m33050P95054J208942K03445
34259D19548r38125q79349k2520L73975Q9195j16655M8821J77463J51108K47508
34249d49031L27218n766m22831j68265N43008O08955j78827o52635j02509N72165
34239G1482L32422l86981n22677o9478J75859N2751J03355M29319M98046R1732
34229G75830l50092m16198j70307J04377J45323k09612p29882p60177l184Q51084
34219g62838Q74770J50957l60619j45564L39970N09975L61397J65338n81j42662
34209I90143j74408j06288j28946l10800m42896l38756r4965O9300P6974J1395
$$ y = [14994, -34164, -673104, -1185754, -938763, -132822, 648756, 1166504, 1427312, 1268811, 608320, -91663, -255477, -102064, -441824, -1354843, -1787893, -992839, 216103, 419548, -518577, -1397926, -1420446, -1046471, -957276, -1073931, -1025110, -847647, -696539, -449031, -121813, -127579, -550410, -718675, -175667, 433288, 254461, -398174, -500683, 71482, 403904, 16923, -505754, -575232, -399373, -346622, -243267, 186052, 684098, 775830, 425738, 9540, -160767, -56390, 88933, -120679, -850561, -1610738, -1613922, -762838, 111932, 262889, -97730, -243294, 96676, 606651, 968048, 1133386, 1132805, 990143, 815735, 709447, 580501, 269701, -173195, -511951, -606916, -537616, -460642, -449247]
34199d49247r279O8757J76245J78211N8059m5139o1538r3908j83964j93684q7948
34188f43435p3445k10701j71168K68290P30569O74661J86922j12818Q4265M24253
34178A157393M06183n5789o07037p84899m34723N8899J44183j41540j49277L62944
34168d3663O86731J93066n54593n32483J67960M68661o967m00591n2700M70926
34158C96347L33301k95636n83691k43204K26445L02888k0613l62806l33789J03145
34148d77613N12722M40212L4603j43912M104k0275l90985n47672j16825L82391
34138c23250L42134M1664R1420L24228J12658m37731n60446r6131K35477L5995
34128b33982j61716J11524M02820Q3043n58563o73304q8297M70223M01209m2799
$$ y = [-449247, -458526, -389769, -213524, -35313, 22746, -22393, -83931, -177839, -361803, -555487, -643435, -716880, -927581, -1098749, -830459, -99890, 574771, 761693, 648875, 733140, 1157393, 1563576, 1507787, 900750, 115851, -318872, -259973, -115790, -257330, -406607, -43663, 643068, 836134, 281541, -250942, -82982, 385679, 378712, -21879, -74579, 396347, 729648, 434012, -149679, -392883, -166438, 136450, 115837, -246969, -580758, -477613, 35109, 475321, 509924, 366012, 370116, 349841, -41144, -588816, -705641, -323250, 18884, 60548, 151968, 476196, 588854, 151123, -409323, -505454, -269977, -233982, -395698, -284174, 118646, 201689, -356874, -1030178, -1118475, -648252, -247043, -289842]
34118b89842k25685J2788K45139J11343j69017r5913L72703O63449L42891k20989
34108G46867l30427L3092J78725k55333p74204p83313l87540n0923J43287L96857
34098a082912O24633N28871J55994j02544n9849J03847K04065K04669M3875k91858
34088C28791n28610l56732M8049J75878q0584k69165o8864K83732M20023L04039
34078B56557Q9013j32289k46974j30882Q6191J00986p4032r6499Q1764O8122k48015
34067b46058l69574J5335M19822K60433k31185l88115j04723J58733J75453J48639
34057a61240J96775J92736R8346P543j10216l15641m32667k63231M7007K35778
34047e04810L34072M31672K93032k42870p15242n57372o143K17130L2534J4069
$$ y = [-289842, -515527, -502739, -257600, -146257, -315274, -411187, -38484, 624965, 967856, 746867, 416440, 449532, 628257, 372924, -401280, -1184593, -1572133, -1623056, -1479769, -1082912, -458279, 70592, 226586, 124042, 64193, 168040, 372105, 576774, 620649, 328791, -199819, -556551, -508502, -332624, -413208, -682373, -751237, -467505, -47482, 256557, 345570, 213281, -33693, -164575, -78384, 22602, -51430, -147929, -66165, 1957, -246058, -615632, -600297, -180475, 79958, -151227, -539342, -644065, -485332, -309879, -161240, 35535, 228271, 326617, 334160, 223944, -91697, -524364, -787595, -740588, -504810, -170738, 260934, 553966, 311096, -404146, -961518, -967661, -750531, -717997, -703928]
34037g03928K89012L12123q6222l07067n830K67391m1430n69654n80399j1560
34027a437564N41403O17307K44053k77524n96876m90078p3384K84064L74149K97804
34017e16646J96199J26876J81519L42681K68509k86100q64109p37718K187M68711
34007h17891K26350k07268l14079k46443k15816j1981L89000M77986N2703k55094
33997i22533P1306N46509M33848j20804m26644l11522j26329J084K17927M53846
33987a83312M73449K80613M4443j53341j78625J46373N44992L44313m97760j037240
33977b16095o21995J05200K23322o9297R611M16391M72362J39785J7463K03977
33967F80724J90467j39984l41902k60826k09645k67050j93106m7369j13879k32526
$$ y = [-703928, -414916, -102793, -189015, -496082, -501912, -234521, -275951, -845605, -1426004, -1437564, -896161, -278854, -34801, -312325, -909201, -1399279, -1472663, -1188599, -814450, -516646, -320447, -193571, -12052, 330629, 599138, 313038, -551071, -1288789, -1286602, -817891, -591541, -798809, -1112888, -1359331, -1575147, -1587128, -1198128, -720142, -667439, -922533, -851227, -304718, 129130, 8326, -418318, -729840, -856169, -855085, -637158, -183312, 290137, 570750, 615193, 461852, 283227, 429600, 974592, 1318905, 821145, -216095, -838090, -732890, -509568, -578865, -569254, -152863, 319499, 459284, 476747, 680724, 871191, 731207, 389305, 128479, -81166, -348216, -541322, -588691, -702570, -935096]
$$ [...]
##END NTUPLES=NMR SPECTRUM
##END=
