##TITLE=31Pdec_DPABF0406
 CDCl3, 24 sc
 5.6.2019
##JCAMPDX= 6.0         $$ Bruker NMR JCAMP-DX V2.0
##DATA TYPE= NMR SPECTRUM
##DATA CLASS= NTUPLES
##ORIGIN= UXNMR, Bruker Analytische Messtechnik GmbH
##OWNER= root
$$ XWIN-NMR		Version 3.5
$$ Wed Jun  5 14:23:25 2019 Russian Standard Time (UT+4h)  she@DPX200
##.OBSERVE FREQUENCY= 81.013821
##.OBSERVE NUCLEUS= ^31P
##.ACQUISITION MODE= SIMULTANEOUS
##.ACQUISITION SCHEME= undefined
##.AVERAGES= 24
##.DIGITISER RES= 17
##SPECTROMETER/DATA SYSTEM= spect
##.PULSE SEQUENCE= zgpg30
##.SOLVENT NAME= DMSO
##.SHIFT REFERENCE= (INTERNAL, DMSO, 0, 182.463)
##AUDIT TRAIL= $$ (NUMBER, WHEN, WHO, WHERE, WHAT)
$$ ##TITLE= Audit trail, XWIN-NMR		Version 3.5
$$ ##JCAMPDX= 5.01
$$ ##ORIGIN= Bruker BioSpin GmbH
$$ ##OWNER= she
$$ F:/spectra/data/she/nmr/P31/1/pdata/1/auditp.txt
$$ ##AUDIT TRAIL=  $$ (NUMBER, WHEN, WHO, WHERE, WHAT)
(   1,<2019-06-05 14:22:09.68 +0400>,<she>,<DPX200>,
      <created by zg, POWCHK disabled, PULCHK disabled
       configuration hash MD5:
       00 E9 B6 7A A2 85 ED C7 34 08 36 98 17 FE 4E 26
       data hash MD5: 32K
       67 01 10 36 E9 E0 5C F0 35 85 C5 15 33 DC 69 05>)
(   2,<2019-06-05 14:22:12.14 +0400>,<she>,<DPX200>,
      <Start of raw data processing
       efp BC_mod = 2 LB = 1 FT_mod = 6 PKNL = 1 PHC0 = -2171.33 PHC1 = 57.59912 SI = 64K 
       data hash MD5: 64K
       A9 03 FE 41 4B D1 40 99 F8 F4 60 E7 E3 C3 03 27>)
(   3,<2019-06-05 14:22:34.43 +0400>,<she>,<DPX200>,
      <pk PHC0 = -2.244097 PHC1 = -11.2 
       data hash MD5: 64K
       11 F5 C3 DA C4 66 9C 61 7F 69 32 BA 87 F8 DC E0>)
$$ ##END=
$$ 
$$ hash MD5
$$ D8 C1 59 07 45 7F D3 18 2D 81 1D F7 05 BD 82 22
##$RELAX= 
##$RELAX= 
##$RELAX= 
##$RELAX= 
##$RELAX= 
##$RELAX= 
##$RELAX= 
##$RELAX= 
$$ Bruker specific parameters
$$ --------------------------
##$DU= <F:/spectra>
##$EXPNO= 1
##$NAME= <P31>
##$PROCNO= 1
##$TYPE= <nmr>
##$USER= <she>
##$AMP= (0..31)
100 100 100 100 100 100 100 100 100 100 100 100 100 100 100 100 100 100 
100 100 100 100 100 100 100 100 100 100 100 100 100 100 
##$AQSEQ= 0
##$AQ_mod= 1
##$AUNM= <au_zg>
##$AUTOPOS= <>
##$BF1= 81.014009
##$BF2= 200.13
##$BF3= 200.13
##$BF4= 200.13
##$BF5= 200.13
##$BF6= 200.13
##$BF7= 200.13
##$BF8= 200.13
##$BYTORDA= 1
##$CFDGTYP= 0
##$CFRGTYP= 5
##$CHEMSTR= <none>
##$CNST= (0..31)
1 1 145 1 1 1 1 1 1 1 1 1 1 1 1 1 1 1 1 1 1 1 1 1 1 1 1 1 1 1 1 1 
##$CPDPRG= <waltz16>
##$CPDPRG1= <>
##$CPDPRG2= <waltz16>
##$CPDPRG3= <>
##$CPDPRG4= <mlev>
##$CPDPRG5= <mlev>
##$CPDPRG6= <mlev>
##$CPDPRG7= <mlev>
##$CPDPRG8= <mlev>
##$CPDPRGB= <>
##$CPDPRGT= <>
##$D= (0..31)
0 1 0 0 0 0 0 0 0 0 0 0.03 2e-05 3e-06 0 0 0 0 0 0 0 0 0 0 0 0 0 0 0 0 
0 0 
##$DATE= 1559730129
##$DBL= (0..7)
120 120 120 11 120 120 24 19 
##$DBP= (0..7)
150 150 150 150 150 150 150 150 
##$DBP07= 0
##$DBPNAM0= <>
##$DBPNAM1= <>
##$DBPNAM2= <>
##$DBPNAM3= <>
##$DBPNAM4= <>
##$DBPNAM5= <>
##$DBPNAM6= <>
##$DBPNAM7= <>
##$DBPOAL= (0..7)
0.5 0.5 0.5 0.5 0.5 0.5 0.5 0.5 
##$DBPOFFS= (0..7)
0 0 0 0 0 0 0 0 
$$ [...]
##$SUBNAM2= <"">
##$SUBNAM3= <"">
##$SUBNAM4= <"">
##$SUBNAM5= <"">
##$SUBNAM6= <"">
##$SUBNAM7= <"">
##$SUBNAM8= <"">
##$SUBNAM9= <"">
##$SW= 369.568048894756
##$SWIBOX= (0..15)
0 1 3 0 0 0 0 0 0 0 0 0 0 0 0 0 
##$SW_h= 29940.119760479
##$TD= 32768
##$TD0= 1
##$TE= 0
##$TE2= 300
##$TE3= 300
##$TEG= 300
##$TL= (0..7)
0 120 53 12 22 120 120 120 
##$TP= (0..7)
150 150 150 150 150 150 150 150 
##$TP07= 0
##$TPNAME0= <>
##$TPNAME1= <>
##$TPNAME2= <>
##$TPNAME3= <>
##$TPNAME4= <>
##$TPNAME5= <>
##$TPNAME6= <>
##$TPNAME7= <>
##$TPOAL= (0..7)
0.5 0.5 0.5 0.5 0.5 0.5 0.5 0.5 
##$TPOFFS= (0..7)
0 0 0 0 0 0 0 0 
##$TUNHIN= 0
##$TUNHOUT= 0
##$TUNXOUT= 0
##$USERA1= <user>
##$USERA2= <user>
##$USERA3= <user>
##$USERA4= <user>
##$USERA5= <user>
##$V9= 5
##$VALIST= <valist>
##$VCLIST= <CCCCCCCCCCCCCCC>
##$VD= 0
##$VDLIST= <DDDDDDDDDDDDDDD>
##$VPLIST= <PPPPPPPPPPPPPPP>
##$VTLIST= <TTTTTTTTTTTTTTT>
##$WBST= 1024
##$WBSW= 4
##$XGAIN= (0..3)
0 0 0 0 
##$XL= 0
##$YL= 0
##$YMAX_a= 51035
##$YMIN_a= -95386
##$ZGOPTNS= <>
##$ZL1= 120
##$ZL2= 120
##$ZL3= 120
##$ZL4= 120
##$ABSF1= 0
##$ABSF2= 0
##$ABSG= 0
##$ABSL= 0
##$ALPHA= 0
##$AQORDER= 0
##$ASSFAC= 0
##$ASSFACI= 0
##$ASSFACX= 0
##$ASSWID= 0
##$AUNMP= <proc_1d>
##$AZFE= 0.1
##$AZFW= 0.5
##$BCFW= 0
##$BC_mod= 2
##$BYTORDP= 0
##$COROFFS= 0
##$CY= -3
##$DATMOD= 1
##$DC= 0
##$DFILT= <>
##$DTYPP= 0
##$F1P= 0
##$F2P= 0
##$FCOR= 1
##$FTSIZE= 65536
##$FT_mod= 6
##$GAMMA= 0
##$GB= 0
##$INTBC= 1
##$INTSCL= 5.30512e-09
##$ISEN= 30
##$LB= 1
##$LEV0= 0
##$LPBIN= 0
##$MAXI= 10000
##$MC2= 0
##$MEAN= 0
##$ME_mod= 0
##$MI= 50
##$NCOEF= 0
##$NC_proc= -5
##$NLEV= 6
##$NOISF1= 182.463
##$NOISF2= 159.3651
##$NSP= 0
##$NTH_PI= 0
##$NZP= 0
##$OFFSET= 182.463
##$PC= 4
##$PHC0= -2173.574
##$PHC1= 46.39912
##$PH_mod= 1
##$PKNL= yes
##$PPARMOD= 0
##$PSCAL= 0
##$PSIGN= 0
##$REVERSE= no
##$SF= 81.0140089999434
##$SI= 65536
##$SIGF1= 159.3651
##$SIGF2= -187.1042
##$SINO= 113.3802
##$SIOLD= 16384
##$SREGLST= <1H.CDCl3>
##$SSB= 0
##$STSI= 65536
##$STSR= 0
##$SW_p= 29940.119760479
##$SYMM= 0
##$S_DEV= 0
##$TDeff= 32768
##$TDoff= 0
##$TI= <>
##$TILT= no
##$TM1= 0
##$TM2= 0
##$TOPLEV= 0
##$USERP1= <user>
##$USERP2= <user>
##$USERP3= <user>
##$USERP4= <user>
##$USERP5= <user>
##$WDW= 1
##$XDIM= 65536
##$YMAX_p= 283036832
##$YMIN_p= -10645646
$$ End of Bruker specific parameters
$$ ---------------------------------
##NTUPLES= NMR SPECTRUM
##VAR_NAME=  FREQUENCY,     SPECTRUM/REAL,   SPECTRUM/IMAG
##SYMBOL=    X,             R,               I
##VAR_TYPE=  INDEPENDENT,   DEPENDENT,       DEPENDENT
##VAR_FORM=  AFFN,          ASDF,            ASDF
##VAR_DIM=   65536,         65536,           65536
##UNITS=     HZ,            ARBITRARY UNITS, ARBITRARY UNITS
##FACTOR=    0.456856943014862, 1,           1
##FIRST=     14782.0589164792, 0,            0
##LAST=      -15158.0608439998, 0,           0
##MIN=       -15158.0608439998, -10645646,   0
##MAX=       14782.0589164792, 283036832,    0
$$ Real data points
##PAGE= N=1
##DATA TABLE= (X++(R..R)), XYDATA
$$ [...]
$$ plain form
42717 1522358 795655 694638 1519261 2651974 3318250 3349808 3013937 2492651 1941410
42708 1941410 1773086 2293762 3119379 3547159 3564093 3862303 4673615 5279502 5094138 4618990
42698 4618990 4706412 5311807 5672662 5453826 4997887 4570006 4057611 3416833 2789906 2147485
42688 2147485 1411141 956050 1308531 2187031 2536752 1848085 858805 540372 887040
42679 887040 1199362 1165884 1063140 1069433 969891 588050 90931 -269845 -471549 -638231
42669 -638231 -766267 -652656 -119856 704870 1421744 1765869 1894311 2094357 2301048 2189475
42659 2189475 1720265 1249133 1036391 999914 1055814 1296602 1608229 1510427 768953 -67093
42649 -67093 -157942 651686 1652602 2066010 1824876 1566587 1944279 2889499 3540661 3083415
$$ packed form
42717A522358p26703j01017Q24623J132713O66276L1558l35871n21286n51241
42708A941410j68324N20676Q25617M27780J6934K98210Q11312O05887j85364m75148
42698D618990Q7422O05395L60855k18836m55939m27881n12395o40778o26927o42421
42688B147485p36344m55091L52481Q78500L49721o88667r89280l18433L46668
42679H87040L12322l3478j02744O293r9542l81841m97119l60776k01704j66682
42669f38231j28036J13611N32800Q24726P16874L44125J28442K00046K06691j11573
42659B189475m69210m71132k12742l6477N5900K40788L11627r7802p41474q36046
42649f7093r0849Q09628J000916M13408k41134k58289L77692R45220O51162m57246
$$ plain form
42639 3083415 1708728 490436 245316 843331 1742701 2697024 3570743 3923115 3401765
42630 3401765 2380806 1642664 1460475 1456868 1326945 1207109 1280672 1470645 1645429 1785661
42620 1785661 1861956 1846846 1870223 2043064 2156340 1953893 1672954 1801871 2249700 2349560
42610 2349560 1880257 1480906 1712007 2265454 2571707 2697616 3047963 3549564 3822473
42601 3822473 3943723 4291732 4660418 4288669 2993415 1667562 1288139 1822919 2469440
42592 2469440 2680535 2572546 2482895 2511303 2531200 2420226 2178403 1886313 1610359 1389311
42582 1389311 1314325 1494813 1830603 1970895 1738095 1469323 1589241 1918733 1905711 1621700
42572 1621700 1907270 3138583 4387301 4477447 3603686 3102705 3581731 4071823 3416513
$$ packed form
42639C083415j374687j218292k45120N98015Q99370R54323Q73719L52372n21350
42630C401765j020959p38142j82189l607j29923j19836P3563J89973J74784J40232
42620A785661P6295j5110K3377J72841J13276k02447k80939J28917M47829R9860
42610B349560m69303l99351K31101N53447L06253J25909L50347N01601K72909
42601C822473J21250L48009L68686l71749j295254j325853l79423N34780O46521
42592B469440K11095j07989q9651K8408J9897j10974k41823k92090k75954k21048
42582A389311p4986J80488L35790J40292k32800k68772J19918L29492j3022k84011
42572A621700K85570J231313J248718R0146q73761n00981M79026M90092o55310
$$ plain form
42563 3416513 1897034 872926 1102087 2049024 2800899 3050610 2988286 2747693 2397864
42554 2397864 2219761 2480052 2926515 2942299 2362743 1793819 1846773 2316944 2507468 2231306
42544 2231306 2010146 2227350 2592060 2725127 2861254 3490842 4506061 5241272 5380195
42535 5380195 5343882 5617964 6092413 6335083 6222502 5940619 5499433 4634275 3268353
42526 3268353 1841072 1015609 1081828 1688371 2174846 2198287 2026950 2157318 2672150 3118054
42516 3118054 3031448 2404057 1569602 856231 495008 635233 1179334 1733789 2006075 2172476
42506 2172476 2563608 3042868 3060322 2404054 1588678 1332060 1832333 2671754 3257941 3286618
42496 3286618 2991881 3032034 3858974 5051934 5581875 4985359 3978203 3548905 3716444
$$ packed form
42563C416513j519479j024108K29161R46937P51875K49711o2324k40593l49829
42554B397864j78103K60291M46463J5784n79556n68924N2954M70171J90524k76162
42544B231306k21160K17204L64710J33067J36127O29588J015219P35211J38923
42535E380195l6313K74082M74449K42670j12581k81883m41186q65158j365922
42526C268353j427281q25463O6219O06543M86475K3441j71337J30368N14832M45904
42516C118054q6606o27391q34455p13371l61223J40225N44101N54455K72286J66401
42506B172476L91132M79260J7454o56268q15376k56618N00273Q39421N86187K8677
42496C286618k94737M0153Q26940J192960N29941n96516j007156m29298J67539
$$ plain form
42487 3716444 3701183 3171653 2650695 2586423 2713285 2707371 2871223 3525530 4105623 3712439
42477 3712439 2541891 1913457 2559978 3606294 3806518 3237606 2960645 3293098 3415721
42468 3415721 2826858 2216299 2351582 2834509 2770001 2236234 2152440 2788389 3330523 3103933
42458 3103933 2408985 1808141 1331213 896767 860009 1435650 2043105 2013672 1641270 1687972
42448 1687972 2037195 1812385 885390 247816 528638 1056194 989305 652335 977584 2080908
42438 2080908 3171311 3626985 3466759 2923727 2226210 1734137 1685093 1820161 1759482 1616286
42428 1616286 1655770 1549066 805307 -79480 96603 1514464 2818534 2855439 2121779
42419 2121779 1780170 1918551 1708322 900920 193316 181335 764945 1623335 2545541 3166741
$$ packed form
42487C716444j5261n29530n20958o4272J26862n914J63852O54307N80093l93184
42477C712439j170548o28434O46521J046316K00224n68912k76961L32453J22623
42468C415721n88863o10559J35283M82927o4508n33767q3794O35949N42134k26590
42458C103933o94948o00844m76928m34446l6758N75641O07455k9433l72402M6702
42448A687972L49223k24810r26995o37574K80822N27556o6889l36970L25249J103324
42438B080908J090403M55674j60226n43032o97517m92073m9044J35068o0679j43196
42428A616286L9484j06704p43759q84787J76083J417861J304070L6905p33660
42419B121779l41609J38381k10229q07402p07604j1981N83610Q58390R22206O21200
$$ plain form
42409 3166741 3052336 2306397 1618036 1500325 1892766 2613460 3651823 4778596 5433137
42400 5433137 5431780 5389919 5962391 6929468 7514771 7431521 7098965 6869830 6587541 6083575
42390 6083575 5673164 5771118 6182988 6189829 5436941 4456849 4063734 4357070 4642910 4361934
42380 4361934 3750908 3427371 3675630 4469647 5878013 7882987 9885734 11012484 11073630
42371 11073630 10711265 10358911 9570224 7823694 5621734 4171650 4019038 4506004 4691494
42362 4691494 4393281 4082004 4055721 4133507 4129189 4203893 4494196 4662597 4282486 3658817
42352 3658817 3725284 4831435 6057352 6201995 5175773 3881955 2943290 2243326 1680774
42343 1680774 1559561 1951712 2331991 2250399 1880423 1530674 1103813 492881 79057 288792
$$ packed form
42409C166741j14405p45939o88361j17711L92441P20694J038363J126773O54541
42400E433137j357m1861N72472R67077N85303q3250l32556k29135k82289n03966
42390F083575m10411R7954M11870O841p52888r80092l93115K93336K85840k80976
42380D361934o11026l23537K48259P94017J408366K004974K002747J126750O1146
42371A1073630l62365l52354p88687j746530k201960j450084j52612M86966J85490
42362D691494k98213l11277k6283P7786m318P4704K90303J68401l80111o23669
42352C658817O6467J106151J225917J44643j026222j293818r38665o99964n62552
42343A680774j21213L92151L80279q1592l69976l49749m26861o10932m13824K09735
$$ plain form
42333 288792 936154 1491576 1758389 1835050 1696022 1342467 1130528 1353743 1639114 1363610
42323 1363610 615428 132404 235499 403637 85546 -533451 -827497 -499716 158078
42314 158078 624116 657871 513082 589423 835233 766759 268397 -1216 599648 1813030
42304 1813030 2874951 3491076 3818893 3754335 3040366 2033210 1545444 1792590 2191832
42295 2191832 2343415 2493347 2811655 2949424 2677933 2363476 2431722 2871125 3562229 4516777
42285 4516777 5427506 5570079 4629636 3184571 1992203 1263403 960224 1177385 1750555
42276 1750555 2110527 2107558 2386167 3295250 4051842 3802161 2954633 2500902 2480421 2238602
42266 2238602 1890251 2216390 3100630 3377794 2550063 1501948 1068786 988363 879183
$$ packed form
42333B88792O47362N55422K66813P6661j39028l53555k11939K23215K85371k75504
42323A363610p48182m83024J03095J68138l18091o18997k94046L27781O57794
42314A58078M66038L3755j44789P6341K45810o8474m98362k69613O00864J213382
42304A813030J061921O16125L27817o4558p13969j007156m87766K47146L99242
42295B191832J51583J49932L18308J37769k71491l14457O8246M39403O91104R54548
42285D516777R10729J42573r40443j445065j192368p28800l03179K17161N73170
42276A750555L59972k969K78609R09083P56592k49681q47528m53731k0481k41819
42266B238602l48351L26139Q84240K77164q27731j048115m33162q0423j09180
$$ plain form
42257 879183 1197716 2312084 3427160 3505453 2778442 2293185 2261788 1964029 1221042 830855
42247 830855 1260674 1863867 1895305 1578863 1577193 1953707 2321507 2627609 3055058 3356685
42237 3356685 3066509 2389403 2151806 2684448 3407995 3815189 4204792 4937958 5526277
42228 5526277 5195841 4084218 3135151 2898558 3141008 3618233 4413960 5293027 5522655
42219 5522655 4864102 4201232 4576261 5894397 7105412 7450796 7027656 6272656 5440190
42210 5440190 4651544 4075180 3912893 4316052 5230767 6195602 6530687 6029441 5287227
42201 5287227 5006996 5139109 5106840 4760536 4610924 5078044 5968424 6846482 7527862 7948422
42191 7948422 7837593 6914424 5410788 4124358 3742549 4116795 4379774 3918315 3093548
$$ packed form
42257H79183L18533J114368J115076P8293p27011m85257l1397k97759p42987l90187
42247H30855M29819O03193L1438l16442j670L76514L67800L06102M27449L01627
42237C356685k90176o77106k37597N32642P23547M07194L89603P33166N88319
42228E526277l30436j111623r49067k36593K42450M77225P95727Q79067K29628
42219E522655o58553o62870L75029J318136J211015L45384m23140p55000q32466
42210E440190p88646n76364j62287M03159R14715R64835L35085n01246p42214
42201E287227k80231J32113l2269l46304j49612M67120Q90380Q78058O81380M20560
42191G948422j10829r23169j503636j286430l81809L74246K62979m61459q24767
$$ plain form
42182 3093548 2744988 3090884 3547862 3672255 3720091 3984508 4110617 3617964 2796822 2468924
42172 2468924 2931213 3647556 4002965 3945247 3821079 3904232 4172268 4369422 4287782 4057348
42162 4057348 3977483 3981842 3658187 3040281 2883666 3668763 4755720 5159087 4828161 4432753
42152 4432753 4136345 3457160 2318601 1384091 1173119 1509611 1998281 2440438 2656717
42143 2656717 2519839 2325734 2559864 3145680 3456849 3160796 2507842 1802804 1270492
42134 1270492 1403512 2535819 3915268 4158938 2985979 1639359 1209040 1420066 1536505
42125 1536505 1526678 1677846 1874600 1985878 2270644 2721114 2731887 2140321 1819273 2402209
42115 2402209 3203149 3373672 3340252 3882326 4455882 3900541 2462177 1600921 1850270
$$ packed form
42182C093548l48560L45896M56978J24393M7836K64417J26109m92653q21142l27898
42172B468924M62289P16343L55409n7718j24168Q3153K68036J97154q1640k30434
42162D057348p9865M359l23655o17906j56615P85097J086957M03367l30926l95408
42152D432753k96408o79185j138559r34510k10972L36492M88670M42157K16279
42143B656717j36878j94105K34130N85816L11169k96053o52954p05038n32312
42134A270492J33020J132307J379449K43670j172959j346620m30319K11026J16439
42125A536505r827J51168J96754J11278K84766M50470J0773n91566l21048N82936
42115B402209Q00940J70523l3420N42074N73556n55341j438364q61256K49349
$$ plain form
42106 1850270 2295970 2276799 2192195 2330681 2261230 1917995 2087861 3116876 4087140 4003057
42096 4003057 3038422 1984321 1221270 898473 1363596 2579076 3683863 3978280 3914959
42087 3914959 4325998 5095915 5494394 5500142 5753225 6241956 6088719 4932732 3675073
42078 3675073 3333597 3704908 3731883 2929731 1938398 1705746 2473269 3623232 4327244
42069 4327244 4265482 3782063 3406877 3313727 3348320 3495332 4003848 4905804 5696172 5831747
42059 5831747 5426757 5069286 4973703 4772396 4246161 3712385 3370031 2822019 1837627 1129828
42049 1129828 1524047 2574634 2994568 2486649 2095589 2492959 3043358 3126823 3263721
42040 3263721 4010140 4679841 4352794 3484201 3194961 3408720 3124726 2330073 2087784
$$ packed form
42106A850270M45700j9171q4604J38486o9451l43235J69866J029015R70264q4083
42096D003057r64635j054101p63051l22797M65123J215480J104787K94417o3321
42087C914959M11039P69917L98479N748K53083M88731j53237j155987j257659
42078C675073l41476L71311K6975q02152r91333k32652P67523J149963P04012
42069D327244o1762m83419l75186r3150L4593J47012N08516R01956P90368J35575
42059E831747m04990l57471r5583k01307n26235n33776l42354n48012r84392p07799
42049A129828L94219J050587M19934n07919l91060L97370N50399Q3465J36898
42040C263721P46419O69701l27047q68593k89240K13759k83994p94653k42289
$$ plain form
42031 2087784 2600882 2748790 2031401 1544745 2234682 3373741 3760002 3496625 3470586
42022 3470586 3729846 3584422 3019078 2872227 3552357 4411086 4583154 3928625 3019052
42013 3019052 2541044 2751361 3279190 3512899 3309101 3087853 3098992 3049530 2793546 2885874
42003 2885874 3849758 5203181 5877446 5499967 4695198 4160641 3983210 3922343 3905645 4068333
41993 4068333 4530738 5227303 5875680 6195434 6217896 6172229 6018684 5496556 4809182 4740052
41983 4740052 5687718 7026272 7920343 8441320 9419250 11530622 14918100 19137049 22849786
41974 22849786 24214891 22605600 19660581 17679542 17219657 17247991 17287128 17997742 19730561
41965 19730561 22268833 26498314 34376756 45645099 55663341 58560286 52783342 42464355
$$ packed form
42031B087784N13098J47908p17389m86656O89937J139059L86261k63377k6039
42022C470586K59260j45424n65344j46851O80130Q58729J72068o54529r09573
42013C019052m78008K10317N27829K33709k03798k21248J1139m9462k55984R2328
42003B885874R63884J353423O74265l77479q04769n34557j77431o0867j6698J62688
41993D068333M62405O96565O48377L19754K2462m5667j53545n22128o87374o9130
41983D740052R47666J338554Q94071N20977R77930K111372L387478M218949L712737
41974B2849786J365105j609291k945019j981039m59885K8334L9137P10614J732819
41965A9730561K538272M229481P878442J1268343J0018242K896945n776944j0318987
$$ plain form
41957 42464355 33200984 27474012 24355112 22368457 21357107 21763666 23439433 26164336
41949 26164336 30884931 38895401 48914776 56026330 55341977 47008250 36290715 28245649
41941 28245649 23549545 20132609 17110975 15277902 14747910 14559963 14774902 16811361
41933 16811361 20775726 24060908 23948185 20718619 16955916 14380500 12639675 10886102
41925 10886102 9152272 7918650 7339586 7323311 7717675 8080579 7837622 7004739 6265972
41916 6265972 6035733 5968508 5764574 5880488 6833379 8216698 9140763 9445139 9713117
41907 9713117 10122417 10095190 9327424 8474134 8369393 9012731 9762615 10198826 10363555 10423978
41897 10423978 10567358 11058105 11929936 12706907 12871946 12577114 12459402 12759778 13101936
$$ packed form
41957D2464355r263371n726972l118900j986655j011350M06559J675767K724903
41949B6164336M720595Q010470J0019375P111554o84353q333727j0717535q045066
41941B8245649m696104l416936l021634j833073n29992j87947K14939K036459
41933A6811361L964365L285182j12723l229566l762703k575416j740825j753573
41925A0886102j733830j233622n79064j6275L94364L62904k42957q32883p38767
41916F265972k30239o7225k03934J15914R52891J383319R24065L04376K67978
41907I713117M09300k7227p67766q53290j04741O43338P49884M36211J64729O0423
41897A0423978J43380M90747Q71831P76971J65039k94832j17712L00376L42158
$$ plain form
41888 13101936 13232061 13460172 14081242 14765536 14954934 14670820 14495669 14762452 15113380
41879 15113380 14980504 14289753 13541700 13306908 13778049 14751649 15860475 16759378 17241618
41870 17241618 17366626 17452154 17765489 18212233 18518251 18714997 19119608 19708078 19932199
41861 19932199 19550866 19302867 20109979 21680172 22622462 22187388 21272433 21242723 22211429
41852 22211429 23108330 23223619 22972188 23037635 23376073 23435753 23034590 22612188 22694536 23388611
41842 23388611 24373293 25147082 25276175 24658836 23693593 23042076 23033843 23310729 23168023 22259848
41832 22259848 20919972 19828470 19440576 19687950 20103289 20229915 20011762 19776637 19757024
41823 19757024 19734753 19374898 18818443 18558924 18655894 18506433 17667414 16524590 15722176
$$ packed form
41888A3101936J30125K28111O21070O84294J89398k84114j75151K66783L50928
41879A5113380j32876o90751p48053k34792M71141R73600J108826Q98903M82240
41870A7241618J25008Q5528L13335M46744L06018J96746M04611N88470K24121
41861A9932199l81333k47999Q07112J570193R42290m35074r14955k9710R68706
41852B2211429Q96901J15289k51431O5447L38438N9680m01163m22402Q2348O94075
41842B3388611R84682P73789J29093o17339r65243o51517q233K76886j42706r08175
41832B2259848j339876j091502l87894K47374M15339J26626k18153k35125j9613
41823A9757024k2271l59855n56455k59519R6970j49461q39019j142824q02414
$$ plain form
41814 15722176 15207687 14409975 13280080 12529837 12655370 13207248 13341074 12792808 12010756
41805 12010756 11542355 11614848 12204525 13161812 14167477 14754973 14576683 13738859 12840154
41796 12840154 12501670 12713656 12784941 12179914 11289119 10983504 11398862 11670600 11143763
41787 11143763 10400814 10560239 11727701 12730795 12518725 11377565 10459966 10375902 10640697
41778 10640697 10476729 9774126 9056584 8726498 8680228 8663512 8679472 8862050 9159410 9413237
41768 9413237 9662272 10071460 10526757 10568605 9887205 8751863 7789833 7368034 7287192 7083137
41758 7083137 6563658 6010481 5864870 6269017 6951366 7485975 7562020 7092608 6285837 5604176
41748 5604176 5392007 5476281 5373359 4922146 4391873 3940184 3467129 3170865 3603807 4741913
$$ packed form
41814A5722176n14489p97712j129895p50243J25533N51878J33826n48266p82052
41805A2010756m68401P2493N89677R57287J005665N87496j78290q37824q98705
41796A2840154l38484K11986P1285o05027q90795l05615M15358K71738n26837
41787A1143763p42949J59425J167462J003094k12070j141160r17599q4064K64795
41778A0640697j63968p02603p17542l30086m6270j6716J5960J82578K97360K53827
41768I413237K49035M09188M55297M1848o81400j135342r62030m21799q0842k04055
41758G083137n19479n53177j45611M04147O82349N34609P6045m69412q06771o81661
41748E604176k12169Q4274j02922m51213n30273m51689m73055k96264M32942J138106
$$ plain form
41738 4741913 5621562 5574599 5297875 5818851 6792247 6935475 6053488 5411973 5831363 6532334
41728 6532334 6424991 5622618 4953280 4649546 4307455 3711449 2985962 2218863 1553718
41719 1553718 1422491 2099447 3147485 3782472 3714987 3308852 3047044 3107855 3290671 3170238
41709 3170238 2585324 2087520 2452168 3561969 4378483 4354440 4192136 4666038 5357744
41700 5357744 5312860 4474996 3675386 3523893 4011374 4864171 5578066 5467780 4458239
41691 4458239 3490882 3374837 3650432 3469525 3100478 3391975 4104554 4164695 3493516 3145615
41681 3145615 3487674 3688740 3383170 3395374 4171214 4798858 4446503 3684275 3437677 3556486
41671 3556486 3441797 3328445 3827509 4673008 4953710 4340510 3304117 2390136 1931394
$$ packed form
41738D741913Q79649m6963k76724N20976R73396J43228q81987o41515M19390P00971
41728F532334j07343q02373o69338l03734l42091n96006p25487p67099o65145
41719A553718j31227O76956J048038O34987o7485m06135k61808O0811J82816j20433
41709C170238n84914m97804L64648J109801Q16514k4043j62304M73902O91706
41700E357744m4884q37864p99610j51493M87481Q52797P13895j10286j009541
41691D458239r67357j16045K75595j80907l69047K91497P12579O0141o71179l47901
41681C145615L42059K01066l05570J2204P75840O27644l52355p62228k46598J18809
41671C556486j14689j13352M99064Q45499K80702o13200j036393r13981m58742
$$ plain form
41662 1931394 2106464 2617651 2706564 2152929 1809768 2434687 3489152 3934535 3745006
41653 3745006 3663492 3853939 3896004 3869049 4238457 4680764 4222588 2792289 1594869 1565071
41643 1565071 2290081 2838606 2888823 2620991 2188746 1801829 1827462 2340716 2900687 3068006
41633 3068006 2843078 2459985 2161538 2287008 3077973 4237897 5178605 5807667 6470494
41624 6470494 6997704 6608772 5132267 3576530 2952758 3143341 3493215 3900885 4597014
41615 4597014 5339771 5707494 5960261 6771212 8114525 9108088 9043952 8059177 6751358
41606 6751358 5620267 4938477 4694268 4531050 4101709 3575894 3491770 4075353 5040692
41597 5040692 6086837 7188153 8250676 8845837 8574530 7564269 6403899 5591225 5098601
$$ packed form
41662A931394J75070N11187Q8913n53635l43161O24919J054465M45383j89529
41653C745006q1514J90447M2065k6955L69408M42307m58176j430299j197420k9798
41643A565071P25010N48525N0217k67832m32245l86917K5633N13254N59971J67319
41633C068006k24928l83093k98447J25470P90965J159924R40708O29062O62827
41624F470494N27210l88932j476505j555737o23772J90583L49874M07670O96129
41615D597014P42757L67723K52767Q10951J343313R93563o4136r84775j307819
41606F751358j131091o81790k44209j63218m29341n25815q4124N83583R65339
41597E040692J046145J101316J062523N95161k71307j010261j160370q12674m92624
$$ plain form
41588 5098601 4492234 3526148 2584915 2323497 2809553 3365644 3496656 3589035 4234448 5164438
41578 5164438 5517819 5090093 4606988 4609425 4731858 4439132 3955091 3966020 4686781 5660140
41568 5660140 6310003 6320323 5623594 4445415 3356137 2917669 3176359 3712037 4221894
41559 4221894 4810195 5589353 6233721 6229492 5575171 4954279 4975317 5349364 5162474 4044479
41549 4044479 2701769 2015627 1930094 1697350 1047135 520528 612930 1189901 1969018 3020895
41539 3020895 4381970 5556784 5890671 5282188 4196247 3137484 2398653 2123855 2267638
41530 2267638 2590069 2926206 3296015 3572559 3387353 2695191 2054332 1862482 1672875
41521 1672875 930649 134211 407389 1868688 3237637 3343666 2404781 1498962 1316900
$$ packed form
41588E098601o06367r66086r41233k61418M86056N56091J31012R2379O45413R29990
41578E164438L53381m27726m83105K437J22433k92726m84041J0929P20761R73359
41568E660140O49863J0320o96729j178179j089278m38468K58690N35678N09857
41559D221894N88301P79158O44368m229o54321o20892K1038L74047j86890j117995
41549D044479j342710o86142q5533k32744o50215n26607R2402N76971P79117J051877
41539C020895J361075J174814L33887o08483j085941j058763p38831k74798J43783
41530B267638L22431L36137L69809K76544j85206o92162o40859j91850j89607
41521A672875p42226p96438K73178J461299J368949J06029r38885r05819j82062
$$ plain form
41512 1316900 1805426 2567392 3145340 3178142 2672278 2012373 1548767 1367260 1487742 1899557
41502 1899557 2326149 2455647 2550449 3230226 4397746 5074569 4748897 4181555 4218732 4459989
41492 4459989 4011793 3102665 2854134 3573900 4348172 4466865 4294244 4393085 4590110 4400638
41482 4400638 3832763 3296986 3066318 3161691 3451884 3588510 3164462 2236009 1453611 1439109
41472 1439109 2205085 3282139 4157059 4522290 4441940 4379398 4711648 5145609 5055839 4497350
41462 4497350 4308515 4927677 5664778 5606807 4838109 4237819 4297570 4621084 4517532 3767007
41452 3767007 2841861 2503393 3012555 3695190 3633047 2843147 2239460 2252504 2198406 1466817
41442 1466817 615743 538967 1086959 1429168 1452791 1781051 2472168 2721200 2072456 1090033
$$ packed form
41512A316900M88526P61966N77948L2802n05864o59905m63606j81507J20482M11815
41502A899557M26592J29498R4802O79777J167520O76823l25672n67342L7177K41257
41492D459989m48196r09128k48531P19766P74272J18693j72621R8841J97025j89472
41482D400638n67875n35777k30668R5373K90193J36626m24048r28453p82398j4502
41472A439109P65976J077054Q74920L65231q0350o2542L32250M33961q9770n58489
41462D497350j88835O19162P37101n7971p68698o00290N9751L23514j03552p50525
41452C767007r25146l38468N09162O82635o2143p89900o03687J3044n4098p31589
41442A466817q51074p6776N47992L42209K3623L28260O91117K49032o48744r82423
$$ plain form
41432 1090033 490716 294612 216256 307107 725877 1259574 1534952 1500268 1377424 1310798
41422 1310798 1308584 1370661 1471307 1539444 1575469 1645238 1707498 1658768 1600745 1800077 2283490
41411 2283490 2725716 2862449 2788857 2724484 2689269 2553105 2269806 1969545 1889492 2168352
41401 2168352 2600245 2756599 2567295 2525240 2918544 3134190 2379671 1007023 335142
41392 335142 986359 2126426 2661011 2490449 2121174 1674878 973074 252695 98647
41383 98647 701992 1598685 2115972 1886867 1124344 561574 813644 1604762 2011336 1663116
41373 1663116 1170417 1075303 1074016 808708 703976 1194501 1711664 1477663 944250 1292408
41363 1292408 2609356 3703756 3815321 3404913 3031692 2576524 2036393 2044540 2885277
$$ packed form
41432A090033n99317j96104p8356R0851M18770N33697K75378l4684j22844o6626
41422A310798k214O2077J00646O8137L6025O9769O2260m8730n8023J99332M83413
41411B283490M42226J36733p3592o4373l5215j36164k83299l00261q0053K78860
41401B168352M31893J56354j89304m2055L93304K15646p54519j372648o71881
41392C35142O51217J140067N34585j70562l69275m46296p01804p20379j54048
41383I8647O03345Q96693N17287k29105p62523n62770K52070P91118M06574l48220
41373A663116m92699r5114j287k65308j04732M90525N17163k34001n33413L48158
41363A292408J316948J094400J11565m10408l73221m55168n40131Q147Q40737
$$ plain form
41354 2885277 3746661 3686762 2813079 1899438 1349662 1129287 1219897 1525830 1767509 1995019
41344 1995019 2654217 3564848 3566577 2079165 371148 118495 1125615 1771356 1474766
41335 1474766 1223766 1559214 1636341 884980 207514 586475 1541229 1990911 1844863 1690518
41325 1690518 1590433 1343093 1404170 2255569 3144726 2819747 1536245 1000140 2015792
41316 2015792 3408693 3806716 3401310 3182133 3296228 3126791 2495453 1851462 1464456
41307 1464456 1172383 852878 583634 419036 449652 897037 1676555 2112465 1696773 970828
41297 970828 963973 1782953 2472333 2391309 2007981 2000602 2181822 1847386 871203 -74363
41287 -74363 -336169 18030 343552 106183 -575002 -1022117 -696997 194917 918380 1001291
$$ packed form
41354B885277Q61384n9899q73683r13641n49776k20375R0610L05933K41679K27510
41344A995019O59198R10631J729j487412j708017k52653J007120O45741k96590
41335A474766k51000L35448P7127p51361o77466L78961R54754M49682j46048j54345
41325A690518j00085k47340O1077Q51399Q89157l24979j283502n36105J015652
41316B015792J392901L98023m05406k19177J14095j69437o31338o43991l87006
41307A464456k92073l19505k69244j64598L0616M47385P79518M35910m15692p25945
41297I70828o855Q18980O89380q1024l83328p379J81220l34436r76183r45566
41287g4363k61806L54199L25522k37369o81185m47115L25120Q91914P23463Q2911
$$ plain form
41277 1001291 631915 280630 170447 185151 99998 -170574 -425978 -314965 206977 683569
41267 683569 734333 691924 1185882 2129840 2734939 2672272 2562137 2951774 3411740 3202504
41257 3202504 2401844 1733531 1548555 1619118 1782370 2121074 2507545 2570212 2222368 1756882
41247 1756882 1348965 934141 645579 838528 1493400 2070817 2193003 2047765 1910577
41238 1910577 1764137 1688603 2063269 2871176 3293862 2692404 1664835 1327637 1718921
41229 1718921 1831050 1259949 789042 980482 1221303 906716 699502 1514479 2768336
41220 2768336 2936677 1773201 702431 743716 1222430 1093673 517908 312005 593418
41211 593418 869051 948477 905151 563967 -87759 -347652 396060 1569233 2078646 1843152
$$ packed form
41277A001291l69376l51285j10183J4704q5153k70572k55404J11013N21942M76592
41267F83569N0764m2409M93958R43958O05099o2667j10135L89637M59966k09236
41257C202504q00660o68313j84976P0563J63252L38704L86471O2667l47844m65486
41247A756882m07917m14824k88562J92949O54872N77417J22186j45238j37188
41238A910577j46440p5534L74666Q07907M22686o01458j027569l37198L91284
41229A718921J12129n71101m70907J91440K40821l14587k07214Q14977J253857
41220B768336J68341j163476j070770M1285M78714j28757n75765k05903K81413
41211E93418K75633P9426m3326l41184o51726k59893P43712J173173N09413k35494
$$ plain form
41201 1843152 1628160 1568015 1098082 338964 159842 598500 619254 -53556 -273289 575144
41191 575144 1314072 768422 -342953 -652370 -325690 -416568 -685890 130554 2001194
41182 2001194 3262485 2922164 1902879 1504929 1796999 2134522 2304951 2416840 2301368
41173 2301368 1744018 995278 578868 770261 1424619 2032275 1947370 1045047 158528 253143
41163 253143 1107807 1533813 1061668 604741 1095237 2225621 3062983 3276725 3144121
41154 3144121 2817374 2247892 1591213 1150597 1025493 1112453 1264350 1263448 956178 601568
41144 601568 692840 1243963 1730190 1943943 2298823 2945127 3269908 2832741 2196038 2124814
41134 2124814 2420013 2309198 1690532 1241997 1478688 2359393 3639888 4944760 5638084
$$ packed form
41201A843152k14992o0145m69933p59118j79122M38658K0754o72810k19733Q48433
41191E75144P38928n45650j111375l09417L26680r0878k69322Q16444J870640
41182B001194J261291l40321j019285l97950K92070L37523J70429J11889j15472
41173B301368n57350p48740m16410J91393O54358O07656q4905r02323q86519R4615
41163B53143Q54664M26006m72145m56927M90496J130384Q37362K13742j32604
41154C144121l26747n69482o56679m40616j25104Q6960J51897r02l07270l54610
41144F01568R1272N51123M86227K13753L54880O46304L24781m37167o36703p1224
41134B124814K95199j10815o18666m48535K36691Q80705J280495J304872O93324
$$ plain form
41125 5638084 5316748 4385299 3560143 2946413 2261538 1774668 2098171 2956030 3109681
41116 3109681 1941190 420563 -28744 839550 2109379 2997438 3537243 4035133 4365309
41107 4365309 4083112 3130037 2174767 2026375 2686857 3255267 2968492 2096147 1498909
41098 1498909 1518899 1755148 1844132 1931433 2238283 2584371 2627060 2405147 2412189 3071146
41088 3071146 4126590 4661015 3994042 2603102 1722982 1828173 2053245 1549501 817954
41079 817954 924551 1823498 2466695 2424101 2312531 2523722 2636422 2448912 2540893 3184853
41069 3184853 3577985 2958761 1838776 1266821 1352307 1449082 1510344 2231522 3767163 5163948
41059 5163948 5422680 4635053 3759325 3560161 3999317 4497778 4609012 4423293 4299097
$$ packed form
41125E638084l21336r31449q25156o13730o84875m86870L23503Q57859J53651
41116C109681j168491j520627m49307Q68294J269829Q88059N39805M97890L30176
41107D365309k82197r53075r55270j48392O60482N68410k86775q72345n97238
41098A498909J9990K36249Q8984Q7301L06850L46088M2689k21913P042O58957
41088C071146J055444N34425o66973j390940q80120J05191K25072n03744p31547
41079H17954J06597Q98947O43197m2594j11570K11191J12700j87510R1981O43960
41069C184853L93132o19224j119985n71955Q5486R6775O1262P21178J535641J396785
41059E163948K58732p87627q75728j99164M39156M98461J11234j85719j24196
$$ plain form
41050 4299097 4268498 3993034 3404288 2978193 3032804 3109183 2580448 1696487 1433254 2281288
41040 2281288 3674984 4706561 4974378 4618712 3961189 3356098 3113845 3315784 3797953
41031 3797953 4363905 4853187 5052846 4865117 4598963 4733905 5273837 5674786 5565774
41022 5565774 5193666 4959329 4892052 4878994 5046885 5486642 5874716 5890626 5864655 6437593
41012 6437593 7571991 8469480 8608993 8331850 8154713 8047660 7829304 7807069 8349352
41003 8349352 9028619 8950779 8037740 7312999 7609017 8536501 9187552 9437950 9919855 10863127
40993 10863127 11648169 11678250 11201465 10962026 11339352 12156909 13137243 14131102 14896124
40984 14896124 15072019 14673232 14428713 15222255 17057880 18866995 19631844 19545993 19690961
$$ packed form
41050D299097l0599k75464n88746m26095N4611P6379n28735q83961k63233Q48034
41040B281288J393696J031577K67817l55666o57523o05091k42253K01939M82169
41031C797953N65952M89282J99659j87729k66154J34942N39932M00949j09012
41022E565774l72108k34337o7277j3058J67891M39757L88074J5910k5971N72938
41012F437593J134398Q97489J39513k77143j77137j07053k18356k2235N42283
41003H349352O79267p7840r13039p24741K96018R27484O51051K50398M81905R43272
40993A0863127P85042L0081m76785k39439L77326Q17557R80334R93859P65022
40984A4896124J75895l98787k44519P93542J835625J809115P64849q5851J44968
$$ plain form
40975 19690961 20622006 21769508 22380253 22508755 22680949 23033616 23406074 24015264 25264753
40966 25264753 26864646 27906935 28085972 28189658 28939189 29886140 30106820 29701983 29863502
40957 29863502 31365721 33539357 35005861 35123590 34441165 33901326 33923796 34325676 34888899
40948 34888899 35690413 36783019 37792754 38159724 37807876 37321587 37332558 37896677 38604192
40939 38604192 39158473 39649865 40264747 40858102 40950510 40281144 39360069 39201246 40281934
40930 40281934 41981874 43365027 44256352 45016678 45462570 44869894 43234913 41678634 41091419
40921 41091419 41055669 40752108 40316231 40406974 40832257 40707095 39990991 39812581 40863050
40912 40863050 42231178 42407028 41025206 39120145 37902688 37700859 37974939 38014955 37583317
$$ packed form
40975A9690961R31045J147502O10745J28502J72194L52667L72458O09190J249489
40966B5264753J599893J042289J79037J03686P49531R46951K20680m04837J61519
40957B9863502J502219K173636J466504J17729o82425n39839K2470M01880N63223
40948C4888899Q01514J092606J009735L66970l51848m86289J0971N64119P07515
40939C8604192N54281M91392O14882N93355R2408o69366r21075j58823J080688
40930D0281934J699940J383153Q91325P60326M45892n92676j634981j556279n87215
40921D1091419l5750l03561m35877R0743M25283j25162p16104j78410J050469
40912D0863050J368128J75850j381822j905061j217457k01829K74080M0016m31638
$$ plain form
40903 37583317 36999379 36605969 36238579 35448473 34230547 33182746 32800421 32885794 32829988
40894 32829988 32262899 31272347 30195880 29361958 28861900 28450762 27839202 27121145 26628006
40885 26628006 26297982 25599324 24279088 22762321 21496496 20341891 19086915 18158046
40877 18158046 18098423 18514339 18365211 17430167 16714729 17009120 17666115 17423451 16082719
40868 16082719 14671689 14011248 13800209 13336174 12603304 12167152 12202633 12151998 11485562
40859 11485562 10471742 9890365 10066195 10484411 10456687 9926650 9373328 9048272 8685746
40850 8685746 8067283 7508194 7448895 7748199 7805288 7383131 6894436 6741739 6786363 6748745
40840 6748745 6762484 7086402 7520642 7675197 7707200 8106743 8644541 8297615 6680062 4938219
$$ packed form
40903C7583317n83938l93410l67390p90106j217926j047801l82325Q5373n5806
40894C2829988n67089r90552j076467q33922n00058m11138o11560p18057m93139
40885B6628006l30024o98658j320236j516767j265825j154605j254976r28869
40877A8158046n9623M15916j49128r35044p15438K94391O56995k42664j340732
40868A6082719j411030o60441k11039m64035p32870m36152L5481n0635o66436
40859A1485562j013820n81377J75830M18216k7724n30037n53322l25056l62526
40850H685746o18463n59089n9299K99304N7089m22157m88695j52697M4624l7618
40840F748745J3739L23918M34240J54555L2003L99543N37798l46926j617553j741843
$$ plain form
40830 4938219 4511279 5330275 6027640 5810899 5264070 5131978 5184029 4831103 4253120 4140117
40820 4140117 4552605 4796936 4485512 4089189 4194717 4681968 4987367 4885823 4626914
40811 4626914 4451784 4366330 4366678 4510266 4645936 4375403 3511490 2423722 1723990 1695979
40801 1695979 2193793 2967840 3826207 4526861 4826136 4726018 4461395 4180093 3864366
40792 3864366 3621644 3715546 4108868 4300682 3962507 3515132 3654234 4405257 5083550 5172712
40782 5172712 4778082 4131186 3169910 1927154 945272 826923 1493567 2280395 2744550
40773 2744550 3038613 3445053 3893325 4145379 4232156 4382128 4517228 4118349 2832063
40764 2832063 1139913 138575 485397 1686309 2619130 2692212 2263480 1972824 2040650
$$ packed form
40830D938219m26940Q18996O97365k16741n46829j32092N2051l52926n77983j13003
40820D140117M12488K44331l11424l96323J05528M87251L05399j01544k58909
40811D626914j75130q5454L48J43588J35670k70533q63913j087768o99732k8011
40801A695979M97814P74047Q58367P00654K99275j00118k64623k81302l15727
40792C864366k42722R3902L93322J91814l38175m47375J39102P51023O78293Q9162
40782E172712l94630o46896r61276j242756r81882j18349O66644P86828M64155
40773B744550K94063M06440M48272K52054Q6777J49972J35100l98879j286286
40764B832063j692150j001338L46822J200912R32821P3082m28732k90656O7826
$$ plain form
40755 2040650 2385226 3036794 3960331 4587513 4114049 2539513 1043521 878314 1970740
40746 1970740 3020290 3010413 2206459 1486080 1138248 807181 402669 424844 1225365 2396227
40736 2396227 3181848 3259128 2895305 2542529 2470828 2613703 2622635 2288924 2002393 2402679
40726 2402679 3359917 3805266 3044358 1811138 1364300 1835080 2267137 2167090 2078650
40717 2078650 2432980 2728217 2364977 1682627 1559570 2299557 3383733 4110682 4132154
40708 4132154 3571325 2927656 2706550 2943414 3266027 3450664 3526031 3311537 2519429 1565999
40698 1565999 1525597 2752966 4207887 4795483 4766479 5013262 5565161 5775781 5575744
40689 5575744 5403391 5125780 4255696 3223036 3161492 4198726 5147670 5268226 5185830
$$ packed form
40755B040650L44576O51568R23537O27182m73464j574536j495992j65207J092426
40746A970740J049550r877q03954p20379l47832l31067m04512K2175Q00521J170862
40736B396227P85621P7280l63823l52776p1701J42875Q932l33711k86531M00286
40726B402679R57238M45349p60908j233220m46838M70780M32057j00047q8440
40717B078650L54330K95237l63240o82350j23057P39987J084176P26949K1472
40708D132154n60829o43669k21106K36864L22613J84637P5367k14494p92108r53430
40698A565999m0402J227369J454921N87596k9004K46783N51899K10620k00037
40689E575744j72353k77611q70084j032660o1544J037234R48944J20556q2396
$$ plain form
40680 5185830 5572274 6099975 6429822 7098411 8404943 9337318 8817890 7405075 6533661
40671 6533661 6467159 6220136 5286862 4249606 3720393 3790979 4561861 6116809 7818883
40662 7818883 8673723 8635064 8592981 8852889 8679254 7686211 6569233 5913995 5342609 4540753
40652 4540753 4099777 4427026 4740838 4262544 3671980 4116954 5296175 5889198 5598559
40643 5598559 5326980 5372436 4966498 3933060 3366229 3947033 4736113 4559571 3768483
40634 3768483 3632647 4521133 5657543 6400498 6879487 7443782 8243160 9415670 11079897
40625 11079897 12979919 14540207 15398929 15636311 15499811 15231580 15196067 15840252 17317541
40616 17317541 19187263 20524283 20421053 18668041 16107376 14107883 13463425 13864053
$$ packed form
40680E185830L86444N27701L29847O68589J306532R32375n19428j412815q71414
40671F533661o6502k47023r33274j037256n29213P0586P70882J554948J702074
40662G818883Q54840l8659m2083K59908j73635r93043j116978o55238n71386q01856
40652D540753m40976L27249L13812m78294n90564M44974J179221N93023k90639
40643E598559k71579M5456m05938j033438n66831N80804P89080j76542p91088
40634C768483j35836Q88486J136410P42955M78989N64295P99378J172510J664227
40625A1079897J900022J560288Q58722K37382j36500k68231l5513O44185J477289
40616A7317541J869722J337020j03230j753012k560665j999493o44458M00628
$$ plain form
40608 13864053 14426665 14420818 13435733 11419437 8964788 7126471 6417251 6232565 5730334
40599 5730334 4982940 4685120 4963740 5181884 4884700 4289750 3769888 3420607 3254426
40590 3254426 3308800 3403097 3218691 2767224 2419769 2384070 2493693 2534867 2416977 2070274
40580 2070274 1629062 1637384 2472801 3555070 3810110 3070024 2347092 2490977 3227413 3817844
40570 3817844 4009139 3929590 3644997 3289183 3146110 3195297 3088038 2942771 3485356 4832658
40560 4832658 5821974 5358755 3940527 2985341 3030866 3505050 3947341 4359012 4423813 3557312
40550 3557312 2013947 950247 918651 1109677 661972 28535 270661 1414853 2376908
40541 2376908 2457017 2127551 2100816 2248854 1995263 1473377 1567604 2644029 3857902 4208890
$$ packed form
40608A3864053N62612n847r85085k016296k454649j838317p09220j84686n02231
40599E730334p47394k97820K78620K18144k97184n94950n19862l49281j66181
40590C254426N4374R4297j84406m51467l47455l5699J09623M1174j17890l46703
40580B070274m41212Q322Q35417J082269K55040p40086p22932J43885P36436N90431
40570C817844J91295p9549k84593l55814j43073M9187j07259j45267N42585J347302
40560D832658R89316m63219j418228r55186M5525M74184M42291M11671O4801q66501
40550C557312j543365j063700l1596J91026m47705o33437K42126J144192R62055
40541B376908Q0109l29466k6735J48038k53591n21886R4227J076425J213873L50988
$$ plain form
40531 4208890 3866071 3750113 4032635 3983904 3423064 3292138 4240989 5484265 5858290
40522 5858290 5400585 4983032 4834377 4456731 3801336 3493043 3860572 4627007 5599802
40513 5599802 6778694 7703357 7680586 6928650 6543349 6909507 7062921 6224757 5122901
40504 5122901 4949352 5609540 5985206 5650715 5346464 5703550 6359574 6707044 6952781
40495 6952781 7856903 9526958 10972272 11145248 10237477 9517437 9804486 10578757 10919570
40486 10919570 10815010 10889323 11184829 11129557 10675166 10503595 10880893 11214787 11143772 11199993
40476 11199993 11820320 12478400 12537612 12342244 12623316 13275331 13602286 13473631 13329208
40467 13329208 13176822 12500834 11266042 10260331 10215774 11089650 12317928 13308679 13644239
$$ packed form
40531D208890l42819j15958K82522m8731n60840j30926R48851J243276L74025
40522E858290m57705m17553j48655l77646o55395l08293L67529P66435R72795
40513E599802J178892R24663k2771p51936l85301L66158J53414q38164j101856
40504E122901j73549O60188L75666l34491l04251L57086O56024L47470K45737
40495F952781R04122J670055J445314J72976r07771p20040K87049P74271L40813
40486A0919570j04560P4313K95506n5272m54391j71571L77298L33894p1015N6221
40476A1199993O20327O58080N9212j95368K81072O52015L26955j28655j44423
40467A3329208j52386o75988j234792j005711m4557Q73876J228278R90751L35560
$$ plain form
40458 13644239 13319135 12878029 12847635 12976238 12565807 11630908 11060708 11334938 11715417
40449 11715417 11263578 10238691 9779796 10300081 10908345 10684727 9997635 9981031 10872422
40440 10872422 11593303 11298624 10734232 11283642 12886236 13893942 13270479 12010120 11708942
40431 11708942 12438542 12972470 12699149 12202812 11991524 11738613 11092679 10358073 9903298
40422 9903298 9574365 9197716 9075971 9405862 9698840 9454215 9042781 9157798 9588262
40413 9588262 9392288 8349504 7392927 7237385 7284742 6522995 5104059 4277963 4808912
40404 4808912 6096023 7012093 7098666 6676363 6210269 5960466 5996018 6148155 6085058 5762787
40394 5762787 5643512 6106972 6815914 7108052 6881685 6568004 6326730 5951744 5646660
$$ packed form
40458A3644239l25104m41106l0394J28603m10431r34899n70200K74230L80479
40449A1715417m51839j024887m58895N20285O08264k23618o87092j6604Q91391
40440A0872422P20881k94679n64392N49410J602594J007706o23463j260359l01178
40431A1708942P29600N33928k73321m96337k11288k52911o45934p34606m54775
40422I903298l28933l76649j21745L29891K92978k44625m11434J15017M30464
40413I588262j95974j042784r56577j55542M7357p61747j418936q26096N30949
40404D808912J287111R16070Q6573m22303m66094k49803L5552J52137o3097l22271
40394E762787j19275M63460P08942K92138k26367l13681k41274l74986l05084
$$ plain form
40385 5646660 6121023 7548187 9038708 9631745 9379169 9007023 8905575 8935870 8912339
40376 8912339 8796559 8640878 8694932 9257624 10091124 10419799 9945448 9372307 9375220 9583275
40366 9583275 9315562 8807071 8740751 8916070 8514660 7602848 7212930 7751845 8375991 8290353
40356 8290353 7765037 7440775 7405839 7428158 7455725 7438919 7186425 6738464 6377489 6083158
40346 6083158 5635961 5400570 6069278 7269529 7500624 6150320 4587261 4313261 4885416
40337 4885416 4826071 3928729 3291255 3397309 3607941 3587483 3869954 4649314 5146586 4737118
40327 4737118 3855294 3221299 2883739 2617283 2640706 3213150 3900791 3982356 3468597 3120419
40317 3120419 3412837 3922841 3892371 3150741 2308799 2085951 2538744 3052440 3122582 2937373
$$ packed form
40385E646660M74363J427164J490521N93037k52576l72146j01448L0295k3531
40376H912339j15780j55681N4054N62692Q33500L28675m74351n73141K913K08055
40366I583275k67713n08491o6320J75319m01410r11812l89918N38915O24146q5638
40356H290353n25316l24262l4936K2319K7567j6806k52494m47961l60975k94331
40346F083158m47197k35391O68708J200251K31095j350304j563059k74000N72155
40337D885416n9345q97342o37474J06054K10632k0458K82471P79360M97272m09468
40327D737118q81824o33995l37560k66456K3423N72444O87641Q1565n13759l48178
40317C120419K92418N10004l0470p41630q41942k22848M52793N13696P0142j85209
$$ plain form
40307 2937373 2960864 3159906 3119302 2873307 3001039 3666206 4138492 3727896 2778076 2152345
40297 2152345 1988813 1649976 889295 361782 683063 1495591 1941579 1820426 1785852 2400044
40287 2400044 3404942 4107502 4224384 4079372 4075736 4280013 4583812 4996955 5561700 6140260
40277 6140260 6589279 7120292 8175726 9845155 11641836 12973133 13612448 13642788 13341967
40268 13341967 13390045 14697943 17370811 20034690 20949999 19869291 18108624 16692549
40260 16692549 15366117 13891681 13254437 14407547 16301874 16517989 14014072 10238855
40252 10238855 7274844 5829007 5437115 5637924 6113646 6278681 5666750 4585332 3771661
40243 3771661 3510819 3544020 3648840 3816918 3980762 3992423 3796485 3354294 2604838 1740222
$$ packed form
40307B937373K3491J99042m0604k45995J27732O65167M72286m10596r49820o25731
40297B152345j63532l38837p60681n27513L21281Q12528M45988j21153l4574O14192
40287B400044J004898P02560J16882j45012l636K04277L03799M13143N64745N78560
40277F140260M49019N31013J055434J669429J796681J331297O39315L0340l00821
40268A3341967M8078J307898K672868K663879R15309j080708j760667j416075
40260A6692549j326432j474436o37244J153110J894327K16115k503917l775217
40252A0238855k964011j445837l91892K00809M75722J65035o11931j081418q13671
40243C771661k60842L3201J04820J68078J63844J1661j95938m42191p49456q64616
$$ plain form
40233 1740222 1162428 868409 364047 -399503 -619134 191473 1249355 1592036 1567231
40224 1567231 2128592 3044735 3136062 2183786 1221483 801892 374148 -269265 -345045 484289
40214 484289 1308843 1426613 1451278 2010530 2403436 1737109 564881 93319 350062 462645
40204 462645 342335 703164 1573681 2153063 2221088 2436476 2999435 3184471 2608595 1930736
40194 1930736 1746778 1670556 1176991 657602 858041 1679942 2280670 2189860 1732857 1417096
40184 1417096 1416108 1713407 2324412 3148594 3803994 3875425 3375303 2816682 2685802 2900513
40174 2900513 2994594 2810277 2664483 2720962 2640264 2191947 1821388 2079796 2744137 3135939
40164 3135939 3208130 3594835 4466239 5046652 4647780 3656161 2999435 2961067 3058497 2938154
$$ packed form
40233A740222n77794k94019n04362p63550k19631Q10607J057882L42681k4805
40224A567231N61361R16143R1327r52276r62303m19591m27744o43413p5780Q29334
40214D84289Q24554J17770K4665N59252L92906o66327j172228m71562K56743J12583
40204D62645j20310L60829Q70517N79382O8025K15388N62959J85036n75876o77859
40194A930736j83958p6222m93565n19389K00439Q21901O00728r0810m57003l15761
40184A417096r88K97299O11005Q24182O55400P1431n00122n58621j30880K14711
40174B900513R4081j84317j45794N6479q0698m48317l70559K58408O64341L91802
40164C135939P2191L86705Q71404N80413l98872r91619o56726l8368R7430j20343
$$ plain form
40154 2938154 2819504 2962732 3167939 3081695 2712124 2294288 1815889 1124494 507699 637270
40144 637270 1660490 2779329 3169053 2991750 2975352 3279987 3487127 3547702 3858630 4309145
40134 4309145 4167599 3254701 2408836 2316301 2615339 2698409 2676835 2872072 3009266 2740512
40124 2740512 2467999 2773739 3382485 3538578 3146998 2728474 2485858 2252543 2173690 2564420
40114 2564420 3186032 3498816 3563758 3847257 4180954 3856491 2871421 2170278 2366551 2996624
40104 2996624 3374106 3504203 3737711 4035273 4019481 3492273 2631433 1838076 1467699 1541362
40094 1541362 1767639 1998272 2413154 3004049 3286512 2983182 2580679 2624934 2870745 2815179
40084 2815179 2665082 2961481 3584272 3984619 4082014 4059566 3686080 2868571 2428063 3082469
$$ packed form
40154B938154j18650J43228K05207q6244l69571m17836m78399o91395o16795J29571
40144F37270J023220J118839L89724j77303j6398L04635K07140O0575L10928M50515
40134D309145j41546r12898q45865r2535K99038Q3070k1574J95237J37194k68754
40124B740512k72513L05740O08746J56093l91580m18524k42616k33315p8853L90730
40114B564420O21612L12784O4942K83499L33697l24463r85070p01143J96273O30073
40104B996624L77482J30097K33508K97562j5792n27208q60840p93357l70377P3663
40094A541362K26277K30633M14882N90895K82463l03330m02503M4255K45811n5566
40084B815179j50097K96399O22791M00347R7395k2448l73486q17509m40508O54406
$$ plain form
40074 3082469 4049082 4106702 3742546 4515713 6326993 7237106 6345796 4960709 4269964
40065 4269964 3708666 2599794 1704665 1848489 2361887 2268216 1975399 2468421 3668141
40056 3668141 4805793 5662875 6300206 6314264 5529562 4749242 4677678 4757684 4225200 3626458
40046 3626458 3971318 4910749 5153047 4403767 3576139 3218341 2982268 2672639 2686583 3202117
40036 3202117 3779346 3968445 3722329 3176322 2540346 2140227 2095388 2103607 1941762 1876726
40026 1876726 2151198 2481551 2592075 2801660 3469414 4267510 4652483 4713146 4918815 5292711
40016 5292711 5370764 4772900 3516013 2118849 1525673 2256911 3451823 3646379 2786047
40007 2786047 2372305 3174841 4109851 4142524 3932643 4455150 5161916 4886990 3763015
$$ packed form
40074C082469R66613N7620l64156P73167J811280R10113q91310j385087o90745
40065D269964n61298j108872q95129J43824N13398r3671k92817M93022J199720
40056C668141J137652Q57082O37331J4058p84702p80320p1564Q0006n32484n98742
40046C626458L44860R39431K42298p49280q27628l57798k36073l09629J3944N15534
40036C202117N77229J89099k46116n46007o35976m00119m4839Q219j61845o5036
40026A876726K74472L30353J10524K09585O67754P98096L84973O0663K05669L73896
40016E292711P8053n97864j256887j397164n93176P31238J194912J94556q60332
40007B786047m13742Q02536R35010L2673k09881N22507P06766k74926j123975
$$ plain form
39998 3763015 2946182 3019597 3695038 4483659 4841828 4436951 3970351 4696500 6452626
39989 6452626 7537214 7332934 7329081 8465583 9468274 9351806 9486376 11175376 13147764
39980 13147764 13768996 13889461 14951639 16091253 15991514 15930362 17860931 21020623 23736404
39971 23736404 27000334 32677774 39977010 47992945 59861244 78551007 98897458 109927125
39963 109927125 106503729 94085008 81098291 71432051 65460306 63142368 63789560 66665245
39955 66665245 73300041 85674502 102468303 122762668 152703396 198822778 251202671
39948 251202671 283036832 275148411 235965506 190729865 156132185 132661457 116129259
39941 116129259 105695877 101126798 101035949 105603263 116275547 133630911 159839236 199047492
$$ packed form
39998C763015q16833P3415O75441P88621L58169m04877m66600P26149J756126
39989F452626J084588k04280l853J136502J002691j16468J34570J689000J972388
39980A3147764O21232J20465J062178J139614r9739o1152J930569L159692K715781
39971B3736404L263930N677440P299236Q015935J1868299J8689763K0346451J1029667
39963A09927125l423396j2418721j2986717r666240n971745k317938O47192K875685
39955F6665245O634796J2374461J6793801K0294365K9940728M6119382N2379893
39948B51202671L1834161p888421l9182905m5235641l4597680k3470728j6532198
39941A16129259j0433382m569079r0849M567314J0672284J7355364K6208325L9208256
$$ plain form
39933 199047492 246842791 282122143 281290965 243345585 192285641 151834079 125725221
39926 125725221 105562801 87883504 75791617 70100514 67697325 66951768 69026238 74936383
39918 74936383 84796215 97603567 108429917 109100943 96269422 76664625 60159661
39911 60159661 49616911 41475265 33726374 27942343 24605451 21831281 18998391 17438533
39903 17438533 17120266 16232788 14434119 13271428 13037235 12259267 10667111 9713308 9674836
39894 9674836 9060722 7522255 6696760 7372868 8204450 8058097 7453111 6876229 5791105
39885 5791105 4260001 3623216 4516237 5798071 6345587 6435135 6552485 6346295 5690547
39876 5690547 5449895 6206275 7266671 7722972 7546934 7045237 6274521 5574105 5579008 6056303
$$ packed form
39933A99047492M7795299L5279352q31178l7945380n1059944m0451562k6108858
39926A25725221k0162420j7679297j2091887n691103k403189p45557K074470N910145
39918G4936383R859832J2807352J0826350O71026j2831521j9604797j6504964
39911F0159661j0542750q141646p748891n784031l336892k774170k832890j559858
39903A7438533l18267q87478j798669j162691k34193p77968j592156r53803l8472
39894I674836o14114j538467q25495O76108Q31582j46353o04986n76882j085124
39885E791105j531104o36785Q93021J281834N47516Q9548J17350k06190o55748
39876E690547k40652P56380J060396M56301j76038n01697p70716p00416M903M77295
$$ plain form
39866 6056303 5796665 4365451 2954617 2750610 3392888 3827068 3797673 3621374 3232986
39857 3232986 2417245 1508300 1021134 905273 811687 780528 1078587 1633836 2159295 2618006
39847 2618006 3128675 3615198 3928506 4139864 4396694 4634529 4681089 4528272 4336996 4277635
39837 4277635 4427463 4682479 4768242 4519225 4123788 3910935 3965329 4133812 4275559 4305084
39827 4305084 4182059 4074205 4263076 4641543 4653822 4049127 3306205 2963915 2994392 3224049
39817 3224049 3767424 4493358 4730339 4252803 3940160 4592235 5690288 6298612 6541385
39808 6541385 6972108 7073251 5928520 4128917 3370431 4051645 4773129 4487114 3727343
39799 3727343 3310623 3175390 3091240 3343027 4019500 4530806 4429089 3972250 3497871 3026915
$$ packed form
39866F056303k59638j431214j410834k04007O42278M34180k9395j76299l88388
39857C232986q15741r08945m87166j15861r3586l1159K98059N55249N25459M58711
39847B618006N10669M86523L13308K11358K56830K37835M6560j52817j91276n9361
39837D277635J49828K55016Q5763k49017l95437k12853N4394J68483J41747K9525
39827D305084j23025j07854J88871L78467J2279o04695p42922l42290L0477K29657
39817C224049N43375P25934K36981m77536l12643O52075J098053O08324K42773
39808F541385M30723J01143j144731j799603p58486O81214P21484k86015p59771
39799C727343m16720j35233q4150K51787O76473N11306j01717m56839m74379m70956
$$ plain form
39789 3026915 2747182 2973420 3366748 3193751 2628544 2684304 3523641 4068299 3745727 3320146
39779 3320146 3377897 3347841 2849879 2667208 3308178 3823645 3303624 2486886 2497784 2890486
39769 2890486 2506300 1638415 1681775 2867354 3866599 3705708 2827397 2095859 1768209
39760 1768209 1653254 1517661 1205761 899340 1125955 1956266 2536149 2140909 1318567
39751 1318567 1135402 1666955 2226145 2719939 3560067 4406841 4376457 3631466 3419928 4124471
39741 4124471 4500051 3506807 1895095 1152237 1588786 2312696 2644314 2736175 2952774
39732 2952774 3277177 3385142 3004931 2213547 1475007 1223549 1366395 1465187 1408873 1487708
39722 1487708 1749338 1843948 1723922 1891203 2536470 2989903 2646061 2034086 2183705 3059406
$$ packed form
39789C026915k79733K26238L93328j72997n65207N5760Q39337N44658l22572m25581
39779C320146N7751l0056m97962j82671O40970N15467n20021q16738J0898L92702
39769B890486l84186q67885M3360J185579R99245j60891q78311p31538l27650
39760A768209j14955j35593l11900l06421K26615Q30311N79883l95240q22342
39751A318567j83165N31553N59190M93794Q40128Q46774l0384p44991k11538P04543
39741D124471L75580r93244j611712p42858M36549P23910L31618R1861K16599
39732B952774L24403J07965l80211p91384p38540k51458J42846R8792n6314P8835
39722A487708K61630R4610j20026J67281O45267M53433l43842o11975J49619Q75701
$$ plain form
39712 3059406 3465484 2714299 1676441 1679423 2779609 3718231 3476800 2346090 1365783
39703 1365783 1133751 1415329 1671214 1665255 1596357 1800432 2322573 2777865 2771458 2443681
39693 2443681 2315620 2530912 2647830 2379292 2069865 2069909 2125524 1957045 1997736 2775057
39683 2775057 3849667 4283987 4055743 4042103 4569358 4991710 4890353 4650167 4513436
39674 4513436 4108950 3411723 3148928 3621519 4099098 4107885 4300581 5118095 5608279 4847181
39664 4847181 3760434 4049589 5732687 7245239 7817829 8261627 9266786 10295938 10547491
39655 10547491 9911353 8584443 6752034 5081876 4561725 5248517 5925167 5572759 4562917
39646 4562917 3865520 3687167 3542157 3248480 3172588 3615518 4414742 5131020 5434943 5430029
$$ packed form
39712C059406M06078p51185j037858K982J100186R38622k41431j130710r80307
39703A365783k32032K81578K55885n959o8898K04075N22141M55292o407l27777
39693B443681j28061K15292J16918k68538l09427M4N5615j68479M0691P77321
39683B775057J074610M34320k28244j3640N27255M22352j01357k40186j36731
39674D513436m04486o97227k62795M72591M77579Q787J92696Q17514M90184p61098
39664D847181j086747K89155J683098J512552N72590M43798J005159J029152K51553
39655A0547491o36138j326910j832409j670158n20151O86792O76650l52408j009842
39646D562917o97397j78353j45010k93677p5892M42930P99224P16278L03923m914
$$ plain form
39636 5430029 5673225 6632937 8043358 9074846 9216586 8691913 7967515 7229688 6429331
39627 6429331 5473058 4277847 2989638 2186766 2431551 3508917 4504759 4742121 4287314
39618 4287314 3548358 2886302 2681894 3188616 4084643 4636624 4520952 4088740 3738670
39609 3738670 3563104 3721211 4463548 5452916 5703934 4703191 3148958 2118042 1874059
39600 1874059 1925018 1869607 1680655 1438949 1298536 1536313 2184822 2749495 2700012 2152328
39590 2152328 1708073 1697713 1916721 2047547 1987600 1721295 1178746 402602 -270875 -408935
39580 -408935 44368 592010 692918 453175 508314 1113825 1781585 2112769 2482382 3318491
39570 3318491 4133193 4100138 3378345 2926812 3024670 2964032 2390181 1948119 2186632 2692609
$$ packed form
39636E430029K43196R59712J410421J031488J41740n24673p24398p37827q00357
39627F429331r56273j195211j288209q02872K44785J077366R95842K37362m54807
39618D287314p38956o62056k04408N06722Q96027N51981j15672m32212l50070
39609C738670j75566J58107P42337R89368K51018j000743j554233j030916k43983
39600A874059N0959n5411j88952k41706j40413K37777O48509N64673m9483n47684
39590B152328m44255j0360K19008J30826n9947k66305n42549p76144o73477j38060
39580d08935M53303N47642J00908k39743N5139O05511O67760L31184L69613Q36109
39570C318491Q14702l3055p21793m51533R7858o0638n73851m42062K38513N05977
$$ plain form
39560 2692609 2847275 2706345 2552163 2212763 1449370 524459 -157488 -508779 -422639 395661
39550 395661 1684156 2356925 1766791 769894 706198 1638771 2423592 2331253 1804263 1655733
39540 1655733 2198886 3190823 4079874 4270222 3587413 2524122 1753355 1503670 1618927
39531 1618927 1907796 2088168 1774619 1019730 547876 914006 1708649 2141396 2122025 2147832
39521 2147832 2365464 2430023 2174210 1776793 1322993 772167 323585 291186 632557 1017532
39511 1017532 1256035 1272357 895265 169665 -359733 -226543 304556 703519 1027970 1680994
39501 1680994 2555492 3122252 3232227 3190491 3193022 3301827 3715235 4351287 4466396 3544835
39491 3544835 2311256 1891423 2156381 1985897 1105223 470636 695462 1260018 1585356
$$ packed form
39560B692609J54666j40930j54182l39400p63393r24911o81947l51291Q6140Q18300
39550C95661J288495O72769n90134r96897o3696R32573P84821r2339n26990j48530
39540A655733N43153R91937Q89051J90348o82809j063291p70767k49685J15257
39531A618927K88869J80372l13549p54889m71854L66130P94643M32747j9371K5807
39521B147832K17632O4559k55813l97417m53800n50826m48582l2399L41371L84975
39511A017532K38503J6322l77092p25600n29398J33190N31099L98963L24451O53024
39501A680994Q74498N66760J09975m1736K531J08805M13408O36052J15109r21561
39491C544835j233579m19833K64958j70484q80674o34587K24826N64556L25338
$$ plain form
39482 1585356 1816979 2157004 2399737 2537621 2905296 3336224 3126972 2264808 1718664
39473 1718664 2019195 2518409 2589554 2541930 2706496 2666123 2203773 2019960 2557453 3017668
39463 3017668 2609732 1973750 2187012 3022344 3448795 3343873 3393101 3637373 3463904 2889615
39453 2889615 2562050 2489757 2000536 1085567 636076 1091761 1841699 2217763 2188081 1877159
39443 1877159 1341690 1064744 1711053 3051713 4032004 4246127 4397037 4892035 5049552
39434 5049552 4365175 3562335 3462217 3602361 3049722 2032824 1603858 1940566 2120839
39425 2120839 1602030 933743 806952 1200753 1730521 2171568 2355370 2128029 1716463
39416 1716463 1634916 1941340 2089419 1839833 1760595 2309372 2881287 2473716 1107415 -95370
$$ packed form
39482A585356K31623L40025K42733J37884L67675M30928k09252q62164n46144
39473A718664L00531M99214P1145m7624J64566m0373m62350j83813N37493M60215
39463C017668m07936o35982K13262Q35332M26451j04922M9228K44272j73469n74289
39453B889615l27565p2293m89221r14969m49491M55685P49938L76064k9682l10922
39443A877159n35469k76946O46309J340660R80291K14123J50910M94998J57517
39434E049552o84377q02840j00118J40144n52639j016898m28966L36708J80273
39425B120839n18809o68287j26791L93801N29768M41047J83802k27341m11566
39416A716463q1547L06424J48079k49586p9238N48777N71915m07571j366301j202785
$$ plain form
39406 -95370 -238412 535484 1587754 2492231 3003483 2965085 2693294 2985164 4183712 5498135
39396 5498135 5821399 5109626 4412909 4553719 5287281 5836042 5756750 5116139 4264873 3695460
39386 3695460 3760161 4233012 4414538 3925243 3146458 2644216 2464136 2326900 2242681 2475618
39376 2475618 3008432 3469254 3604694 3517208 3426382 3452059 3612997 3790411 3737828 3404829
39366 3404829 3200229 3587425 4394859 4890849 4653125 4031107 3579183 3357368 3072828
39357 3072828 2674526 2434531 2501670 2695583 2764977 2580330 2035610 1095535 131882 -98386
39347 -98386 791143 2184643 3015948 3004242 2927918 3522760 4561905 5343969 5643372 5629616
39337 5629616 5162397 3931732 2305000 1303317 1465530 2238586 2745140 2704938 2355698
$$ packed form
39406i5370j43042P73896J052270R04477N11252l8398k71791K91870J198548J314423
39396E498135L23264p11773o96717J40810P33562N48761p9292o40611q51266n69413
39386C695460O4701M72851J81526m89295p78785n02242j80080j37236q4219K32937
39376B475618N32814M60822J35440q7486r0826K5677J60938J77414n2583l32999
39366C404829k04600L87196Q07434M95990k37724o22018m51924k21815k84540
39357C072828l98302k39995O7139J93913O9394j84647n44720r40075r63653k30268
39347i8386Q89529J393500Q31305j1706p6324N94842J039145P82064K99403j3756
39337E629616m67219j230665j626732j001683J62213P73056N06554m0202l49240
$$ plain form
39328 2355698 1955931 1734539 1935931 2506190 3006748 3147539 3096559 2992805 2591396 1797242
39318 1797242 1111448 1009529 1233452 1289135 1307621 1691232 2145944 1949435 1216385 1031127
39308 1031127 1995020 3291634 3663591 2944981 2176698 2341494 3309163 4055584 3783606
39299 3783606 2721545 1737392 1286535 1106415 990787 1258162 2044637 2709210 2655062
39290 2655062 2358955 2728935 3642633 4078406 3706904 3368249 3725266 4340265 4498637
39281 4498637 4196208 3832882 3560037 3425889 3608077 3978117 3913198 3081938 2045394
39272 2045394 1593827 1826076 2324603 2873896 3511464 4162167 4699210 5149262 5478273
39263 5478273 5468521 5155447 5020882 5364775 5889841 6329549 6986673 8066979 8972171 9036474
$$ packed form
39328B355698l99767k21392K01392N70259N00558J40791n0980j03754m01409p94154
39318A797242o85794j01919K23923N5683J8486L83611M54712j96509p33050j85258
39308A031127R63893J296614L71957p18610p68283J64796R67669P46421k71978
39299C783606j062061r84153m50857j80120j15628K67375P86475O64573n4148
39290B655062k96107L69980R13698M35773l71502l38655L57017O14999J58372
39281D498637l02429l63326k72845j34148J82188L70040o4919q31260j036544
39272B045394m51567K32249M98527N49293O37568O50703N37043M50052L29011
39263E478273r752l13074j34565L43893N25066M39708O57124J080306R05192O4303
$$ plain form
39253 9036474 8651058 8841203 9910889 11302297 12665593 14224969 16116076 18219417
39245 18219417 20699528 23773138 26689971 27872675 26627523 24100000 22009865 20947449
39237 20947449 20434001 20130739 20188827 20558185 20738579 20510994 20543614 21908034 24987818
39228 24987818 29065033 33213220 37675031 44109466 54076436 67092921 80207276 89490118
39220 89490118 92137451 87822406 78761298 68475731 59830680 53740130 49558139 46422391
39212 46422391 44002513 42344013 41615328 41999584 43435943 45601440 48557286 53137604
39204 53137604 60175000 69757840 81928847 97240386 114822348 129976997 135971278
39197 135971278 129651272 114414238 96880425 81687653 70113640 61823831 55868667
$$ packed form
39253I036474l85416J90145J069686J391408J363296J559376J891107K103341
39245A8219417K480111L073610K916833J182704j245152k527523k090135j062416
39237B0947449n13448l03262N8088L69358J80394k27585L2620J364420L079784
39228B4987818M077215M148187M461811O434435R966970J3016485J3114355R282842
39220H9490118K647333m315045r061108j0285567q645051o090550m181991l135748
39212D6422391k419878j658500p28685L84256J436359K165497K955846M580318
39204E3137604P037396R582840J2171007J5311539J7581962J5154649N994281
39197A35971278o320006j5237034j7533813j5192772j1574013q289809n955164
$$ plain form
39190 55868667 50798056 45909662 42311882 41276640 41928514 42312188 42477189 44432303
39182 44432303 48921837 54522814 60598417 68712700 79393009 89108052 92604632 87820226
39174 87820226 77195339 64797256 53556147 44748996 38370464 33579566 29652951 26672064
39166 26672064 24841233 23614671 22348943 21351222 21215770 21494768 21270803 20860303 21583347
39157 21583347 23719944 25930434 26929179 26569714 25041225 22315900 18955995 16278388
39149 16278388 14910469 14038936 12774490 11393993 10474752 9666094 8311678 6696911
39141 6696911 5685593 5482060 5602301 5757079 5982501 6188102 6314215 6642310 7236779
39132 7236779 7441309 6738616 5752906 5448318 5593314 5104369 3839794 2898990 2967230
$$ packed form
39190E5868667n070611m888394l597780j035242O51874L83674J65001J955114
39182D4432303M489534N600977O075603Q114283J0680309R715043L496580m784406
39174H7820226j0624887j2398083j1241109q807151o378532m790898l926615k980887
39166B6672064j830831j226562j265728r97721j35452K78998k23965m10500P23044
39157B1583347K136597K210490R98745l59465j528489k725325l359905k677607
39149A6278388j367919q71533j264446j380497r19241q08658j354416j614767
39141F696911j011318k03533J20241J54778K25422K05601J26113L28095N94469
39132G236779K04530p02693r85710l04588J44996m88945j264575r40804O8240
$$ plain form
39123 2967230 3473342 3774887 4131335 4846500 5293958 4699018 3461591 2838502 3389196
39114 3389196 4371896 4745397 4320574 3767565 3737676 4161575 4383260 3903831 2901549
39105 2901549 1975846 1519780 1507868 1760897 2122968 2396576 2401170 2192539 2061958 2261447
39095 2261447 2793776 3400217 3684731 3436004 2954783 2801618 3040946 3097721 2648804 2197209
39085 2197209 2284978 2604139 2575253 2416872 2754869 3381823 3405268 2649359 1925821 1724772
39075 1724772 1573854 1030183 462046 405494 832218 1450923 2091681 2449078 2147123 1458939
39065 1458939 1261014 1834190 2408993 2356239 2066522 2090022 2194620 2002330 1848613 2161010
39055 2161010 2553048 2412805 1939342 1744892 1840407 1875005 1989809 2506802 3081801 3146741
$$ packed form
39123B967230N06112L01545L56448P15165M47458n94940j237427o23089N50694
39114C389196R82700L73501m24823n53009k9889M23899K21685m79429j002282
39105B901549r25703m56066j1912K53029L62071K73608M594k08631j30581J99489
39095B261447N32329O06441K84514k48727m81221j53165K39328N6775m48917m51595
39085B197209Q7769L19161k8886j58381L37997O26954K3445p55909p23538k01049
39075A724772j50918n43671n68137n6552M26724O18705O40758L57397l01955o88184
39065A458939j97925N73176N74803n2754k89717K3500J04598j92290j53717L12397
39055B161010L92038j40243m73463j94450R5515L4598J14804N16993N74999O4940
$$ plain form
39045 3146741 3004985 3495468 4598664 5290286 4884142 3795545 2887448 2636961 2927168
39036 2927168 3164049 2775960 2072932 2165468 3342618 4147730 3161411 1214404 419195
39027 419195 1215393 1971855 1643583 1125998 1406212 1945148 1854887 1434120 1394187 1485334
39017 1485334 1099656 623486 999022 2234439 3353007 3697068 3486365 3172357 2920237
39008 2920237 2707231 2421092 1896358 1197678 716456 721811 1104160 1796547 2936364 4193367
38998 4193367 4547072 3466542 1931171 1480323 2413666 3626979 4084917 3729077 2987388
38989 2987388 2177709 1592079 1540256 1968858 2395729 2481361 2421587 2575337 2888730 2905557
38979 2905557 2329708 1451523 899953 937154 1177182 1195507 1179138 1539789 2065288 2128323
$$ packed form
39045C146741j41756M90483J103196O91622m06144j088597r08097k50487K90207
39036B927168K36881l88089p03028R2536J177150Q05112r86319j947007p95209
39027D19195P96198P56462l28272n17585K80214N38936r0261m20767l9933R1147
39017A485334l85678m76170L75536J235417J118568L44061k10703l14008k52120
39008B920237k13006k86139n24734o98680m81222N355L82349O92387J139817J257003
38998D193367L53705j080530j535371m50848R33343J213313M57938l55840p41689
38989B987388q09679n85630n1823M28602M26871Q5632n9774J53750L13393J6827
38979B905557n75849q78185n51570L7201K40028J8325j6369L60651N25499O3035
$$ plain form
38969 2128323 1736455 1562262 1735700 1528532 693184 164047 662885 1433385 1362992 734237
38959 734237 709614 1484511 2193236 2477982 2873131 3530023 3763833 3222441 2529686 2352473
38949 2352473 2626201 3055705 3579568 3920593 3455290 2088049 667708 21292 65466
38940 65466 302434 652477 1287665 2108252 2908959 3684844 4309406 4321999 3564047 2685920
38930 2685920 2480810 2962518 3559405 3927624 4080794 4012679 3766802 3679547 3985004 4310994
38920 4310994 4099751 3411344 2784352 2427098 2137371 1946786 2169575 2732818 3101238
38911 3101238 3056503 2968116 3042568 2887786 2218904 1506599 1404865 1850647 2260532 2415886
38901 2415886 2602139 2952518 3209003 3193337 3018318 2700079 2053922 1230341 892613 1435916
$$ packed form
38969B128323l91868j74193J73438k07168q35348n29137M98838P70500p0393o28755
38959G34237k4623P74897P08725K84746L95149O56892K33810n41392o92755j77213
38949B352473K73728M29504N23863L41025m65303j367241j420341o46416M4174
38940F5466K36968L50043O35188Q20587Q00707P75885O24562J2593p57952q78127
38930B685920k05110M81708N96887L68219J53170o8115k45877q7255L05457L25990
38920D310994k11243o88407o26992l57254k89727j90585K22789N63243L68420
38911C101238m4735q8387P4452j54782o68882p12305j01734M45782M09885J55354
38901B415886J86253L50379K56485j5666j75019l18239o46157q23581l37728N43303
$$ plain form
38891 1435916 2340166 2781752 2684654 2626482 2817570 2835457 2486081 2270298 2636439 3266241
38881 3266241 3556679 3450325 3304406 3219644 3038909 2836378 2850578 3002229 3000812 2891128
38871 2891128 2959826 3110335 2930381 2466898 2299306 2623115 2874640 2609819 2196919 2187442
38861 2187442 2488073 2706487 2914967 3393771 3841765 3583137 2590938 1680623 1514083
38852 1514083 1888516 2222146 2339048 2476210 2775932 3101092 3282585 3324576 3338951 3364167
38842 3364167 3276184 2901881 2268553 1706747 1618262 2137735 3038212 3874797 4179721 3737731
38832 3737731 2907133 2527618 3166495 4440486 5384970 5559465 5478358 5797937 6388686
38823 6388686 6540245 5957143 5184840 4953894 5333595 5728999 5646113 5250918 5069806 5264451
$$ packed form
38891A435916R04250M41586r7098n8172J91088J7887l49376k15783L66141O29802
38881C266241K90438j06354j45919q4762j80735k02531J4200J51651j417j09684
38871B891128O8698J50509j79954m63483j67592L23809K51525k64821m12900r477
38861B187442L00631K18414K08480M78804M47994k58628r92199r10315j66540
38852A514083L74433L33630J16902J37162K99722L25160J81493M1991J4375K5216
38842C364167q7983l74303o33328n61806q8485N19473R00477Q36585L04924m41990
38832C737731q30598l79515O38877J273991R44484J74495q1107L19579N90749
38823F388686J51559n83102p72303k30946L79701L95404q2886l95195j81112J94645
$$ plain form
38813 5264451 5444411 5266917 4984579 5128561 5727181 6180637 6028567 5571131 5501742 6093279
38803 6093279 7013859 7839210 8405080 8634432 8400335 7796259 7302099 7351810 7777322 7932285
38793 7932285 7399015 6417296 5618599 5484953 6027551 6781994 7106160 6704600 5926230
38784 5926230 5389161 5325606 5516140 5796182 6203536 6544975 6328246 5430314 4419921
38775 4419921 3843331 3576037 3314328 3249920 3577437 3701574 2889372 1654485 1451356
38766 1451356 2697389 4039885 4135169 3368213 3063040 3579534 4101739 4020405 3611879
38757 3611879 3367466 3430440 3797592 4390699 4749870 4300106 3220287 2495028 2716199
38748 2716199 3290486 3304849 2807501 2618349 3023750 3342732 2961137 2259392 2099452 2639507
$$ packed form
38813E264451J79960j77494k82338J43982N98620M53456j52070m57436o9389N91537
38803F093279R20580Q25351N65870K29352k34097o04076m94160M9711M25512J54963
38793G932285n33270r81719p98697j33646N42598P54443L24166m01560p78370
38784E926230n37069o3555J90534K80042M07354L41439k16729q97932j010393
38775D419921n76590k67294k61709o4408L27517J24137q12202j234887k03129
38766A451356J246033J342496R5284p66956l05173N16494N22205q1334m08526
38757C611879k44413O2974L67152N93107L59171m49764j079819p25259K21171
38748B716199N74287J4363m97348j89152M05401L18982l81595p01745j59940N40055
$$ plain form
38738 2639507 3128512 2911607 2257689 1945564 2236455 2623040 2629948 2503196 2814193 3544887
38728 3544887 3977013 3606056 2851453 2569675 3001270 3549060 3628360 3381172 3329645 3585885
38718 3585885 3776457 3679359 3552973 3742823 4258980 4877329 5406569 5705593 5683733 5462191
38708 5462191 5303495 5216797 4924790 4417072 4133958 4259639 4292189 3881667 3684667 4564280
38698 4564280 6142112 7115576 7074686 6974990 7460892 7748042 6911576 5535168 5114953
38689 5114953 6143210 7638822 8495704 8602665 8591384 9004513 9804015 10395359 10189959
38680 10189959 9379009 8894627 9235567 9665499 9159261 7912330 7179220 7623872 8548861
38671 8548861 8947719 8723663 8555154 8966051 9850026 10685607 10999482 10738068 10250240
$$ packed form
38738B639507M89005k16905o53918l12125K90891L86585O908j26752L10997P30694
38728C544887M32126l70957p54603k81778M31595N47790P9300k47188n1527K56240
38718C585885J90572r7098j26386J89850N16157O18349N29240K99024k1860k21542
38708E462191j58696q6698k92007n07718k83114J25681L2550m10522j97000Q79613
38698D564280J577832R73464m0890r9696M85902K87150q36466j376408m20215
38689E114953J028257J495612Q56882J06961j1281M13129P99502N91344k05400
38680A0189959q10950m84382L40940M29932n06238j246931p33110M44652R24989
38671H548861L98858k24056j68509M10897Q83975Q35581L13875k61414m87828
$$ plain form
38662 10250240 9807686 9269921 8458127 7652791 7293670 7317064 7301423 7198336 7314218 7527891
38652 7527891 7206926 6160240 5115671 4895656 5489594 6198467 6352546 5723821 4664240
38643 4664240 4012026 4351090 5142195 5184267 4251412 3567525 4116629 5187957 5433737
38634 5433737 4847881 4623879 5230497 5751192 5324493 4281153 3446387 3085655 3069522
38625 3069522 3458442 4240617 4854567 4686554 3951931 3494923 3679282 3981028 3821378
38616 3821378 3363251 3177879 3374636 3440975 2953268 2183260 1844890 2310698 3216002 3875236
38606 3875236 3994656 3866655 3911252 4218744 4612308 4947120 5126018 4956575 4337209 3616569
38596 3616569 3409540 3852106 4303497 4074343 3280247 2651566 2596078 2809133 2805391 2474769
$$ packed form
38662A0250240m42554n37765q11794q05336l59121K3394j5641j03087J15882K13673
38652G527891l20965j046686j044569k20015N93938P08873J54079o28725j059581
38643D664240o52214L39064P91105M2072r32855o83887N49104J071328K45780
38634E433737n85856k24002O06618N20695m26699j043340q34766l60732j6133
38625C069522L88920P82175O13950j68013p34623m57008J84359L01746j59650
38616C821378m58127j85372J96757O6339m87707p70008l38370M65808R05304O59234
38606C875236J19420j28001M4597L07492L93564L34812J78898j69443o19366p20640
38596C616569k07029M42566M51391k29154p94096o28681n5488K13055l742l30622
$$ plain form
38586 2474769 2028008 1717153 1752826 2219143 2888352 3335140 3411244 3442216 3827257 4609784
38576 4609784 5509515 6138104 6124420 5388020 4465295 4187800 4749458 5410419 5440851 5042921
38566 5042921 4947584 5364406 5790431 5721478 5159145 4516825 4331520 4893721 5844948 6361774
38556 6361774 6078655 5560750 5491795 5752506 5801969 5588376 5423652 5276958 4966441 4817338
38546 4817338 5271428 5977935 6176022 5909851 5886929 6134478 5915335 5159694 4781374 5131520
38536 5131520 5292224 4577534 3712423 3685705 4285674 4689678 4788222 4931536 4931411 4372292
38526 4372292 3553467 3121346 3007166 2680992 2293085 2594029 3707626 4832456 5277571
38517 5277571 5117227 4742479 4396093 4259024 4457071 4863740 5272984 5715803 6219952
$$ packed form
38586B474769m46761l10855L5673M66317O69209M46788P6104L0972L85041P82527
38576D609784Q99731O28589j3684p36400r22725k77495N61658O60961L0432l97930
38566E042921r5337M16822M26025o8953n62333o42320j85305N62201R51227N16826
38556F361774k83119n17905o8955K60711M9463k13593j64724j46694l10517j49103
38546D817338M54090P06507J98087k66171k2922K47549k19143p55641l78320L50146
38536E131520J60704p14690q65111k6718N99969M04004R8544J43314j25n59119
38526D372292q18825m32121j14180l26174l87907L00944J113597J124830M45115
38517E277571j60344l74748l46386j37069J98047M06669M09244M42819N04149
$$ plain form
38508 6219952 6455179 6151124 5683716 5625506 5847541 5738996 5243158 4973502 5302915 6020736
38498 6020736 6908148 7932866 8790881 8996165 8626836 8340054 8456799 8654896 8737344
38489 8737344 9002642 9566032 9990616 9993991 9949690 10249754 10651181 10706841 10458816 10280767
38479 10280767 10349472 10635247 11093620 11493512 11350402 10436521 9176898 8220789 7773651
38470 7773651 7581794 7370418 7059360 6740893 6660463 7027333 7650752 7962445 7590617 6745778
38460 6745778 5912045 5359863 5076774 4960116 4966814 5240411 6047295 7279181 8114513 7713150
38450 7713150 6329057 5164868 4936063 5165645 5167725 5059346 5287430 5711734 5854636
38441 5854636 5761638 5930563 6478980 6937730 6870752 6289609 5476715 4759945 4445418 4643969
$$ packed form
38508F219952K35227l04055m67408n8210K22035j08545m95838k69656L29413P17821
38498F020736Q87412J024718Q58015K05284l69329k86782J16745J98097Q2448
38489H737344K65298N63390M24584L375m4301L00064M01427N5660k48025j78049
38479A0280767O8705K85775M58373L99892j43110r13881j259623r56109m47138
38470G773651j91857k11376l11058l18467q0430L66870O23419L11693l71828q44839
38460F745778q33733n52182k83089j16658O698K73597Q06884J231886Q35332m01363
38450G713150j384093j164189k28805K29582K080j08379K28084M24304J42902
38441E854636r2998J68925N48417M58750o6978n81143q12894p16770l14527J98551
$$ plain form
38431 4643969 5123745 5525616 5689409 5644317 5441801 5191889 5097387 5243478 5505867 5816242
38421 5816242 6275599 6836842 7217708 7392236 7773680 8509032 8979529 8564943 7618093
38412 7618093 7000674 6799500 6293724 5284606 4638875 5079657 6035438 6326922 5725617
38403 5725617 5169832 5412910 6061898 6290128 6115184 6407932 7646759 9194986 10076725
38394 10076725 10068600 9609283 8948236 8026766 7143988 7013737 7863722 8985926 9577518
38385 9577518 9714672 10124036 11191850 12516126 13311841 13030981 11715834 9953339 8428085
38376 8428085 7451186 6997054 7051370 7566841 8148076 8297262 8078342 8073143 8584996 9393402
38366 9393402 10341500 11444880 12221949 11792415 10155055 8607691 8225147 8530716 8379152
$$ packed form
38431D643969M79776M01871J63793m5092k02516k49912r4502J46091K62389L10375
38421E816242M59357N61243L80866J74528L81444P35352M70497m14586r46850
38412G618093o17419k01174n05776j009118o45731M40782R55781K91484o01305
38403E725617n55785K43078O48988K28230j74944K92748J238827J548227Q81739
38394A0076725q125m59317o61047r21470q82778j30251Q49985J122204N91592
38385I577518J37154M09364J067814J324276P95715k80860j315147j762495j525254
38376H428085r76899m54132N4316N15471N81235J49186k18920n199N11853Q08406
38366I393402R48098J103380P77069m29534j637360j547364l82544L05569j51564
$$ plain form
38357 8379152 7586001 6878144 6689311 6854512 7168213 7448838 7356986 6920229 6885018 7703652
38347 7703652 8530741 8192579 6871527 5777141 5342876 4899194 4086729 3389619 3116097
38338 3116097 2981916 2953512 3423480 4233741 4584319 4306842 4195945 4619659 4857099 4412177
38328 4412177 3949718 4143119 4501560 4264765 3732274 3707198 4156808 4438918 4504408 4863782
38318 4863782 5483605 5630725 4939465 4032393 3949596 5279820 7775173 10523493 12656553
38309 12656553 14137309 15586146 17126499 17903597 17181500 15439722 13795452 12699394
38301 12699394 11832477 11030509 10659904 11172392 12763696 15356084 18598829 22173062 26352618
38292 26352618 31625876 37184915 40538041 39714243 35547596 30737179 26855809 23435499
$$ packed form
38357H379152p93151p07857j88833J65201L13701K80625r1852m36757l5211Q18634
38347G703652Q27089l38162j321052j094386m34265m43682q12465o97110k73522
38338C116097j34181k8404M69968Q10261L50578k77477j10897M23714K37440m44922
38328D412177m62459J93401L58441k36795n32491k5076M49610K82110O5490L59374
38318D863782O19823J47120o91260r07072q2797J330224K495353K748320K133060
38309A2656553J480756J448837J540353P77098p22097j741778j644270j096058
38301A2699394q66917q01968l70605N12488J591304K592388L242745L574233M179556
38292B6352618N273258N559039L353126q23798m166647m810417l881370l420310
$$ plain form
38284 23435499 19929923 17138096 16111132 16700403 17987404 19560280 21720759 24861410
38276 24861410 29144419 34319909 39243219 41927713 40859984 36395078 30510162 25146515
38268 25146515 20984727 17691377 14915727 12798272 11614679 11217539 11122434 11180987 11834123
38259 11834123 13425665 15515666 17248007 18187107 18322391 17463643 15355884 12444378
38251 12444378 9786411 7923996 6457281 5051049 4175908 4256152 4616197 4115728 2687910
38242 2687910 1462552 1235533 1481287 1252469 598382 498161 1446424 2672789 3085185
38233 3085185 2657588 2345153 2661417 2988827 2627451 1952642 1871799 2434470 2771479 2390249
38223 2390249 1764049 1472876 1468908 1489148 1547508 1608007 1337357 677928 200705 367839
$$ packed form
38284B3435499l505576k791827j026964N89271J287001J572876K160479L140651
38276B4861410M283009N175490M923310K684494j067729m464906n884916n363647
38268B5146515m161788l293350k775650k117455j183593l97140r5105N8553O53136
38259A1834123J591542K090001J732341R39100J35284q58748k107759k911506
38251A2444378k657967j862415j466715j406232q75141Q0244L60045n00469j427818
38242B687910j225358k27019K45754k28818o54087j00221R48263J226365M12396
38233C085185m27597l12435L16264L27410l61376o74809q0843N62671L37009l81230
38223B390249o26200k91173l968K0240N8360O0499k70650o59429m77223J67134
$$ plain form
38213 367839 854454 1141108 1348086 1800477 2129246 1682894 731701 364172 1022582 1915877
38203 1915877 2201458 2093697 2343855 3091351 3750448 3785662 3160096 2172843 1248289 809838
38193 809838 999993 1486602 1771724 1708863 1540634 1446816 1278216 814977 137772 -389768
38183 -389768 -495373 -294674 -172489 -343156 -569303 -421154 168446 743508 811299 375976
38173 375976 -157251 -521032 -800063 -1086089 -1173981 -795620 -40246 681112 1082586 1226111
38163 1226111 1272150 1218100 1003997 719122 535102 516441 623809 792090 860290 595601
38153 595601 52820 -221925 278169 1296787 2012415 2028743 1759053 1684031 1695961 1494177
38143 1494177 1209450 1155378 1227331 1079707 763946 651387 749913 625133 76051 -585138
$$ packed form
38213C67839M86615K86654K06978M52391L28769m46352r51193l67529O58410Q93295
38203A915877K85581j07761K50158P47496O59097L5214o25566r87253r24554m38451
38193H09838J90155M86609K85122o2861j68229r3818j68600m63239o77205n27540
38183c89768j05605K00699J22185j70667k26147J48149N89600N75062O7791m35323
38173C75976n33227l63781k79031k86026q7892L78361P55374P21358M01474J43525
38163A226111M6039n4050k14103k84875j84020j8661J07368J68281O8200k64689
38153E95601n42781k74745N00094J018618P15628J6328k69690p5022J1930k01784
38143A494177k84727n4072P1953j47624l15761j12559R8526j24780n49082o61189
$$ plain form
38133 -585138 -1042983 -1311672 -1404610 -1152599 -624368 -307899 -514360 -917207 -1044563 -950529
38123 -950529 -998662 -1206758 -1254122 -1010330 -628178 -187244 345153 850054 1168716 1447394
38113 1447394 1929374 2405204 2378257 1869956 1509566 1596590 1632776 1191188 754460 1070855
38103 1070855 1946376 2368036 1812532 818320 133966 -136000 -255815 -204329 241736 984749
38093 984749 1598605 1802670 1631820 1173325 470608 -256950 -617697 -442824 27041 509796
38083 509796 1029253 1665747 2145309 2046865 1411895 796740 618694 764991 999595 1392967
38073 1392967 2018047 2501683 2364726 1735199 1259177 1264243 1442556 1457865 1408623 1472162
38063 1472162 1514731 1394201 1322347 1517984 1710495 1417177 637107 -89310 -292150 28857
$$ packed form
38133e85138m57845k68689r2938K52011N28231L16469k06461m02847j27356R4034
38123i50529m8133k08096m7364K43792L82152M40934N32397N04901L18662K78678
38113A447394M81980M75830k6947n08301l60390Q7024L6186m41588m36728L16395
38103A070855Q75521M21660n55504r94212o84354k69966j19815N1486M46065P43013
38093I84749O13856K04065j70850m58495p02717p27558l60747J74873M69865M82755
38083E09796N19457O36494M79562r8444o34970o15155j78046J46297K34604L93372
38073A392967O25080M83636j36957o29527m76022N066J78313J5309m9242O3539
38063A472162M2569j20530p1854J95637J92511k93318p80070p26417k02840L21007
$$ plain form
38053 28857 574125 1057307 1368665 1614899 1953832 2298978 2386443 2258367 2324901 2667256
38043 2667256 2695706 1968184 968010 453226 362629 137594 -121044 204337 971196 1214900
38033 1214900 638844 177258 604074 1451147 1890639 1919836 1986628 2075281 1870487 1312935
38023 1312935 384933 -1050313 -2543062 -2931659 -1828524 -559308 -508398 -1074462 -581826
38014 -581826 1115006 2409866 2303941 1529683 1085172 1028826 1161421 1596834 2027240
38005 2027240 1593184 232462 -874457 -967218 -771066 -1024590 -1049941 -18012 1275126
37996 1275126 1414647 609157 331207 931117 1230792 626623 23253 173880 468578
37987 468578 148871 -387095 -434136 -276416 -575086 -1044794 -880534 -238008 -160971 -975460
$$ packed form
38053B8857N45268M83182L11358K46234L38933L45146Q7465j28076O6534L42355
38043B667256K8450p27522j000174n14784r0597k25035k58638L25381P66859K43704
38033A214900n76056m61586M26816Q47073M39492K9197O6792Q8653k04794n57552
38023A312935r28002j435246j492749l88597J103135J269216N0910n66064M92636
38014e81826J696832J294860j05925p74258m44511n6346J32595M35413M30406
38005B027240m34056j360722j106919r2761J96152k53524k5351J031929J293138
37996A275126J39521q05490k77950N99910K99675o04169o03370J50627K94698
37987D68578l19707n35966m7041J57720k98670m69708J64260O42526P7037q14489
$$ plain form
37977 -975460 -1751712 -1669542 -1100413 -837391 -870370 -599674 50892 460330 271923 -55448
37967 -55448 102997 707108 1174116 1123614 693989 216558 -114532 -234643 -142795 51696
37957 51696 187846 252142 387955 637670 818810 745926 451098 100229 -184017 -335720
37947 -335720 -330453 -265909 -313820 -459626 -425089 -6569 620370 1098938 1310288 1441465
37937 1441465 1703701 2113860 2477011 2473947 1899759 988782 384783 572895 1397003 2297790
37927 2297790 2899009 3129664 2930054 2256609 1421371 1014532 1242401 1573863 1321639
37918 1321639 484147 -230469 -211638 420445 1037577 1182611 888075 436336 54154 -98234
37908 -98234 124744 684681 1213677 1259155 704325 -144960 -812471 -880302 -183765 908005
$$ packed form
37977i75460p76252Q2170N69129K63022l2979K70696O50566M09438j88407l27371
37967e5448J58445O04111M67008n0502m29625m77431l31090j20111R1848J94491
37957E1696J36150O4296J35813K49715J81140p2884k94828l50869k84246j51703
37947c35720N267O4544m7911j45806L4537M18520O26939M78568K11350J31177
37937A441465K62236M10159L63151l064n74188r10977o03999J88112Q24108R00787
37927B297790O01219K30655j99610o73445q35238m06839K27869L31462k52224
37918A321639q37492p14616J8831O32083O17132J45034k94536m51739l82182j52388
37908i8234K22978N59937N28996M5478n54830q49285o67511o7831O96537J091770
$$ plain form
37898 908005 1570857 1340436 797428 918102 1716067 2166233 1667088 876194 689670 1074178
37888 1074178 1523889 2056142 2879523 3462616 2966823 1579920 509298 498359 1097796
37879 1097796 1559383 1698197 1627420 1372557 1110455 1159485 1358682 1078299 273981 -118710
37869 -118710 570952 1670618 2041780 1603738 1180897 1119535 972823 540751 329771 715201
37859 715201 1328867 1643618 1667826 1679688 1653683 1359296 794092 161848 -419340 -879527
37849 -879527 -1012045 -657743 -15905 521790 828111 1059319 1224560 1064113 485051 -150375
37839 -150375 -395643 -232744 -5649 44948 -59305 -271223 -614513 -985559 -1113256 -850892
37829 -850892 -351941 121843 378859 224394 -483461 -1492415 -2147840 -2043779 -1484666
$$ packed form
37898I08005O62852k30421n43008J20674P97965M50166m99145p90894j86524L84508
37888A074178M49711N32253Q23381N83093m95793j386903j070622j0939N99437
37879A097796M61587J38814p0777k54863k62102M9030J99197k80383q04318l92691
37869a18710O89662J099666L71162m38042m22841o1362j46712m32072k10980L85430
37859G15201O13666L14751K4208J1862k6005k94387n65204o32244n81188m60187
37849h79527j32518L54302O41838N37695L06321K31208J65241j60447n79062o35426
37839a50375k45268J62899K27095N0597j04253k11918l43290l71046j27697K62364
37829h50892M98951M73784K57016j54465p07855j008954o55425J04061N59113
$$ plain form
37820 -1484666 -965769 -428501 466992 1464914 1780726 1189220 439153 263698 481464
37811 481464 503918 296706 253445 385178 323401 105779 298188 1130472 2023703 2293049
37801 2293049 1963914 1562508 1386793 1364941 1420020 1515530 1412703 850262 22529 -541304
37791 -541304 -680707 -749958 -892951 -704520 -7581 532283 209565 -616758 -972961 -663874
37781 -663874 -361785 -311390 43603 847417 1277775 824763 233117 346173 780605 767528
37771 767528 659184 1311180 2324904 2348584 1159318 68215 -44975 165255 -156083
37762 -156083 -800235 -1202519 -1362338 -1292411 -493320 1117221 2510655 2718220 2079308
37753 2079308 1453029 864093 -47409 -874989 -1003150 -901120 -1500897 -2437178 -2278934
$$ packed form
37820a484666N18897N37268Q95493R97922L15812n91506p50067j75455K17766
37811D81464K2454k07212m3261J31733o1777k17622J92409Q32284Q93231K69346
37801B293049l29135m01406j75715k1852N5079R5510j02827n62441q27733n63833
37791e41304j39403o9251j42993J88431O96939N39864l22718q26323l56203L09087
37781f63874L02089N0395L54993Q03814M30358m53012n91646J13056M34432j3077
37771G67528j08344O51996J013724K3680j189266j091103j13190K10230l21338
37762a56083o44152m02284j59819O9927P99091J610541J393434K07565o38912
37753B079308o26279n88936r11502q27580j28161J02030n99777r36281J58244
$$ plain form
37744 -2278934 -637056 1204373 2027575 1931400 1533982 1051133 653329 724410 1152257
37735 1152257 1198922 653907 296891 596142 789748 39935 -1237973 -2064947 -2259222
37726 -2259222 -2154953 -1575813 -283529 903137 771635 -447434 -1096425 -250286 1120267
37717 1120267 1561009 882940 -10920 -386846 -198555 195470 299785 -236013 -1197060
37708 -1197060 -1907072 -2002530 -1754063 -1408886 -763835 203734 871225 789026 511840 821660
37698 821660 1412228 1242267 114170 -1018601 -1427526 -1404882 -1427312 -1394277 -1149299 -979331
37688 -979331 -994519 -682115 198905 847018 419266 -566367 -781553 105144 1100941 1386191
37678 1386191 1232639 1226010 1389359 1441034 1298285 966517 445938 45405 258791 1013568
$$ packed form
37744b278934J641878J841429Q23202r6175l97418m82849l97804P1081M27847
37735A152257M6665n45015l57016K99251J93606p49813j277908q26974j94275
37726b259222J04269N79140J292284J186666j31502j219069o48991Q46139J370553
37717A120267M40742o78069q93860l75926J88291L94025J04315n35798r61047
37708a197060p10012r5458K48467L45177O45051R67569O67491q2199k77186L09820
37698H21660N90568j69961j128097j132771m08925K2644k2430L3035K44978J69968
37688i79331j5188L12404Q81020O48113m27752r85633k15186Q86697R95797K85250
37678A386191j53552o629J63349N1675j42749l31768n20579m00533K13386P54777
$$ plain form
37668 1013568 1577417 1567280 1502863 1907360 2364502 2036320 790152 -689142 -1656582
37659 -1656582 -1798307 -1296865 -787964 -885436 -1374013 -1330674 -477350 174262 -330525 -1463722
37649 -1463722 -1984913 -1702642 -1467567 -1642638 -1648249 -1049491 -136477 696865 1284828 1280469
37639 1280469 322865 -1124719 -1925878 -1597335 -813818 -371341 -392288 -772006 -1513653
37630 -1513653 -2205143 -2039411 -942087 60197 212544 80053 544642 1404756 1781686
37621 1781686 1430192 823431 307500 -16551 139570 962944 1938513 2244648 1685879
37612 1685879 706710 -279651 -967643 -895396 64159 1103843 1230708 586108 197769
37603 197769 421179 550804 144503 -229755 2158 481234 568099 339506 296971 478844
$$ packed form
37668A013568N63849j0137o4417M04497M57142l28182j246168j479294r67440
37659a656582j41725N01442N08901r7472m88577M3339Q53324O51612n04787j133197
37649a463722n21191K82271K35075j75071n611N98758R13014Q33342N87963m359
37639A280469r57604j447584q01159L28543P83517M42477k0947l79718p41647
37630a513653o91490J65732J097324J002284J52347j32491M64589Q60114L76930
37621A781686l51494o06761n15931l24051J56121Q23374R75569L06135n58769
37612A685879r79169r86361o87992P2247R59555J039684J26865o44600l88339
37603A97769K23410J29625m06301l74258K31913M79076Q6865k28593m2535J81873
$$ plain form
37593 478844 485253 176958 -172017 -310430 -197617 145248 616560 929961 831099 401034
37583 401034 -44963 -274890 -193175 245391 901287 1341209 1175179 515657 -105254 -275753
37573 -275753 -11866 402194 673840 654588 471949 499381 954417 1523540 1668270 1349271
37563 1349271 1096539 1202080 1240427 751455 65047 -128031 110584 -21495 -820579 -1536387
37553 -1536387 -1436495 -796647 -294682 51116 619346 1259486 1515633 1588397 2097248 2848955
37543 2848955 2858825 1880898 957329 961955 1453079 1596111 1452693 1551623 1767638 1536865
37533 1536865 871546 352075 289516 537138 897370 1104038 706453 -342506 -1266335
37524 -1266335 -1341412 -900802 -722754 -786638 -555663 -164595 -194142 -414327 -1582 921837
$$ packed form
37593D78844O409l08295l48975j38413J12813L42865M71312L13401r8862m30065
37583D01034m45997k29927Q1715M38566O55896M39922j66030o59522o20911j70499
37573b75753K63887M14060K71646j9252j82639K7432M55036N69123J44730l18999
37563A349271k52732J05541L8347m88972o86408j93078K38615j32079p99084p15808
37553a536387R9892O39848N01965L45798N68230O40140K56147P2764N08851P51707
37543B848955R870r77927r23569M626M91124J43032j43418R8930K16015k30773
37533A536865o65319n19471o2559K47622L60232K06668l97585j048959r23829
37524a266335p5077M40610J78048o3884K30975L91068k9547k20185M12745R23419
$$ plain form
37514 921837 1246720 660685 217439 623426 1123993 794081 -59517 -575629 -584322 -376010
37504 -376010 31252 566628 710564 272808 -29992 361619 794642 385247 -449547 -551929
37494 -551929 183244 705964 403591 -282856 -884730 -1510393 -2180452 -2465411 -2206426 -1948902
37484 -1948902 -2222667 -2800770 -3003089 -2470699 -1452294 -523381 -82469 14064 187649
37475 187649 367591 -88392 -1282929 -2119934 -1571197 -282315 93883 -871126 -1839348
37466 -1839348 -1579323 -419867 526274 740111 415301 -106313 -490903 -507483 -367041
37457 -367041 -499755 -753525 -467215 362854 812374 439172 122370 737623 1739098
37448 1739098 2025922 1654772 1565960 1918882 1898288 1169647 404288 119263 -41733 -487366
$$ packed form
37514I21837L24883n86035m43246M05987N00567l29912q53598n16112q693K08312
37504c76010M07262N35376J43936m37756l02800L91611M33023m09395q34794j02382
37494e51929P35173N22720l02373o86447o01874o25663o70059k84959K58985K57524
37484a948902k73765n78103k02319N32390J018405R28913M40912R6533J73585
37475A87649J79942m55983j194537q37005N48737J288882L76198r65009r68222
37466a839348K60025J159456R46141K13837l24810n21614l84590j6580J40442
37457c67041j32714k53770K86310Q30069M49520l73202l16802O15253J001475
37448A739098K86824l71150q8812L52922k0594p28641p65359k85025j60996m45633
$$ plain form
37438 -487366 -933074 -939489 -579717 -119300 427066 931544 827541 -236295 -1659849 -2371860
37428 -2371860 -1989014 -1104969 -484185 -326577 -334182 -199930 70766 194971 -63085 -559221
37418 -559221 -849686 -683712 -287224 -34455 24361 133051 423267 727366 765460 385818
37408 385818 -333739 -1085863 -1464799 -1244791 -581666 92829 392711 244559 -84647 -271896
37398 -271896 -367069 -824742 -1844760 -2788688 -2745734 -1785955 -1067467 -1319890 -1759906 -1163180
37388 -1163180 332241 1316828 939353 -183413 -1039986 -1399129 -1526026 -1424434 -964151
37379 -964151 -328707 244543 861986 1600427 2085626 2047652 1966378 2401195 2893689 2461661
37369 2461661 1198530 378111 663697 1175985 926750 336648 447774 1176263 1385086
$$ packed form
37438d87366m45708o415L59772M60417N46366N04478j04003j063836j423554p12011
37428b371860L82846Q84045O20784J57608p605J34252K70696J24205k58056m96136
37418e59221k90465J65974L96488K52769N8816J08690K90216L04099L8094l79642
37408C85818p19557p52124l78936K20008O63125O74495K99882j48152l29206j87249
37398b71896r5173m57673j020018r43928M2954R59779P18488k52423m40016N96726
37388a163180J495421R84587l77475j122766q56573l59143j26897J01592M60283
37379i64151O35444N73250O17443P38441M85199l7974q1274M34817M92494m32028
37369B461661j263131q20419K85586N12288k49235n90102J11126P28489K08823
$$ plain form
37360 1385086 537770 -653645 -1295091 -1244464 -845989 -458602 -466278 -1054359 -1646225 -1244883
37350 -1244883 181849 1279898 937293 -153558 -405429 460323 1113362 600904 -353154
37341 -353154 -518175 131167 631966 571680 568183 1204009 2166698 2700563 2472992 1705187
37331 1705187 757319 -73737 -504924 -369723 181299 748571 996158 855863 497908
37322 497908 202051 193949 484907 882725 1209338 1443519 1619462 1737669 1868236 2141983
37312 2141983 2453945 2384682 1721484 910807 589444 691654 457602 -562973 -1908498
37303 -1908498 -2789901 -2933812 -2613824 -2160695 -1749509 -1439321 -1105307 -515105 216692
37294 216692 452385 -272259 -1454720 -1963203 -1239368 145423 1199436 1493506 1346890
$$ packed form
37360A385086q47316j191415o41446N0627L98475L87387p676n88081n91866M01342
37350a244883J426732J098049l42605j090851k51871Q65752O53039n12458r54058
37341c53154j65021O49342N00799o0286l497O35826R62689N33865k27571p67805
37331A705187r47868q31056m31187J35201N51022N67272K47587j40295l57955
37322D97908k95857q102K90958L97818L26613K34181J75943J18207J30567K73747
37312B141983L11962o9263o63198q10677l21363J02210k34052j020575j345525
37303a908498q81403j43911L19988M53129M11186L10188L34014N90202P31797
37294B16692K35693p24644j182461n08483P23835J384791J054013K94070j46616
$$ plain form
37285 1346890 1286551 1481445 1621393 1314901 656316 259694 526045 1040657 1066037 556955
37275 556955 205819 407232 710946 582233 229534 198736 448200 424544 -1812 -276329
37265 -276329 -23552 310062 65125 -641958 -1018978 -671238 -112623 8914 -165212 36360
37255 36360 797846 1557176 1812484 1697917 1537206 1279133 769838 244200 46059 59671
37245 59671 -68527 -280920 -240465 -34986 -110302 -449804 -502110 -126279 76808 -256066
37235 -256066 -574924 -259656 360919 483605 1108 -480084 -619116 -658172 -775444 -756951
37225 -756951 -468354 -162999 -88517 -111027 54390 438536 797657 881690 649374 288989
37215 288989 27028 -105806 -198022 -132703 360019 1166579 1665891 1446025 811144 224331
$$ packed form
37285A346890o0339J94894J39948l06492o58585l96622K66351N14612K5380n09082
37275E56955l51136K01413L03714j28713l52699l0798K49464k3656m26356k74517
37265b76329K52777L33614k44937p07083l77020L47740N58615J21537j74126K01572
37255C6360P61486P59330K55308j14567j60711k58073n09295n25638j98141J3612
37245E9671j28198k12393M0455K05479p5316l39502n2306L75831K03087l32874
37235b56066l18858L15268O20575J22686m82497m81192j39032l9056j17272J8493
37225g56951K88597L05355P4482k2510J65417L84146L59121Q4033k32316l60385
37215B88989k61961j32834r2216O5319M92722Q06560M99312k19866o34881n86813
$$ plain form
37205 224331 -329022 -887732 -880578 196267 1644741 2040299 938135 -685364 -1791218
37196 -1791218 -2227695 -2150091 -1476965 -405458 366226 537778 655226 1094266 1326409
37187 1326409 918649 554782 1096683 2107479 2359689 1587861 746612 601591 972562
37178 972562 1375358 1546619 1254122 408358 -490033 -755815 -509451 -538550 -1055849 -1401929
37168 -1401929 -1195983 -934607 -1063937 -1211332 -819267 56997 1011545 1794166 2198972
37159 2198972 2049919 1651258 1593978 1760037 1321008 201202 -400188 307877 1422676
$$ packed form
37205B24331n53353n58710P154J076845J448474L95558j102164j623499j105854
37196a791218m36477P7604O73126J071507P71684J71552J17448M39040K32143
37187A326409m07760l63867N41901J010796K52210p71828q41249j45021L70971
37178I72562M02796J71261k92497q45764q98391k65782K46364k9099n17299l46080
37168a401929K05946K61376j29330j47395L92065Q76264R54548P82621M04806
37159B198972j49053l98661n7280J66059m39029j119806o01390P08065J114799
$$ [...]
##END NTUPLES=NMR SPECTRUM
##END=
