##TITLE=31Pdec_DPABC1702-12
 CDCl3, 24 sc
 17.2.2022
##JCAMPDX= 6.0         $$ Bruker NMR JCAMP-DX V2.0
##DATA TYPE= NMR SPECTRUM
##DATA CLASS= NTUPLES
##ORIGIN= UXNMR, Bruker Analytische Messtechnik GmbH
##OWNER= root
$$ XWIN-NMR		Version 3.5
$$ Fri Feb 18 11:02:25 2022 Russian Standard Time (UT+4h)  she@DPX200
##.OBSERVE FREQUENCY= 81.013821
##.OBSERVE NUCLEUS= ^31P
##.ACQUISITION MODE= SIMULTANEOUS
##.ACQUISITION SCHEME= undefined
##.AVERAGES= 24
##.DIGITISER RES= 16
##SPECTROMETER/DATA SYSTEM= spect
##.PULSE SEQUENCE= zgpg30
##.SOLVENT NAME= CDCl3
##.SHIFT REFERENCE= (INTERNAL, CDCl3, 0, 248.564)
##AUDIT TRAIL= $$ (NUMBER, WHEN, WHO, WHERE, WHAT)
$$ ##TITLE= Audit trail, XWIN-NMR		Version 3.5
$$ ##JCAMPDX= 5.01
$$ ##ORIGIN= Bruker BioSpin GmbH
$$ ##OWNER= she
$$ F:/spectra/data/she/nmr/P31/1/pdata/1/auditp.txt
$$ ##AUDIT TRAIL=  $$ (NUMBER, WHEN, WHO, WHERE, WHAT)
(   1,<2022-02-18 11:00:48.81 +0400>,<she>,<DPX200>,
      <created by zg, POWCHK disabled, PULCHK disabled
       configuration hash MD5:
       00 E9 B6 7A A2 85 ED C7 34 08 36 98 17 FE 4E 26
       data hash MD5: 32K
       D4 F1 95 1A E1 CD 67 F6 0C 8E 53 F2 38 D1 7F 0C>)
(   2,<2022-02-18 11:00:54.37 +0400>,<she>,<DPX200>,
      <Start of raw data processing
       efp BC_mod = 2 LB = 1 FT_mod = 6 PKNL = 1 PHC0 = -9188.042 PHC1 = 100.0745 SI = 64K 
       data hash MD5: 64K
       6C BE 28 C9 BB 75 07 53 99 E7 63 AF 93 7E C8 DB>)
(   3,<2022-02-18 11:01:13.56 +0400>,<she>,<DPX200>,
      <pk PHC0 = 12.28458 PHC1 = 0 
       data hash MD5: 64K
       41 8C F0 F9 32 F6 2C 06 85 8C 47 8C F2 D2 CA 17>)
(   4,<2022-02-18 11:01:19.06 +0400>,<she>,<DPX200>,
      <abs ABSG = 5 
       data hash MD5: 64K
       4B EB CC EA B6 14 97 05 2F 2C A6 86 DA 23 61 51>)
$$ ##END=
$$ 
$$ hash MD5
$$ C8 F7 4E C7 B6 19 C7 28 55 92 EE 63 E8 57 4E 94
##$RELAX= 
##$RELAX= 
##$RELAX= 
##$RELAX= 
##$RELAX= 
##$RELAX= 
##$RELAX= 
##$RELAX= 
$$ Bruker specific parameters
$$ --------------------------
##$DU= <F:/spectra>
##$EXPNO= 1
##$NAME= <P31>
##$PROCNO= 1
##$TYPE= <nmr>
##$USER= <she>
##$AMP= (0..31)
100 100 100 100 100 100 100 100 100 100 100 100 100 100 100 100 100 100 
100 100 100 100 100 100 100 100 100 100 100 100 100 100 
##$AQSEQ= 0
##$AQ_mod= 1
##$AUNM= <au_zg>
##$AUTOPOS= <>
##$BF1= 81.014009
##$BF2= 200.13
##$BF3= 200.13
##$BF4= 200.13
##$BF5= 200.13
##$BF6= 200.13
##$BF7= 200.13
##$BF8= 200.13
##$BYTORDA= 1
##$CFDGTYP= 0
##$CFRGTYP= 5
##$CHEMSTR= <none>
##$CNST= (0..31)
1 1 145 1 1 1 1 1 1 1 1 1 1 1 1 1 1 1 1 1 1 1 1 1 1 1 1 1 1 1 1 1 
##$CPDPRG= <waltz16>
##$CPDPRG1= <>
##$CPDPRG2= <waltz16>
##$CPDPRG3= <>
##$CPDPRG4= <mlev>
##$CPDPRG5= <mlev>
##$CPDPRG6= <mlev>
##$CPDPRG7= <mlev>
##$CPDPRG8= <mlev>
##$CPDPRGB= <>
##$CPDPRGT= <>
##$D= (0..31)
0 1 0 0 0 0 0 0 0 0 0 0.03 2e-05 3e-06 0 0 0 0 0 0 0 0 0 0 0 0 0 0 0 0 
0 0 
##$DATE= 1645167648
##$DBL= (0..7)
120 120 120 11 120 120 24 19 
##$DBP= (0..7)
150 150 150 150 150 150 150 150 
##$DBP07= 0
##$DBPNAM0= <>
##$DBPNAM1= <>
##$DBPNAM2= <>
$$ [...]
##$SUBNAM3= <"">
##$SUBNAM4= <"">
##$SUBNAM5= <"">
##$SUBNAM6= <"">
##$SUBNAM7= <"">
##$SUBNAM8= <"">
##$SUBNAM9= <"">
##$SW= 501.771253377433
##$SWIBOX= (0..15)
0 1 3 0 0 0 0 0 0 0 0 0 0 0 0 0 
##$SW_h= 40650.406504065
##$TD= 32768
##$TD0= 1
##$TE= 0
##$TE2= 300
##$TE3= 300
##$TEG= 300
##$TL= (0..7)
0 120 53 12 22 120 120 120 
##$TP= (0..7)
150 150 150 150 150 150 150 150 
##$TP07= 0
##$TPNAME0= <>
##$TPNAME1= <>
##$TPNAME2= <>
##$TPNAME3= <>
##$TPNAME4= <>
##$TPNAME5= <>
##$TPNAME6= <>
##$TPNAME7= <>
##$TPOAL= (0..7)
0.5 0.5 0.5 0.5 0.5 0.5 0.5 0.5 
##$TPOFFS= (0..7)
0 0 0 0 0 0 0 0 
##$TUNHIN= 0
##$TUNHOUT= 0
##$TUNXOUT= 0
##$USERA1= <user>
##$USERA2= <user>
##$USERA3= <user>
##$USERA4= <user>
##$USERA5= <user>
##$V9= 5
##$VALIST= <valist>
##$VCLIST= <CCCCCCCCCCCCCCC>
##$VD= 0
##$VDLIST= <DDDDDDDDDDDDDDD>
##$VPLIST= <PPPPPPPPPPPPPPP>
##$VTLIST= <TTTTTTTTTTTTTTT>
##$WBST= 1024
##$WBSW= 4
##$XGAIN= (0..3)
0 0 0 0 
##$XL= 0
##$YL= 0
##$YMAX_a= 1510
##$YMIN_a= -3852
##$ZGOPTNS= <>
##$ZL1= 120
##$ZL2= 120
##$ZL3= 120
##$ZL4= 120
##$ABSF1= 248.5645
##$ABSF2= -253.2056
##$ABSG= 5
##$ABSL= 3
##$ALPHA= 0
##$AQORDER= 0
##$ASSFAC= 0
##$ASSFACI= 0
##$ASSFACX= 0
##$ASSWID= 0
##$AUNMP= <proc_1d>
##$AZFE= 0.1
##$AZFW= 0.5
##$BCFW= 0
##$BC_mod= 2
##$BYTORDP= 0
##$COROFFS= 0
##$CY= -3
##$DATMOD= 1
##$DC= 0
##$DFILT= <>
##$DTYPP= 0
##$F1P= 0
##$F2P= 0
##$FCOR= 1
##$FTSIZE= 65536
##$FT_mod= 6
##$GAMMA= 0
##$GB= 0
##$INTBC= 1
##$INTSCL= 5.30512e-09
##$ISEN= 30
##$LB= 1
##$LEV0= 0
##$LPBIN= 0
##$MAXI= 10000
##$MC2= 0
##$MEAN= 0
##$ME_mod= 0
##$MI= 50
##$NCOEF= 0
##$NC_proc= -9
##$NLEV= 6
##$NOISF1= 182.463
##$NOISF2= 159.3651
##$NSP= 0
##$NTH_PI= 0
##$NZP= 0
##$OFFSET= 248.5645
##$PC= 4
##$PHC0= -9175.758
##$PHC1= 100.0745
##$PH_mod= 1
##$PKNL= yes
##$PPARMOD= 0
##$PSCAL= 0
##$PSIGN= 0
##$REVERSE= no
##$SF= 81.014009
##$SI= 65536
##$SIGF1= 159.3651
##$SIGF2= -187.1042
##$SINO= 113.3802
##$SIOLD= 16384
##$SREGLST= <1H.CDCl3>
##$SSB= 0
##$STSI= 65536
##$STSR= 0
##$SW_p= 40650.406504065
##$SYMM= 0
##$S_DEV= 0
##$TDeff= 32768
##$TDoff= 0
##$TI= <>
##$TILT= no
##$TM1= 0
##$TM2= 0
##$TOPLEV= 0
##$USERP1= <user>
##$USERP2= <user>
##$USERP3= <user>
##$USERP4= <user>
##$USERP5= <user>
##$WDW= 1
##$XDIM= 65536
##$YMAX_p= 475010311
##$YMIN_p= -377494412
$$ End of Bruker specific parameters
$$ ---------------------------------
##NTUPLES= NMR SPECTRUM
##VAR_NAME=  FREQUENCY,     SPECTRUM/REAL,   SPECTRUM/IMAG
##SYMBOL=    X,             R,               I
##VAR_TYPE=  INDEPENDENT,   DEPENDENT,       DEPENDENT
##VAR_FORM=  AFFN,          ASDF,            ASDF
##VAR_DIM=   65536,         65536,           65536
##UNITS=     HZ,            ARBITRARY UNITS, ARBITRARY UNITS
##FACTOR=    0.620285442955139, 1,           1
##FIRST=     20137.2065510759, 0,            0
##LAST=      -20513.1999529892, 0,           0
##MIN=       -20513.1999529892, -377494412,  0
##MAX=       20137.2065510759, 475010311,    0
$$ Real data points
##PAGE= N=1
##DATA TABLE= (X++(R..R)), XYDATA
$$ [...]
##PAGE= N=2
##DATA TABLE= (X++(I..I)), XYDATA
12937f601025J052114M83822M36842j360280j366268L613637P080359J774171
12929E113372n796751l825837M447027N091506k480620m166403L588080O733841
12921H704215j483346p716980j441359O593397K997429n652452n347124J521055
12913a825165K787806j070316J62887N754221M817569l391952p271814k362714
12905b399478K385738P43727k330857k460312l410018p296687q012879j127299
12897b3908065P709911J0457555O691474J136249l132281m770733k765838R85894
12889g595834K184170L37072j00872K635563M102064J003511k878831k097658
12881b410815K663429N697071K903485m591111j1288706j1459895n276440J28313
$$ y = [-6601025, -5548911, -5065089, -4628247, -5988527, -7354795, -3741158, 3339201, 5113372, -683379, -4509216, -62189, 5029317, 2548697, -1617706, 1970374, 8704215, 7220869, -496111, -1937470, 4655927, 7653356, 2000904, -3346220, -1825165, 962641, -107675, 55212, 5809433, 10627002, 7235050, -36764, -2399478, -13740, 729987, -1600870, -4061182, -7471200, -14767887, -22780766, -23908065, -16198154, -5740599, 950875, 2087124, -1045157, -5815890, -8581728, -7595834, -5411664, -5074592, -5175464, -2539901, 1562163, 2565674, -313157, -2410815, 252614, 5949685, 8853170, 4262059, -7026647, -18486542, -23762982, -23634669]
12873b3634669k59102j388084M186065J2607169J2021751K21598j0867710j1157966
12865a8270948l764204L160056O872674P664872M774332M53994M44324M618419
12857E953519M586586l536543j1547378j0551451k490236N729557J1176592J1383167
12849A0703813K000377j2851398j7838042n665549R402320R945873n35679n979046
12841a0817331k771504J17371O19582M666826R860344O679766l119456o729225
12833a493627j081329L164217J051274j90877K141716M93217o289366p709187
12825i913962l51514M668942J328155p80136M715276Q328636K868602j988969
12817H875030K509462O962644P04855p697744n153050K347939O80420p085545
$$ y = [-23634669, -23893771, -25281855, -21095790, -8488621, 3533130, 3754728, -7112982, -18270948, -22035152, -18875096, -12002422, -4337550, 436782, 890776, 1335100, 5953519, 10540105, 7003562, -4543816, -15095267, -17585503, -11855946, -679354, 10703813, 12704190, -147208, -17985250, -23650799, -14248479, -4302606, -4838285, -10817331, -13588835, -13471464, -12851882, -8185056, 1675288, 8355054, 5235598, -1493627, -2574956, 589261, 1640535, 1449658, 3591374, 4084591, -2204775, -9913962, -10265476, -5596534, -4268379, -5048515, -333239, 7995397, 10863999, 8875030, 11384492, 18347136, 19051991, 11354247, 6201197, 8549136, 9229556, 2144011]
12809B144011p175328k79031R42814m654442o377283k384805p29549j404798K715302
12800a7203109Q151705M740589k951283j14718J0915204J1162797k773785j1077569
12792H49831l070776O357819L729107k076270o2134K285662m116274j0010578
12784f113613l807275O500866O623688l49072k281925K50676o41110k321181J492664
12775f46282M484637j412671o816543J280297J3040890Q192989q524121j1894192
12767b294996K396148R760270k333445j3426047m422433J1282742J0703787k894484
12759H771542r352051m678510j632901l700368j385493O133994O578166l715685
12751b981306j0881789m231144P218928Q743914J233366k692052J069837L548827
$$ y = [2144011, -5031317, -5310348, -4367534, -9021976, -15399259, -17784064, -18513613, -19918411, -17203109, -9051404, -4310815, -7262098, -7376816, 3538388, 14701185, 11927400, 849831, -2220945, 4136874, 7865981, 5789711, 5727577, 8013239, 3896965, -6113613, -9920888, -3420022, 3203666, 2854594, 572669, 823345, 182235, -2138946, -646282, 3838355, 2425684, -4390859, -3110562, 9930328, 18123317, 9599196, -2294996, 101152, 9861422, 7527977, -5898070, -10320503, 962239, 11666026, 8771542, -580509, -5259019, -6891920, -10592288, -11977781, -5843787, 734379, -2981306, -13863095, -18094239, -10875311, -2131397, -898031, -3590083, -2520246, 1028581]
12743A028581j416388o982995l875278N072972Q155745J104184o739008m969628
12735h621815L995070Q438489L009069m586249m190822L361836P476309J999753
12727A0881640o061791n440854L568405Q150909L45155j0592043j0040603J410001
12719g779181R057386N531794k20872Q16971L871099P39129n167857m890089Q24490
12710B782870L502213P84253k241316l247274m080568l715151J74901L993593
12702b046479K643482l42026K059001O536198L266500o608752j0981440n920722
12694a1394238p85947j036398n07639M059222N569954R52802j300863L038648
12686a404459M615528k054642n808150K329383J0142382J778098j4802988j7710823
$$ y = [1028581, -387807, -7370802, -11246080, -6173108, 1982637, 3086821, -3652187, -8621815, -4626745, 3811744, 6820813, 2234564, -1956258, 1405578, 8881887, 10881640, 4819849, -621005, 2947400, 11098309, 11443464, 851421, -9189182, -7779181, 1278205, 6809999, 6589127, 7406098, 11277197, 12016326, 6848469, 1958380, 2782870, 6285083, 7069336, 4828020, 1580746, -2499822, -6214973, -6040072, -2046479, 597003, 254977, 2313978, 8850176, 12116676, 5507924, -5473516, -11394238, -12180185, -13216583, -13724222, -9665000, -4095046, -3142244, -4443107, -1404459, 3211069, 1156427, -4651723, -2322340, 7820042, 9598140, -5204848, -22915671]
12678b2915671l803068Q313585P073840Q10030o12612M22531m94350k81540L503858
12669g983397N901125L027789r66335j150760J190786L214698M946875N372520
12661A3553301J817126l145576k512674L378591M962430j568423p019463l883645
12653E581667J261596o42323n478040l572860K833111K866666m600055q750178
12645a0500416l677800M058801P320131P575918P887228N529296j987541r444880
12637F760737r373098k281672L878160L239254k499535o945281m966949K583588
12629i604796Q195903M221846p428288j4790136q574805O408011J6264109J3308413
12621H000257K624429n901325p750826n150836k008304P2504J873568M136688
$$ y = [-22915671, -26718739, -18405154, -11331314, -10521284, -11133896, -10711365, -11205715, -11487255, -7983397, -2082272, 945517, -20818, -1171578, 19208, 3233906, 8180781, 13553301, 15370427, 12224851, 9712177, 13090768, 18053198, 16484775, 9465312, 5581667, 6843263, 6200940, 722900, -2849960, -16849, 2849817, -1750238, -10500416, -14178216, -10119415, -2799284, 4776634, 12663862, 18193158, 16205617, 6760737, -2612361, -4894033, -1015873, 2223381, -276154, -7221435, -12188384, -9604796, -1408893, 2812953, -4615335, -19405471, -27980276, -21572265, -5308156, 8000257, 10624686, 4723361, -3027465, -8178301, -10186605, -10114101, -8240533, -4103845]
12613d103845N426464L447005q39799k690326K86897L519364R96659n710558q927764
12604h595903n597576j203642j253778l798735l494147O81986N203318O819053
12596a1239424M702823J26542l602497l297479N1555K180293J888832K334466
12588f854889M261552L636803o62003l127860n65824J685936r87002l527464j11012
12579f251763M053430Q35500n419036l701656M518505O393465j118785n924114
12571f614454q18702N105255K276715m046294l636124K485029N605098L027336
12563C383859p89435k534095j987306P41748L866989L658895N11331K98773M669003
12554A1819762O228929j61828p586175o560097O66158L818849q39051p634986
$$ y = [-4103845, 1322619, 4769624, 3929825, 1239499, 1526396, 5045760, 6042419, 331861, -8595903, -14193479, -15397121, -16650899, -20449634, -23943781, -23261795, -18058477, -11239424, -6536601, -6410059, -10012556, -13310035, -13258480, -11078187, -9189355, -6854889, -2593337, 1043466, 381463, -2746397, -3312221, -1626285, -2613287, -6140751, -6251763, -2198333, -1362833, -6781869, -10483525, -5965020, 428445, -690340, -6614454, -7433156, -2327901, -51186, -4097480, -7733604, -5248575, 356523, 3383859, 2594424, 60329, -1926977, -1185229, 2681760, 6340655, 6851986, 7150759, 11819762, 18048691, 17886863, 10300688, 3740591, 4406749, 8225598, 7386547, -248439]
12546b48439j0718377r201481n038805j269249j12552P68738N754805J2233760
12538g831600J1666216L780453n89028K503240J804076q757161j4937719l814255
12530a6175778J1074193P742588q335148j1259930L921441J3303733K693634j1038479
12522h073746q462646L772797Q209807M238729K853250M530418L97793r356310
12514a889908j3689448o657432N518601J3176306J1848308L639991m273318m805789
12506B867311P02538K708712l690027j0930025r403522j006042M226321J839243
12498a2685491k852443k764007L128964R101189Q218174N14153n278922k779703
12490e398086J764213j105129o701788j929172J0719826J2338681k624488j4040224
$$ y = [-248439, -10966816, -20168297, -25207102, -26476351, -26588903, -25820165, -20065360, -7831600, 3834616, 7615069, 7026041, 9529281, 11333357, 2576196, -12361523, -16175778, -5101585, 2641003, -5694145, -16954075, -13032634, 271099, 2964733, -8073746, -16536392, -12763595, -4553788, -315059, 2538191, 7068609, 7466402, -1889908, -15579356, -22236788, -16718187, -3541881, 8306427, 11946418, 7673100, 2867311, 3569849, 6278561, 2588534, -8341491, -17745013, -18751055, -14524734, -12685491, -15537934, -18301941, -15172977, -6071788, 2146386, 2660539, -2618383, -5398086, -3633873, -4739002, -11440790, -13369962, -2650136, 9688545, 7064057, -6976167]
12482f976167o018771P589615N401090p171529q053998M901312J1939432M580907
12474F191891l063432k90493M314985J438263k515026R67289O149298L177239
12466A6370014m858276p585510l994156j752720l479991m400022k384918q93429
12458a2979008j212700L51135N123677P818301L453016m783712q758842n598111
12450a6586244o82700P70607J252896N845178J1750847R976119r19018r965849
12442A441836p624167J216153M784888P54444l059123j909120Q26341J677993
12434a890755J800982K092429Q10402j598474j473939J629167K886126n62078
12426C693860m845316m705044j37031M471731N011928M75692n756456p350920
$$ y = [-6976167, -12994938, -5405323, -4233, -7175762, -15229760, -10328448, 1610984, 6191891, 3128459, 2837966, 7152951, 8591214, 6076188, 7043477, 13192775, 16370014, 11511738, 3926228, -67928, -1820648, -5300639, -9700661, -12085579, -12979008, -14191708, -13840573, -8716896, -898595, 2554421, -2229291, -10988133, -16586244, -17268944, -16498337, -15245441, -9400263, 2350584, 12326703, 11407685, 1441836, -6182331, -4966178, -181290, 573154, -2485969, -4395089, -3568748, -1890755, -89773, 2002656, 2813058, 1214584, -259355, 1369812, 4255938, 3693860, -1151456, -5856500, -5993531, -1521800, 3490128, 3965820, -1790636, -9141556]
12418i141556j685875N259045N681211J108973O0303M156730N121942j296981
12410I263792p201198m493693K199390K968208j604686j912925M498936P967968
12402A1685792Q76912j0457642j3515257n542447M043216O469485L231170Q55759
12394b353012P29834p51112l751857l314762K172922O561624M032626k386386
12386I39877n234075k816004J38299K20234j517028l200817l824674j739525L546672
12377a3487041Q011559O414479l23556n203935l568313J887192N148140L205115
12369B083640j834741m861519k596898K329467M378813L231346L911034O321043
12361A2962185K564455q894642j5024555n233573J0053865J2111553J421877m033105
$$ y = [-9141556, -10827431, -5568386, 112825, 1221798, 1282101, 5438831, 10560773, 9263792, 2062594, -2431099, -231709, 2736499, 1131813, -781112, 3717824, 11685792, 12562704, 2105062, -11410195, -16952642, -12909426, -6439941, -3208771, -2353012, -1623178, -2374290, -6126147, -9440909, -7267987, -706363, 3326263, 939877, -4294198, -7110202, -6971903, -6751669, -8268697, -11469514, -15294188, -17033713, -13487041, -5475482, 938997, 615441, -4588494, -8156807, -6269615, -1121475, 2083640, 248899, -4612620, -7209518, -4880051, -501238, 2730108, 6641142, 12962185, 15526640, 6631998, -8392557, -13626130, -3572265, 8539288, 9961165, 5928060]
12353E928060K450004P408955J284007o500553n365509j146794l817326r388912
12345i148068p508782Q24353O059515N342118L483741K673193J473317P35547
12337C934934J457973M18830l582910m028224L113463Q771076K361498r793978
12329B652662j1397111m55667P625088L183403n185297o222703k019091p07530
12321a2526246k291980j119481K849465M368136K422450J754411M661522P012737
12313G131014M138573k721874p788736o959857j281795M843276P375589M738815
12305I475005j734862p957981r118395m155180K118815L915224J268774r20743
12297g109343j73081J295203J754645K435503L406674K113015j531729l389365
$$ y = [5928060, 8378064, 15787019, 17071026, 10570473, 5204964, 4058170, 240844, -9148068, -16656850, -15832497, -9772982, -4430864, -947123, 1726070, 3199387, 3934934, 5392907, 5811737, 2228827, -1799397, 1314066, 10085142, 12446640, 2652662, -8744449, -9200116, -1575028, 1608375, -3576922, -9799625, -11818716, -12526246, -14818226, -15937707, -13088242, -8720106, -6297656, -4543245, 118277, 7131014, 11269587, 8547713, 758977, -6200880, -7482675, -2639399, 4736190, 9475005, 7740143, -217838, -9336233, -13491413, -11372598, -7457374, -6188600, -7109343, -7282424, -5987221, -4232576, -1797073, 1609601, 3722616, 2190887, -1198478]
12289a198478j335043J333753J726682J649093K515040J370388l175404o059079
12281c173048k839861K152875J281338n090763q867564m856708L561972Q842440
12273h989319O368871j544599p009471m498417J794082L153228n93561q48999
12265a2168185M712187O890096M03677n624908j552574P090449Q550222K600053
12257A0901017k203764l400883m552325m645766k85510M388887K449021l070399
12249d19722l170785K061158M452626K200741P59410M35307l627423r210967q233707
12240a4753362j082535L210001K048918J527727K982577J411527j583604J335478
12232d903273P229884M269021o934335j0623406o47362R233967P756007J970612
$$ y = [-1198478, -2533521, -1199768, 526914, 2176007, 4691047, 6061435, 2886031, -3173048, -6012909, -3860034, -2578696, -7669459, -16537023, -21393731, -17831759, -8989319, -2620448, -4165047, -11174518, -15672935, -13878853, -10725625, -11319186, -12168185, -7455998, -565902, -162225, -5787133, -7339707, -249258, 8300964, 10901017, 8697253, 5296370, 744045, -3901721, -4187231, 201656, 2650677, -419722, -3590507, -1529349, 2923277, 5124018, 5883428, 6318735, 2691312, -6519655, -14753362, -15835897, -12625896, -10576978, -9049251, -6066674, -4655147, -6238751, -4903273, 2326611, 6595632, -338703, -10962109, -11609471, -2375504, 5380503, 7351115]
12224G351115R82656O45568l515681m075417L304742P126343j578200j0893718
12216f52592n860576O072533O830674l156707q022791l542429l41160j930085
12208a0603133m1460O458366O974338j711054p820475k621344O714612R048737
12200F398587L885819k194140n374193n189314j867736K313082M140856M414578
12192F527539O312403P845350L250805o190736j0673668m848768M381434P161048
12184A3765407K318602m288102q268850r046787o950158k471212K352864M448474
12176h139762K206586k385782m419291j106010L336182J846813m738934o864448
12168b0264646M9171P785511P518210K998500K557574L967387p92580r208142
$$ y = [7351115, 8333771, 8979339, 5463658, 1388241, 4692983, 11819326, 10241126, -652592, -6513168, -440635, 6390039, 3233332, -4789459, -8331888, -8673048, -10603133, -10644593, -4186227, 2788111, 1077057, -6743418, -9364762, -2650150, 6398587, 10284406, 8090266, 2716073, -2473241, -4340977, -2027895, 2112961, 6527539, 12839942, 20685292, 23936097, 17745361, 7071693, 2222925, 6604359, 13765407, 16084009, 11795907, 3527057, -5519730, -12469888, -14941100, -12588236, -8139762, -5933176, -8318958, -12738249, -13844259, -10508077, -8661264, -13400198, -20264646, -20215475, -12429964, -4911754, -1913254, 644320, 4611707, 3819127, -5389015]
12160e389015j0237858k386779L448617J268500k251492r43715J408579J49824
12152a4933339j639175K06742L693599N751909P294777Q098346M253177l595299
12144I130737p060184j757878M642936L442376k318717m295952k460227k636358
12136c313267m198115j023382N959117P618775M84287o691074m763696L303665
12128b623690P374753M138172j02996n3500J401950p14794m999022o381492m748269
12119f708888m336809n100805k418876K908804L205326k862968m580934N273366
12111a4621784J6920805J6333122N678480j595139k193994m766473j1072521j1305939
12103f623443j819720O744164N279091j463262m931577m749578l822445j216937
$$ y = [-5389015, -15626873, -18013652, -14565035, -13296535, -15548027, -16491742, -15083163, -14933339, -16572514, -16365772, -12672173, -6920264, 374513, 8472859, 12726036, 9130737, 2070553, 312675, 4955611, 8397987, 6079270, 1783318, -676909, -3313267, -7511382, -8534764, -2575647, 5043128, 5527415, -1163659, -5927355, -2623690, 4751063, 8889235, 8786239, 8732739, 10134689, 9419895, 4420873, -1960619, -6708888, -11045697, -16146502, -18565378, -15656574, -12451248, -15314216, -19895150, -14621784, 2299021, 18632143, 24310623, 22715484, 20521490, 15755017, 4682496, -6623443, -8443163, -1698999, 3580092, 2116830, -2814747, -7564325, -11386770, -12603707]
12095a2603707K715980K955255j139247k028424L353561O309675L50550o661579
12087f747936m609233K803081N577731L984906M837466O654911K413699n823876
12079I090749q691775n005379k626916l634591j334480N821787R326018M014412
12071F959825l267327l768443J325188M064540L7203p931712j2904067r309598
12063b4794391R83985Q322432N863466n03625M72603Q637489J1564968K344716
12055A2891643j0143534j3028591n232737L492019N203132R48248k600760q13122
12047i283702L936163N161882J530190L1418N286564R730884L162824r980854
12039I575369j4299167n671457K431196l54823o205624l152451N675545Q124972
$$ y = [-12603707, -9887727, -6932472, -8071719, -10100143, -6746582, -436907, -86357, -6747936, -11357169, -8554088, -2976357, 1008549, 5846015, 12500926, 14914625, 9090749, 398974, -4606405, -7233321, -10867912, -12202392, -6380605, 2945413, 6959825, 3692498, -75945, 1249243, 5313783, 5350986, -2580726, -15484793, -24794391, -23810406, -15487974, -9624508, -10128133, -9655530, -1018041, 10546927, 12891643, 2748109, -10280482, -15513219, -12021200, -6818068, -5869820, -8470580, -9283702, -5347539, -185657, 1344533, 1375951, 6662515, 16393399, 19556223, 9575369, -4723798, -10395255, -7964059, -8318882, -14524506, -17676957, -12001412, -3876440]
12031c876440K021583l856148m557078l175488j431774K768433P384815O280492
12023A558395K6940k636963J770518N191901Q46879n443417m599216R94120J941704
12014c49139k097353j923576M985628Q698236J850751q290433r806084k178293
12006i110263N410505P629697O340082L073994k268892n737984k232755M396188
11998G500572L919180m478845q989750l003424L892412Q73760o908807o877900
11990a4072802J430377P550205P194113N490935M485571M19881n391560n655062
11982A451658m06218O99485n379224p839157J252951J2615599J2157556J216669
11974A5769319o424137m314794M81768M08251l021261m857997m514381l992316
$$ y = [-3876440, -1854857, -5711005, -10268083, -13443571, -14875345, -12106912, -4722097, 1558395, 1585335, -1051628, 718890, 5910791, 6757670, 1314253, -3284963, -2290843, -349139, -2446492, -4370068, 615560, 9313796, 11164547, 2874114, -6931970, -9110263, -3699758, 3929939, 10270021, 13344015, 11075123, 5337139, 3104384, 7500572, 11419752, 6940907, -2048843, -5052267, -1159855, -286095, -7194902, -14072802, -12642425, -5092220, 2101893, 7592828, 12078399, 12498280, 7106720, 1451658, 1045440, 1744925, -3634299, -11473456, -10220505, 2395094, 14552650, 15769319, 9345182, 5030388, 5512156, 5920407, 2899146, -1958851, -6473232, -10465548]
11966a0465548k862633N83865M865181N700913J557180l261003l096708J715927
11958e262826M610594J289159m429073o330699m479329l095067j965209K746984
11950a6915466R101097R013193J04772r191064j0372235m711725J657619O221173
11942a5092636Q549371O381162j29853m861754l184493P91571R62559p89561J013425
11933f360209M478406K759875l922649p644765m662787m8313J038887n4856L27846
11924a4088565K686728M949540M715668O70803m485922m075305M179018J1699132
11916F251097Q303131l070627r374757n390854O92274J298395r54276j443524
11908c689141j550925k686807r69873M895312P701373J872253o209559o536861
$$ y = [-10465548, -13328181, -12744316, -7879135, -2178222, -621042, -3882045, -6978753, -5262826, -652232, 636927, -3792146, -10122845, -14602174, -17697241, -19662450, -16915466, -7814369, 1198824, 1303596, -7887468, -18259703, -22971428, -21313809, -15092636, -6543265, -162103, -291956, -5153710, -8338203, -7546632, -6584073, -7373634, -6360209, -1881803, 878072, -3044577, -10689342, -15352129, -15400442, -14361555, -14416411, -14088565, -11401837, -6452297, -1736629, -1065826, -5551748, -9627053, -5448035, 6251097, 14554228, 11483601, 2108844, -3282010, -2589736, -1291341, -2245617, -3689141, -5240066, -7926873, -8896746, -4001434, 3699939, 5572192, -637367, -7174228]
11900g174228K06552N089882M170570P35293k873453o608190p455051k087792
11892a5996417N159378N671508q16214m851402p14324N792617O170848L43327
11884G59321m579106l234022K711362O293278K229255n729667o957510K256898
11876f250191J0921628O881810n125806r616461l302936J353812k318186m892811
11868a2349141J069897O645274J633299o996159n899171K788485N733124N01120
11860f873272k398141J193060L246850m40605k566625K005245O734989M559201
11852E460702p58091j974702J04373M9823k527769l951514l522964l338526l465711
11843a3924379k194668P40791M367284P428595P234636J681040n448773o484325
$$ y = [-7174228, -6967676, -1877794, 2292776, 3028069, 154616, -6453574, -13908625, -15996417, -10837039, -5165531, -5981745, -10833147, -11547471, -5754854, 415994, 759321, -3819785, -7053807, -4342445, 1950833, 4180088, -1549579, -8507089, -6250191, 4671437, 11553247, 6427441, -3189020, -6491956, -5138144, -7456330, -12349141, -11279244, -4633970, -3000671, -9996830, -15896001, -13107516, -7374392, -6873272, -9271413, -8078353, -4831503, -5272108, -7838733, -5833488, 901501, 5460702, 4702611, 2727909, 2832282, 2882105, 354336, -3597178, -7120142, -10458668, -13924379, -16119047, -15378256, -11010972, -3582377, 3652259, 5333299, -115474, -6599799]
11835f599799j32401N920220N973235L362254K452571J232166k084828k863661
11827G259757J430159L605578k491068r515942o291360M321836R376962M993316
11819A2689238r93715l964721o660828q318518l887828L459030L143994n003103
11811i536451p520656J538844R583981M847777n010517n407546K947889P254008
11803a302671K502000m192867o147201l207352K766648Q981698R873125K929243
11795A2202623n116725n972953j658084m52973l501590m802158k518879p4839
11787a1895578K546233P271296Q527289j290396j5252057j5359435J918533J7259966
11779f274149J4251248J395679l107869J491699J547084o271994r936306k564884
$$ y = [-6599799, -6732200, -811980, 5161255, 8523509, 10976080, 12208246, 10123418, 7259757, 8689916, 12295494, 9804426, 288484, -6002876, -1681040, 7695922, 12689238, 11695523, 7730802, 1069974, -7248544, -11136372, -7677342, -4533348, -9536451, -17057107, -15518263, -5934282, -1086505, -6097022, -11504568, -8556679, -1302671, 1199329, -2993538, -9140739, -12348091, -9581443, -599745, 9273380, 12202623, 7085898, 1112945, -545139, -998112, -4499702, -9301860, -11820739, -11895578, -9349345, -2078049, 6449240, 5158844, -10093213, -25452648, -23534115, -6274149, 7977099, 9372778, 6264909, 7756608, 9303692, 3031698, -6904608, -9469492]
11771i469492O362908N607775k054502n532103q56503N663462O767961J639003
11763H128509m676053n857756M08629Q994726J0508363J052851j1615005j4844918
11755g900654m952283Q054751J1477407M056468l976093m739888j975367l292993
11747c248652p210139n025207M608257J1239350O817267k374931m761875P4396
11739A18466K556973j206382m580238k601925K68403j001601l085045p27827L419425
11730f839751L147429m55262q60617K349475K462754k594369n809286k166930
11722a0766557K929014K231961j555797j97118O359249R058862L353240l747646
11714G665208l710563J850153M422412M39277n263378o797106l506037J373467
$$ y = [-9469492, -3106584, 2501191, 446689, -5085414, -5941917, -278455, 6489506, 8128509, 3452456, -2405300, -1996671, 6998055, 17506418, 18559269, 6944264, -7900654, -12852937, -4798186, 6679221, 10735689, 6759596, 2019708, 44341, -3248652, -10458791, -15483998, -10875741, 363609, 7180876, 4805945, 44070, 118466, 2675439, 1469057, -3111181, -5713106, -5444703, -6446304, -9531349, -10259176, -6839751, -3692322, -4147584, -5008201, -2658726, -195972, -2790341, -8599627, -10766557, -7837543, -5605582, -7161379, -7358497, -999248, 8059614, 11412854, 7665208, 3954645, 5804798, 10227210, 10666487, 5403109, -1393997, -4900034, -3526567]
11706c526567M619564M456899R12363l542265n312234l126385N67187K284726
11698b666712Q35494k074491l353692q17809M157278O350852J875004n573068
11690a267144p117341K24382Q070670O378940l306889r560912o018974J009523
11682a1587745K229976k118111l973207P28826P069030Q143914L150430k860659
11674G82454m874493k154396J946106L381513J430268n97424K30980K085001Q65022
11665C095031l244209n445671l614209j673187k921553m047474n03973M987157
11657a3368088N423321J31713l993971k633841P41447J752555J200861J040637
11649i705366j42580l148497m381404j167935L173199M771629N264650O305832
$$ y = [-3526567, 1092997, 5549896, 6462259, 2919994, -2392240, -5518625, -4951438, -2666712, -1831218, -3905709, -7259401, -8077210, -3919932, 2430920, 4305924, -1267144, -8384485, -8160103, -89433, 6289507, 2982618, -6578294, -12597268, -11587745, -9357769, -11475880, -15449087, -14720261, -7651231, 492683, 3643113, 782454, -4092039, -6246435, -4300329, -918816, 511452, -85972, 145008, 2230009, 3095031, -149178, -5594849, -9209058, -10882245, -13803798, -17851272, -18355245, -13368088, -7944767, -7813054, -11807025, -14440866, -13699419, -11946864, -10746003, -9705366, -9847946, -12996443, -17377847, -18545782, -15372583, -10600954, -5336304, 969528]
11641I69528L462253n323443r991568O332J5831195J6318619j800812j6286101
11633C186003r987601N240518P783029k070403o337110J244495Q367081N983816
11625A3409828o5730k552097l395875n219030m568668j54413K274974j68334j924458
11616b363803L20026Q14521m014266p117678k796406J839727j590777p438059
11608b2346715m981475L154664N513322J055552p68227K237196K159798l128785
11600a7104670n653617j838057K043891K640240M549277Q040915N674358k303367
11592c951030l521382O185329J1864067J550802j2766642j2052287Q73076P116589
11584d701478J108666m554883k298058J071101O96111J968392O651110O051009
$$ y = [969528, 4431781, -891662, -10883230, -10876898, 4954297, 21272916, 19472104, 3186003, -6801598, -1561080, 6221949, 4151546, -2185564, -941069, 7426012, 13409828, 13344098, 10792001, 7396126, 2177096, -2391572, -2545985, -271011, -439345, -2363803, -2043777, -1229256, -5243522, -12361200, -15157606, -13317879, -14908656, -22346715, -27328190, -24173526, -18660204, -17604652, -18372879, -16135683, -13975885, -17104670, -22758287, -24596344, -22552453, -19912213, -15362936, -7322021, -1647663, -3951030, -7472412, -1287083, 10576984, 12127786, -638856, -12691143, -11818067, -4701478, -3592812, -8147695, -10445753, -9374652, -8678541, -6710149, -59039, 5991970]
11576E991970l474643j0855265o273601L060760M026537k793256n935613r23278
11568a7176389N673431P963187O687623L760268o22679m305110l453120J493994
11560B1205M863821K419009l995492q852652p622374j20786P971584Q864392J646234
11551E194941m808732k699499L520914L472158l322823o571647j124879N346632
11543i92935M514383p66000k940534j803000k126473l159413M26626P706329J0137967
11534A0996950L368219n897877q320673l022332L179021M589087J192855l661373
11526B423877o693520o395125l731820j138741J35546P67613R45464m47244k717854
11517a6851804k333991J972031N546086L552337j146902j154100M464470Q183389
$$ y = [5991970, 2517327, -8337938, -14611539, -11550779, -7524242, -10317498, -16253111, -17176389, -11502958, -3539771, 3147852, 6908120, 6285441, 1980331, -1472789, 21205, 4885026, 7304035, 3308543, -5544109, -13166483, -13287269, -5315685, 3548707, 5194941, 386209, -2313290, 1207624, 4679782, 1356959, -5214688, -6339567, -992935, 3521448, 2755448, -185086, -1988086, -4114559, -7273972, -6847346, 858983, 10996950, 14365169, 8467292, 146619, -2875713, 303308, 4892395, 6085250, 2423877, -4269643, -10664768, -14396588, -15535329, -15399783, -14632170, -13686706, -14133950, -16851804, -19185795, -17213764, -11667678, -8115341, -9262243, -10416343, -5951873, 2231516]
11509B231516M847457j137832l120808j827280k051077k989964N98598P559022
11501D109632Q359263k023683j4348361j4522143j445027J0719268R796808o896
11493F38861n207648j078902M218142L415891J3126L5756Q04670l717356r927123
11484a0804583p524704L789159J1057271N981516k847031k708736N047457Q401743
11476A0392092K268881o350703r198803m711139L961967J1243037J0051826j441655
11468A6215503j3610316j4099230l968275L169932n0118n957662n337441j45876
11460b3783483L232149M714087O371830M776515k535318q028116k891294P569685
11452a0573945Q943680j487997j0253858o973902K175216N671414K619808k0231
$$ y = [2231516, 7078973, 5941141, 2820333, 993053, -1058024, -4047988, -3449390, 4109632, 12468895, 10445212, -3903149, -18425292, -19870319, -9151051, 645757, 638861, -4568787, -5647689, -1429547, 1986344, 1999470, 2035226, 2839896, -877460, -10804583, -18329287, -14540128, -3482857, 2498659, -348372, -3057108, 1990349, 10392092, 12660973, 6310270, -2888533, -7599672, -3637705, 7605332, 17657158, 16215503, 2605187, -11494043, -15462318, -12292386, -12342504, -18300166, -23637607, -23783483, -20551334, -15837247, -9465417, -4688902, -7224220, -15252336, -18143630, -10573945, -1630265, -3118262, -13372120, -20346022, -18170806, -12499392, -9879584, -9899815]
11444i899815J15950M2668k51783K100678N084998K810975m087200o920062j549431
11435a2553022M175534J419908o079258p122202M61774P049912N977441K593009
11427d076904M168145P672650N042018l043309p330215l873975L95192j129471
11419b175869m613688k208125N305357Q762083L163055n251397o505365J233512
11411b290437R686839R799735J415899p053192q181271l450224m40782k898021
11403c411454o292871m551657J271573M416917K056431n57090K212121P610520
11395B754490P806236J144466n243710n730156l621483m083629m548177O06285
11387a0915678Q459755R722682K854808l255559l177364k013000m080189m359051
$$ y = [-9899815, -9783865, -9741197, -9992980, -7892302, -2807304, 3671, -4083529, -11003591, -12553022, -8377488, -6957580, -13036838, -20159040, -19697266, -12647354, -6669913, -4076904, 91241, 7763891, 12805909, 9762600, 2432385, -1441590, -1046398, -2175869, -6789557, -8997682, -3692325, 5069758, 8232813, 2981416, -3523949, -2290437, 7396402, 17196137, 18612036, 11558844, 3377573, -72651, -513433, -3411454, -9704325, -14255982, -12984409, -8567492, -6511061, -7068151, -4856030, 2754490, 10560726, 11705192, 6461482, 731326, -2890157, -6973786, -11521963, -10915678, -2455923, 7266759, 10121567, 6866008, 3688644, 1675644, -2404545, -6763596]
11379f763596J281772O229495L524061j163506J161145O200568K975526o216535
11371G228930p925289M31217O416492L276105o71914J121316K003049m006016
11363G873890r797136p071608k09771K604334K898366N003981M158877n061093
11355C99840j4747421j2559615j035457O050340M595536L250714N972018O286600
11347a787445J613068o90720K854506L954070l857915j2988051j2101703k628194
11339b5632384L933654K106947k041752q62505N348231R872696P509001J9382
11331B53270n442843l662857K824842O709388M488196m79899l695828m792538
11323c798269n490212n427445k981637J049381L225412J226278l194890n463774
$$ y = [-6763596, -5481824, 747671, 4271732, 3108226, 4269371, 10469939, 13445465, 7228930, -696359, -265142, 6151350, 9427455, 8755541, 9876857, 11879906, 7873890, -1923246, -8994854, -9204625, -6600291, -3701925, 1302056, 5460933, 399840, -14347581, -26907196, -27942653, -21892313, -17296777, -14046063, -8074045, -1787445, -174377, -865097, 1989409, 5943479, 2085564, -10902487, -23004190, -25632384, -21698730, -19591783, -21633535, -22496040, -17147809, -7275113, 233888, 253270, -5189573, -8852430, -6027588, 681800, 5169996, 4690097, 994269, -3798269, -9288481, -14715926, -17697563, -16648182, -13422770, -12196492, -15391382, -20855156]
11315b0855156k606007L442281P522318O596558K551308o37069j110244P1433
11307e024578O60844r06765l646346m016096m62343K572098q0722m938107k833579
11298a8675594O398818J0741153L181375o317687n191934K220077J932545o482219
11290a2193466q430689K520279J3655398J1174328j106152q982548o878557j252727
11282a1494134J168652M83522l77560l97913L01733K247630N242920O474058K484569
11273F133477n658803j0763478o542651L429491Q255291L378745l139709j970672
11265f878309M675152P464516L350168k502441n647284n724182k476819L848347
11257c890852Q659875O967949J131667k139153j954291l038448n893670n481317
$$ y = [-20855156, -23461163, -20018882, -12496564, -5900006, -3348698, -3985767, -5096011, -5024578, -4363734, -5270499, -8916845, -12932941, -13395284, -10823186, -10903908, -15842015, -18675594, -12276776, -1535623, 1645752, -4671935, -9863869, -7643792, -5711247, -12193466, -20624155, -18103876, -4448478, 6725850, 5619698, -3362850, -10241407, -11494134, -10325482, -9841960, -10219520, -10617433, -10315700, -8068070, -2825150, 3648908, 6133477, 474674, -10288804, -16831455, -13401964, -5146673, -1767928, -4907637, -6878309, -2203157, 5261359, 8611527, 6109086, 461802, -5262380, -7739199, -3890852, 4769023, 11736972, 12868639, 10729486, 8775195, 5736747, -156923, -5638240]
11249e638240l85902M539880N583329L133864k323312q964578r555235Q23450
11241a2786744J3116807J2649914O18228o378118j666985J883642n383975j2950181
11233a0897412p643250M326837P498837J104531k237508K673511Q163939P405038
11225A0394523J774105m889810r487162q004204M3967O478451L004403n785720
11217f471447p364229P88776P903157N996125j61948k381409l31988J151690L21956
11208e49317q60175j125155r90597r40851p54659J22526K094697M288118M378336
11199E662923J164301l243264n333265l638626M98226L949659L162551k397154
11191a74649p251466m682941L615164P745598K531599n134182o067600o51082
$$ y = [-5638240, -6024142, -1484262, 4099067, 7232931, 4909619, -4054959, -13610194, -12786744, 330063, 12979977, 13598205, 7220087, 5553102, 7436744, 2052769, -10897412, -18540662, -14213825, -6714988, -5610457, -7847965, -5174454, 2989485, 10394523, 12168628, 7278818, -2208344, -10212548, -10168581, -3690130, -685727, -6471447, -13835676, -13046900, -5143743, 852382, 690434, -1690975, -2022963, -871273, -549317, -1409492, -2534647, -3525244, -4466095, -5220754, -5098228, -3003531, 1284587, 5662923, 6827224, 3583960, -1749305, -5387931, -4889705, -940046, 2222505, -174649, -7426115, -12109056, -8493892, -748294, 1783305, -3350877, -9418477, -10069559]
11183a0069559M168049M711612J731752l325362o999143l827203N257838R653266
11175A301250K378798q210981r342122k033618K324455J21781j882551m29394
11167a5772382M69750k20428J143114L344897J394959j535395L157703J2161888
11159D144106J0857540k908037j1320072k696896R241620N935210p484610j1042934
11151e274073o80748P810994M291453l010469l385599J415332L886217K405875
11143G458982l09027l445163o597767o675098j772593M555518O894098M046001
11135D154951q67790m278117m359678j660429R61749J155291L45490J283513K551706
11126g13314M03309l247116j326917O853762J1591111O037773k734068l979712
$$ y = [-10069559, -5901510, -1189898, 541854, -2783508, -9782651, -13609854, -8352016, 1301250, 3680048, -4530933, -13873055, -15906673, -13582218, -13460437, -15342988, -15772382, -15302632, -15523060, -14379946, -11035049, -9640090, -11175485, -8017782, 4144106, 15001646, 12093609, 773537, -1923359, 7318261, 13253471, 5768861, -5274073, -5954821, 1856173, 6147626, 3137157, -248442, 1166890, 5053107, 7458982, 7149955, 3704792, -2892975, -9568073, -11340666, -6785148, 108950, 4154951, 3287161, -990956, -5350634, -7011063, -6049314, -4894023, -4548533, -3265020, -713314, -310005, -3557121, -4884038, 1969724, 13560835, 19598608, 16864540, 12884828]
11118A2884828J94272r03345p836149r090594j73699P451443L138298o760343
11110a095289q612342j020230N531825N032539J651958L116o05128q54769J275094
11101A306774N075601N569127O76645n003379o291307l154321J468211N035295
11093D682646M881826n76901p637833r177671l686077K022701K180693l34357
11085g644973N27850M844153P275925M200977l041939r797449j0747229l981211
11077a8363896N329926Q743999M267499j445277k525094o03193O21293J775840
11069b198903M362138O033885M600751K525166K158647O20377m828409j0126106
11061C147546r459769l954579Q67623L416636N352555N398209J263764l858802
$$ y = [12884828, 13079100, 12175755, 4339606, -4750988, -4924687, 2526756, 5665054, -1095289, -9707631, -10727861, -5196036, -163497, 1488461, 1491577, 886449, 31680, 1306774, 6382375, 11951502, 12628147, 7624768, 1333461, -1820860, -352649, 4682646, 9564472, 8987571, 1349738, -7827933, -11514010, -9491309, -7310616, -7644973, -7117123, -2272970, 5002955, 9203932, 6161993, -3635456, -14382685, -18363896, -13033970, -4289971, -22472, -1467749, -3992843, -4596036, -3974743, -2198903, 2163235, 8197120, 12797871, 15323037, 17481684, 18102061, 13273652, 3147546, -6312223, -10266802, -9399179, -5982543, -629988, 4768221, 6031985, 2173183]
11053B173183m222272m32314J565374K91369L76298L440829M346811o31314p205793
11044b97829q397780l542237J415623J793568j24846J313364O119850O494446
11036D774159k626939j3381822j2640497j57052R727191P500188K07575j718052
11028h315249K48153q04455l555750j951985L186630O578705P979061R183786
11020A2548896O563435k258526r280291o389372k94322k761679r538214n966789
11012a7376862P359008J3143836M366967n468461m855973K6253L67423l08297
11004b746106L101403N009522j56244n591779k739145M162908N695897K022734
10996H759190r45195k907899n410689l719181N180726J2364636P854514k874865
$$ y = [2173183, -2049089, -2481403, -916029, -624660, -248362, 3192467, 7539278, 6907964, -297829, -8695609, -12237846, -10822223, -9028655, -9153501, -7840137, -1720287, 4774159, 2147220, -11234602, -23875099, -24032151, -14304960, -6804772, -6597197, -8315249, -8067096, -8871551, -12427301, -14379286, -11192656, -4613951, 3365110, 12548896, 19112331, 16853805, 7573514, 1184142, 889820, -1871859, -11410073, -17376862, -10017854, 3125982, 7492949, 2024488, -2831485, -2805232, -2437809, -2746106, 355297, 5364819, 5208575, -383204, -3122349, 1040559, 6736456, 8759190, 7813995, 4906096, -504593, -4223774, 956952, 13321588, 21176102, 18301237]
10988A8301237o745939l579219l815353p800860m272671Q144224J4389560M965207
10980A9586186q627695j0048094m87529N628241J704301m852640n760391j995509
10972d853130O46453j45958k256579l301027k947510j975136p99297O49814K124875
10963a2857495K845769K287978O47829j562866l371250k802812J265927N720611
10955g826309M764523k299678p624680l732923N725211R924157N478717K01119
10947D610137J09038M35525m508540r173726m389529N847693P403254k258984
10939a925132p687102K236557J5867643J3951892k975506j5535748j1983848o68884
10931h720128N268080L259042k439828q561160j1089196n379843N331832R902486
$$ y = [18301237, 11555298, 7976079, 4160726, -3640134, -7912805, 231419, 14620979, 19586186, 10958491, 910397, 422868, 6051109, 7755410, 2902770, -2857621, -4853130, -4206677, -4352635, -6609214, -9910241, -12857751, -14832887, -15632184, -14982370, -12857495, -10011726, -7723748, -7075919, -8638785, -12010035, -14812847, -13546920, -7826309, -3061786, -5361464, -12986144, -16719067, -10993856, -1069699, 4409018, 4610137, 4719175, 5154700, 646160, -8527566, -12917095, -7069402, 333852, -1925132, -9612234, -7375677, 8491966, 22443858, 19468352, 3932604, -8051244, -8720128, -3452048, -193006, -2632834, -11193994, -22283190, -27663033, -22331201, -12428715]
10923a2428715M266304j914750k32302M347592M619037L965541O784155O093170
10915A5500032m522432j4355697q407069P547131J3149980L599032n126703l027181
10907D357093P04106l185147q777884p525673k062532J857596N451752R566246
10899C85557Q001650j607907r342437o009917K718384N369747J398673j501210
10891e87460j331668k061087l447504j325673L169033L936895l45179m153736
10883f146379l345034K91512L154557L889786K928851J426148Q30244J327897
10875D357582J336016m9086j647421k352644k447961j798289M52954L350944M320606
10866E522701K844608J010983q368r73135k435810m772425q566192j0945900n331087
$$ y = [-12428715, -8162411, -10077161, -10309463, -5961871, -1342834, 2622707, 9406862, 15500032, 10977600, -3378097, -11785166, -4238035, 8911945, 12510977, 7384274, 4357093, 5061199, 1876052, -6901832, -14427505, -16490037, -14632441, -9180689, 385557, 8387207, 6779300, -2563137, -8573054, -5854670, -484923, 913750, -587460, -1919128, -3980215, -7427719, -8753392, -5584359, -1647464, -1992643, -6146379, -9491413, -9199901, -6045344, -2155558, 773293, 2199441, 3029685, 4357582, 5693598, 5644512, 3997091, 1644447, -803514, -2601803, -2148849, 1202095, 5522701, 8367309, 9378292, 9369924, 8396789, 5960979, 1188554, -7377638, -18323538, -23654625]
10857b3654625Q343533J7360280J0265393n505740j1969328n216342J902244J812123
10849f662462J133374M291129M622230j289281n155431j327773L460731L094129
10841B166646J852185K602333q09916r169768j0434199P50204J0164712N392261
10833B514458l386886j154863N821559K083784q286636p912770L831774R926212
10825C436632L897790k591277k094340j239310m099703l993750J780298M649691
10817b53969m29685n776337l827581J735929M427495M770151N085521L096970
10809H828494k446467o520713m374561J652866O218275P096408M056551k898968
10801A1611885j0457539j1990275m934150M553562P583537K134826m696685m032639
$$ y = [-23654625, -15311092, 2049188, 12314581, 6808841, -5160487, -10376829, -8474585, -6662462, -5529088, -1237959, 3384271, 2094990, -3060441, -4388214, -927483, 2166646, 4018831, 6621164, 5811248, -3358520, -13792719, -13042515, -2877803, 2514458, -872428, -2027291, 3794268, 5878052, -2408584, -10321354, -6489580, 3436632, 7334422, 4743145, 2648805, 1409495, -2690208, -6683958, -4903660, -253969, -683654, -6459991, -10287572, -8551643, -4124148, 646003, 5731524, 8828494, 6382027, -138686, -4513247, -2860381, 3357894, 10454302, 14510853, 11611885, 1154346, -10835929, -15770079, -11216517, -3632980, -1498154, -6194839, -10227478]
10793a0227478M392710J0104236M381652n763262m829730P452554J1810171k872726
10785A4448127j9706475j5772044M810225J7157569J0483092j736348n835498
10778C848648l848310j986714K70932L329109K854713j352399k472472J647180
10770B290687L644062j240280p391481q344158n486835k385643J204292M700756
10762a3008600M083913r05633m085799j969237J222117J619995J524081L036458
10754h482705L295174P15324r35536N85845J595175m30823j810945M56418K862635
10745b149438J487269j554656k658395k631232l238484k582629J110598M948497
10737g268470N180791K535603J75073p72605p73713r102N56032q38340l566956
$$ y = [-10227478, -5834768, 4269468, 8651120, 2887858, -1941872, 5510682, 17320853, 14448127, -5258348, -21030392, -16220167, 937402, 11420494, 9684146, 3848648, 338, -1986376, -1715444, 1613665, 4468378, 3115979, 643507, 2290687, 5934749, 4694469, -2697012, -11041170, -16528005, -18913648, -17709356, -13008600, -8924687, -9830320, -13916119, -15885356, -14663239, -13043244, -11519163, -8482705, -5187531, -4472207, -5407743, -4821898, -3226723, -3657546, -5468491, -5012073, -2149438, -662169, -2216825, -4875220, -7506452, -10744936, -13327565, -12216967, -7268470, -2087679, 447924, 622997, -149608, -923321, -932423, -376391, -1214731, -4781687]
10728d781687m259384j391785K335531L530196J851843l69003n39310J710167
10720a913432L259356R90792k344128p04890M401381L414107n491788r525359
10712g913961O3820J1508022Q662355l318074n792917L393376P329421j491668
10704A2440374r749275n973911K716377M986737K110294J012848J894377J785494
10696A1223315J246408J69214m348217j0079720r354010k193233J251784k435957
10688a4520416l117313M693499J0024492L398922n267505j392439J0159977J1839487
10680A5818704q1651j1383981j1521566n445117j687749j68876L356507Q156799
10672b956930R234633M267114l256324p171062m576547Q73180K820465p2541k586578
$$ y = [-4781687, -9041071, -10432856, -8097325, -4567129, -2715286, -3084289, -3623599, -1913432, 1345924, 2336716, -7412, -712302, 3689079, 7103186, 1611398, -7913961, -7850141, 3657881, 12320236, 9002162, 3209245, 6602621, 13932042, 12440374, 2691099, -3282812, -566435, 4420302, 6530596, 7543444, 9437821, 11223315, 12469723, 12638937, 8290720, -1789000, -11143010, -13336243, -12084459, -14520416, -17637729, -12944230, -2919738, 479184, -4788321, -6180760, 3979217, 15818704, 15737053, 4353072, -7168494, -12613611, -14301360, -14470236, -11113729, -2956930, 6277703, 10544817, 7288493, 117431, -4459116, -3585936, -765471, -838012, -3424590]
10663c424590k86212M352719N165977j22431p149429r028611l268775M714904
10655i046448O727897J651414l231679k874836r99405j748346j543868L408604
10647g656667P746343M678730j853707l249210j72731P64142j1375K240702M799892
10638G286119J997925k046603K21355M324136Q56313n552445l204397L363703
10630G246106j040442j3348257j3197808L016376J3774791O263318n015574m564349
10622f865839J207250R28305j759372k35297N35538l217032k645592O900912J2578956
10613G427829L613492r338407j0529117k633943J933547J821895K888002L651369
10605a165333J85266l003547q28964J987787L27962j178504J464216K504652j023303
$$ y = [-3424590, -3710802, 641917, 5807894, 5685463, -1463966, -10492577, -13761352, -9046448, -2318551, -667137, -3898816, -6773652, -7773057, -9521403, -11065271, -7656667, 89676, 4768406, 2914699, -334511, -507242, 256900, 245525, 2486227, 7286119, 9284044, 7237441, 7458796, 11782932, 12639245, 7086800, 3882403, 7246106, 6205664, -7142593, -20340401, -17324025, -3549234, 2714084, -2301490, -6865839, -5658589, -4730284, -6489656, -6724953, -6189415, -9406447, -12052039, -5151127, 7427829, 11041321, 1702914, -8826203, -11460146, -9526599, -7704704, -4816702, -1165333, -980067, -3983614, -4812578, -2824791, -2496829, -3675333, -2211117, 293535, -729768]
10596g29768r36799N620650O486594m089970j0521914m64578J1230636M769799
10588A1364650j1349987j3438530J05816R179821M623215k709174l719704j455399
10580g399292L34356K173222K478101k62541j163617L228368N795993N4439o286044
10571a047015k991332M536662M087270k725143m417804R88088N505666N329433
10563I265825K090144m118153j0372340p424174O006544J4288318M888657j1380913
10555C243908j5184423n132518N432713R084144O890179j95204p948089o872798
10547a0682088K936860O946929r75432o484807K08225O247319N05254n110151
10539f407891J72132K946056q008296j5050167j066791J5918153J0814046n355161
$$ y = [-729768, -1666567, 3954083, 10440677, 6350707, -4171207, -4635785, 6594851, 11364650, 14663, -13423867, -13318051, -4138230, 484985, -2224189, -5943893, -7399292, -7064936, -4891714, -2413613, -2676154, -3839771, -611403, 5184590, 5239029, -1047015, -4038347, 498315, 4585585, 1860442, -2557362, -1569274, 3936392, 9265825, 11355969, 7237816, -3134524, -10558698, -4552154, 9736164, 14624821, 3243908, -11940515, -17073033, -11640320, -2556176, 4334003, 4138799, -3809290, -10682088, -7745228, -798299, -1773731, -8258538, -8050313, -1802994, -1297740, -6407891, -6235759, -3289703, -11297999, -26348166, -27414957, -11496804, -682758, -6037919]
10531f037919o134830M316779L978468m204361k193966M511394r10293q986297
10523a5661025q02425J0813484J901923j3857660n939308J4699168J1346829j1895713
10515i394727j5758609M470377J2523107k975946j2829742l585497M561456L068800
10507a9920781O231279J1944637L104495j0029163k906790J0895752N23416j6561510
10499a6718665j341406K3448257L539029l8577962k9287529J8744076J7072370
10492b3121830l3009943l0388497K5987568n276225j55976423k22184418m5941462
10485d89911230K08881160K57495839Q9006134m9624564k6733573L6576260J7888936
10478D3578962k8440582j6830959J6035507M442018k2051416r163978J6872972
$$ y = [-6037919, -12172749, -7855970, -3877502, -8081863, -10275829, -5764435, -6674728, -15661025, -16463450, -5649966, -3748043, -17605703, -23545011, -8845843, 2500986, -9394727, -25153336, -20682959, -8159852, -11135798, -23965540, -27551037, -22989581, -19920781, -13689502, -1744865, 1359630, -8669533, -11576323, -680571, -157155, -16718665, -18060071, 5388186, 8927215, -29650747, -58938276, -40194200, -23121830, -56131773, -86520270, -60532702, -65808927, -221785350, -443969768, -489911230, -281030070, -23534231, 65471903, 15847339, -10886234, 25690026, 43578962, 15138380, -1692579, 14342928, 18784946, -3266470, -12430448, 4442524]
10471D442524P514967j4818695o067132J4614397P177901j1035898k565685J6038746
10463A5301125O874158j6869453j6489213K598642P450525p82706J280367P769905
10455G133350j471333j3695841l719746J4979740J0742737q827179j0290843N705484
10447E56369P973634p876602j3764776q6979J1188281P081404n81492l265660
10439A224179o298059q575766j866866P707754N176843n835721p522816J292705
10431a4697747N174310J301688J675539P128763O289567L39518J840884Q439637
10423A7492159N050739o259546o599098N966509J1031258O29344p750517k220002
10415A7340846M724430N51427o411644m461908J422346J413875j921761j801489
$$ y = [4442524, 11957491, -2861204, -8928336, 5686061, 12863962, 1828064, -737621, 15301125, 22175283, 5305830, -11183383, -8584741, -1134216, -1916922, -636555, 7133350, 5662017, -8033824, -11753570, 3226170, 13968907, 5141728, -5149115, 556369, 8530003, 653401, -13111375, -13198354, -2010073, 5071331, 4489839, 1224179, -5073880, -13649646, -15516512, -7808758, -2631915, -8467636, -15990452, -14697747, -9523437, -8221749, -6546210, 582553, 6872120, 7211638, 9052522, 17492159, 22542898, 16283352, 9684254, 15650763, 26682021, 27311365, 19560848, 17340846, 22065276, 22616703, 16205059, 11743151, 13165497, 14579372, 12657611, 10856122]
10407A0856122p66950l636950o645206m698662j364304j885715l317021m09745
10399a1868431M611819N917553K894024j144084m583918o632046n128011n5288
10391a5988382M258174M324042J998822J080596K110609K615762N39751l337216
10383b397842n024717q09932O744532R453519L825764l210976l980397r72730
10375C627221j204859l965256l084346J314178L051733P82070q96270j005627
10367a381156l231681o525319m398243L727194R186051O070975n24555k724234
10359A99032n77154N18371q28492o95546L121335O919626N375038j284170o495486
10350F252554n102889j77287J252295j713896l242838o81726J293252j236521
$$ y = [10856122, 10089172, 6452222, -192984, -4891646, -6255950, -8141665, -11458686, -11868431, -7256612, -1339059, 1554965, 410881, -4173037, -10805083, -15933094, -15988382, -11730208, -7406166, -5407344, -4326748, -2216139, 399623, 939374, -2397842, -7422559, -8232491, -1487959, 7965560, 11791324, 8580348, 4599951, 3627221, 2422362, -1542894, -4627240, -3313062, -261329, 520741, -375529, -1381156, -4612837, -11138156, -15536399, -11809205, -2623154, 3447821, 2923266, 199032, -378122, 140249, -688243, -1383789, 1737546, 8657172, 14032210, 12748040, 6252554, 1149665, 972378, 2224673, 510777, -2732061, -3413787, -2120535, -3357056]
10342c357056n311194o275860l566934J426613P096797Q783131K094714p589214
10334f699003q183409J760106Q971303N057242j131528M42622M313329J053325
10326E583987m865515l624582J382303k40943o349129n539769K671642O920213
10318d061793K522019l563740o144198o594547m408628K628513R519488Q234010
10310a868876J190803j744317Q53378K057092J162305L248874N085270j447703
10302H536826j0938756q115383O414989J3248664L609304p106487m755514K331745
10294C225388L87235o606196o010928K026020P367520O756739M458720J725107
10286A3329605k379522m345510j244079J756977j268402o141226m545208K468294
$$ y = [-3357056, -8668250, -14944110, -18511044, -17084431, -9987634, -1204503, 890211, -6699003, -14882412, -13122306, -4151003, 906239, -225289, 217333, 4530662, 5583987, 718472, -2906110, -1523807, -1764750, -8113879, -13653648, -10982006, -4061793, -1539774, -5103514, -11247712, -17842259, -22250887, -19622374, -10102886, -1868876, -678073, -2422390, -1569012, 488080, 1650385, 4899259, 9984529, 8536826, -2401930, -10517313, -4102324, 9146340, 12755644, 5649157, 893643, 3225388, 3612623, -2993573, -9004501, -6978481, 389039, 7145778, 11604498, 13329605, 10950083, 6604573, 5360494, 7117471, 5849069, -292157, -4837365, -2369071]
10278b369071N961268J978007m453594o540349j886841N897722Q664400J732371
10270H983913p454796o810832J646117K471294q189655j3072047l53130J4732925
10262h046211J1455067m290936r555627L44832P744661K625822m403690k709723
10254f835805L157701N508849N987249Q090142Q492093L604916l252900p151092
10246A7601153p582246n725588k359824n30653k901285n368570j695084N255274
10238c306823O938227L630254L015660L805003l414364j5465817j4873327K579813
10230a7091374J6119625Q853594o773831q629010K250657P346832J015244n008115
10222a916378l958692j734902k043159n76389L867347O381959N938427N983244
$$ y = [-2369071, 3592197, 5570204, 1116610, -5423739, -7310580, -1412858, 7251542, 8983913, 1529117, -5281715, -3635598, -1164304, -9353959, -22426006, -22779136, -8046211, 3408856, -882080, -10437707, -10092875, -2348214, 277608, -4126082, -6835805, -3678104, 1830745, 7817994, 15908136, 24400229, 28005145, 24752245, 17601153, 10018907, 4293319, 1933495, 1402842, -1498443, -6867013, -8562097, -3306823, 3631404, 7261658, 10277318, 14082321, 10667957, -4797860, -19671187, -17091374, -971749, 7881845, 1108014, -7520996, -5270339, 2076493, 3091737, -1916378, -5875070, -7609972, -9653131, -10229520, -6362173, 19786, 5958213, 11941457]
10214A1941457M555774l045702j1487448j0044695j363836M75820o348434p157122
10206b2474186L916339J2535081P777744m9993J625965O194825J634177o784015
10198D375937o322186l98623k138343r277143o413766Q014576J6689138Q984280
10190A3513870n019635j1327238q612961k226320N336563J0870134Q556088n68338
10182A0522163o264686l289067O09176k060785o040690k804511M786351P145778
10174B603729K342458l501680o537758p075975m161613K550991P162495L036497
10166c580856n938461q268558p10771O702319M889245j747953k506939M060139
10158g101835Q664117N073622r30600j3347O948615R635287K911052n929934q107667
$$ y = [11941457, 16497231, 13451529, 1964081, -8080614, -9444450, -8968630, -15317064, -22474186, -18557847, -6022766, 1754978, 1704985, 3330950, 9525775, 11159952, 4375937, -1946249, -2344872, -4483215, -13760358, -20174124, -12159548, 4529590, 13513870, 8494235, -2833003, -11445964, -13672284, -8335721, 2534413, 11090501, 10522163, 4257477, 968410, 1577586, -483199, -6523889, -9328400, -4542049, 2603729, 4946187, 1444507, -5093251, -12169226, -16330839, -13779848, -6617353, -3580856, -9519317, -17787875, -18498646, -11796327, -6907082, -8655035, -11161974, -7101835, 1562282, 6635904, 5705304, 5691957, 12640572, 22275859, 25186911, 19256977, 11149310]
10149A1149310n565179n617896p865480n768454M19732K939018p0610j213556
10141a1593115K591835L883999j981452p129654l213554M860365O799310K193164
10133c589102j986384l621085m450619j764485O504304J1817597M446047p903098
10125e46825o500798J0230397K0601656R406981r900560j4622345m381064J783326
10117F070768m808989j2154964r108735k375684l489986q768201m799908R218674
10109c0217025J7747897J0714716j849037m678980J224477L249942j088045j482210
10101f378265N110657P118834j977003j0240226n183465N521788O334665k69180
10093C7805J541123J2436218J4093459j402267j6692539j4099764r74148L932590
$$ y = [11149310, 5584131, -33765, -7899245, -13667699, -13247967, -10308949, -10379559, -11593115, -9001280, -5117281, -7098733, -14228387, -17441941, -12581576, -5782266, -3589102, -5575486, -9196571, -13647190, -15411675, -8907371, 2910226, 7356273, -546825, -7047623, 3182774, 23784430, 33191411, 23290851, 8668506, 4287442, 6070768, 1261779, -10893185, -20001920, -22377604, -25867590, -34635791, -39435699, -30217025, -12469128, -1754412, -3603449, -8282429, -7057952, -3808010, -4896055, -6378265, -1267608, 5851226, 3874223, -6366003, -11549468, -6027680, 306985, 37805, 1578928, 14015146, 28108605, 26706338, 10013799, -4085965, -5060113, -1127523]
10085a127523q15954j240522O033197Q004679j807702j0664651n349329P329560
10077C61755J0372437J282178n886931k742434J997558j475705p241839l370503
10069f703484P345790R703270p86963j0221942o726742K773600M789741n34252
10061c60982k889112j40739k15674n722799q997072m832826J864508M801422M477782
10052a2015492L628896J708746j369236k056964R50409K320674k731673r670907
10044a9235547q629499L034698J5783878J6974634M561367r310726j0778075n72777
10036h172047O947339L503548j731633K558048J0719366Q763789k069850o119376
10028A4399184J632438P570928J671396p344469p630939k184082m02061j873973
$$ y = [-1127523, -1943477, -3183999, 2849198, 10853877, 9046175, -1618476, -6967805, 361755, 10734192, 12016370, 6129439, 3387005, 5384563, 3908858, -3332981, -6703484, 642306, 10345576, 9558613, -663329, -7390071, -4616471, 173270, -360982, -3250094, -3390833, -3606507, -9329306, -18326378, -23159204, -21294696, -16493274, -12015492, -8386596, -6677850, -8047086, -10104050, -9153641, -6832967, -9564640, -19235547, -27865046, -24830348, -9046470, 7928164, 12489531, 3178805, -7599270, -8172047, -1224708, 2278840, 547207, 3105255, 13824621, 22588410, 20518560, 14399184, 16031622, 23602550, 25273946, 17929477, 10298538, 8114456, 7712395, 5838422]
10020E838422o30950J755041m68472n276418n183807J068762P675321R963006
10012A4740905O789988j129405q980123r258690j896687L418218J478092n30717
10004D631581K713049L535411l921967r248935k027018P514662L554238p352216
9996f01195n933538O683961J0611243J413861m059166R0909j208190j2424140
9988e426255j3892963M110881J9068222R639279r338424j0840694J270424K322275
9980c087255r561905j1433135L944004J5505403Q505680l561558l258244M365563
9972A418553M221515l654351o896913j287226N209030N864617K247505j325066
9964E797664k909298k317089k85366J361718J362623L67578p64035k367439m178794
$$ y = [5838422, 5207472, 6962513, 6494041, 1217623, -3966184, -2897422, 4777899, 14740905, 21530893, 20401488, 11421365, 2162675, 265988, 3684206, 5162298, 4631581, 7344630, 10880041, 6958074, -2290861, -4317879, 3196783, 6751021, -601195, -6534733, 149228, 10760471, 12174332, 8115166, 8206075, 6997885, -5426255, -19319218, -15208337, 3859885, 13499164, 4160740, -6679954, -5409530, -3087255, -12649160, -24082295, -20138291, -4632888, 3872792, 311234, -2947010, 1418553, 5640068, 1985717, -4911196, -6198422, -989392, 4875225, 7122730, 5797664, 2888366, 571277, 285911, 1647629, 3010252, 3377830, 2613795, 246356, -3932438]
9955c932438m091525o40108M381933P149499N218196l33741n335940n723756j645004
9946d952884K384068K724759P70959L88558K857012O124262P402332M978948m10933
9937B2267081m759457m262130p80343L3814k911095n016468m499204m712460n560027
9928a0200289j950933M639172M105314n132434q706549K505632J4931816J1240916
9920A1432645k585383p484982j838274l75922n506640l354111Q866347J4563337
9912A3717017M754872o626800n259751K337829K588996l282013m441248J434578
9904E223480O986061O582781P81991n918318p336390j492029M157753J599500
9896A0584829m061716j661546O179524O183519k079155m926503M82634J534507
$$ y = [-3932438, -8023963, -8664071, -4282138, 2867361, 8085557, 7751816, 2415876, -3307880, -4952884, -2568816, 155943, 926902, 1315460, 4172472, 10296734, 17699066, 22678014, 22267081, 17507624, 13245494, 12465151, 12498965, 9587870, 4571402, 72198, -4640262, -10200289, -12151222, -7512050, -3406736, -8539170, -17245719, -14740087, 191729, 11432645, 8847262, 1362280, -475994, -851916, -6358556, -9712667, -846320, 13717017, 18471889, 11845089, 6585338, 8923167, 11512163, 8230150, 3788902, 5223480, 12209541, 18792322, 19574313, 13655995, 6319605, 4827576, 8985329, 10584829, 6523113, 4861567, 11041091, 17224610, 15145455, 10218952, 10701586, 12236093]
9888A2236093m432323m069535M707532N498878n265850p871385M718116J0546926
9880A6068452j692936q604597O091750J8697432Q682025J549796K3151560L9970180
9872A03913662L478267o1784984p9543567l1240290J9073661K1025911q61498
9865b5938838m457840O358763Q204645M149116O091573M688131p718920j2207815
9857b0831185M706476J9613435P386015j4814688j4788866K563910Q064239j329787
9849i430451l705343M903734O651848k023373n107410J253406K616596n003894
9841i844887p720217K95817P423519O033202K447487J365862p37203l398914r60332
9832e095666M023127K687149l653223n029982n71825J887277K369283O613110
$$ y = [12236093, 7803770, 3734235, 8441767, 13940645, 8674795, 803410, 5521526, 16068452, 14375516, 5770919, 11862669, 30560101, 39242126, 40791922, 63943482, 103913662, 107391929, 45606945, -33936622, -65176912, -46103251, -25077340, -25938838, -30396678, -24037915, -15833270, -11684154, -5592581, -904450, -8623370, -20831185, -16124709, 3488726, 10874741, -3939947, -18728813, -16164903, -8100664, -9430451, -13135794, -8232060, -1580212, -3603585, -8710995, -7457589, -4840993, -9844887, -17565104, -17269287, -9845768, -3812566, -1365079, 783, -736420, -4135334, -5095666, -1072539, 1614610, -2038613, -7068595, -7640420, -5753143, -3383860, 3229250]
9824C229250R349082N66072j2157284j0598529K995552O227673o698534j3667365
9816b0754083l62304J5880387J2898846l902942j2920685p295271J807206M663564
9808i985282J649147k972243n495052l871364m30297K05433j198960Q73910O265429
9799a4959279P601385K007280m249646n777278m024397p54319M972953J0490069
9791d693232R772548K971277l228417o270317q859203r219337k698518N892730
9783a6332469N850322j092484j452792P156266J0665150K304440n515623k309624
9775g26814L733744J703414l718553k976936J451689K292042J296083K765875
9767E820544K659953k763105o132826k47008P536681N890970k051276m655694
$$ y = [3229250, 12578332, 13144404, 987120, -9611409, -6615857, -388184, -7086718, -20754083, -21116387, -5236000, 7662846, 3759904, -9160781, -16456052, -14648846, -9985282, -8336135, -11308378, -16803430, -20674794, -21105091, -20899658, -22098618, -21224708, -14959279, -7357894, -5350614, -9600260, -15377538, -19401935, -20156254, -15183301, -4693232, 5079316, 8050593, 4822176, -1448141, -10307344, -19526681, -22225199, -16332469, -10482147, -11574631, -13027423, -5871157, 4793993, 7098433, 1582810, -726814, 3006930, 4710344, 991791, -1985145, -533456, 1758586, 3054669, 5820544, 8480497, 5717392, -415434, -662442, 6874239, 12765209, 10713933, 6058239]
9759F058239q15843Q51593j917621l157256q58377Q17123L37553j65534j086049
9750F3828l672015m516793l45768M484586L793820l23020j815768j323131k999281
9741f653542m343810M6009O743597O520668j245245p158157n439480k46734K706829
9732i069865L087338K745719J724049n12128l502090o070042o226370k595764
9724b0419153K201289L243010N63354m43096J647742J725621j324966m73447O920431
9715f359215J1779872O873949j268550l785930l744681p167532q669365q61510
9707a3202962Q602738O127195n285532r449077j697810O207147O181888K676520
9699A60107l43671n111160r002347l541275R346800J4288970L747120r524728
$$ y = [6058239, 5242396, 6093989, 4176368, 1019112, 160735, 977858, 1315411, 1149877, 63828, -3608187, -8124980, -8470748, -3986162, -192342, -515362, -2331130, -3654261, -6653542, -10997352, -10951343, -4207746, 2312922, 1067677, -6090480, -11529960, -11776694, -9069865, -5982527, -3236808, -1512759, -2024887, -5526977, -11597019, -17823389, -20419153, -18217864, -14974854, -14411500, -14854596, -13206854, -11481233, -12806199, -13279646, -6359215, 5420657, 12294606, 11026056, 7240126, 3495445, -3672087, -12341452, -13202962, -4600224, 1526971, -3758561, -13207638, -14905448, -8698301, -2516413, 160107, -183564, -5294724, -14297071, -17838346, -8491546, 5797424, 9544544, 19816]
9691A9816j0086494J2471P768516P712987M120550M19270l983316q576950j0503630
9682a3096780p929439j479354N841876Q957726M976446j603990l030164J031455
9674f332224L062030l06742l143018l97078M017288M203748J250354k60478J19049
9665B212929k7540p52211n00224Q14763K855748N582038O428683J595725o700096
9656A1509815r870135m268245K542680K192030k814460m073125K58659M926034
9648D03253O332350M649684l65037p888185j1683086n592464N998924J1013805
9640B869244N004934l477244n739004l986546m433397n552661j133608P615102
9632h833180J1584290O482541r63104k816944o65094j575247o460223q605362
$$ y = [19816, -10066678, -10054207, -2285691, 5427296, 9547846, 9967116, 5983800, -2593150, -13096780, -21026219, -22505573, -16663697, -7705971, -2729525, -4333515, -7363679, -6332224, -3270194, -3576936, -6719954, -7117032, -3099744, 1104004, 2354358, 2093880, 2212929, 2185389, 1433178, 932954, 1747717, 4603465, 10185503, 16614186, 18209911, 11509815, 1639680, -2628565, -85885, 2106145, -708315, -4781440, -4522781, 403253, 6735603, 11385287, 11020250, 3132065, -8551021, -14143485, -8144561, 2869244, 7874178, 4396934, -1342070, -5328616, -9762013, -15314674, -16448282, -8833180, 2751110, 9233651, 8270547, 5453603, 4788509, 3213262, -3246961, -11852323]
9624a1852323l814856L300790N495075J998200j635565j252437J490871K663116
9616c607129J550680Q07582J793796K106366p57048m768388n263419j314249L093627
9607f358182M937164N311333N137389K520585k259155m011225m0356L969271J863882
9598A1070706k913168k858439R98737J197376l096965n238934l237330k225801
9590f303818l502392j909567L076113M431026m4947k778840Q75012M702536K457880
9581A003003k313523l556689j481073J692907N907974P672354P12502j1026365
9573a388910j2646847M57985J2295547Q253607l855901p720680k814728O40804
9565f779123J861543O895273J1920171P566571l002495p551268m697861m040827
$$ y = [-11852323, -15667179, -12366389, -6871314, -4873114, -6508679, -7761116, -6270245, -3607129, -2056449, -1248867, 544929, 2651295, 1894247, -2874141, -8137560, -9451809, -6358182, -1421018, 3890315, 9027704, 11548289, 9289134, 5277909, 5237553, 9206824, 11070706, 8157538, 5299099, 6297836, 7495212, 4398247, -840687, -4078017, -6303818, -9806210, -11715777, -8639664, -4208638, -4253585, -7032425, -6157413, -1454877, 1003003, -1310520, -4867209, -6348282, -4655375, 1252599, 8924953, 9637455, -1388910, -14035757, -13577772, -1282225, 6971382, 3115481, -4605199, -7419927, -6779123, -4917580, 1977693, 13897864, 21464435, 18461940, 10910672, 6212811, 2171984]
9557B171984p542784p289601j766029J877829K497811N854393R912501N986505
9549A1702609l501111n884079k47547l03705r696992j3266465k165507R800829
9541a3561968P477479k532897m539187J622134M186406L44290j937855K77305
9533h664293J012950k597992n137667j858753M362125P509590N688160J810450
9525B124570j089929l338896o389375p893330l289012N329157P813116m41795
9517g175494r042390n777518N220082R765928M931266P29326J614121J095183
9509A360504l448292n283593j633746J048348k24382l3558K837104J512787m282671
9500h147499l907516N753544J1325689K701385j0285598j2325089l694166M577292
$$ y = [2171984, -5370800, -12660401, -14426430, -12548601, -10050790, -4196397, 5716104, 11702609, 8201498, 2317419, 2069872, 1766167, -7930825, -21197290, -23362797, -13561968, -6084489, -8617386, -13156573, -11534439, -7348033, -7003743, -8941598, -8664293, -7651343, -10249335, -15387002, -17245755, -12883630, -5374040, 314120, 2124570, 1034641, -2304255, -8693630, -16586960, -19875972, -14546815, -6733699, -7175494, -16217884, -21995402, -16775320, -7009392, -2078126, -1348800, 265321, 1360504, -2087788, -7371381, -9005127, -7956779, -8181161, -8214719, -5377615, -3864828, -8147499, -12055015, -6301471, 5024218, 7725603, -2559995, -14885084, -18579250, -14001958]
9492a4001958P798993Q249036N990498N18534l646378k572859N75475J837242
9484D748583K857636M388758J812073n094389p313242q37388L830507k502285
9476A890253j1432026r314386J527125P739163N717245L614542N741871P660731
9468A3144518N458038j86439p374454j2325580r220120J092704P488451K667367
9460G44485n167567m679438J268062K337372j510438k239063J077841K840297
9452e328449K850129M278930L507139l929735j0656687n938445N331265P953347
9444a932506o4716n515627k149009J753183O48770L24478M213609N915892J935020
9435E129094j044415J180294J931389m066324r882236o767204J900569N767425
$$ y = [-14001958, -6202965, 2046071, 8036569, 8555103, 4908725, 2335866, 2911341, 4748583, 7606219, 11994977, 13807050, 8712661, 1399419, 562031, 4392538, 1890253, -9541773, -18856159, -17329034, -9589871, -3872626, -258084, 5483787, 13144518, 18602556, 18416117, 11041663, -1283917, -10504037, -9411333, -1922882, 744485, -4423082, -9102520, -7834458, -5497086, -7007524, -9246587, -8168746, -5328449, -2478320, 1800610, 5307749, 1378014, -9278673, -15217118, -9885853, -1932506, -1997222, -7512849, -9661858, -7908675, -7259905, -6935427, -2721818, 3194074, 5129094, 4084679, 5264973, 7196362, 3130038, -6752198, -13519402, -11618833, -5851408]
9427e851408K180941j605086R73047P609123R334098M56205j2654055j6028059
9419a5585194n457045N736986M005028m822667m954323M303874Q406930K402731
9411e963680j335573M978637J1242613P064226j005825j642126K025585j206388
9403A4157469j0878140j4872498p717522K238731N485138L024470K065660M957369
9395a539323O809298L272512k888244n506733l750097k425803k967729p84719
9387i780838M840488N909648k136505j0456479q688015p63894K802089K914371
9379a5359135P519038J2986276P767640n086494q164485K966274J1114771M276741
9371A8020626o094938n063227K526269L121222k655004m143745l56696J80958
$$ y = [-5851408, -3670467, -5275553, -4302506, 3306617, 12640715, 13096920, 442865, -15585194, -21042239, -15305253, -11300225, -16122892, -21077215, -16773341, -8366411, -5963680, -7299253, -2320616, 8921997, 15986223, 14980398, 13338272, 15363857, 14157469, 3279329, -11593169, -19310691, -17071960, -11586822, -8562352, -6496692, -1539323, 5269975, 8542487, 5654243, 147510, -3602587, -6028390, -8996119, -9780838, -4940350, 969298, -1167207, -11623686, -20311701, -21075595, -18273506, -15359135, -7840097, 5146179, 12913819, 7827325, -337160, 2629114, 13743885, 18020626, 11925688, 6862461, 9388730, 12509952, 9854948, 5711203, 5354507, 5535465]
9363E535465m310356o802451m556409k471307l135109l259926q51789J919646
9355a7932236L758129N609455O486201L757214j460563l856862l43788N578846
9347A596396O838348M6232r349405j0685051o10135R859062P658839l848121q498483
9338f992318q48196O007428J426556o443608m978512K740547M858472P88548J02612
9329c338471M682689N961920K40044n283394m213521O44806L473963K771753n1459
9320D888330l464799n035078k698873J632936L797326L271417L174981M197037
9312I763277L079384k005566q348557j1795776j0244498m319442K716635O614273
9304a4540270O460348N782771O491232M783620k053559p755499l454118Q295859
$$ y = [5535465, 1225109, -5577342, -10133751, -12605058, -15740167, -19000093, -19851882, -17932236, -14174107, -8564652, -2078451, 1678763, 218200, -3638662, -3982450, 1596396, 8434744, 8480976, -868429, -11553480, -12163615, -2304553, 5354286, 1506165, -6992318, -7840514, -1833086, -406530, -6850138, -11828650, -9088103, -4229631, -3441083, -3338471, 1344218, 7306138, 7546182, 2262788, -1950733, -1305927, 2168036, 4939789, 4888330, 1423531, -3611547, -6310420, -4677484, -880158, 2391259, 5566240, 9763277, 12842661, 10837095, 2488538, -9307238, -19551736, -23871178, -21154543, -14540270, -8079922, -2297151, 4194081, 8977701, 6924142, -831357, -4285475, 4010384]
9296D010384J3707550M873988r300229j3883120o021656L114396L547112j824041
9288a775616l255862J700819N366296J467965n861797q039565l232308L016598
9280a0613470N756181M179510n12777n152104m692413J422716N523027J851224
9272b238106k834080J011885Q287870N366093o542305j0530075n35386Q095123
9264H1019K677861p880674r411002l733687n6412K743973R499028J3795490O660614
9255A4376210n719591r181098k704614K402954J243755r45651j200853j392461
9247c121349o11425K487126K894218k771009o302209K8913P314771K893778o191224
9238c378410l250797P909658P005770p469802j2775636J348608J4888666Q489557
$$ y = [4010384, 17717934, 22591922, 13291693, -591427, -6613083, -3498687, 48425, -1775616, -5031478, -3330659, 2035637, 3503602, -2358195, -10397760, -13630068, -10613470, -4857289, -677779, -1190556, -6342660, -11035073, -9612357, -4089330, -2238106, -5072186, -4060301, 4227569, 9593662, 3051357, -7478718, -8014104, 81019, 2758880, -5121794, -14532796, -18266483, -18322895, -15578922, -6079894, 7715596, 14376210, 8656619, -524479, -3229093, -826139, 417616, -528035, -1728888, -3121349, -3732774, -1245648, 1648570, -1122439, -7424648, -7395735, -80964, 2812814, -3378410, -6629207, 1280451, 8286221, 816419, -11959217, -10610609, 4278057, 12767614]
9230A2767614q423000j4969586p744347K471305R367359J1845902P259207k315864
9222A0258590o330516j98128N801447K634885l300865l421007k365284o606670
9214c527548r273105k224807O565549M831380k766506k865595L702861N480443
9206g7328J755499J482729M210309J426571m612302l071012M134603L124233p321409
9197A051893j1837104m126031K975287O27244j614055M800782J0579619M905148
9189G362783m929937n405965J604852M279616O75483j825044j894745m304765
9181d437722p298629m291308K216349K052602n430688q121871O58826J1392250
9173a3260191J1928113L703950k727447k843585j298799k626870n554153o335178
$$ y = [12767614, 4344614, -10624972, -18369319, -15898014, -6530655, 5315247, 12574454, 10258590, 3928074, 3729946, 9531393, 12166278, 8865413, 5444406, 3079122, -3527548, -12800653, -15025460, -8459911, -3628531, -6395037, -9260632, -5557771, -77328, 1678171, 3160900, 7371209, 8797780, 4185478, 1114466, 5249069, 8373302, 1051893, -10785211, -14911242, -11935955, -11308711, -12922766, -8121984, 2457635, 7362783, 2432846, -2973119, -1368267, 2911349, 3586832, 1761788, -132957, -4437722, -11736351, -16027659, -13811310, -11758708, -17189396, -25311267, -24652441, -13260191, -1332078, 2371872, -355575, -3199160, -4497959, -7124829, -12678982, -19014160]
9165a9014160l148715L000761Q568722R043857L440467l080664m375242q83682
9157f448656J729736J428493K037698N027288N344593L0646m676235k266465J988380
9148D195478k115887j1902157j2678993L08904J2261141Q598171m656768j0258136
9140a6248247l525201M452757M662994J66002k035426J39027M825806Q975025
9132A412737Q748072L088229k658309k485400J451988K407227L39488J140830
9124A3444862M655145L404109m518518j0866209r314581l623291L29722K465636
9116d023125L997602L147298M50141N12088L240451J586694o021002r913360l456653
9107a0479866N527166O679466K425490J067927K035671q4586l116928j984694
$$ y = [-19014160, -22162875, -19162114, -10593392, -1549535, 1890932, -1189732, -5564974, -6448656, -4718920, -3290427, -1252729, 3774559, 9119152, 9149798, 4473563, 2207098, 4195478, 2079591, -9822566, -22501559, -22192655, -9931514, -1333343, -5990111, -16248247, -19773448, -15320691, -10657697, -10491695, -12527121, -12388094, -7562288, 1412737, 10160809, 13249038, 10590729, 8105329, 9557317, 11964544, 12304032, 13444862, 18100007, 21504116, 16985598, 6119389, -3195192, -6818483, -6488761, -4023125, -25523, 3121775, 3571916, 4084004, 7324455, 8911149, 2890147, -7023213, -10479866, -4952700, 1726766, 4152256, 5220183, 7255854, 7171268, 4054340, 2069646]
9099B069646o25175n075058r108816k920601O767377L985173q805054j0943869
9091b4656377L523655J4157177N715116p852622o474673M794587P191388n0510
9083c652259j843805L803235K401048r509926j5067919l282744J2724206J4938651
9075E10487N118006k452943l439814m380506o509757l865305K799523M000570
9067h219739l071148q404364m250736K736432K287990l279119l456906L191618
9059b2465972O865001K282594l152242r86352N869303Q248571L648679k091147
9051a781565l577668r16803K690711L975580J472082j941914o85523N104154O480356
9042A0819410k194706j1554978p884013N430008R791302j790307j2980096p637411
$$ y = [2069646, 1444471, -3630587, -12739403, -15660004, -8892627, -4907454, -13712508, -24656377, -21132722, -6975545, -1260429, -9113051, -15587724, -10793137, -3601749, -3652259, -5496064, -1692829, 708219, -8801707, -23869626, -27152370, -14428164, 510487, 5628493, 3175550, -264264, -4644770, -11154527, -15019832, -12220309, -8219739, -11290887, -19695251, -23945987, -21209555, -18921565, -22200684, -25657590, -22465972, -15600971, -13318377, -16470619, -17456971, -11587668, -3339097, 309582, -1781565, -5359233, -6276036, -3585325, 390255, 1862337, -79577, -765100, 4339054, 10819410, 8624704, -2930274, -10814287, -5384279, 4407023, 2616716, -10363380, -18000791]
9034a8000791O403713J0030138J748375k140754N684801J2885000P270642n962272
9026A7918852j3507754j0835813k794718N037417Q573798N214202j372209k184259
9018F049516M533649P863718n09012j1951659j2380066l119457K416392J63197
9010f933722q68443L298637M932306J52211l132607J04130K301742k443345o021229
9001h610320J93098R131587Q835020K161607Q58301M845632L479491m327703p619558
8992H947155k571701J074560l114255q211728o292998K03037N016993O400238
8984A451301M259715j525645n929466k286179N016086L223041q313070j3755693
8976a7859910m298021P911481R335235M578041L594487K911756m004082r029008
$$ y = [-18000791, -11597078, -1566940, 181435, -1959319, 3725482, 16610482, 23881124, 17918852, 4411098, -6424715, -9219433, -4182016, 4391782, 9605984, 8233775, 6049516, 10583165, 18446883, 17937871, 5986212, -6393854, -9513311, -7096919, -6933722, -7802165, -4503528, 428778, 580989, -2551618, -2447488, -145746, -2589091, -8610320, -8417222, 714365, 9549385, 11710992, 12569293, 17414925, 20894416, 16566713, 8947155, 6375454, 7450014, 4335759, -3875969, -10168967, -9965930, -4948937, 1451301, 5711016, 4185371, -1744095, -4030274, 985812, 4208853, -4104217, -17859910, -22157931, -14246450, -4911215, -333174, 3261313, 6173069, 2168987, -6860021]
8968f860021j399930J0401974R346261k218184o286527J107297N334092m84205
8960H940757n703134l282182j035940m582970o514905j406926L483620J857149
8952h244531o71165J396005K899001p57549l444054L61453M643167K772039n17292
8943a562926R39894K208001l168284r062502n475647M312838Q331321L997335
8935E20030o14024j324850j958585m155842l448476K530781Q988399R372365K391110
8926A2300908o640158j0020996n290448R56018J143366k083972m73710M533581
8918e575411L166861l839144l111201Q072269J3099756K235020q822470l205937
8910B019743Q519797N383393q507739j0400455L350601J1755279L462972p482188
$$ y = [-6860021, -8259951, 2142023, 11488284, 9270100, 2983573, 4090870, 9424962, 8940757, 3237623, -44559, -1080499, -5663469, -12178374, -13585300, -10101680, -8244531, -8915696, -7519691, -4620690, -5378239, -8822293, -8460840, -3817673, -1045634, -1562926, -623032, 1584969, -1583315, -10645817, -16121464, -11808626, -3477305, 520030, -93994, -1418844, -3377429, -7533271, -10981747, -8450966, 537433, 9909798, 12300908, 5660750, -4360246, -9650694, -8694676, -7551310, -9635282, -10108992, -5575411, -2408550, -6247694, -9358895, -1286626, 11813130, 14048150, 5225680, 2019743, 10539540, 15922933, 7415194, -2985261, 365340, 12120619, 15583591, 8101403]
8902H101403p087949j574109j465997k708481K988791J0935916J0316014J371369
8894B0876957n816240n889199k611683j068560k357932m867518o170505m368405
8886a2273085j12048L549183M145862J511942k448232l838948O08194P623591
8878a233541Q088761r88688r515928o769987K989517O522613O49457m950891l155902
8869h364589K564217O191802O188412L426104k04445r42269K139249L276261j529331
8860A2745411n857608k596053K166853j871707r884603p714127L979522R272620
8852B40308K760481k750137M71496K595870m136071j0160010m990467M584131
8844a1384399N918219J32349k416349J083373N105769O135633M035495j909351
$$ y = [8101403, 1013454, -560655, -2026652, -4735133, -1746342, 9189574, 19505588, 20876957, 15060717, 9171518, 6559835, 5491275, 3133343, -1734175, -7904680, -12273085, -12385133, -8835950, -4690088, -3178146, -5626378, -9465326, -8857132, -1233541, 6855220, 5866532, -3649396, -10419383, -7429866, -907253, -257796, -5208687, -8364589, -5800372, 391430, 6579842, 10005946, 9801501, 8859232, 10998481, 14274742, 12745411, 6887803, 4291750, 6458603, 4586896, -5297707, -13011834, -9032312, 240308, 3000789, 250652, 722148, 3318018, -818053, -10978063, -15968530, -11384399, -5466180, -5333831, -7750180, -6666807, -1561038, 4574595, 8610090, 6700739]
8836F700739r737593j2215996n086795O007307J2460823J1954023O704089r61492
8828A5825105o809103n834116j69462J510703k941080m995767P22274P583717
8820D892271P829285L327493p93673m403336p802566p547785l159255K01958O52567
8811f803041J842164K734271k494991j0015951p098014N942325J1563901K295430
8803b033906n994461q70367N644915p6771p686709j956900Q040485M380710o545299
8794g098303m200538R519365J2700691N80814p866394l075537J891679k340932
8786A10845n964655n27372N377839K640366k425177p94177L260532Q30816n886561
8777c377544p248128m11465P648665Q488529K52639r656356j0359359m64407P938389
$$ y = [6700739, -3036854, -15252850, -20339645, -14332338, -1871515, 10082508, 16786597, 15825105, 9016002, 3181886, 3012424, 4523127, 1582047, -3413720, -2691446, 4892271, 12721556, 16049049, 15255376, 10852040, 3049474, -4498311, -7657566, -7455608, -6803041, -4960877, -2226606, -4721597, -14737548, -21835562, -15893237, -4329336, -2033906, -8028367, -8898734, -3253819, -3330590, -11017299, -12974199, -4933714, -553004, -7098303, -11298841, -1779476, 10921215, 11502029, 3635635, 560098, 2451777, 110845, -5853810, -6381182, -1003343, 1637023, -788154, -1582331, 1678201, 2509017, -3377544, -10625672, -11037137, -3388472, 5100057, 5352696, -4303660, -14663019, -15127426, -7189037]
8768g189037N182571j400691M72208P169514N543197l232186m612652L892809
8760E825733P441225j292194j0036882p601337q44402r70348n653411n731693
8752a8863309l64160M490168O054940N444762L852917L221703N108632O078246
8744A5023899J468525m732033l540231L496226M331062m152001r597880l442005
8736a144438N559630N579571r86721m114967j880570M9297r93510k782694l151957
8727c866359j529865R04113N24576l735546m852386L674914J3917871J1120961
8719A6158279k956802r718334j612386O410469J763291o353369m829661J316456
8711A77943O10105l338663J67233P670361O493145l616349j0437169q607378m227345
$$ y = [-7189037, -2006466, -3407157, -2934949, 4234565, 9777762, 6545576, 1932924, 5825733, 13266958, 11974764, 1937882, -5663455, -6507857, -7478205, -13131616, -18863309, -19227469, -14737301, -8682361, -3237599, 615318, 3837021, 8945653, 15023899, 16492424, 11760391, 8220160, 11716386, 16047448, 11895447, 2297567, -1144438, 4415192, 9994763, 9008042, 4893075, 3012505, 3061802, 2068292, -714402, -3866359, -5396224, -4492111, -3967535, -7703081, -12555467, -8880553, 5037318, 16158279, 13201477, 3483143, 1870757, 8281226, 10044517, 3691148, -1138513, 177943, 788048, -2550615, -2383382, 5286979, 11780124, 8163775, -2273394, -10880772, -15108117]
8702a5108117j521538J354257L530805J111457l614026l508268J972137N895156
8694i888137M500867K04682n100691j0611012j1345499k271053J1569033J8051914
8686d889896J2667801K832400l318681n072521m887505l122073L84129M034939
8678a371407N586678L267531l052738r184563q347131K49281Q247560Q511749
8670C906960M270165J978456M15256m707398r711505o919641K268246Q272020
8662b27441O764437K180193j551582m436344m796238j81628N034265K759150n956224
8653d11412j0439102n627355J250223K850333J535153J965933K459114O52921
8645e764192O27336N848798J0093608N098878n090519p554031R43015Q433984
$$ y = [-15108117, -16629655, -15275398, -11744593, -10633136, -14247162, -17755430, -15783293, -9888137, -5387270, -5182588, -10283279, -20894291, -32239790, -34510843, -22941810, -4889896, 7777905, 10610305, 7291624, 2219103, -2668402, -5790475, -5406346, -1371407, 4215271, 7482802, 4430064, -4754499, -13101630, -12852349, -4604789, 3906960, 8177125, 10155581, 10570837, 5863439, -3848066, -10767707, -8499461, -227441, 6536996, 8717189, 7165607, 2729263, -2066975, -2248603, 2785662, 5544812, -411412, -10850514, -16477869, -15227646, -12377313, -10842160, -8876227, -6417113, -5764192, -5136856, 711942, 10805550, 15904428, 10813909, 3259878, 4202893, 12636877]
8637A2636877M789171l936335n349697P80071L781852r6455k670941P23771K354256
8628A3012570l912813r552060l753486P767614J0139946K160687l395246j768338
8620A0698874j934811p273486p814081P30785O359695L23452o774747k212059
8612g896378P172472O558549k233211n159267J60299K648523j918379n489646
8604f157038l437282p25990k19379J673994M744873L005387l211814m865765J450671
8595g742343P451533O548440L152243K524390R96081n557091j1022326o528646
8587a0177719N168865J1717495O893276k527296o557758l613287J91132N42739
8579A637447k83410J113979K854090J143596j957765q81416L118859K525797k758895
$$ y = [12636877, 17426048, 13489713, 8140016, 8920087, 12701939, 12605484, 9934543, 10658314, 13012570, 9099757, -452303, -4205789, 3561825, 13701771, 15862458, 12467212, 10698874, 8764063, 1490577, -6323504, -5592719, 766976, 1090428, -5684319, -7896378, -723906, 5834643, 3601432, -1557835, -1397536, 1250987, -667392, -6157038, -9594320, -10320310, -10539689, -8865695, -4120822, -1115435, -4327249, -9193014, -7742343, -290810, 6257630, 9409873, 11934263, 12930344, 7373253, -3649073, -10177719, -5008854, 6708641, 13601917, 11074621, 4516863, 903576, 1094708, 1637447, 1354037, 2468016, 5322106, 6465702, 4507937, 3626521, 6745380, 9271177, 6512282]
8570F512282k380812P371048J3707516N072663r838222j4222419p918510m101829
8562e798283n110923l90711J0440288J2234705r12411j2732227p934864M987609
8554e216817P763620l31656m696861k34488K370383l431541q168586j409138J0595003
8545b760081J2375004J074415r330344p381521J232075M367604J668053J934902
8537C180107N782748M105188m691601r593684m717742P36901j223544l542717
8529i964344J804849P313901K641774n238320k262217Q239367J0235521J274394
8521A4044925n331865m208067m062946p901778o817957J206053M838926p60059
8513h992768m510411J292411P665012N038435j029286j107505K935956M753831
$$ y = [6512282, 4131470, 11502518, 25210034, 30282697, 20444475, 6222056, -1696454, -5798283, -10909206, -11299917, -859629, 11375076, 10462665, -2269562, -10204426, -5216817, 2546803, 2215147, -2481714, -2716202, -345819, -3777360, -11945946, -13355084, -2760081, 9614923, 10689338, 1358994, -6022527, -4790452, -422848, 1245205, 3180107, 8962855, 13068043, 8376442, -1217242, -5934984, -5198083, -6421627, -9964344, -8159495, -845594, 1796180, -3442140, -5704357, 2535010, 12770531, 14044925, 8713060, 4504993, 442047, -7459731, -14277688, -13071635, -8232709, -8992768, -13503179, -12210768, -4545756, 492679, -536607, -1644112, 1291844, 6045675]
8505F045675N101718O388206N227971p940l488295k496195l633739r637426j1218328
8496g718353k401706P209452P250671K968638L926885O605089K717217m007612
8488A6550281m808639k370247m655924q487931n348362J536463K395989p71551
8480e959921J962321Q893960Q386616m86217o081082m037328k597903n729139
8472e648693o760819k736838k99618k237029j805130L690587O298658J230052
8464h268830l937132j436887M544233N418778N52701m509536o070050l276582
8456a6983305L151368Q952017Q707128L378596m73963r30123k587874o156757
8448b942913n515528R09269N197650J888511l466268l723283m94908J261804J990643
$$ y = [6045675, 11147393, 17535599, 22763570, 22755630, 19267335, 16771140, 13137401, 3499975, -7718353, -10120059, -2910607, 4340064, 7308702, 11235587, 17840676, 20557893, 16550281, 11741642, 9371395, 4715471, -3772460, -9120822, -7584359, -5188370, -5959921, -3997600, 4896360, 13282976, 12796759, 6715677, 2678349, 80446, -5648693, -12409512, -15146350, -15445968, -17682997, -19488127, -15797540, -9498882, -8268830, -12205962, -13642849, -9098616, -3679838, -3127137, -7636673, -13706723, -16983305, -13831937, -4879920, 3827208, 7205804, 6731841, 5801718, 3213844, -2942913, -8458441, -7549172, -2351522, -463011, -3929279, -7652562, -8147470, -6885666, -4895023]
8439d895023M208691O442119O630453N976567M211040k307156j2103300j5651163
8431g487772p956978K834201O825926N316409M241922K403395l214430o841474
8423c878801j114879Q931277J1407614M924180j439319l849502o814503j0729515
8415b563448r431653k439749K416287K040081K470371O047457N546444k663450
8407A422340r881604p462420K74390L923657L012532L322768N498672N395194
8399E505529K386621p24619l294912n216477l190404L578620P467289J386141
8391G897788q667715r946884j006528O744760N972339J406286j071046k634670
8383a305670m673736l655167J144529L139753j367683n546405k173677M570196
$$ y = [-4895023, -686332, 5755787, 12386240, 18362807, 22573847, 20266691, 8163391, -7487772, -15444750, -12610549, -5784623, -468214, 3773708, 6177103, 2962673, -3878801, -4993680, 3937597, 15345211, 20269391, 18830072, 14980570, 8166067, -2563448, -11995101, -14434850, -12018563, -9978482, -7508111, -1460654, 4085790, 1422340, -8459264, -15921684, -15647294, -11723637, -8711105, -5388337, 110335, 5505529, 7892150, 7167531, 3872619, -1343858, -4534262, -955642, 6511647, 7897788, -769927, -10716811, -11723339, -4978579, 993760, 2400046, 1329000, -1305670, -5979406, -9634573, -8490044, -5350291, -6717974, -12264379, -14438056, -9867860]
8375i867860N762655J554342m62624K341311N465136N800699M434186K059191
8367A7087036j121209k095610J004277K949629k454843j1069534j2370150n223184
8359a3293588K2093k414357n353528j063424O360574P661751J731407m388028
8351a0737100n294206j593253L033292N007211L224631Q68324K052322N171952
8343A733173M252856j104027l410854J223264N803969K561457n042206p594816
8335a577184l325496J039330R29563j517295k701450j511118J524527M397331
8327b741792L916714o1918k518279L46091N013971N726207K783138J49087k098332
8318A0514887n840076p935321l599169M084852O598767K308569j976029k600029
$$ y = [-9867860, -4105205, -2550863, -3013487, -672176, 4792960, 10593659, 15027845, 17087036, 15965827, 13870217, 14874494, 17824123, 15369280, 4299746, -8070404, -13293588, -13271495, -15685852, -21039380, -22102804, -15742230, -8080479, -6349072, -10737100, -16031306, -17624559, -14591267, -9584056, -6359425, -5491101, -3438779, 1733173, 5986029, 4882002, 1471148, 2694412, 8498381, 11059838, 6017632, -1577184, -4902680, -3863350, -2933787, -4451082, -7152532, -8663650, -7139123, -2741792, 1174922, 1113004, -1405275, -1059184, 3954787, 9680994, 12464132, 12613219, 10514887, 4674811, -3260510, -6859679, -2774827, 3823940, 6132509, 4156480, 1556451]
8310A556451l218846n154131l120970M704391J0685243Q188278J554844j272924
8302A3922336o42384j891412m288358k388525L022605M464242n22255n111424
8294F564825l710833p6195k29755k504501j132492L081348L216999k461816o892490
8285d144910m578300O51739K640742K210954L284278M213734J228925k308355
8277C198807N998N151860L629813l766700m985767K851322N857454m669427j5573758
8268h300398j0693357L587950Q306932J117233l031153J992430O162041L835437
8260B977115K453402N031081K007542r924760j6551104o333800J0077971J4308050
8252D045497N608278j983909j625556J040977J173550L64185k19598j853809l573520
$$ y = [1556451, -1662395, -6816526, -9937496, -5233105, 5452138, 13640416, 15195260, 13922336, 13279952, 11388540, 7100182, 4711657, 7734262, 12198504, 11676249, 6564825, 2853992, 2777797, 2548042, 43541, -1088951, 1992397, 5209396, 2747580, -4144910, -8723210, -8071471, -5430729, -3219775, 64503, 4278237, 5507162, 3198807, 3204805, 8356665, 11986478, 8219778, 3234011, 6085333, 11942787, 7273360, -8300398, -18993755, -15405805, -7098873, -5981640, -9012793, -7020363, -858322, 2977115, 5430517, 10461598, 12469140, 2544380, -14006724, -20340524, -10262553, 4045497, 9653775, 7669866, 6044310, 7085287, 8258837, 8623022, 8403424, 6549615, 2976095]
8243B976095l661948m467932p958610q958225j728137Q837389J2218055P161477
8235D418164J838829J60654j449751l644248k005510K671246K983943k676263
8227B297064o419623l656995K13515P38097J938205O399032P588923Q10082o410795
8218C497505n167085L4829j125227o846156n859726L259118Q797818M374392j461092
8209d95624K63597M908136L080191l436047m843026N16254L615917n82136n156093
8200b128831k470072L454951L059541l572566o157139K84706P118542L936410
8192C525542o336876j0832717l686210O948456J0087833M863932r51718k178355
8184A439887j591367m024674q362203q135833l17814R001910J0780513M249519
$$ y = [2976095, -685853, -5153785, -13112395, -22070620, -23798757, -14961368, -2743313, 4418164, 6256993, 6417647, 4967896, 1323648, -681862, 1989384, 4973327, 2297064, -4122559, -7779554, -7566039, -6827942, -4889737, 1509295, 9098218, 9908300, 3497505, -1669580, -1634751, -2759978, -9606134, -15465860, -12206742, -3408924, 965468, -495624, -232027, 4676109, 7756300, 4320253, -522773, -6519, 3609398, 3027262, -2128831, -4598903, -1143952, 1915589, -1656977, -7814116, -7529410, -410868, 3525542, -2811334, -13644051, -17330261, -10381805, -293972, 4569960, 3618242, 1439887, -151480, -4176154, -12538357, -20674190, -20992004, -11990094, -1209581, 3039938]
8176C039938k269314k755741l50666K26885Q73455M425634O340380J461551m386466
8167F605656j321769O814082N132006q769825j7846157r475320O019823J1103387
8159a738117N194454M17244O49877o15570n111434o784998l453019O88589M042091
8150f710883P675330P175050k605033j4173259j3074638K43594Q801702M162909
8142h505228j929758J373609O550485L094333k776097Q26377R852604J0498986
8134A8985311J674516n235500o292864q055625j0950969o678486M189576P933943
8126d430098j665714j1365099o617878P872002J5931850J1543133K474333l368450
8118A0374079n008809l432485J056922N370577M559877j486625o876734p121680
$$ y = [3039938, 770624, -1985117, -2335783, -2108898, -1235443, 3190191, 9530571, 10992122, 6605656, 5283887, 12097969, 17229975, 8460150, -9386007, -18861327, -12841504, -1738117, 3456337, 3873581, 4523458, 3907888, -1203546, -7988544, -11441563, -10752974, -6710883, 964447, 8139497, 5534464, -8638795, -21713433, -21469839, -12668137, -8505228, -10434986, -9061377, -2510892, 583441, -2192656, -1366279, 8486325, 18985311, 20659827, 15424327, 9131463, 1075838, -9875131, -16553617, -12364041, -4430098, -6095812, -17460911, -24078789, -16206787, -274937, 11268196, 13742529, 10374079, 5365270, 1932785, 2989707, 8360284, 12920161, 11433536, 4556802, -2564878]
8110b564878m092058j884238j102153J84039K018602K326631P21909k46819J246932
8101c392033L183065K075406k267235o293114o760713l350383K194671O716648
8093g893688N993271j067367p901615n629177M591263J0731297N768360k134813
8085B457531k050391L408453L946177q12091j934174K045651K551770k781747
8077F831179m787017R67497M998256p58730q801529p553252P36098M768655J549815
8068b049028k412385l833705n033899n006660M29345Q618218J0582354M197112
8060E491352k043694j938596j99001l200619p708128n593022L341078R630023
8052b220607N600387m943577j0203051l473459Q312018J1878211M353699k294100
$$ y = [-2564878, -6656936, -8541174, -9643327, -9459288, -7440686, -5114055, -4392146, -4638965, -3392033, -208968, 1866438, -400797, -6693911, -13454624, -16805007, -14610336, -7893688, -1900417, -2967784, -10869399, -16498576, -11907313, -1176016, 4592344, 2457531, 407140, 3815593, 7761770, 6949679, 5015505, 7061156, 9612926, 6831179, 2044162, 3011659, 8009915, 7251185, -1550344, -9103596, -8367498, -3598843, -2049028, -4461413, -8295118, -13329017, -18335677, -17906332, -9288114, 1294240, 5491352, 3447658, 1509062, 1310061, -1890558, -9598686, -15191708, -11850630, -2220607, 3379780, -1563797, -11766848, -15240307, -6928289, 4949922, 9303621, 7009521]
8044G009521J754165Q160616J264863j6823665k4819532j0332655J1998900J9147053
8036b640734Q425835l261398m074452J263917L962562L006772J016091k051916
8028E646677n378620m462883J823247O399520K772373m958525p564709l472501
8020i195421J057544K781098M336930O104831L856347k648077o374931k964315
8012c045994K242783K657644N85317K016439N214620K963030m735351q443558
$$ y = [7009521, 8763686, 16924302, 18189165, 1365500, -23454032, -33786687, -21787787, -2640734, 5785101, 2523703, -1550749, -286832, 3675730, 6682502, 7698593, 5646677, 268057, -4194826, -2371579, 4027941, 6800314, 1841789, -5722920, -9195421, -8137877, -5356779, -1019849, 5084982, 8941329, 6293252, -81679, -3045994, -803211, 1854433, 2439750, 4456189, 9670809, 12633839, 7898488, -545070]
$$ [...]
##END NTUPLES=NMR SPECTRUM
##END=
