##TITLE=31Pdec_DPABC1503
 CDCl3, 24 sc
 17.3.2022
##JCAMPDX= 6.0         $$ Bruker NMR JCAMP-DX V2.0
##DATA TYPE= NMR SPECTRUM
##DATA CLASS= NTUPLES
##ORIGIN= UXNMR, Bruker Analytische Messtechnik GmbH
##OWNER= root
$$ XWIN-NMR		Version 3.5
$$ Thu Mar 17 10:04:08 2022 Russian Standard Time (UT+4h)  she@DPX200
##.OBSERVE FREQUENCY= 81.013821
##.OBSERVE NUCLEUS= ^31P
##.ACQUISITION MODE= SIMULTANEOUS
##.ACQUISITION SCHEME= undefined
##.AVERAGES= 27
##.DIGITISER RES= 16
##SPECTROMETER/DATA SYSTEM= spect
##.PULSE SEQUENCE= zgpg30
##.SOLVENT NAME= CDCl3
##.SHIFT REFERENCE= (INTERNAL, CDCl3, 0, 248.564)
##AUDIT TRAIL= $$ (NUMBER, WHEN, WHO, WHERE, WHAT)
$$ ##TITLE= Audit trail, XWIN-NMR		Version 3.5
$$ ##JCAMPDX= 5.01
$$ ##ORIGIN= Bruker BioSpin GmbH
$$ ##OWNER= she
$$ F:/spectra/data/she/nmr/P31/1/pdata/1/auditp.txt
$$ ##AUDIT TRAIL=  $$ (NUMBER, WHEN, WHO, WHERE, WHAT)
(   1,<2022-03-17 10:03:05.84 +0400>,<she>,<DPX200>,
      <created by zg, POWCHK disabled, PULCHK disabled
       terminated by command 'halt'
       configuration hash MD5:
       00 E9 B6 7A A2 85 ED C7 34 08 36 98 17 FE 4E 26
       data hash MD5: 32K
       C6 CD F2 D6 D9 CF 07 D4 64 D3 5B 0A F1 6E 8D 6A>)
(   2,<2022-03-17 10:03:09.68 +0400>,<she>,<DPX200>,
      <Start of raw data processing
       efp BC_mod = 2 LB = 1 FT_mod = 6 PKNL = 1 PHC0 = -9191.464 PHC1 = 112.6757 SI = 64K 
       data hash MD5: 64K
       BD AE D5 C3 6E B3 91 81 B7 AE 9E 40 6E 70 B5 95>)
(   3,<2022-03-17 10:03:31.42 +0400>,<she>,<DPX200>,
      <pk PHC0 = 5.083717 PHC1 = 0 
       data hash MD5: 64K
       79 87 B7 9F E0 83 CD E3 2D 84 F9 6F 2F 00 5A A0>)
$$ ##END=
$$ 
$$ hash MD5
$$ 0C 5F 98 DE C8 AD 92 27 62 DA 63 3D EC 8A CB 2D
##$RELAX= 
##$RELAX= 
##$RELAX= 
##$RELAX= 
##$RELAX= 
##$RELAX= 
##$RELAX= 
##$RELAX= 
$$ Bruker specific parameters
$$ --------------------------
##$DU= <F:/spectra>
##$EXPNO= 1
##$NAME= <P31>
##$PROCNO= 1
##$TYPE= <nmr>
##$USER= <she>
##$AMP= (0..31)
100 100 100 100 100 100 100 100 100 100 100 100 100 100 100 100 100 100 
100 100 100 100 100 100 100 100 100 100 100 100 100 100 
##$AQSEQ= 0
##$AQ_mod= 1
##$AUNM= <au_zg>
##$AUTOPOS= <>
##$BF1= 81.014009
##$BF2= 200.13
##$BF3= 200.13
##$BF4= 200.13
##$BF5= 200.13
##$BF6= 200.13
##$BF7= 200.13
##$BF8= 200.13
##$BYTORDA= 1
##$CFDGTYP= 0
##$CFRGTYP= 5
##$CHEMSTR= <none>
##$CNST= (0..31)
1 1 145 1 1 1 1 1 1 1 1 1 1 1 1 1 1 1 1 1 1 1 1 1 1 1 1 1 1 1 1 1 
##$CPDPRG= <waltz16>
##$CPDPRG1= <>
##$CPDPRG2= <waltz16>
##$CPDPRG3= <>
##$CPDPRG4= <mlev>
##$CPDPRG5= <mlev>
##$CPDPRG6= <mlev>
##$CPDPRG7= <mlev>
##$CPDPRG8= <mlev>
##$CPDPRGB= <>
##$CPDPRGT= <>
##$D= (0..31)
0 1 0 0 0 0 0 0 0 0 0 0.03 2e-05 3e-06 0 0 0 0 0 0 0 0 0 0 0 0 0 0 0 0 
0 0 
##$DATE= 1647496985
##$DBL= (0..7)
120 120 120 11 120 120 24 19 
##$DBP= (0..7)
150 150 150 150 150 150 150 150 
##$DBP07= 0
##$DBPNAM0= <>
##$DBPNAM1= <>
##$DBPNAM2= <>
##$DBPNAM3= <>
##$DBPNAM4= <>
##$DBPNAM5= <>
##$DBPNAM6= <>
##$DBPNAM7= <>
##$DBPOAL= (0..7)
0.5 0.5 0.5 0.5 0.5 0.5 0.5 0.5 
$$ [...]
##$SUBNAM2= <"">
##$SUBNAM3= <"">
##$SUBNAM4= <"">
##$SUBNAM5= <"">
##$SUBNAM6= <"">
##$SUBNAM7= <"">
##$SUBNAM8= <"">
##$SUBNAM9= <"">
##$SW= 501.771253377433
##$SWIBOX= (0..15)
0 1 3 0 0 0 0 0 0 0 0 0 0 0 0 0 
##$SW_h= 40650.406504065
##$TD= 32768
##$TD0= 1
##$TE= 0
##$TE2= 300
##$TE3= 300
##$TEG= 300
##$TL= (0..7)
0 120 53 12 22 120 120 120 
##$TP= (0..7)
150 150 150 150 150 150 150 150 
##$TP07= 0
##$TPNAME0= <>
##$TPNAME1= <>
##$TPNAME2= <>
##$TPNAME3= <>
##$TPNAME4= <>
##$TPNAME5= <>
##$TPNAME6= <>
##$TPNAME7= <>
##$TPOAL= (0..7)
0.5 0.5 0.5 0.5 0.5 0.5 0.5 0.5 
##$TPOFFS= (0..7)
0 0 0 0 0 0 0 0 
##$TUNHIN= 0
##$TUNHOUT= 0
##$TUNXOUT= 0
##$USERA1= <user>
##$USERA2= <user>
##$USERA3= <user>
##$USERA4= <user>
##$USERA5= <user>
##$V9= 5
##$VALIST= <valist>
##$VCLIST= <CCCCCCCCCCCCCCC>
##$VD= 0
##$VDLIST= <DDDDDDDDDDDDDDD>
##$VPLIST= <PPPPPPPPPPPPPPP>
##$VTLIST= <TTTTTTTTTTTTTTT>
##$WBST= 1024
##$WBSW= 4
##$XGAIN= (0..3)
0 0 0 0 
##$XL= 0
##$YL= 0
##$YMAX_a= 3914
##$YMIN_a= -4874
##$ZGOPTNS= <>
##$ZL1= 120
##$ZL2= 120
##$ZL3= 120
##$ZL4= 120
##$ABSF1= 0
##$ABSF2= 0
##$ABSG= 0
##$ABSL= 0
##$ALPHA= 0
##$AQORDER= 0
##$ASSFAC= 0
##$ASSFACI= 0
##$ASSFACX= 0
##$ASSWID= 0
##$AUNMP= <proc_1d>
##$AZFE= 0.1
##$AZFW= 0.5
##$BCFW= 0
##$BC_mod= 2
##$BYTORDP= 0
##$COROFFS= 0
##$CY= -3
##$DATMOD= 1
##$DC= 0
##$DFILT= <>
##$DTYPP= 0
##$F1P= 0
##$F2P= 0
##$FCOR= 1
##$FTSIZE= 65536
##$FT_mod= 6
##$GAMMA= 0
##$GB= 0
##$INTBC= 1
##$INTSCL= 5.30512e-09
##$ISEN= 30
##$LB= 1
##$LEV0= 0
##$LPBIN= 0
##$MAXI= 10000
##$MC2= 0
##$MEAN= 0
##$ME_mod= 0
##$MI= 50
##$NCOEF= 0
##$NC_proc= -8
##$NLEV= 6
##$NOISF1= 182.463
##$NOISF2= 159.3651
##$NSP= 0
##$NTH_PI= 0
##$NZP= 0
##$OFFSET= 248.5645
##$PC= 4
##$PHC0= -9186.38
##$PHC1= 112.6757
##$PH_mod= 1
##$PKNL= yes
##$PPARMOD= 0
##$PSCAL= 0
##$PSIGN= 0
##$REVERSE= no
##$SF= 81.014009
##$SI= 65536
##$SIGF1= 159.3651
##$SIGF2= -187.1042
##$SINO= 113.3802
##$SIOLD= 16384
##$SREGLST= <1H.CDCl3>
##$SSB= 0
##$STSI= 65536
##$STSR= 0
##$SW_p= 40650.406504065
##$SYMM= 0
##$S_DEV= 0
##$TDeff= 32768
##$TDoff= 0
##$TI= <>
##$TILT= no
##$TM1= 0
##$TM2= 0
##$TOPLEV= 0
##$USERP1= <user>
##$USERP2= <user>
##$USERP3= <user>
##$USERP4= <user>
##$USERP5= <user>
##$WDW= 1
##$XDIM= 65536
##$YMAX_p= 526725187
##$YMIN_p= -476320850
$$ End of Bruker specific parameters
$$ ---------------------------------
##NTUPLES= NMR SPECTRUM
##VAR_NAME=  FREQUENCY,     SPECTRUM/REAL,   SPECTRUM/IMAG
##SYMBOL=    X,             R,               I
##VAR_TYPE=  INDEPENDENT,   DEPENDENT,       DEPENDENT
##VAR_FORM=  AFFN,          ASDF,            ASDF
##VAR_DIM=   65536,         65536,           65536
##UNITS=     HZ,            ARBITRARY UNITS, ARBITRARY UNITS
##FACTOR=    0.620285442955139, 1,           1
##FIRST=     20137.2065510759, 0,            0
##LAST=      -20513.1999529892, 0,           0
##MIN=       -20513.1999529892, -476320850,  0
##MAX=       20137.2065510759, 526725187,    0
$$ Real data points
##PAGE= N=1
##DATA TABLE= (X++(R..R)), XYDATA
$$ [...]
##PAGE= N=2
##DATA TABLE= (X++(I..I)), XYDATA
12996A113791L39617l178629n618311m720254j080527L372402O113541M935119
12988A276749M97633l244010l158994m56791J390602R18228n54844j062999L05034
12979d089392K512551K825570p7187l147219k258877J309183K143625o14681j640754
12970c037181J156694K379450j229672l907366m35919L805371J398626l638966
12962c508963k069135L988567L510435m562783q287853j606281O291028O062995
12954a81990J517537L54083J178951j113373m257254k734816J760040L052722
12946d24100L98628k268958l854692n199950l857080K018933P101266M868078
12938a217875j406871k404084L054743O353356K349943l970939o058504l892393
$$ plain form
12996 1113791 1453408 -1725221 -7343532 -12063786 -13144313 -9771911 -3658370 1276749
12988 1276749 1774382 -1469628 -4628622 -5085413 -3694811 -2776583 -3331427 -4394426 -4089392
12979 -4089392 -1576841 1248729 1171542 -1975677 -4234554 -2925371 -781746 -1396427 -3037181
12970 -3037181 -1880487 498963 -730709 -4638075 -5073994 -1268623 130003 -3508963
12962 -3508963 -5578098 -1589531 1920904 -2641879 -10929732 -12536013 -6244985 -181990
12954 -181990 1335547 1689630 2868581 1755208 -2502046 -5236862 -3476822 -424100
12946 -424100 -25472 -2294430 -6149122 -11349072 -15206152 -13187219 -6085953 -1217875
12938 -1217875 -2624746 -5028830 -1974087 4379269 6729212 2758273 -3300231 -7192624
12930g192624j037511N30842K62467j490347k108399P88857M579339M134176k95825
12921a829025k931828j033880J848145K271131R90465o21150k593399l358628
12913g258169n83296L320381K649972k492141m907820q56119M448323N228992
12905d49877K802107R68306j16064j008775J28084K715825J662378m257742p639673
12896e195431k760022M512334M826347q90544m338074l308210k713651l630023
12888a3497274j457461L941171N766219J184810l178009j190343L549165L831620
12880a050102k43009k504941o10903J308276J2751j864045l93274L232109M251279
12871B138141J378067j371944r41302K18006j106015k499938N18454N753361N769537
$$ plain form
12930 -7192624 -8230135 -7699293 -7436826 -8927173 -11035572 -10246715 -5667376 -1533200 -1829025
12921 -1829025 -4760853 -5794733 -3946588 -1675457 -684992 -1306142 -3899541 -7258169
12913 -7258169 -7841465 -4521084 -1871112 -4363253 -9271073 -10127192 -5678869 -449877
12905 -449877 2352230 3320536 3204472 2195697 2323781 5039606 6701984 2444242 -5195431
12896 -5195431 -7955453 -3443119 1383228 492684 -3845390 -7153600 -9867251 -13497274
12888 -13497274 -14954735 -11013564 -5247345 -4062535 -7240544 -8430887 -4881722 -1050102
12880 -1050102 -1293111 -3798052 -4408955 -3100679 -3087928 -4951973 -5345247 -2113138 2138141
12871 2138141 3516208 2144264 1202962 1420968 314953 -2184985 -1666531 4086830 9856367
12862I856367o87219n527331l001213J742813J090749l249782l783617P76553
12854b782680M497409L838809J357171m1571m58399k35790Q31026J103096j232350
12845F876721l996715l420219n45464J87306j327789q21374J976251J892963k585418
12836a763738n599144k898672J471973K037485L41683J137708L952845M354251
12828C034391J469178j282893k009154k055401k126648r99701J287197K404173
12820b78858J080519q22113q47600P80032J563134L4475k118918j840488J260038
12811a189779L779534K640814p58157k568195j725530l14260O52609K012586K867033
12802E396655P05191l483931m702994j047494K722138J890440j614495l184768
$$ plain form
12862 9856367 9169148 3641817 640604 2383417 3474166 224384 -3559233 -2782680
12854 -2782680 1714729 5553538 6910709 6869138 6410739 6174949 7005975 8109071 6876721
12845 6876721 2880006 -540213 -1085677 -898371 -2226160 -3047534 -1071283 821680 -1763738
12836 -1763738 -7362882 -10261554 -8789581 -6752096 -6410413 -5272705 -1319860 3034391
12828 3034391 4503569 3220676 1211522 -843879 -2970527 -3970228 -2683031 -278858
12820 -278858 801661 -20452 -868052 -88020 1475114 1509589 -609329 -2449817 -1189779
12811 -1189779 2589755 5230569 4472412 1904217 178687 -135573 517036 2529622 5396655
12802 5396655 6101846 2617915 -2085079 -3132573 -410435 1480005 -134490 -3319258
12794c319258k723454k977273l121454J48925N750316Q096006M799996j74651
12786F479153k657581l401447m623490m985128j891058K872010M086066L04028
12778c817447l301943j504627L644749N334370J343538l057186k925417l96105
12770d680068k45265j929184j217439J837037K642424m7228k082991j151243n1958
12761f925915m45087M94113L623994M194702l05208m229469k008255K467317K146439
12752i87369j334559q76414L246976L527204j724814n135646k363121J283011
12744d364732K09328k837220k460004Q15762K893734K753912J939253Q63562j27626
12735c14031O85452K822749K140098k800095o571686m102891J300267K902940
$$ plain form
12794 -3319258 -6042712 -9019985 -12141439 -11992514 -6242198 1853808 6653804 6479153
12786 6479153 3821572 420125 -4203365 -9188493 -11079551 -8207541 -4121475 -3817447
12778 -3817447 -7119390 -8624017 -4979268 355102 1698640 -1358546 -4283963 -4680068
12770 -4680068 -4925333 -6854517 -8071956 -6234919 -3592495 -3639723 -5722714 -6873957 -6925915
12761 -6925915 -7371002 -6876889 -3252895 941807 636599 -3592870 -5601125 -3133808 -987369
12752 -987369 -2321928 -3198342 48634 3575838 1851024 -3284622 -5647743 -4364732
12744 -4364732 -4155404 -6992624 -9452628 -8636866 -5743132 -2989220 -1049967 -186405 -314031
12735 -314031 371421 3194170 5334268 2534173 -4037513 -8140404 -6840137 -3937197
12727c937197P40677K78851K602093L231132P06438q16757Q10583J807900j024715
12718D399005m895087n452171k866438k17003J259871K181896K537045K067006
12710i85876J505712J229816L58694j014708r49257Q55429J261721j673721m570217
12701c982407k957137J888589M469947K782725K33313l83316n09747k014880l502586
12692c975499k836433p60232N82894J018969J769685K701166K561209J367834
12684B429593M05778K2240p41422k218874l266992k608862j91891K663586L882340
12675C75496K201290r13748k072765j79237J570072K19248j915473m84587L245249
12666B045545L019845k714461o886026l157345M708634P692826L346437k480162
$$ plain form
12727 -3937197 -3196520 -2917669 -315576 2915556 3621994 2805237 3615820 5423720 4399005
12718 4399005 -496082 -5948253 -8814691 -9031694 -7771823 -5589927 -3052882 -985876
12710 -985876 519836 1749652 2108346 1093638 144381 999810 2261531 587810 -3982407
12701 -3982407 -6939544 -5050955 -581008 2201717 2435030 2051714 1541967 -472913 -3975499
12692 -3975499 -6811932 -7572164 -6989270 -5970301 -4200616 -1499450 1061759 2429593
12684 2429593 2835371 2857611 2116189 -102685 -3369677 -5978539 -6170430 -3506844 375496
12675 375496 2576786 1663038 -409727 -588964 981108 1200356 -715117 -1199704 2045545
12666 2045545 5065390 2350929 -4535097 -7692442 -2983808 4709018 8055455 5575293
12658E575293m518203l151519o59300J928629K919403K00390m245201m743343
12650f693851J41717M328500K528831k045315k831939M14372K541252J600914
12642a5519O68258J550189K159547Q17487j286476k710668l096714j687534J552850
12633b048580L492940J161412k548216k057130J656373J752418k979887n120225
12625f690895o78328L868052K409609m98232J680104M902527J233661n988407
12617B38091n888860J929038N665816j17287o104555l454522K985755M057434
12609f89090O03045n16019J052432K55045k831915k945374O58685K691441O90179
12600a031571j593069j029660P07528J622411K614732L800203K392769k522831
$$ plain form
12658 5575293 1057090 -2094429 -2753729 -825100 2094303 2294693 -1950508 -6693851
12650 -6693851 -6552134 -2223634 305197 -1740118 -4572057 -4157685 -1616433 -15519
12642 -15519 652739 2202928 4362475 5179962 3893486 1182818 -1913896 -3601430 -2048580
12633 -2048580 1444360 2605772 57556 -1999574 -343201 1409217 -1570670 -6690895
12625 -6690895 -7369223 -3501171 -1091562 -1589794 90310 4992837 6226498 238091
12617 238091 -5650769 -3721731 1944085 1826798 -4277757 -7732279 -4746524 -689090
12609 -689090 -86045 -602064 450368 705413 -2126502 -5071876 -4413191 -1721750 -1031571
12600 -1031571 -2624640 -3654300 -2946772 -1324361 1290371 5090574 7483343 4960512
12592D960512o678928n586886n92510L077182K846372P20679l40308M71129K075238
12583I52480K921111J817791j355170n001838o336904l632188J320987L765041
12575e548690Q47102l999287m127467J739538P011354N773879Q43481p22175K037836
12566C855571L463268M80007l370321m126376k425713l96345J703396L125239
12558B308726J399086l038147m867803q17988M466467M271127o13100l407847
12550b99479j425142R11769l05037k914771k906402m94238R11113j86761j892879
12541h601827j799381M44265L207475M478511L468656J104899j083409k358643
12533a139454k648835j641177P97126L417728M119220K089550j245321l441593
$$ plain form
12592 4960512 -1718416 -7305302 -7897812 -4820630 -1974258 -1253579 -1593887 -1122758 952480
12583 952480 3873591 5691382 4336212 -665626 -7002530 -10634718 -9313731 -5548690
12575 -5548690 -4701588 -8700875 -12828342 -11088804 -4077450 1696429 2539910 1817735 3855571
12566 3855571 7318839 7798846 4428525 302149 -2123564 -2519909 -816513 2308726
12558 2308726 3707812 669665 -4198138 -5016126 -549659 3721468 3108368 -299479
12550 -299479 -1724621 -812852 -1117889 -4032660 -6939062 -7433300 -6522187 -6708948 -8601827
12541 -8601827 -10401208 -9956943 -6749468 -2270957 1197699 2302598 1219189 -1139454
12533 -1139454 -3788289 -5429466 -4632340 -1214612 2904608 4994158 3748837 307244
12525C07244k721960Q68688M835174N486602J619733l347278m879401k764868
12517e96066o64070k82023N45206K701902K683130j971310o942750n650798J342186
12508h834593O395284M919192O63754j081031r09063k090340l493191j242901
12500e672889L737915N550306J648494l378861m406114k265232q48386q85632
12492f520399k68136J352434K214590K025023K314623L086873K269568p11340
12484E763236l399261l504811j691824P78Q90092J454874J628933Q53111o23768
12475A371360j745460j929484j468596n12004J441228M156212N254685K069240
12467H637181m059030p229251l399328L561533N821473J681472k605696k411692
$$ plain form
12525 307244 -2414716 -1546028 3289146 8775748 10395481 7048203 2168802 -596066
12517 -596066 -1260136 -1542159 -996953 1704949 4388079 2416769 -4525981 -10176779 -8834593
12508 -8834593 -2439309 2479883 3143637 2062606 1153543 -936797 -4429988 -5672889
12500 -5672889 -1934974 3615332 5263826 1884965 -2521149 -4786381 -5634767 -6520399
12492 -6520399 -6788535 -5436101 -3221511 -1196488 1118135 4205008 6474576 5763236
12484 5763236 2363975 -1140836 -2832660 -2831882 -1941790 -486916 1142017 1995128 1371360
12475 1371360 -374100 -2303584 -3772180 -4284184 -2842956 1313256 6567941 8637181
12467 8637181 4578151 -2651100 -6050428 -2488895 3332578 5014050 2408354 -3338
12459c338j020634k934685n686376l938257J307497M058131K501381M32132j5380
12450e299529n32722j160080N86484L635460L122415j245059l100214P51187M617076
12441A375018K719414j905679l107805j506728j779185l368222j626595K981322
12433f218460M390945M89483l223507j680825K858853M681443K125314j540489
12425A882757k978738k196967j428459j797939j778099L63816L057606K647686
12417b228337j198813m213611l416113j148111n16804j28290K537100N229113
12409e083866L695706r94557l317084j190529K082594L854971M783945M615177
12401H446357R52588n364861q464691m575846K249208N145430L077019R43019
$$ plain form
12459 -3338 -1023972 -3958657 -9645033 -13583290 -12275793 -8217662 -5716281 -5284149 -5299529
12450 -5299529 -5832251 -6992331 -6405847 -2770387 352028 -893031 -3993245 -3242058 1375018
12441 1375018 4094432 2188753 -919052 -2425780 -4204965 -7573187 -9199782 -6218460
12433 -6218460 -1827515 -1338032 -4561539 -6242364 -3383511 1297932 3423246 1882757
12425 1882757 -1095981 -3292948 -4721407 -6519346 -8297445 -7933629 -4876023 -2228337
12417 -2228337 -3427150 -7640761 -11056874 -12204985 -12721789 -12850079 -10312979 -5083866
12409 -5083866 -1388160 -2382717 -5699801 -6890330 -4807736 -952765 3831180 8446357
12401 8446357 9398945 4034084 -4430607 -9006453 -6757245 -1611815 1465204 2408223
12393B408223K033270L798640J945522l197309o264048l296204K588840M314474
12385D331408O7486l843305j816261K565104J604370m665585p826874l042421
12377a2626078M100180N517318J076281k671370j607523J965007L533302J555869
12369H42986j697683k838301o96654K463193L383402J464153j019063k243904
12361c41871k653927k965000k297739K54615L276227L976978J644238r59349o56306
12352g22134J835906K290155j150782m418969k820228J617867K887991O69150
12344A88956O86629L896090L255920m181087r874167n996631J570440K088971
12336h364879l126302l958588J288929M431116K556142J669053L584847K219896
$$ plain form
12393 2408223 4441493 8240133 10185655 6988346 724298 -2571906 16934 4331408
12385 4331408 4398894 555589 -1260672 1304432 2908802 -1756783 -9583657 -12626078
12377 -12626078 -8525898 -3008580 -1932299 -4603669 -6211192 -4246185 -712883 842986
12369 842986 -854697 -3692998 -4389652 -1926459 1456943 2921096 1902033 -341871
12361 -341871 -2995798 -5960798 -8258537 -8003922 -4727695 -750717 893521 -65828 -722134
12352 -722134 1113772 3403927 2253145 -2165824 -4986052 -3368185 -480194 188956
12344 188956 875585 4771675 8027595 3846508 -6027659 -12024290 -10453850 -8364879
12336 -8364879 -11491181 -15449769 -14160840 -9729724 -7173582 -5504529 -1919682 300214
12328C00214l282352m473756J543321N238779K71160n244972k590555K551853
12320e686308N08915n120780l846863L436307O345509K605368K54553K369653
12312H66354K360223l061213p276143m415213J877404M987229M192322K621700
12304B152663J405911K2472j031236j239122j340494j585548r53463O77326J808956
12295h2535J501318K78968j098680j740033l46134K701451M315043K599629n8145
12286H070882j017310j812252m208329m982864p66926M371940L600948j709445
12278A546644l723563n97748J407771p27695k332196n26594O59326j234958j770356
12269g299369J766789L880147j29139m855758k527648M295873O346237J656772
$$ plain form
12328 300214 -2982138 -7455894 -5912573 -673794 -402634 -5647606 -8238161 -5686308
12320 -5686308 -5177393 -10298173 -14145036 -10708729 -4363220 -1757852 -1503299 866354
12312 866354 3226577 165364 -7110779 -11525992 -9648588 -4661359 -469037 2152663
12304 2152663 3558574 3581046 2549810 1310688 -29806 -1615354 -2568817 -1891491 -82535
12295 -82535 1418783 1697751 599071 -1140962 -1487096 1214355 5529398 8129027 8070882
12286 8070882 7053572 5241320 1032991 -3949873 -4716799 -344859 3256089 1546644
12278 1546644 -2176919 -2774667 -1366896 -2094591 -4426787 -4953381 -4294055 -5529013 -7299369
12269 -7299369 -5532580 -1652433 -1781572 -6637330 -9164978 -4869105 1477132 3133904
12261C133904k516803j434405J305949J201680m52647l58804Q11884p4601l355775
12252a739618n881340m975182j312627K062990K751801J062821n52509l7993K321161
12243f300496M338411M004809J320285j517413k119972o07113N34286J02969J28120
12234a16114K226973L726119R26055m375628n936825j606958L266355L131034
12226A241011m91626k135499m03893R77096n56998k653656j679301K000434M281618
12217E79186K542961j084463k701782j712034o60861l88411J170828M109283M471286
12208F325993K85217l691379j898212L537690N469462J756206k741487l797917
12200E245573k086410L08925K258275J958818j622105m936029l168083J693799
$$ plain form
12261 3133904 617101 -817304 488645 1690325 1237678 878874 1690758 1616157 -1739618
12252 -1739618 -7620958 -12596140 -13908767 -11845777 -9093976 -8031155 -8583664 -8621657 -6300496
12243 -6300496 -1962085 2042724 3363009 1845596 -274376 -881489 -347203 -244234 -116114
12234 -116114 2110859 5836978 6763033 2387405 -3549420 -5156378 -1890023 1241011
12226 1241011 749385 -1386114 -1790007 -812911 -1369909 -4023565 -5702866 -3702432 579186
12217 579186 3122147 2037684 -664098 -2376132 -3036993 -3425404 -2254576 1854707 6325993
12208 6325993 6611210 2919831 1021619 4559309 10028771 11784977 9043490 5245573
12200 5245573 3159163 3468088 5726363 7685181 6063076 1127047 -2041036 -347237
12192c47237K446517k076168m482239n75245L783415K478822r86539j71629L048173
12183C117870K001561l012681m875570r98589L011790K329654n65352r04385J204454
12174A308752K007182L28439p79940J193987L972958L045810j627486m339746
12166E109956j336287K865836J349356m504552o379038j538672K921358R79338
12158e32705l670769m238326o85876K302937K961815K505082R16093j710368k251836
12149d403953J472664N814214N548373J245977k427868l702088l865988k672288
12141b990957M87317K454729j23068l802428j714544N607589R433683M679621
12133A4031942l273572o371454l825454q76139q68770k202339j863027P29472
$$ plain form
12192 -347237 2099280 23112 -4459127 -5034372 -1250957 1227865 241326 69697 3117870
12183 3117870 5119431 2106750 -2768820 -3767409 -755619 1574035 1008683 104298 1308752
12174 1308752 3315934 3644373 2864433 4058420 8031378 11077188 9449702 5109956
12166 5109956 3773669 6639505 7988861 3484309 -2894729 -4433401 -1512043 -532705
12158 -532705 -4203474 -8441800 -9127676 -6824739 -3862924 -1357842 -441749 -2152117 -4403953
12149 -4403953 -2931289 2882925 8431298 9677275 7249407 3547319 -318669 -2990957
12141 -2990957 -2503640 -48911 -171979 -3974407 -5688951 -81362 9352321 14031942
12133 14031942 10758370 4386916 561462 -314677 -1183447 -3385786 -5248813 -4519341
12125d519341L464879M043727K379878K13847j430720k853432l460524j606793
12117c768479J924273L266115P06549k242701j921104J88458O85174j37720r1691
12108a391126J33452j181917k292153n09036K431360K841777J490094J818270
12100C340721K876702N20436m309843n162865M81192O953744P848189L385669
12092A5933945j767464m436655m660655m093295m135271m090203j491930L668088
12084e073440O635009L367497l081353n961867l554274Q6887K031636K856063
12076b693842K772541J070100n51515L79185K005519L33785l345384l432473R04208
12067b557876M085399K896148M85732k69031j005287k912784l525179j580203
$$ plain form
12125 -4519341 -1054462 2989265 5369143 5582990 4152270 1298838 -2161686 -3768479
12117 -3768479 -1844206 1421909 2128458 -114243 -2035347 -1846889 -1161715 -1299435 -1391126
12108 -1391126 -1257674 -2439591 -4731744 -5240780 -2809420 32357 1522451 3340721
12100 3340721 6217423 6737859 2428016 -2734849 -2253657 4700087 12548276 15933945
12092 15933945 14166481 9729826 5069171 975876 -3159395 -7249598 -8741528 -5073440
12084 -5073440 1561569 4929066 1847713 -4114154 -7668428 -7581541 -5549905 -2693842
12076 -2693842 78699 1148799 597284 976469 2981988 3315773 -29611 -3462084 -2557876
12067 -2557876 1527523 4423671 4909403 4640372 3635085 722301 -2802878 -4383081
12059d383081J40010j57849k17904J499009K679764J520597k25878r53710j448506
12050a547548j472054P97852L868859L167676j268109l273438J54809M037602
12042D465649L481973N68281r79558k061354m209722m739026j376912K617379
12034b233290L107412J053886n18124j383021j851808k92689K838448L420621
12026D141435L81345j514931K9271L92082k744353l417980J945866N651065K93229
12017E157029p447105o242617J547428M004575o05540k104580L498919P757529
12009E565638M411386j704082m560026n269176n629055k898978L025742N498855
12001a559696R46963l902372j665451M234711N158933M57411k498924K46574M492642
$$ plain form
12059 -4383081 -4243071 -4400920 -4618824 -3119815 -440051 1080546 854668 -99042 -1547548
12050 -1547548 -3019602 -2221750 1647109 4814785 3546676 273238 428047 4465649
12042 4465649 7947622 8515903 7536345 5474991 1265269 -3473757 -4850669 -2233290
12034 -2233290 874122 1928008 1409884 26863 -1824945 -2117634 720814 4141435
12026 4141435 4522780 3007849 3037120 3429202 684849 -2733131 -787265 4863800 5157029
12017 5157029 -2290076 -8532693 -6985265 -2980690 -3586230 -5690810 -2191891 5565638
12009 5565638 9977024 8272942 3712916 -1556260 -7185315 -10084293 -7058551 -1559696
12001 -1559696 -612733 -4515105 -6180556 -1945845 3213088 3670499 1171575 1418149 5910791
11992E910791M619842J46736n130906p321871n252808j165051J275099P64082
11984f154086n22605l32895P27059Q46598j17768r82052j080686l77126J001492
11975f992069K124668J495139q25753k579303k040168k80763N09666L5964m6996
11966h599615J351164L177227L262921P19906k783336m536086l617400j339944
11958a2365163J125439L708994N418053M040980j77867l044441j429401K135595
11950e87811K986542P65225j152648j251404r70814j006872m84559L62100K06068
11941a134173p45584j152537j080883j271544r91508K22343M19134j324965j608397
11932h668114K109463N396671K532032l348433l756128J814072M887882J629506
$$ plain form
11992 5910791 10530633 10677369 5546463 -1775408 -7028216 -8193267 -6918168 -6154086
11984 -6154086 -6676691 -7009586 -6282527 -5435929 -5553697 -6535749 -7616435 -7993561 -6992069
11975 -6992069 -4867401 -3372262 -4198015 -6777318 -8817486 -9098249 -8588583 -8552619 -8599615
11966 -8599615 -7248451 -4071224 -808303 -88397 -2871733 -7407819 -11025219 -12365163
11958 -12365163 -11239724 -7530730 -2112677 1928303 1750436 -1294005 -2723406 -587811
11950 -587811 2398731 3163956 2011308 759904 -210910 -1217782 -1702341 -1340241 -1134173
11941 -1134173 -1879757 -3032294 -4113177 -5384721 -6376229 -6153886 -5734752 -7059717 -8668114
11932 -8668114 -6558651 -1161980 1370052 -1978381 -5734509 -3920437 967445 2596951
11924B596951j846753q79154L40416k076511l712621p1551M142554K198908l258850
11915b566611m503827r14935J623635J262892J603044L360952K791822q47264
11907A809708l331604k438140q95914p36302j30051K105814L615952K516883N06358
11898C022704k12237M2141K06949K91673l7600j643908l331929k335626J023422
11889b974411K554582J07182l001620k877896k66344J875103K890712L047354
11881A354662O25495m872828q509693m620807M201004Q326562L045258n201118
11873e651465p175050j792174M595659P007287N788318L246812O83802j071696
11865E631493j498238j349139j477085r03519J241515K506046j51823m304433
$$ plain form
11924 2596951 750198 -128956 211460 -1865051 -5577672 -5649223 -1506669 692239 -2566611
11915 -2566611 -7070438 -7985373 -6361738 -5098846 -3495802 -134850 2656972 1809708
11907 1809708 -1521896 -3960036 -4855950 -5592252 -5722303 -3616489 -537 2516346 3022704
11898 3022704 2810467 2852608 3059557 3351230 3313630 1669722 -1662207 -3997833 -2974411
11889 -2974411 -419829 -312647 -3314267 -6192163 -6458507 -4583404 -1692692 1354662
11881 1354662 1980157 -2892671 -11402364 -16023171 -11822167 -3495605 -450347 -5651465
11873 -5651465 -12826515 -14618689 -10023030 -3015743 2772575 6019387 6703189 5631493
11865 5631493 4133255 2784116 1307031 403512 1645027 4151073 3999250 -305183
11857c05183l775257J884274N001403N00731n735609m660004K987470P933173
11849C830998N239673o13346l803503m066666l629794k540875k21020J815279
11841c989254J855048M67541r61134k122104k643627j400851J263857K795235
11833d735289J744570j3091m9770J335612K132148J361397m58160k131746k230943
11824c045272l22037J842248K290151J804015K117245J730628j978519o333572
11816a895113n104557J377210M560796K18389l938626L66773Q396534Q757785
11808A2739191L22405o662268n927429k315234j670596k177224J2823L148652
11800b529680L338580J366104P41556J570736J115673j073666k676219k401661
$$ plain form
11857 -305183 -4080440 -2196166 2805237 3305968 -2429641 -7089645 -4102175 3830998
11849 3830998 9070671 8457325 4653822 587156 -3042638 -5583513 -5804533 -3989254
11841 -3989254 -2134206 -1666665 -2627799 -4749903 -7393530 -8794381 -7530524 -4735289
11833 -4735289 -2990719 -3003810 -3053580 -1717968 414180 1775577 1317417 -814329 -3045272
11824 -3045272 -3367309 -1525061 765090 2569105 4686350 6416978 4438459 -1895113
11816 -1895113 -6999670 -5622460 -1061664 -843275 -4781901 -4415128 3981406 12739191
11808 12739191 13061596 6399328 471899 -1843335 -3513931 -5691155 -5678332 -2529680
11800 -2529680 808900 2175004 2916560 4487296 5602969 4529303 1853084 -548577
11792e48577r84709Q52342K445113J976483j544462n293175m907956m87696K513794
11783e978843j6406n173019o226375r03724N668650P082834L217690k18999O06841
11774a941351L087853K775545Q2659q69234J023269K367199R63634j070935j431607
11765D987032j070922j117321q581K871087L972860N50085l643491l111844L97399
11756C826304P9018m699940o377345o67029O384614O879054J523652l248671m543905
11747h44248l880274j960579J180155K683577L5550l042346n06933N985611P898030
11738G548543K219736l841046l678846l67281j87939k442438j927677J781619
11730h95329M092602L011410J066624n3117j463063l268454l567334k290104j844329
$$ plain form
11792 -548577 -1533286 -680944 1764169 3740652 2196190 -3096985 -8004941 -8492637 -5978843
11783 -5978843 -5995249 -11168268 -17394643 -18298367 -12629717 -5546883 -2329193 -2548192 -1941351
11774 -1941351 1146502 3922047 4004706 3135472 4158741 6525940 7489574 6418639 4987032
11765 4987032 3916110 2798789 2790208 5661295 9634155 10184240 6540749 3428905 3826304
11756 3826304 3905322 -794618 -7171963 -7838992 -1454378 5424676 6948328 3699657 -844248
11747 -844248 -4724522 -6685101 -5504946 -2821369 -2785819 -5828165 -6335098 -349487 7548543
11738 7548543 9768279 5927233 2248387 1881106 1693167 -749271 -2676948 -895329
11730 -895329 3197273 6208683 7275307 7222190 5759127 2490673 -1076661 -3366765 -5211094
11721e211094k579905j566397K102841M351195J477727l829219n248086q62058
11713a1364996M477280N207448J335067k488322k876516q53438Q65374J596650
11705d101453K108937J824689n18635l530625l672003k17259L079694K987979
11697b038676R47134R1528N07263J93524j080596j896366j962561j925464j290873
11688h455087P72375L177754L879432K609282P47732p60381j681994j840874j744755
11679c296516k290581k466163J65124M848312O744623L414021j195351k599134
11671C324335j917766k017792j587917J388484L874850K079108j365378j554092
11663B223832m6542j638219m674651l559244M28541P54960k104142p68475N256570
$$ plain form
11721 -5211094 -7790999 -9357396 -7254555 -2903360 -1425633 -5254852 -10502938 -11364996
11713 -11364996 -6887716 -1680268 -345201 -2833523 -5710039 -6563477 -5698103 -4101453
11705 -4101453 -1992516 -167827 -686462 -4217087 -7889090 -8106349 -5026655 -2038676
11697 -2038676 -1091542 -1000014 -492751 -299227 -1379823 -3276189 -5238750 -7164214 -8455087
11688 -8455087 -7682712 -4504958 -625526 1983756 2731488 1971107 289113 -1551761 -3296516
11679 -3296516 -5587097 -8053260 -7888136 -3039824 3704799 7118820 5923469 3324335
11671 3324335 1406569 -611223 -2199140 -810656 3064194 5143302 3777924 2223832
11663 2223832 2177290 539071 -4135580 -7694824 -7266283 -6511323 -8615465 -9383940 -4127370
11654d127370P076762J082686m640699l523975o9680o7380p21814J872600L684027
11645E65157j06277n391395n393111j517131M49094M50404K023527L942292K640880
11636b336560N6986O50881K800236J298170l147987m741683j980500R95777J796167
11627d608513J876601J823443P25702l33473J84048L13765k235918m565957k375595
11618i195897K285287L560315Q29393j352222j212808j008090j331739q10128
11610h235889l86749j368884r19284L377221O796408L780625j450628p42678L386171
11601D236313J133940o767447q449403o96015M957421J353411k946809L64245
11593f814344M830921J583275m491515l735425J207144J123352k592894j038742
$$ plain form
11654 -4127370 2949392 4032078 -608621 -4132596 -4202276 -4269656 -4991470 -3118870 565157
11645 565157 458880 -4932515 -10325626 -11842757 -11393663 -10943259 -8919732 -4977440 -2336560
11636 -2336560 -2279574 -1628693 1171543 2469713 -678274 -5419957 -7400457 -6404680 -4608513
11627 -4608513 -2731912 -908469 -182767 -516240 -332192 -18427 -2254345 -6820302 -9195897
11618 -9195897 -6910610 -3350295 -2520902 -3873124 -5085932 -6094022 -7425761 -8235889
11610 -8235889 -8622638 -9991522 -10910806 -7533585 -737177 3043448 1592820 850142 4236313
11601 4236313 5370253 -1397194 -9846597 -10542612 -5585191 -4231780 -7178589 -6814344
11593 -6814344 -1983423 -400148 -4891663 -8627088 -7419944 -6296592 -8889486 -9928228
11585i928228M890829N120657j596170m435542J756098P982183N529372j435543
11577G883656m168812k122189k81378J53896R68302Q87272k378820o189144n508915
11568a0756132n63634L394602L672890K692016K698124K408568K52733k457528
11560A341639l386108k072258L43078K581179L386618J875044j085930l082303
11552i9041k812951j566443j192721j608133j268529N99414K990582L845530J670289
11543E57997k588342n431329m237047p67501J018633O58453J300724L450908L274179
11534b763325m19628k593577K00977L214977R79474k714210o16145M828520M261459
11525D378522k826136o102198p75894M766927K763696k258941k561413M86262
$$ plain form
11585 -9928228 -5037399 83258 -1512912 -5948454 -4192356 3789827 9319199 7883656
11577 7883656 3714844 1592655 1311277 1465173 2433475 3320747 941927 -5247217 -10756132
11568 -10756132 -11319766 -7925164 -4252274 -1560258 1137866 3546434 3799167 1341639
11560 1341639 -2044469 -4116727 -3773649 -1192470 2194148 4069192 2983262 -99041
11552 -99041 -2911992 -4478435 -5671156 -7279289 -8547818 -7948404 -4957822 -1112292 557997
11543 557997 -2030345 -7461674 -11698721 -12466222 -11447589 -10789136 -9488412 -6037504 -2763325
11534 -2763325 -3182953 -5776530 -5575553 -2360576 -1381102 -4095312 -4711457 117063 4378522
11525 4378522 1552386 -4549812 -5325706 -558779 2204917 -54024 -2615437 -2129175
11517b129175J368677O95778J590355J730678j538125l329583J276642O295239
11509E960486K863724m984706n275949K439685O103547Q37411m008663j429720
11501B505815K394259L12536l727565l112166l14728r31905k499669Q07854O341821
11492A776252N788735j415074o248950k765921M084541N663316L64496n616297
11484A631098o204347j726892K755901L894184K872288J549917r10044m655885
11476g93780n556502l66014O143986N748742j484614o677862m438094J036171
11468f387967L949693M028193K763881n31302m775477n286729o31637L703756
11460c167589K865800q63386l033259l283992k530400L55135M235235M073802
$$ plain form
11517 -2129175 -760498 -64720 1525635 3256313 1718188 -1611395 -334753 5960486
11509 5960486 8824210 3839504 -1436445 1003240 7106787 7944198 3935535 2505815
11501 2505815 4900074 5212610 1485045 -1627121 -1941849 -2873754 -5373423 -4565569 1776252
11492 1776252 7564987 6149913 -99037 -2864958 1219583 6882899 7247395 1631098
11484 1631098 -4573249 -6300141 -3544240 349944 3222232 4772149 3862105 -793780
11476 -793780 -6350282 -6716296 -572310 5176432 3691818 -2986044 -7424138 -6387967
11468 -6387967 -2438274 1589919 4353800 3822498 -952979 -6239708 -6871345 -3167589
11460 -3167589 -301789 -1165175 -4198434 -7482426 -10012826 -9657691 -5422456 -1348654
11452a348654q00058k979018J844778O317468K340353n152147n461241Q72548
11444d365971L704026J26052k174702Q03066L114500K30259l150900j859275Q06795
11435b766150q36945m970410m930145O74988N944350N449506M97779l047169j694079
11426e678275J870803K443772o01224k293627N31667L972460K507745k821515
11418f8194o053579m509574p31177K587141M619773M100438L75921l184335k151689
11409e015275K025267L272502k2680k614103p65184K349755K350873J35642q33682
11400H83115k54837k70394j187553j274116J09686J476121R86787j613059m225638
11391e369888l769450J99364L813441L147335m03898j947253M7665K249243K012405
$$ plain form
11452 -1348654 -2148712 -5127730 -3282952 3034516 5374869 222722 -5238519 -4365971
11444 -4365971 -661945 -535893 -2710595 -1907529 1206971 1437230 -1713670 -3572945 -2766150
11435 -2766150 -3603095 -8573505 -13503650 -12828662 -6884312 -1434806 -937027 -3984196 -5678275
11426 -5678275 -3807472 -1363700 -1964924 -4258551 -3726884 245576 2753321 -68194
11418 -68194 -6121773 -10631347 -11362524 -8775383 -4155610 -55172 320749 -2863586 -5015275
11409 -5015275 -2990008 282494 259814 -2354289 -3119473 -769718 1581155 1716797 883115
11400 883115 628278 357884 -829669 -2103785 -1994099 -517978 468809 -1144250 -5369888
11391 -5369888 -9139338 -8939974 -5126533 -1979198 -2383096 -4330349 -4282684 -2033441 -21036
11382b1036O05148L1898K93220J098291K924792M806751M069783l6736m839683
11373H932428p544433p696512n731764j995929J927011L848790L825644L606780
11365h27985L002594M07017k726900k480297J180702L254047Q82921k671476l528135
11356c507512k366872j474034p94764P8500r0194j143649m11521K368318L314633
11347d027095Q73977q62690O55367J397108j721096l887546k36360M293689K064031
11338a450615l729071l275328L330870N419919p86275n633109j681816M391669
11330c413756K954027l411320m993572l53147K916135R68947j537276r4658L307219
11321c657401M504244K810575J64568j833323k230353q24861O32710k98388l156798
$$ plain form
11382 -21036 584112 616010 909230 2007521 4932313 9739064 13808847 13772111 8932428
11373 8932428 1387995 -6308517 -12040281 -14036210 -12109199 -8260409 -4434765 -827985
11365 -827985 2174609 2581626 -145274 -2625571 -1444869 1809178 2692099 20623 -3507512
11356 -3507512 -5874384 -7348418 -8143182 -8064682 -8154876 -9298525 -9710046 -7341728 -4027095
11347 -4027095 -3153118 -4015808 -3360441 -1963333 -3684429 -7571975 -7808335 -3514646 -1450615
11338 -1450615 -5179686 -8455014 -5124144 295775 -490500 -6123609 -7805425 -3413756
11330 -3413756 -459729 -3871049 -8864621 -9217768 -6301633 -5332686 -6869962 -6964620 -3657401
11321 -3657401 846843 3657418 3821986 1988663 -241690 -1066551 -433841 -732229 -3889027
11312c889027m451369k188795J509876L372582K688890J026660j1967L35283J801076
11303A93209K743075J467644j147728k007743j7664J731703j57187m478165o593159
11294h266015m206393J26951K721448L160656L527882M207732K864628j400703
11286B736186m948606l527373J222037K932190o39827l936574j722045K893070
11278d990942L372701o9640j610264L9314N6311l055253m125174l65706L281526
11269g467127K265405k92701J78653J705927L66551j766561m66064K438130K251018
11260g86769O0515L41064K090325P37722k559619k478705K38394l47182l882263
11251f586518l290328K326213M886381J017429j859778J493600M901179J715985
$$ plain form
11312 -3889027 -8340396 -10529191 -9019315 -5646733 -2957843 -1931183 -1943150 -1607867 193209
11303 193209 2936284 4403928 3256200 1248457 1230793 2962496 2805309 -1672856 -8266015
11294 -8266015 -12472408 -12345457 -9624009 -6463353 -2935471 1272261 4136889 2736186
11286 2736186 -2212420 -5739793 -4517756 -1585566 -2225393 -6161967 -7884012 -4990942
11278 -4990942 -1618241 -1687881 -3298145 -3258831 -3202520 -6257773 -10382947 -10748653 -7467127
11269 -7467127 -5201722 -5494423 -5315770 -3609843 -3243292 -5009853 -5475917 -3037787 -786769
11260 -786769 -726254 -385190 1705135 2442857 -116762 -2595467 -2357073 -2704255 -6586518
11251 -6586518 -9876846 -7550633 -2664252 -1646823 -3506601 -2013001 2888178 4604163
11243D604163l538015l019106J679660L569670J757910N3273j429992m315016
11235f37453n428475j461744K959417J409743k730507j171567M392095L856455
11227A187964m127881q368757k155604O253052N977437j489501o280148l857597
11219a2861035J628028M550619L173571m70496k566323p83750K564371K782627
11211a982388p05648l441255k817778j622182k310932k155463K032172P521511
11203e481963Q482067L765639j794888l410032j120378J241528L21246l320251
11195a317032n561727l301932J568574M448971L726642J571261l90805k378375
11187a634423l299202r72630L074121L716765m17490m041791k756973O03027J161042
$$ plain form
11243 4604163 1066148 -1952958 -273298 3296372 5054282 5107555 3677563 -637453
11235 -637453 -6065928 -7527672 -4568255 -3158512 -5889019 -7060586 -2668491 1187964
11227 1187964 -2939917 -11308674 -13464278 -7211226 -1233789 -2723290 -9003438 -12861035
11219 -12861035 -11233007 -6682388 -3508817 -3979313 -6545636 -7329386 -4765015 -1982388
11211 -1982388 -2688036 -6129291 -8947069 -10569251 -12880183 -15035646 -13003474 -5481963
11203 -5481963 3000104 6765743 4970855 1560823 440445 1681973 2003219 -1317032
11195 -1317032 -6878759 -10180691 -8612117 -4163146 -436504 1134757 743952 -1634423
11187 -1634423 -4933625 -5906255 -2832134 884631 467141 -3574650 -6331623 -5728596 -4567554
11178d567554r4205J261385M909004N609085J049627m596145n815538j581227
11170c825568M464513P444726M816975j377280n767244m899735j010720J026131
11162H71798k38623j982692j748675k32244Q44822J177709J210332Q04859j97092
11153E10194j136246j317765j012518q31093n42844N56715K144363K681868J291256
11144B343930q12603j709420j223018o22787k4843J768666M130978L916214j09536
11135G657581m380563m875112k598601j440508k040738j816028k13577O71112
11127i036434O29121J617469K964010J536397j926322k230187J984825M888815
11119D27694K154546k099553j983060R41144J136257j453234k257081o00145k30245
$$ plain form
11178 -4567554 -4661759 -3400374 1508630 7117715 8167342 3571197 -2244341 -3825568
11170 -3825568 638945 8083671 12900646 11523366 5756122 856387 -154333 871798
11162 871798 633175 -1349517 -3098192 -3330436 -2485614 -1307905 -97573 707286 510194
11153 510194 -626052 -1943817 -2956335 -3787428 -4330272 -3773557 -1629194 1052674 2343930
11144 2343930 1531327 -178093 -1401111 -2023898 -2048741 -280075 3850903 7767117 7657581
11135 7657581 3277018 -1598094 -4196695 -5637203 -7677941 -9493969 -9707546 -9036434
11127 -9036434 -8407313 -6789844 -3825834 -2289437 -4215759 -6445946 -4461121 427694
11119 427694 2582240 482687 -1500373 -559229 577028 -876206 -3133287 -3733432 -3963677
11110c963677j625605q21512K937372M955037K859581O97276J807192K794430
11102I640094o66454n863824o577759k684036m07959k858854n500537l037866
11094a7957195K857372N783841K968862j579084k413164R19657M036362L541761
11086a841588R36037j86483M89488r9300k868076m067079p23622L684735L092292
11077a583596k158537m962335j506371L003235K054585k492381l476145Q41807
11069a0279738M873832M345250J227991j123237k475049l056634j249962K631906
11061e105641M233731R30467l323284l232924J98021J883930O03336l43033N89106
11052c566291J453648J316265J571537K132530Q86198j896288k828367o67445
$$ plain form
11110 -3963677 -5589282 -6410794 -3473422 1481615 4341196 5038472 6845664 9640094
11102 9640094 8973640 3109816 -3467943 -6151979 -6559938 -9418792 -14919329 -17957195
11094 -17957195 -15099823 -9315982 -6347120 -7926204 -10339368 -9419711 -5383349 -1841588
11086 -1841588 -905551 -1092034 -602546 -701846 -3569922 -7637001 -8360623 -4675888 -1583596
11077 -1583596 -3742133 -8704468 -10210839 -7207604 -5153019 -7645400 -11121545 -10279738
11069 -10279738 -5405906 -1060656 167335 -955902 -3430951 -6487585 -7737547 -5105641
11061 -5105641 -871910 58557 -3264727 -6497651 -6299630 -4415700 -3812364 -4155397 -3566291
11052 -3566291 -2112643 -796378 775159 2907689 3793887 1897599 -930768 -1598213
11044a598213J481464J040904m53865p67954p50746k042588l456401k566772M26821
11035h687350K802238K645018O22479j015174n47085J317506J739014n94855k688379
11026d406588p46550L771207N236733J778819j839338j200174J625651J871918
11018F091678r12185l151688k653423l50742K084235L275976J843111j834314
11010D392648m284907k535899J336395K449819r8976k187798j168045L35149o76565
11001b438179k131331k15040L513462L267187k001742n625918k274209L771091
10993d134679M293071r67319m286508j863119J139811K4582j611573J320072N842818
10984b42844N143131l86436l687882j841872O37757r0787k128285k472323j320327
$$ plain form
11044 -1598213 -116749 924155 470290 -297664 -1048410 -3090998 -6547399 -9114171 -8687350
11035 -8687350 -5885112 -3240094 -2617615 -3632789 -4179874 -2862368 -1123354 -1718209 -4406588
11026 -4406588 -5153138 -1381931 3854802 5633621 3794283 2594109 4219760 6091678
11018 6091678 5179493 2027805 -625618 -976360 1107875 4383851 6226962 4392648
11010 4392648 107741 -2428158 -1091763 1358056 1259080 -928718 -2096763 -1761614 -2438179
11001 -2438179 -4569510 -4784550 -1271088 1996099 -5643 -5631561 -7905770 -4134679
10993 -4134679 158392 -808927 -5095435 -6958554 -5818743 -5794161 -7405734 -6085662 -242844
10984 -242844 4900287 4513851 825969 -1015903 -378146 -468933 -2597218 -5069541 -6389868
10975f389868K57905K343664L919244K776836m83006k274055j387993m78716q35392
10966b551381l35922J569319J869316m12447j584966M96487K322727P09778j550007
10957E32904n99066J734721J248993j459500k469861j260765p77932j839648k239345
10948g129499j117271j77614m25649q48664m68033O25988K020724K990699K598257
10939a931062J243716O01914O52383p93028l734779m313531m61267L809202L607092
10930a319360J88730j467760j56866J049511N15330l28255n14000n73144l27624
10921b933438O87766J036328p95245k917454k123921R22163K359969P87630j449515
10912d425717k428081k298308r23474J994314M196339K603107j420549k763897
$$ plain form
10975 -6389868 -6131963 -3788299 130945 2907781 2424775 150720 -1237273 -1715989 -2551381
10966 -2551381 -2887303 -1317984 551332 138885 -1446081 -949594 1373133 2082911 532904
10957 532904 -66162 1668559 2917552 1458052 -1011809 -2272574 -3050506 -4890154 -7129499
10948 -7129499 -8246770 -8424384 -8850033 -9698697 -10166730 -9540742 -7520018 -4529319 -1931062
10939 -1931062 -687346 -85432 566951 -226077 -3960856 -8274387 -8735654 -4926452 -1319360
10930 -1319360 -1130630 -2598390 -2755256 -1705745 -1190415 -1518670 -2032670 -2605814 -2933438
10921 -2933438 -2245672 -1209344 -2004589 -4922043 -7045964 -6123801 -3763832 -2976202 -4425717
10912 -4425717 -6853798 -9152106 -10075580 -8081266 -3884927 -1281820 -2702369 -5466266
10904e466266K00764L233119K837489J099992J167663J583973q56732m749743
10896i49741n080476n03615M111423L841192R657j969136r2973J759016k19581
10887I05766m012875m801601k141424K032K17048J591073N029827N966239J547950
10878D304035l394197k864050J085248J810621j357849k872329n88903J519885
10870b357539J113593J047101K992900L718053R48782k237726k442567r74682
10862A807915m21403m41038m92596k230690n005993l797711K844876P320385K609270
10853B193015n961125p116567j68076M344545J056874l151816j674068J747688
10845h729530J316492l96678J782622N190662L670035j045202j612595K565157
$$ plain form
10904 -5466266 -5265502 -2032383 805106 1905098 3072761 4656734 3800002 -949741
10896 -949741 -6030217 -6533832 -2422409 1418783 1428440 -540696 -633669 1125347 905766
10887 905766 -3107109 -7908710 -10050134 -10048102 -9831054 -8239981 -3210154 2756085 4304035
10878 4304035 909838 -1954212 -868964 941657 -416192 -3288521 -3877424 -2357539
10870 -2357539 -1243946 -196845 2796055 6514108 7462890 5225164 2782597 1807915
10862 1807915 1386512 945474 452878 -1777812 -6783805 -10581516 -7736640 -416255 2193015
10853 2193015 -3768110 -10884677 -11052753 -6708208 -5651334 -8803150 -10477218 -8729530
10845 -8729530 -7413038 -7809716 -6027094 -836432 2833603 1788401 175806 2740963
10837B740963M399815R96772k194955j210426K94320j733487m818287m531248
10829f056533j234318J669118K533891J524344o16264j720944o7753J625449o52125
10820b995135m054918j391616N921180O944458j652969p781642j705420P803902
10812A087840O666619k530838n734350k14905L030973j243566n538077m137756
10804h614060j245868p68540K32066L171974L573039K64273o45498L362072N245259
10795D574717l62247p646402q046465k060727L465326M685149K252613j701227
10787d839263l879217j833814J454779O86177k268211R5079P418192R482706K282291
10778H598719m512920k906941J137197l33431k919794J096530P232075N366308
$$ plain form
10837 2740963 7140778 8137550 5942595 4732169 5026489 3293002 -1525285 -6056533
10829 -6056533 -7290851 -5621733 -3087842 -1563498 -2179762 -3900706 -3968459 -2343010 -2995135
10820 -2995135 -7050053 -8441669 -2520489 4423969 2771000 -5010642 -6716062 1087840
10812 1087840 7754459 5223621 -510729 -725634 2305339 1061773 -4476304 -8614060
10804 -8614060 -9859928 -10628468 -10396402 -7224428 -3651389 -3387116 -4032614 -670542 4574717
10795 4574717 4212470 -3433932 -11480397 -13541124 -10075798 -5390649 -3138036 -4839263
10787 -4839263 -8718480 -10552294 -9097515 -8411338 -10679549 -10584470 -3166278 6316428 8598719
10778 8598719 4085799 1178858 2316055 1982624 -937170 159360 7391435 12757743
10770A2757743k955605o693834k543922J767270Q08570k315098l555065l056265
10762e786206j801840m6599N35292j139852k117166O08520M208419L761287K47
10753a777898k422916k301716j673186o09150J740612L236431J880063L81843
10745a545917J771207L486427J955865m57459K04233J941273Q45698j157393m71457
10736F572477K94663k665350n430782k219098L291957L202565q73276r69023K236880
10727C441013M11315o414793p959439k67038P713713P872720K914906j362194
10719F350203m167292n635149l348862K065017M987643K799002m35854j407710
10711A206998j870744k541594l36632M268256M641991j947185q111925o181535
$$ plain form
10770 12757743 9802138 3108304 564382 2331652 3140222 825124 -2729941 -5786206
10762 -5786206 -7588046 -7634645 -7099353 -8239205 -10356371 -9747851 -5539432 -1778145 -1777898
10753 -1777898 -4200814 -6502530 -8175716 -8784866 -7044254 -3807823 -1927760 -1545917
10745 -1545917 225290 3711717 5667582 5210123 5414356 7355629 8201327 7043934 6572477
10736 6572477 6867140 4201790 -1228992 -3448090 -156133 3046432 2173156 1204133 3441013
10727 3441013 3852328 -2562465 -10521904 -10788942 -3075229 4797491 7712397 6350203
10719 6350203 2182911 -3452238 -6801100 -4736083 251560 3050562 2614708 1206998
10711 1206998 -663746 -3205340 -3541972 726284 5368275 3421090 -4690835 -10872370
10703a0872370P08301L521286q4131l973333k742902K149378N449755M381858
10695a462158J131146l07319O85786Q41659j464475l056874j078384J743625J134616
10686a832378j878581l012976j719686j036953j845900k128129q65119J313358
10678a3006364L624538M054000K72747m826724l931927L359944O880668P55068
10670b818050n712786k044844N853576N220274k098460l237071L376298N951716
10662D490653Q6409m720703k505758K78038j545792k751778J208142N347614M252133
10653D138958P50684p09531j259890k846171l684137k910382k718084k611670
10645a1850223Q27270N801014N572346j82004l486324r38309J143841j391264
$$ plain form
10703 -10872370 -10164069 -6642783 -6726914 -10700247 -13443149 -11293771 -5844016 -1462158
10695 -1462158 -331012 -638331 47455 889114 -575361 -3632235 -4710619 -2966994 -1832378
10686 -1832378 -3710959 -6723935 -8443621 -9480574 -11326474 -13454603 -14319722 -13006364
10678 -13006364 -9381826 -5327826 -5055079 -9881803 -13813730 -10453786 -3573118 -2818050
10670 -2818050 -8530836 -10575680 -4722104 498170 -1600290 -4837361 -1461063 4490653
10662 4490653 4577062 -143641 -2649399 -2371361 -3917153 -6668931 -5460789 -113175 4138958
10653 4138958 4889642 4180111 2920221 74050 -3610087 -6520469 -9238553 -11850223
10645 -11850223 -11022953 -5221939 350407 168403 -3317921 -4256230 -3112389 -4503653
10637d503653l314114j19740L731631K992257K87775J81983J105125o01028l709637
10628c949401m448728j927056K118083N180263M188146j280310n633105l161618
10620h913726K859299M090315l54205l659997l183085l017288m375888l484364
10612b0038939j37852J502389J574993L954699O603653L450001l434989n131919
10604a1657964l75250K980530J787436N91465L56768k405749m811203n24208N911934
10595h146241L776270l864572l087643N770325O434990m722399j0053990L55433
10587a3537827J1634827Q345157k288322n256189p24119K048275J346089M56032
10579B023923j156417l259221j395471L340907K154985o227442j0674713n373474
$$ plain form
10637 -4503653 -7817767 -7937507 -4205876 -1213619 -925844 -743861 361264 -239764 -3949401
10628 -3949401 -8398129 -10325185 -8207102 -3026839 1161307 -119003 -5752108 -8913726
10620 -8913726 -6054427 -1964112 -2318317 -5978314 -9161399 -12178687 -16554575 -20038939
10612 -20038939 -20176791 -18674402 -17099409 -13144710 -6541057 -3091056 -6526045 -11657964
10604 -11657964 -12033214 -9052684 -7265248 -6673783 -6317015 -8722764 -13533967 -14058175 -8146241
10595 -8146241 -4369971 -8234543 -11322186 -5551861 883129 -3839270 -13893260 -13537827
10587 -13537827 -1903000 6442157 4153835 -1102354 -1826473 221802 1567891 2023923
10579 2023923 867506 -2391715 -3787186 -446279 1708706 -4518736 -15193449 -20566923
10571b0566923J211046K475652L717771P895075P402361m40083n490145k154611
10563e949857J056175j397461k270992J780523J867263m529627n774482K010493
10555a3207965N523930j093953l923055M447724R065182k60519q642708k188390
10547a0279754P163083L867085m251204l193374J682409n51114m565496k188492
10539a2316857k87334m703017m892851M831214R119602j647432j0324992k237054
10531b2458721P642444K480981n360515M08366P622173j33008r955930l618350
10523b3372560O895210K397200o616770j823511O105353j45518p793994J050707
10515b3303883J0679188J7564j3896802n580355R506303L337566j0927800n233411
$$ plain form
10571 -20566923 -19355877 -16880225 -13162454 -5267379 2134982 1694899 -3795246 -5949857
10563 -5949857 -4893682 -6291143 -8562135 -6781612 -4914349 -9443976 -15218458 -13207965
10555 -13207965 -7684035 -8777988 -12701043 -8253319 811863 551344 -8091364 -10279754
10547 -10279754 -3116671 750414 -3500790 -6694164 -5011755 -5562869 -10128365 -12316857
10539 -12316857 -12604191 -17307208 -22200059 -17368845 -8249243 -9896675 -20221667 -22458721
10531 -22458721 -14816277 -12335296 -17695811 -17287445 -9665272 -9798280 -19754210 -23372560
10523 -23372560 -16477350 -14080150 -20696920 -22520431 -16415078 -16560596 -24354590 -23303883
10515 -23303883 -12624695 -12607131 -26503933 -32084288 -22577985 -19240419 -30168219 -35401630
10507c5401630P651026L29237j2034474r62488J4330625J048791j8477142n368570
10499d8884625J5992114j09819k6682861q480430K5097424N121133l8834814k1274414
10491i8056292K6434854r266930r4213948m3223017J73549245L10248899J72338158
10484D37810969q8270578j82169766p6534207J9062295m967754m6420369j7286985
10477D1223605K1851135M433469k5268039j2015875J1672498R84221j7280140
10470B5600874n384415J2689134K621758j4909701p750683Q017865L864953p870605
10462A6879180l618752N425766r4869q141997j558314O372431j165806j0443020
10454C654619l980570N566487Q80224o450239J73183R099566K961080p507236
$$ plain form
10507 -35401630 -27750604 -27421367 -39455841 -40418329 -26087704 -25038913 -43516055 -48884625
10499 -48884625 -32892511 -33002330 -59685191 -68165621 -43068197 -37947064 -76781878 -98056292
10491 -98056292 -71621438 -80888368 -175102316 -218325333 -44776088 265472811 437810969
10484 437810969 349540391 167370625 90836418 109898713 104930959 58510590 41223605
10477 41223605 63074740 67508209 42240170 30224295 41896793 42881014 25600874
10470 25600874 20216459 32905593 35527351 20617650 12866967 20884832 24749785 16879180
10462 16879180 13260428 18686194 18591325 10449328 8891014 15263445 14097639 3654619
10454 3654619 -325951 5240536 6120760 -329479 -156296 8943270 11904350 4397114
10446D397114l706448O260956M086997m708222l144288N262759N343781j071021
10438A2721628j767680J266326j513377n720778j529710N087341J897724o337911
10430D103563n387005L722819P367005K278855k093118j060101R75997J313519
10422A1221534J355940O37012j623374k402818j0313J686387L63481l10721J200155
10413A2117283L77414l739514m929155j200381J107634j75705J060241N301250
10405I919067L616506n301399r344626k667656L934451J714449k242183l53511
10397g24902J796198j047038j780419M439477P936155J026739o670313m271110
10389G04787J761246O28661l183767p0000N426670L128683l342616l149418K138415
$$ plain form
10446 4397114 690666 6951622 11038619 6330397 3186109 8448868 13792649 12721628
10438 12721628 10953948 12220274 10706897 4986119 3456409 8543750 10441474 4103563
10430 4103563 -1283442 2439377 9806382 12085237 9992119 8932018 9908015 11221534
10422 11221534 12577474 13214486 11591112 9188294 9177981 10864368 11227849 10917128 12117283
10413 12117283 12494697 8755183 3826028 2625647 3733281 3557576 4617817 9919067
10405 9919067 13535573 8234174 -1110452 -3778108 156343 1870792 -371391 -724902
10397 -724902 1071296 24258 -1756161 2683316 10619471 11646210 4975897 704787
10389 704787 2466033 3094694 -89073 -159073 5267597 8396280 5053664 1904246 4042661
10380D042661K308450k865907m561553j134899R15128k12184m59725N31147k46839
10371a683721j557644k74223J487365J04711k267791j827734l4416O36306K110997
10362c306150N000430M483925p37249l351998O28280L593183q53570n870841k702761
10353c116751M491740O474654L802508K179064K95711n349198r808854o368445
10345g399571J066954L734255J610314Q29012K426382L563664M656470N877202
10337A6364682K765030n233417r100239l261764L646228K059443k952103j853329
10329B434531K165754M70373m004091k544274K384137J821413k556612j828785
10321a657554L027521L038424j991484l698498o34537Q25079k58504Q84969L019787
$$ plain form
10380 4042661 6351111 3485204 -1076349 -2211248 -1296120 -1508304 -1968029 -1436882 -1683721
10371 -1683721 -3241365 -3515588 -2028223 -1923512 -4191303 -6019037 -6053453 -5417147 -3306150
10362 -3306150 1694280 6178205 5440956 2088958 2717238 6310421 5456851 -413990 -3116751
10353 -3116751 1374989 7849643 11652151 13831215 14126926 8777728 -1031126 -7399571
10345 -7399571 -6332617 -2598362 -988048 -159036 2267346 5831010 10487480 16364682
10337 16364682 19129712 13896295 4796056 1534292 5180520 7239963 4287860 2434531
10329 2434531 4600285 5070658 1066567 -1477707 906430 2727843 171231 -1657554
10321 -1657554 1369967 4408391 2416907 -1281591 -1916128 -1091049 -1349553 -464584 2555203
10312B555203O55881l665566k502841K270443K259984j631672p90373M264837
10304C415896L992689k309277m130973K167029P273897M571418j127963m269285
10296I583431n924062o687784l568945K136189M150779J559653M2589Q76257n24078
10287A644029l431423j373320M423442M124796l784332p604268p35376P150337
10279D13885N276334k166445m252259K67846M042867L169597j19436l217222m880186
10270a465019l759997k01635K669506K932570K241810J995143P84478k017119
10262C179737l900490k907964m52098J458894K835526M180496N040400M816238
10254A4250739K916848j083951n080536m758931K181K509704j641579o582483
$$ plain form
10312 2555203 3211084 -454482 -2957323 -686880 1573104 -58568 -848941 3415896
10304 3415896 7408585 5099308 968335 3135364 10409261 14980679 13852716 9583431
10296 9583431 3659369 -3028415 -6597360 -4461171 -310392 1249261 1291850 2168107 1644029
10287 1644029 -1787394 -3160714 1262728 5387524 1603192 -6001076 -6736452 413885
10279 413885 5690219 3523774 -728485 -460639 3582228 6751825 6632389 3415167 -1465019
10270 -1465019 -5225016 -5426651 -2757145 175425 2417235 4412378 5196856 3179737
10262 3179737 -720753 -3628717 -4080815 -2621921 213605 4394101 9434501 14250739
10254 14250739 17167587 16083636 11003100 6244169 6246350 8756054 7114475 531992
10246E31992m287585K661354M883602M70091l720801l747667k158658m29489K611122
10237c186039M633201J550934l929279m709298q65382O15445j720966j795511
10229i406895K238822M816649L767297L654206N322088K944428m247694p740357
10221A348544k763619L689214L828082q4934j828964q44816K40119J370868K716219
10212G670713J971141j275021l456932k821111j912537j686006M20491L928091
10204B838829M078068J90107k225951q62055j85158k289683k785320J75808J713851
10195F48496k75902o21787K840278M065586J21397k174232J496249L926690j129720
10186H897055o694066l854466K415259J264762n640933o880830K12171O199101
$$ plain form
10246 531992 -3755593 -1094239 3789363 4259454 538653 -3209014 -5367672 -5797161 -3186039
10237 -3186039 1447162 2998096 -931183 -5640481 -6505863 -5890418 -7611384 -9406895
10229 -9406895 -7168073 -2351424 1415873 5070079 10392167 13336595 9088901 1348544
10221 1348544 -1415075 2274139 6102221 6017287 4188323 3343507 3583626 4954494 7670713
10212 7670713 9641854 8366833 4909901 2088790 176253 -1509753 -1089262 2838829
10204 2838829 6916897 7107004 4881053 4018998 3833840 1544157 -1241163 -1065355 648496
10195 648496 372594 -249193 2591085 6656671 6778068 4603836 6100085 10026775 8897055
10186 8897055 2202989 -1651477 763782 2028544 -3612389 -10493219 -10281048 -4081947
10178d081947M458995j028602l811782k535675P43047L357983K698881q35969
10170a035069k448319P92624M565871L465452m94630j772628m73335l99450q80683
10161A319833J219456L481552Q47972m461651n131323q91807Q40677k286644l603367
10152h665302P98999N109284L423546q95030j422184J113666J353714j260840
10144d44147k187249J42633J799541j11978k726389j618130K562503M608642J758988
10135C784414k390483k527956J420079M574672L839944J131571q31482k505338
10127F495421n090956o808517m754423O20772N466457O587506L966396q2202k902340
10118C498114l283370k265853j625851j462695o58549M54244K76487r09601p88656
$$ plain form
10178 -4081947 377048 -651554 -4463336 -6999011 -6255964 -2897981 -199100 -1035069
10170 -1035069 -3483388 -2690764 1875107 5340559 4845929 3073301 2599966 2200516 1319833
10161 1319833 2539289 6020841 6868813 2407162 -2724161 -3615968 -2775291 -5061935 -8665302
10152 -8665302 -7866303 -2757019 666527 -228503 -1650687 -537021 816693 -444147
10144 -444147 -2631396 -2488763 -689222 -801200 -3527589 -5145719 -2583216 2025426 3784414
10135 3784414 1393931 -1134025 286054 4860726 8700670 9832241 9000759 6495421
10127 6495421 1404465 -5404052 -10158475 -9537703 -4071246 2516260 6482656 6400454 3498114
10118 3498114 214744 -2051109 -3676960 -5139655 -5798204 -5343960 -5067473 -5977074 -6765730
10109f765730J184585K680348K211797J035187K11248j062504k720650k657562
10101e883281j74955K236034K382184J088840O7736k07840N09751K252490L083841
10092E354800J013747j801312j300398J520210J625558j048979p78384L274927
10084G860169L714597k965138q787988n783807J536680L548091K50920p38390
10076a364866K258505L305745p1096l187529k591350p42130o09007j467445j743710
10067f212883j367781j79606J925084K839774M23285k971537k579934J713832
10059f409766M832804L854250J634495J717757L348039L449646R69231k481691
10051A0914765m715236m612801k660844k78184J699081L164623L242925P04648
$$ plain form
10109 -6765730 -5581145 -2900797 -689000 346187 557435 -505069 -3225719 -5883281
10101 -5883281 -6058236 -3822202 -1440018 -351178 -283442 -491282 18469 2270959 5354800
10092 5354800 6368547 4567235 3266837 4787047 6412605 5363626 4585242 7860169
10084 7860169 11574766 8609628 -178360 -5962167 -4425487 -877396 -626476 -1364866
10076 -1364866 893639 4199384 4128288 940759 -1650591 -2392721 -3001728 -4469173 -6212883
10067 -6212883 -7580664 -7760270 -5835186 -2995412 -2572127 -5543664 -8123598 -6409766
10059 -6409766 -1576962 2277288 3911783 5629540 8977579 12427225 13396456 10914765
10051 10914765 6199529 1586728 -1074116 -1352300 346781 3511404 6754329 7458977
10043G458977l200172m851645k745548N62583K297313K211956L70862l467729
10035a363403o353543l416603M100884P817915L711399j309106j69288L148668
10027F166923J058242m197499m425323L43052K144807j373640l967248k059662
10019f310348M76667N65581K94699O82914q40306l831799l334837J457730M055790
10010f783909M23901m296938l625553P96919K754509P47909j371754r09194Q75101
10001a1389009J659780Q39573m87946j061850r83609j198477r64865J811396N779001
9992e996006N360506j009753n725903j643224O118436O424824j263508o184749
9984c919377k676698K848765L816915K394843K118593Q57958k850364m311601
$$ plain form
10043 7458977 4258805 -592840 -3338388 -2775805 -478492 1733464 2104326 -1363403
10035 -1363403 -7716946 -11133549 -7032665 785250 4496649 3187543 3018255 6166923
10027 6166923 7225165 3027666 -1397657 -1054605 1090202 -283438 -4250686 -6310348
10019 -6310348 -5833681 -5268100 -4973401 -4290487 -5130793 -8962592 -12297429 -10839699 -6783909
10010 -6783909 -6360008 -10656946 -14282499 -13485580 -10731071 -9983162 -11354916 -12264110 -11389009
10001 -11389009 -9729229 -8889656 -9377602 -10439452 -11423061 -12621538 -13586403 -11775007 -5996006
9992 -5996006 -635500 -1645253 -7371156 -9014380 -2895944 3528880 2265372 -3919377
9984 -3919377 -6596075 -3747310 69605 2464448 4583041 5440999 2590635 -1720966
9976a720966m40111L345709J129345l814805m447875p63054J852619J492815J83581
9967c182742j503020l681308l672710J35442L294241Q52245l996380l775785J912763
9958a3617254N920724M214188K39209j955299k529360k341620n00592K245985
9950h324019K544784l89241k524063p85188K140422J926140q77811k025805j61349
9941h476130J427943J76034j646333l03227L466318M916496J979972j571533j457466
9932a487926J218819K335122J039475q8541J0497q0584p72377j176010j856876
9923h58401l513208l674399p2360L450158J251742l868108l105394M010190P088362
9914G08582O81632o664633n325393J724297N630175M741228K563073p43032n328854
$$ plain form
9976 -1720966 -2161077 1184632 2313977 -1500828 -5948703 -6711757 -4859138 -3366323 -3182742
9967 -3182742 -4685762 -8367070 -12039780 -11904338 -8610097 -7757852 -11754232 -15530017 -13617254
9958 -13617254 -7696530 -3482342 -3243133 -5198432 -7727792 -10069412 -10570004 -8324019
9950 -8324019 -5779235 -6168476 -8692539 -9477727 -7337305 -5411165 -6288976 -8314781 -8476130
9941 -8476130 -7048187 -6872153 -8518486 -8821713 -5355395 -438899 1541073 -30460 -1487926
9932 -1487926 -269107 2066015 3105490 3016949 3027446 2946862 2174485 998475 -858401
9923 -858401 -4371609 -8046008 -8118368 -4668210 -3416468 -7284576 -10389970 -6379780 708582
9914 708582 1390214 -5274419 -10599812 -8875515 -3245340 1495888 4058961 3315929 -2012925
9905b012925n863030P42561O467221K331305o254712o580804J294206N016261
9897d859917K12862l763244q06957K753481R30550j860760j25873L131996L189607
9888a198255J786569J751990Q29784k461476l802952p36928J433039j356966l750306
9879g505501j3373N026059L690290r49619n159N748995O695927J32781n555866
9870G264534m094152O02823K416319J347448K46624n80694j589310j442337J75294
9861D346549O58436j620574m233542l860439l64299L752397N774519L933248j106788
9852G279507n226048m364600J50216K931965J809026K907M5137K3694j779886
9843H71918k801992m62725K536500J533141k929491n308797k305914L194802N913807
$$ plain form
9905 -2012925 -7875955 -7133394 -666173 1665132 -4589580 -11170384 -9876178 -4859917
9897 -4859917 -4647055 -8410299 -9217256 -6463775 -5533225 -7393985 -7519858 -4387862 -1198255
9888 -1198255 588314 2340304 3170088 708612 -3094340 -3831268 -2398229 -3755195 -7505501
9879 -7505501 -7518874 -2492815 1197475 247856 242697 5991692 12687619 12820400 7264534
9870 7264534 3170382 3773205 6189524 7536972 7783596 7202902 5613592 4171255 4346549
9861 4346549 5004985 3384411 -849131 -4709570 -5073869 -1321472 4453047 8386295 7279507
9852 7279507 2053459 -2311141 -2160925 771040 2580066 2582973 2628110 2651804 871918
9843 871918 -1930074 -2392799 143701 1676842 -1252649 -6561446 -8867360 -5672558 241249
9834B41249L794008p74416l956863l977809k083014m15318N90272J962984L718587
9825i00320M210852K480253n3560j095332J300J596386J183865k159193n866178
9816f01927n470410J2763N347202M650073p87025l895893j311830K728621L253385
9807C924959R09134j075747k187118l220219k872261j35253K205468J121692j122840
9798b452185J61694M435341O167519K961230j420956l218263l273099l597690
9790b36409l528881k081955p94590r85864p68420J640185L626845J471356k854943
9781d512676k879381L274755R059311P513415M13318m275046k926672O9452j30038
9772E606438k042680j702946J12928m34566k689234j691004L055322N156590R66172
$$ plain form
9834 241249 4035257 3260841 -696022 -4673831 -6756845 -7172163 -6581891 -4618907 -900320
9825 -900320 3310532 5790785 5737225 4641893 4643193 6239579 7423444 5264251 -601927
9816 -601927 -6072337 -6059574 -712372 3937701 3150676 -745217 -2057047 671574 3924959
9807 3924959 4834093 3758346 1571228 -1648991 -4521252 -4656505 -2451037 -1329345 -2452185
9798 -2452185 -2290491 2144850 8312369 11273599 9852643 6634380 3361281 -236409
9790 -236409 -3765290 -5847245 -6641835 -7627699 -8396119 -6755934 -3129089 -1657733 -4512676
9781 -4512676 -7392057 -4117302 4942009 12455424 12868742 8593696 5667024 5736476 5606438
9772 5606438 3563758 1860812 1973740 1539174 -1150060 -2841064 214258 5370848 6337020
9763F337020l849741k622251J828839K013926j680742j826147K975527N124688
9755H301119P37810l489859j399046K215370r6142n244736m175068K903465N919197
9746E672110K44007o628764o828231k722502q55930j354765J70276L718805M686775
9737c898219J591909j605528j331388J610001M496141N716106M624312J394082
9729A2597416k003265l091286j983906j109727j455867j512648m29302N73647
9721A585062Q15119J237597J655376J51721k872880l481620m162L064963J026439
9712C177615l509148l981844M51858M009754L129408P37805K40908M35833p55908
9703C936281j776253m81326J284964L53293k230358k373779Q91371L838340K900152
$$ plain form
9763 6337020 2487279 -134972 1693867 3707793 2027051 200904 3176431 8301119
9755 8301119 9038929 5549070 4150024 6365394 6269252 1024516 -3150552 -247087 5672110
9746 5672110 5916117 -712647 -7540878 -10263380 -11119310 -12474075 -12303799 -8584994 -3898219
9737 -3898219 -2306310 -3911838 -5243226 -3633225 862916 6579022 11203334 12597416
9729 12597416 10594151 7502865 5518959 4409232 2953365 1440717 1011415 1585062
9721 1585062 2400181 3637778 5293154 5444875 2571995 -909625 -913787 2151176 3177615
9712 3177615 -331533 -4313377 -3861519 148235 3277643 4015448 4256356 4692189 3936281
9703 3936281 2160028 1678702 2963666 3316959 1086601 -1287178 -395807 3442533 6342685
9694F342685j350968n450597o563107m474880j154681J459967L202088M392297
9686c597196L621871k82712m040602k213702M258368O801944N68673p441349p411855
9677i736560l49613M495310L587483J985995K623036K003293j200283k141701
9669A266960J271412L188441o80293m941011k842745K558521L515009O1202j411680
9660A985816J7731j124791n510330o253365l39086N148480L170346k732246l964402
9651i601847P39033M697858L564007L42460m54473R98187J598816M21573o17001
9642A688613k19377M46799k55439j950873k745705j729898M5077J152006J382807
9633b185990J361721J429537J496767J288869K74880j692730l192639k184340
$$ plain form
9694 6342685 4991717 -458880 -7021987 -11496867 -12651548 -11191581 -7989493 -3597196
9686 -3597196 24675 -258037 -4298639 -6512341 -2253973 4547971 5116644 -2324705 -9736560
9677 -9736560 -10086173 -5590863 -2003380 -17385 2605651 4608944 3408661 1266960
9669 1266960 2538372 5726813 5046520 105509 -2737236 -178715 3336294 3397496 1985816
9660 1985816 2003547 878756 -4631574 -10884939 -11224025 -6075545 -2905199 -5637445 -9601847
9651 -9601847 -8862814 -4164956 -600949 -258489 -712962 285225 1884041 2305614 1688613
9642 1688613 1469236 1916035 1660596 -290277 -3035982 -4765880 -4720803 -3568797 -2185990
9633 -2185990 -824269 605268 2102035 3390904 3665784 1973054 -1219585 -3403925
9625c403925Q18584K266288J29292k578404j467617K875384N241994K551206k605696
9616C827106n720276n029724j604180K525578M850724L358971r09238l841972
9608b543011k738994L93035J793778Q70128m9047J52244K83435k12622p2010J085783
9598a037281J211820j196949l978346l434717N78709L766231K551751j186332
9590b725114k249975J161983M782477L592209j402983m079188j182483L078667
9582I75593K378496l294255p437633n227578R47506N191105M828259J594310j748728
9573a792925l282969j838321J734066L744336J461279k380517k601120N18726
9565d437445R66539l569061o989663l396387L688348O172205K952637L57149J785121
$$ plain form
9625 -3403925 -2585341 -319053 -189761 -2768165 -4235782 -1360398 3881596 6432802 3827106
9616 3827106 -1893170 -6922894 -8527074 -6001496 -1150772 2208199 1298961 -2543011
9608 -2543011 -5282005 -4888970 -3095192 -2225064 -2274111 -2121867 -1838432 -2051054 -2123064 -1037281
9598 -1037281 174539 -1022410 -5000756 -8435473 -7856764 -4090533 -1538782 -2725114
9590 -2725114 -4975089 -3813106 969371 4561580 3158597 -920591 -2103074 975593
9582 975593 3354089 59834 -7377799 -12605377 -11657871 -6466766 -1638507 -44197 -1792925
9573 -1792925 -5075894 -6914215 -5180149 -1435813 25466 -2355051 -4956171 -4437445
9565 -4437445 -3470906 -7039967 -14029630 -17426017 -13737669 -7565464 -4612827 -4255678 -2470557
9556b470557L368781J154256k983595m993013l961881j288426J956131M381630
9548d836674M074417J510925N4733J356602K856123J931058k94867j599855k185816
9539B866646k800005k118147P29592L207121K286158j220156l991123m253656
9531e293570k175941J543499M846440M669530J234113p80212J100673K508604
9523G653136j030739n832838m885168Q14430L060299j190049n393351l411807
9515a0216087K180915M974068L218373o5827k038822j757509N08795K762398K163353
9506A729657j077474k774771k78641L130371K430278j924301m431482k023698
9498e220061K124767L370340J679039O38650J522691J493295j281658l677236
$$ plain form
9556 -2470557 898224 2052480 -931115 -5924128 -9886009 -11174435 -9218304 -4836674
9548 -4836674 -762257 748668 803401 2160003 5016126 6947184 6652317 5052462 2866646
9539 2866646 66641 -2051506 -1321914 1885207 4171365 2951209 -1039914 -5293570
9531 -5293570 -7469511 -5926012 -1079572 3589958 4824071 4043859 5144532 7653136
9523 7653136 6622397 789559 -4095609 -3281179 -220880 -1410929 -6804280 -10216087
9515 -10216087 -8035172 -3061104 157269 91442 -1947380 -3704889 -3196094 -433696 1729657
9506 1729657 652183 -2122588 -2401229 729142 3159420 1235119 -3196363 -5220061
9498 -5220061 -3095294 275046 1954085 2592735 4115426 5608721 4327063 649827
9490F49827j916073J794622J469048l537046o577952l011418L146444N303970
9482b678578L079361O42490l92234j177122j118797J128092L412094K320087j000778
9473D214615k376284j303883q87363j651437j029335J060602J743880N27581k92039
9464F337n35637j712055j969985J758800O365600N006001j799324n568790k594961
9455a044014J075911O43992k03790K072420L404612j64035m467829m191784j711349
9446d585866j432667j113527K708608N763739K232999l728792l063648L379824
9438A60670N677641N84415l864825j697791K404185K005707j168629j795322k81488
9429B024563j323584n287029o502051r39380P416589J0024820L637635n066736
$$ plain form
9490 649827 -1266246 528376 1997424 -1539622 -8117574 -11128992 -7982548 -2678578
9482 -2678578 400783 1043273 651039 -526083 -1644880 -516788 2895306 5215393 4214615
9473 4214615 1838331 534448 -352915 -2004352 -3033687 -1973085 -229205 298376 6337
9464 6337 -529300 -2241355 -4211340 -2452540 3913060 8919061 7119737 1550947 -1044014
9455 -1044014 31897 675889 472099 2544519 5949131 5785096 1317267 -2874517 -4585866
9446 -4585866 -6018533 -7132060 -4423452 1340287 3573286 -155506 -3219154 160670
9438 160670 5838311 6422726 2557901 860110 3264295 5270002 4101373 2306051 2024563
9429 2024563 700979 -4586050 -11088101 -12027481 -4610892 5413928 9051563 3984827
9421C984827o889340j307806L584408K640478l98097r61296j169675l956149n461023
9412i933673j041413N096366N165044M17000r88942K142133K586269j758509l469477
9403a785202J519225O204003L515966k657768m350532j577262j60748j588302
9395h80620k470700j749279j448578j264414J234264M923839N268661J225986
9387D839159k531850j953404J261134K681613P55788k474250m487942m244752
9379f154504k041070Q32711K540942K163206Q76410O59531J543440J397208o55188
9370A162686k039809p3084L304039L272512r62945m512231l630895o98989L17022
9361c861694J2386J174376K866204J891313j051409j835662N23196K546498K154266
$$ plain form
9421 3984827 -2904513 -4212319 -627911 2012567 1614470 653174 -516501 -4472650 -9933673
9412 -9933673 -10975086 -5878720 -713676 -296676 -1285618 856515 3442784 1684275 -1785202
9403 -1785202 -265977 5938026 9453992 6796224 2445692 868430 707682 -880620
9395 -880620 -3351320 -5100599 -6549177 -7813591 -6579327 -1655488 3613173 4839159
9387 4839159 2307309 353905 1615039 4296652 5052440 2578190 -1909752 -6154504
9379 -6154504 -8195574 -7362863 -4821921 -2658715 -1782305 -1122774 420666 1817874 1162686
9370 1162686 -877123 -950207 2353832 5626344 4663399 151168 -3479727 -4178716 -3861694
9361 -3861694 -3849308 -2674932 191272 2082585 1031176 -804486 -281290 2265208 4419474
9352D419474J389554K023321K378674M13836k874418m801133l870807o44338K473615
9343I07778K563351m34923k500499n77042K460762J804755j663992k913980j191698
9334a545488p04777k491254k402366R86617L175080J464703l90762Q27172J992082
9325I11007l51198l230634k122302J326482K216219J22051j609848j903782j956219
9316f598224j296783P76293J671258r32119l462428o19788N404236O537283O12632
9307B092360m887088l463991J508974K578413j004601l373272j357163J395261
9299f511107N63621k384372k637635P58715L493041K128357j268347k393208m85919
9290h736854J652171K079791J399722P96081R89379K352131L566087J685559l231250
$$ plain form
9352 4419474 5809028 7832349 10211023 10624859 7750441 2949308 -921499 -1565837 907778
9343 907778 3471129 3036206 535707 -41335 2419427 4224182 2560190 -353790 -1545488
9334 -1545488 -2250265 -4741519 -7143885 -6157268 -2982188 -1517485 -1908247 -1081075 911007
9325 911007 559809 -2670825 -4793127 -3466645 -1250426 -1128375 -2738223 -4642005 -6598224
9316 -6598224 -7895007 -7118714 -5447456 -6379575 -9842003 -10461791 -5057555 1479728 2092360
9307 2092360 -2794728 -6258719 -4749745 -2171332 -3175933 -6549205 -7906368 -6511107
9299 -6511107 -5947486 -8331858 -10969493 -10210778 -6717737 -4589380 -5857727 -8250935 -8736854
9290 -8736854 -7084683 -5004892 -3605170 -2809089 -1819710 532421 4098508 5784067 2552817
9281B552817n750649k097146K628787R37503m705167m638224K387978O366945
9273b317156J985853k845000m33195M156316K520781k771389l487592N4344R45899
9264b191139j471041j636895R45900J084756j609761j708828J613850K741963
9256b231195O4926r11728K188849L848327K02594m102164l477273J54952J507103
9247b755609j7050j098841p4073K040169L651731L360364J089658n53019N65298
9238F208628J481705k229344p819633p193291O40029O385350L588418k155927
9230a094065k525689J265737K345633l67575k125709j080694P9781Q9606N69481
9221b843494J783045J885400N22178n68487m40559L36921J064050Q40832j184407
$$ plain form
9281 2552817 -3197832 -5294978 -2666191 -1728688 -6433855 -11072079 -8684101 -2317156
9273 -2317156 -331303 -3176303 -3609498 546818 3067599 296210 -3191382 -3137038 -2191139
9264 -2191139 -3662180 -5299075 -4353175 -3268419 -4878180 -6587008 -4973158 -2231195
9256 -2231195 -2166269 -3077997 -889148 2959179 3161773 -940391 -4417664 -4262712 -2755609
9247 -2755609 -2772659 -3871500 -3945573 -1905404 1746327 5106691 6196349 5643330 6208628
9238 6208628 7690333 5460989 -2358644 -9551935 -8911906 -2526556 1061862 -1094065
9230 -1094065 -3619754 -2354017 -8384 -375959 -2501668 -3582362 -3502581 -3412975 -2843494
9221 -2843494 -1060449 824951 1347129 778642 338083 675004 1739054 2579886 1395479
9212A395479l434342k492066J420847L111638k2518l082922q89204L791993M937519
9203D736424K764802J850065K389357Q84134j876312j465197J615104J758131
9195A2656508k308266n108415l233411k9774O68832m70347j716190k983551l048610
9186e573224R9088M032460L313763j420658k767840J740725M814689J095966l958870
9177A376099l472265l38743o91297k233187P77503N149952K909825l905891m628714
9168e056718K904948Q184012M319457k082905k692376J11467l27591l282286l514454
9159a436446q64742R92939J904175L668191L807759j101272p323223p272861r03556
9150h529036L845669K866033O95311J597108L094044J824783m24426q90759r11311
$$ plain form
9212 1395479 -2038863 -4530929 -3110082 1556 -20962 -3103884 -3993088 -201095 4736424
9203 4736424 7501226 9351291 11740648 12624782 10748470 9283273 10898377 12656508
9195 12656508 10348242 5239827 2006416 1976642 2645474 2175127 458937 -2524614 -5573224
9186 -5573224 -5474136 -1441676 1872087 451429 -2316411 -575686 4239003 5334969 1376099
9177 1376099 -2096166 -2434909 -3126206 -5359393 -4581890 568062 3477887 -428004 -5056718
9168 -5056718 -2151770 6032242 10351699 8268794 5576418 5687885 5360294 2078008 -1436446
9159 -1436446 -2301188 -1308249 595926 4264117 8071876 6970604 -352619 -7625480 -8529036
9150 -8529036 -4683367 -1817334 -1122023 475085 3569129 5393912 4969486 4078727 3167416
9141C167416k159790k216980R74312L891034K251942j693638k474333L0676J361884
9132C132523N21007P49188K389649J602400k447398n145575l514053n39540L47314
9123b904485L18874J322174J661740k93744j561215J282617N636783N707802Q09559
9114A1980105l833571m374787k283505o84271m55222q37319j065528n23806O66569
9105a411335J059488r1128p93842R59910L163688K150942j277793k514869n22496
9096G22565M37574j739142k994054M5000L791834L044739p72053k199822m16775
9087h0134N85683m67990o04898R66465R18114j855702l314329o40655K843760
9078a649686K752145K48255m03172J450636K657762J442335r18902k875539l851475
$$ plain form
9141 3167416 1007626 -1209354 -235042 3655992 5907934 4214296 1739963 1770639 3132523
9132 3132523 3653530 4402718 6792367 8394767 5947369 801794 -2712259 -3251799 -2904485
9123 -2904485 -2585611 -1263437 398303 104559 -1456656 -174039 5462744 11170546 11980105
9114 11980105 8146534 3771747 1488242 803971 348749 -488570 -1554098 -2077904 -1411335
9105 -1411335 -351847 -442975 -1236817 -276907 2886781 5037723 3759930 1245061 722565
9096 722565 1160139 -579003 -3573057 -3528057 263777 3308516 2536463 336641 -80134
9087 -80134 505549 37559 -567339 399126 1317240 -538462 -3852791 -4493446 -1649686
9078 -1649686 1102459 1350714 947542 2398178 5055940 6498275 5579373 2703834 -1147641
9069a147641l246540j118980O00202L41960k50092J321527L823904L648737O90377
9060D663454j132151j42540K88475k686858o254499n385695L18454O000313P089302
9051B758255L538382j043098l051725j874248L9531K83638n84018m22617O60240
9042C04340L01131j921019l206904j832092Q9602K56703L7417J774354M129560
9033f6908L581519k25299l840278m572596k922684m24249K146663L803192L114967
9024E94327K45773k376051k670342j227339j04399j14806l23276J43532Q70464
9015d962117J102224J153815J767610K172440N46484k624737l723585q44027K362899
9006c048994J307097k254924k459935J141765K334951j559038m553283j243913
$$ plain form
9069 -1147641 -4394181 -5513161 -4912959 -4570999 -4821091 -3499564 324340 3973077 4663454
9060 4663454 3531303 3388763 3677238 990380 -5264119 -10649814 -10331360 -4331047 2758255
9051 2758255 6296637 5253539 2201814 327566 367097 650735 66717 -355900 304340
9042 304340 605471 -1315548 -4522452 -6354544 -6264942 -6008239 -5970822 -4196468 -66908
9033 -66908 3514611 3289312 -550966 -5123562 -8046246 -8470495 -6323832 -2520640 594327
9024 594327 840100 -1535951 -4206293 -5433632 -5538031 -5652837 -5976113 -5832581 -4962117
9015 -4962117 -3859893 -2706078 -938468 1233972 1780456 -844281 -4567866 -5411893 -3048994
9006 -3048994 -1741897 -3996821 -6456756 -5314991 -2980040 -4539078 -9092361 -10336274
8998a0336274M266060M542865j4009k847443j667714k62186p82550q29482J333346
8989f597387M072299N504510M993309J881407k740740m163238L97944N514958
8981H863062L651441l042431n134391o34622J986489j926453n605306k588412
8973d430623K729441L248551N87199K53727J195188r14235m126957l264445J13577
8964d608577N1623k870938k262363K489736M617296J453124j279280M01406K363324
8955C55351M86280j783935K69292L954113L267339j366326l783714j387677J727410
8946A738133J223398k157464m698791m154010j029666K450828L740780J912901
8938i73891j001012j826008K6909J849034J270342p54325j768832j436450j340881
$$ plain form
8998 -10336274 -6070214 -1527349 -1541358 -4388801 -6056515 -6318701 -7101251 -7930733 -6597387
8989 -6597387 -2525088 2979422 7972731 9854138 7113398 2950160 3348104 8863062
8981 8863062 12514503 9472072 4337681 3703059 5689548 3763095 -1842211 -4430623
8973 -4430623 -1701182 1547369 2134568 2388295 3583483 2669248 -1457709 -4722154 -4608577
8964 -4608577 -4556954 -7427892 -9690255 -7200519 -2583223 -1130099 -2409379 -2007973 355351
8955 355351 841631 -942304 -673012 3281101 6548440 5182114 1398400 10723 1738133
8946 1738133 2961531 804067 -3894724 -8048734 -9078400 -6627572 -2886792 -973891
8938 -973891 -1974903 -3800911 -3774002 -1924968 -654626 -1408951 -3177783 -4614233 -5955114
8929e955114j551589n924L609808N734531L126429k089190m500681k257135J128819
8920b760046K121379J104123j27706j537095l259883l497144j008045J884634
8912g079783J849041o57552j924237j02794K610894L117843R29762j789495k559823
8903e606144q94889J113435J026557p60461j402968J75335J538443P62321p5577
8894d123948J866480N062128N111218R83140l388514m265555k368584r80655j510101
8885c614391k309258j430899M89235R30115p06788j393225J494729N392148N058672
8876C910338N5879m080131l334499L0732K081592K364397J693701q29136m611016
8867b718143n324219p42815M422435M760074K197414J883246K901687M43411m347842
$$ plain form
8929 -5955114 -7506703 -7512627 -3902819 1831712 4958141 2868951 -1631730 -3888865 -2760046
8920 -2760046 -638667 465456 337750 -1199345 -4459228 -7956372 -8964417 -7079783
8912 -7079783 -5230742 -5888294 -7812531 -7915325 -5304431 -2186588 -1256826 -3046321 -5606144
8903 -5606144 -6501033 -5387598 -4361041 -5121502 -6524470 -6349135 -4810692 -4048371 -4123948
8894 -4123948 -2257468 2804660 7915878 8899018 5510504 1244949 -1123635 -2104290 -3614391
8885 -3614391 -5923649 -7354548 -6865313 -5935198 -6641986 -8035211 -6540482 -1148334 3910338
8876 3910338 3966217 -113914 -3448413 -3417681 -1336089 1028308 2722009 1892873 -2718143
8867 -2718143 -8042362 -8785177 -4362742 397332 2594746 4477992 7379679 7823090 3475248
8858C475248n019399p06579J797537r61784l533068p17018L964380L925348o72656
8849A552009m020192l229467j090784r02788k081019j641782J438726M300445
8841e674852L263184j117398l946816k337168O21778R00704k20803R32138L628663
8832c950570M063840J907345p8525j633798m049856m895790r74264M079479L424698
8823b107441j473705k119372K850570M972909O06376k570942O81526L486520r13847
8814C412594o516863m430607J820730K438400k107619k899935J553467L531435
8806c198398K05993j918963J082179M046841J862502k624392m032398j984852
8798f561488N74384K123501K466482J478428K43923L44708Q83656j91538j399096
$$ plain form
8858 3475248 -1544151 -2250730 -453193 -1414977 -4948045 -5665063 -1700683 2224665 1552009
8849 1552009 -2468183 -5697650 -6788434 -7691222 -9772241 -11414023 -9975297 -5674852
8841 -5674852 -2411668 -3529066 -7475882 -9813050 -9191272 -8290568 -8511371 -7579233 -3950570
8832 -3950570 113270 2020615 1942090 308292 -3741564 -8637354 -9611618 -5532139 -2107441
8823 -2107441 -3581146 -5700518 -2849948 2122961 2729337 158395 839921 4326441 3412594
8814 3412594 -3104269 -7534876 -5714146 -3275746 -5383365 -8283300 -6729833 -3198398
8806 -3198398 -2992405 -4911368 -3829189 217652 2080154 -544238 -4576636 -6561488
8798 -6561488 -5987104 -3863603 -1397121 81307 325230 669938 1553594 1362056 -37040
8789c7040P72003M781329M356655j739710o168721l158183K915309M211586P72173
8780F705401r97282R14243J628556j874923n406312l712873J724624M622230K104830
8771E708494k299997l810468j717821J425658L571459M061837K359753j197517
8763H101398l874928k890493L70232J545468n93892k601613k163496j546238k843045
8754f496607l642731j121953K637643L729262K439230J608489J042244j159232
8746i63655l049288o93362M321349N282487j68411o139205o378893j770097K594479
8737f964596M003982K891634K86737k140052j875332J255454L434699J546878
8729B439404j941844k236000O49916K029159k399j565681N53069L148094J147488
$$ plain form
8789 -37040 734963 5516292 9872947 8133237 1964516 -1193667 1721642 5933228 6705401
8780 6705401 5708119 6622362 8250918 6375995 969683 -2743190 -1018566 3603664 5708494
8771 5708494 3408497 -401971 -2119792 -694134 2877325 6939162 9298915 8101398
8763 8101398 4226470 1335977 1706209 3251677 2657785 56172 -2107324 -3653562 -6496607
8754 -6496607 -10139338 -11261291 -8623648 -4894386 -2455156 -846667 195577 -963655
8746 -963655 -4012943 -4706305 -384956 4897531 4729120 -1410085 -7788978 -9559075 -6964596
8737 -6964596 -2960614 -68980 217757 -1922295 -3797627 -2542173 892526 2439404
8729 2439404 497560 -1738440 -1088524 940635 938236 -627445 -74376 3073718 4221206
8720D221206m074424n901322k162428J562871N88282j800199l11147L113092K349608
8711b414461k404315m352099o22054L898969M840273L656507K164445j195314
8703C571951n747243o085227m90086M323259L000275J35538J722157L763253j009263
8694C184614q967484r195236k68518P188087N849323J69096k682208j874402J79005
8685f417723K606294M116573K236126k091302m112147k032555O66374J542544
8677c485816K340018L801464L266818J80561j632890j63356J602789J416384J141418
8668H467390J656124M71792k273778j973373K086255L172098k626457q744729
8660B35322p329300q80735K530040J484493Q16480J852889J154234k030061m215113
$$ plain form
8720 4221206 146782 -5754540 -7916968 -6354097 -5765815 -7566014 -7877161 -4764069 -2414461
8711 -2414461 -4818776 -9170875 -9792929 -5893960 -1053687 2602820 4767265 3571951
8703 3571951 -2175292 -8260519 -8750605 -4427346 -1427071 -1291533 430624 4193877 3184614
8694 3184614 -5782870 -14978106 -15246624 -8058537 -2209214 -2040118 -4722326 -6596728 -6417723
8685 -6417723 -3811429 305144 2541270 449968 -3662179 -5694734 -5028360 -3485816
8677 -3485816 -1145798 2655666 5922484 6103045 4470155 4306799 5909588 7325972 8467390
8668 8467390 10123514 10595306 8321528 6348155 8434410 11606508 8980051 235322
8660 235322 -7093978 -7974713 -5444673 -3960180 -3143700 -1290811 -136577 -2166638 -6381751
8651f381751l587718j690022N93051L443603M913246K676113j071354j609220
8643b714052J208205K821047J316691j64323N75265J275547l33521k616551l024156
8634a655848j978354j240485n78137J309520L618947L597913J16759m238462n510094
8625f558241k678242J186026K582809J410891p7269q40260j130980q2080L089214
8616c098132N636383L510673k085009n124662l425670j728533l387906m514828
8608a4217684q83041M150251M485679P05130j523212l37180J089762R67574O66490
8599d896231M97688q57468k512336j771634J137132K848234J824456o0933j049624
8590d840716j145057k70260J769983L471942K965662J008781k39390o77811j371270
$$ plain form
8651 -6381751 -9969469 -11659491 -11066440 -7622837 -2709591 -33478 -1104832 -2714052
8643 -2714052 -1505847 1315200 2631891 2467568 3042833 4318380 3984859 1368308 -1655848
8634 -1655848 -3634202 -4874687 -5452824 -4143304 -524357 3073556 3190315 -1048147 -6558241
8625 -6558241 -9236483 -8050457 -5467648 -4056757 -4134026 -4974286 -6105266 -6187346 -3098132
8616 -3098132 2538251 6048924 3963915 -1160747 -4586417 -6314950 -9702856 -14217684
8608 -14217684 -15100725 -10950474 -6464795 -5759665 -7282877 -7620057 -6530295 -5562721 -4896231
8599 -4896231 -4398543 -5256011 -7768347 -9539981 -8402849 -5554615 -3730159 -3791092 -4840716
8590 -4840716 -5985773 -6256033 -4486050 -1014108 1951554 2960335 2720945 2043134 671864
8581F71864j451756K57208J713004J94318k435955j819287J831896L686242J571441
8572D218975j442542k292166j253840N49547K513877K836776P17l378533k955726
8563a202915L58117J061063k093224l693748m29902L407404K721300q43144k343512
8554c058561r40169M06006J13146r37676j650701j037559J801009N380640N740220
8545E816355J487364l181892l506201l19067J844990J078902o61945j289529l42406
8536I26571J944935M186267L351988j818967p234191o920193p83281M348593L043998
8527A045720j913874l464982L85571M276511K983459j636242l565712j032503
8519b922052J623839J002676l95350R87330L104631J153114m100401o162765k009182
$$ plain form
8581 671864 -779892 -522684 1190320 1384638 -1051317 -2870604 -1038708 2647534 4218975
8572 4218975 2776433 484267 -769573 -220026 2293851 5130627 5131344 1752811 -1202915
8563 -1202915 -844798 216265 -1876959 -5570707 -6000609 -2593205 128095 -715049 -3058561
8554 -3058561 -3998730 -3592724 -3479578 -4417254 -6067955 -7105514 -5304505 76135 5816355
8545 5816355 7303719 4121827 615626 296559 2141549 3220451 2558506 1268977 926571
8536 926571 2871506 7057773 10409761 8590794 1356603 -5563590 -6346871 -1998278 1045720
8527 1045720 -868154 -4333136 -3947565 328946 3312405 1676163 -1889549 -2922052
8519 -2922052 -1298213 -295537 -690887 296443 3401074 4554188 453787 -5708978 -7718160
8510g718160L235229L324076q80687l501130j774523J492915K782014J866641
8502a173625N88884J34967N92239J590427K070342N00298k939102m869810j861128
8493e366508M176523O513139J884761m241094m631728n98325M80357k591369k755529
8484g129773K880611O836951K882416l422930l577455K23539j42398m201776m092883
8475i743698J121573L721763Q85578r71755J757314L740635R72323k163177j576659
8466b256103p71220l002649l813892Q86502N562338K546311n388682q460222l461561
8457a8159178L567370O616778N059765J083210k256313j622105K631951M677844
8449A599322N41473n035031m854410J7985K633026J395918J079749L142526L288647
$$ plain form
8510 -7718160 -4482931 -1158855 -2039542 -5540672 -7315195 -5822280 -3040266 -1173625
8502 -1173625 -584741 -449774 142465 1732892 3803234 4303532 1364430 -3505380 -5366508
8493 -5366508 -1189985 5323154 7207915 2966821 -1664907 -2263232 -1782875 -4374244 -7129773
8484 -7129773 -4249162 2587789 5470205 2047275 -1530180 -1306641 -1449039 -5650815 -9743698
8475 -9743698 -8622125 -4900362 -4014784 -4986539 -3229225 511410 1483733 -679444 -2256103
8466 -2256103 -3027323 -6029972 -9843864 -8957362 -3395024 -848713 -6237395 -14697617 -18159178
8457 -18159178 -14591808 -7975030 -2915265 -1832055 -4088368 -5710473 -3078522 1599322
8449 1599322 2140795 -2894236 -7748646 -7730661 -5097635 -3701717 -2621968 520558 3809205
8440C809205r0504k645513j585075J28313j50039m67644P58248R62273j633410
8431i14146l919855k693449K57327J655846J831366K366713J929465r74934l539936
8422d001603j919738K303200L688020O91246k507743k385734k67791J122025J762584
8413a515534K739648L097692J262469j492810k005660J33253J477363m59828l265179
8404b8586k814877M81772J653575j819871n725301m226336K195389O925183N426089
8395B067037N44482j667118M91118L080078K135505j673581m703576n022060l749702
8386h497817k292447l95395K248790M220982L955356K236365J257511J520397
8378D253742J475745J91409j437960k359754k523945j981580m09330J887129L676073
$$ plain form
8440 3809205 3718701 1073188 -511887 -383574 -533613 -1001257 -243009 719264 -914146
8431 -914146 -4834001 -7527450 -7270123 -5614277 -3782911 -1416198 513267 -461667 -4001603
8422 -4001603 -5921341 -3618141 69879 761125 -1746618 -4132352 -4400143 -3278118 -1515534
8413 -1515534 1224114 4321806 5584275 4091465 2085805 2219058 3696421 3236593 -28586
8404 -28586 -2843463 -2361691 -708116 -2527987 -8253288 -12479624 -10284235 -3359052 2067037
8395 2067037 2611519 944401 1435519 4515597 6651102 4977521 273945 -4748115 -8497817
8386 -8497817 -10790264 -11185659 -8936869 -4715887 -760531 1475834 2733345 4253742
8378 4253742 5729487 5920896 4482936 2123182 -400763 -2382343 -2791673 -904544 2771529
8369B771529L876843K177356r21820l549602l171568P0384K088642r0348l308299
8360e6883k395652J581997K543241q17406k589299R12569N208651M765695R54391
8351A0107304j578481k253374l165549l614362j534800J542185K023133l06439
8343A219617k430457k546425r37444J853648M259407L347282q70194l322588n85606
8334a2760K991063J346881l459177m121388M02219L516789J610319r29081N78610
8325A923475M087435M527605O98221m160168o296802m537118j221760q5972j412059
8316f477143r43821L421145O648685L350755k918287m029276L07508K452332o28947
8307A182951l311076j732786K58291p61260j539208R73818L197881J197353k066422
$$ plain form
8369 2771529 6648372 8825728 7903908 4354306 1182738 1253122 3341764 3251416 -56883
8360 -56883 -2452535 -870538 1672703 855297 -1734002 -821433 4387218 9152913 10107304
8351 10107304 8528823 6275449 3109900 -504462 -2039262 -497077 1526056 1219617
8343 1219617 -1210840 -3757265 -4694709 -2841061 1418346 4765628 3895434 572846 -12760
8334 -12760 2978303 4325184 866007 -3255381 -2853162 663627 2273946 1344865 1923475
8325 1923475 6010910 10538515 11236736 7076568 779766 -3757352 -4979112 -5065084 -6477143
8316 -6477143 -7420964 -3999819 2648866 5999621 3081334 -947942 -640434 1811898 1182951
8307 1182951 -2128125 -3860911 -3602620 -4363880 -5903088 -4929270 -1731389 -534036 -2600458
8298b600458j886114J63421l92062k830464k703340P10880L848419M317506K563746
8289A191534k99710k565076j865127J419837L153171J306563l77999J379549L311296
8280F654038J039193k962696l307008q43435n91070k278612r42175L351594M631503
8271D751332J187343j268192O50005K343935m78218m050915k684969J698884K455987
8262D605192j532055m570424k951013J81595L28756j765753j909435P72268K189658
8253d651211o98642m634455l680656K401167P039812N589372J513669N18279J675125
8244E072460j84934m651459n122262N69327N332046K530930m177343n955201j022633
8235g609069L903045L655292N77436p61553k02746m90421j923923k019138K40677
$$ plain form
8298 -2600458 -4486572 -4323151 -4715213 -7545677 -10249017 -9538137 -5689718 -1372212 1191534
8289 1191534 891824 -1673252 -3538379 -2118542 1034629 2341192 1963193 3342742 6654038
8280 6654038 7693231 4730535 1423527 580092 -10978 -2289590 -3231765 119829 4751332
8271 4751332 5938675 4670483 5320488 7664423 7186205 3135290 450321 2149205 4605192
8262 4605192 3073137 -1497287 -4448300 -4266705 -3937949 -5703702 -7613137 -6840869 -4651211
8253 -4651211 -5349853 -9984308 -13664964 -11263797 -4223985 1365387 2879056 3397335 5072460
8244 5072460 4887526 236067 -4886195 -4316868 1015178 3546108 -631235 -6586436 -7609069
8235 -7609069 -3706024 -50732 526704 -234849 -437595 -928016 -2851939 -4871077 -4630400
8226d630400K707495L044218J426856m86963j759238k239299j627691m2132J071604
8217b535550L32481j286169j210759J342757M242129N171595L944040J529013
8209A1529537j344353l549690l492715j380812O2235q96221k271379j420655O27815
8200b136238Q87743m80813l87746J767806K605573L972l245135l151466J14016
8191d022288K813721K476005J43550j718021j925065j105011m86219n27332p15428
8182e066088o84399q62298j305312q23989J147804K562970J046803j948659k229931
8173h163099J098832L778832K377788p39415j219293P26053J248247p22479k046503
8164c661037p16914J052952O12459j037162j069274R93839L066244L446850K118443
$$ plain form
8226 -4630400 -1922905 1121313 2548169 2061206 301968 -1937331 -3565022 -3607154 -2535550
8217 -2535550 -2203069 -3489238 -4699997 -3357240 884889 6056484 10000524 11529537
8209 11529537 10185184 6635494 3142779 1761967 1824202 927981 -1343398 -2764053 -2136238
8200 -2136238 -1248495 -1729308 -2117054 -349248 2256325 2260297 -984838 -4136304 -4022288
8191 -4022288 -1208567 1267438 1410988 -307033 -2232098 -3337109 -3823328 -4350660 -5066088
8182 -5066088 -5750487 -6612785 -7918097 -8742086 -7594282 -5031312 -3984509 -5933168 -8163099
8173 -8163099 -7064267 -3285435 -907647 -1647062 -2866355 -2140302 -892055 -1614534 -3661037
8164 -3661037 -4377951 -3324999 -2712540 -3749702 -4818976 -3825137 -758893 2687957 4806400
8155D806400j50974k177500k407854o19615O87803j058431m163034l679214J799258
8146f963161O871465N562219p18262m915296l652677q68999j065609k941601k664664
8137a1356585l76281Q78340J091761L042394N951122M817820j513757o198247
8129c663433k586690O001051R577475L916054m781341q225573n099060j69391
8121e030908K403412K254929J078168K83608M2777o29686k397376l814193k507107
8112h316376J108396L377253K172445o4576k54561N65580l51468k076101j342919
8103e182327J334776J757298r75905k415599J88186L179977K175838j028841j424747
8094b391344J554507L792376K875445M87434j385092k704852l343782k348083
$$ plain form
8155 4806400 4655426 2477926 70072 -549543 138260 -920171 -5083205 -8762419 -6963161
8146 -6963161 -91696 5470523 4752261 -163035 -3815712 -4684711 -5750320 -8691921 -11356585
8137 -11356585 -11732866 -10854526 -9762765 -6720371 -769249 4048571 2534814 -3663433
8129 -3663433 -6250123 -249072 9328403 13244457 8463116 237543 -4861517 -5030908
8121 -5030908 -2627496 -372567 705601 989209 1031986 402300 -1995076 -5809269 -8316376
8112 -8316376 -7207980 -3830727 -1658282 -1722858 -1977419 -1411839 -1763307 -3839408 -5182327
8103 -5182327 -3847551 -2090253 -3066158 -5481757 -5293571 -2113594 62244 -966597 -2391344
8094 -2391344 -836837 2955539 5830984 6318418 4933326 2228474 -1115308 -3463391
8086c463391l85532K5237j729406k684291j83518M088427N805193L140147j149619
8077C463247k870589r74567J576148J790213N37618O59353J730601K51792l799511
8068B364305n032843o79956L498670Q06112n713145p076006j685406K876706K118703
8059h522860O48434K953952N585577L546999j124656k941641j310370J78174K9314
8050i57077n38543j016029j272436m7288K271402K165498j472761l653905l24354
8041d845493M266518L557637q18518j973204O71409J194161j748293k519241J231031
8032i83993M277513K872539N90099J068005J559426j278785m627023m060864p96308
8023a379391R66732Q14140J224174K391922K576149J642704L27157j837987m166964
$$ plain form
8086 -3463391 -3848923 -3823686 -5553092 -8237383 -8420901 -4332474 1472719 4612866 3463247
8077 3463247 592658 -381909 1194239 2984452 3522070 4181423 5912024 6163816 2364305
8068 2364305 -2668538 -3348494 150176 956288 -4756857 -11832863 -13518269 -10641563 -8522860
8059 -8522860 -7874426 -4920474 665103 4212102 3087446 145805 -1164565 -986391 -957077
8050 -957077 -1495620 -2511649 -3784085 -3831373 -1559971 605527 -867234 -4521139 -4845493
8041 -4845493 -578975 2978662 2160144 186940 858349 2052510 304217 -2215024 -983993
8032 -983993 3293520 6166059 6756158 7824163 9383589 8104804 3477781 -583083 -1379391
8023 -1379391 -412659 401481 1625655 4017577 6593726 8236430 8563587 6725600 2558636
8014B558636l229599J948679N864036L040994l436220n630088j794733K205834
8006A527539K118847j51220j844091l206727m208015k673627J491321M308422
7998b637551K983665P4276m12086J490034K870093K484327J315964L5232j467194
7989F736760k709310k768541j482593N43492K401697K747068N92833k876022m764401
7980a579017l717354j253636Q30444K295892K711914O58623l182723m684286j131018
7971i051161M225574N822055K977165k6782n05389j93972j098055k229674j947245
7962b027484o77129M64958J548673K625714K658283J470377R00892J863858J870898
7953A0699040j839465p500496r832710n977259J442846P198360P889019L951798
$$ plain form
8014 2558636 -670963 1277716 7141752 10182746 6746526 1116438 -678295 1527539
8006 1527539 3646386 3495166 1651075 -1555652 -5763667 -8437294 -6945973 -2637551
7998 -2637551 346114 420390 8304 1498338 4368431 6852758 8168722 8203954 6736760
7989 6736760 4027450 1258909 -223684 319808 2721505 5468573 6061406 3185384 -1579017
7980 -1579017 -5296371 -6550007 -5719563 -3423671 -711757 -53134 -3235857 -7920143 -9051161
7971 -9051161 -4825587 996468 3973633 3946851 3441462 3247490 2149435 -80239 -2027484
7962 -2027484 -2704613 -2239655 -690982 1934732 4593015 6063392 6964284 8828142 10699040
7953 10699040 8859575 1359079 -8473631 -14450890 -13008044 -5809684 2079335 6031133
7945F031133q53044k230961L58959K482199P9696m416978m699847K75623L963086
7936I89866J216018m244025n105562n39652L657575L724540J749769O82208L78883
7927B509620J02563P13706J954691J070181k733814n207129k260068L346652M680607
7918D177009j47845n259004m606546N88617L987659K148829j862140k890287p9743
7909c943451K504721J512897j206292j449000J057522K263405J63448j912743
7901a009493m72132K683870L391213J284811q16764k057101l516587l875131m43058
7892d830372M835812N800344N92373m949110n282216k264856n97783j40162K144264
7883d691706N179299M674055N09337k226607n43552K476159K588318j76875k848831
$$ plain form
7945 6031133 5178089 2947128 3306087 5788286 5867982 1451004 -3248843 -2973220 989866
7936 989866 2205884 -2038141 -7143703 -7683355 -4025780 -301240 1448529 2130737 2509620
7927 2509620 2612183 3325889 5280580 6350761 3616947 -1590182 -3850250 -503598 4177009
7918 4177009 4029164 -1229840 -5836386 -5247769 -1260110 888719 -973421 -3863708 -3943451
7909 -3943451 -1438730 74167 -1132125 -2581125 -1523603 739802 903250 -1009493
7901 -1009493 -1481625 1202245 4593458 5878269 5061505 3004404 -512183 -4387314 -4830372
7892 -4830372 5440 5805784 6398157 1449047 -3833169 -6098025 -6695808 -6835970 -4691706
7883 -4691706 487593 5161648 5670985 3444378 2900826 5376985 7965303 7788428 4939597
$$ [...]
##END NTUPLES=NMR SPECTRUM
##END=
