##TITLE=31Pdec_DPAA1503
 aceton, 24 sc
 16.3.2022
##JCAMPDX= 6.0         $$ Bruker NMR JCAMP-DX V2.0
##DATA TYPE= NMR SPECTRUM
##DATA CLASS= NTUPLES
##ORIGIN= UXNMR, Bruker Analytische Messtechnik GmbH
##OWNER= root
$$ XWIN-NMR		Version 3.5
$$ Wed Mar 16 11:06:56 2022 Russian Standard Time (UT+4h)  she@DPX200
##.OBSERVE FREQUENCY= 81.013821
##.OBSERVE NUCLEUS= ^31P
##.ACQUISITION MODE= SIMULTANEOUS
##.ACQUISITION SCHEME= undefined
##.AVERAGES= 24
##.DIGITISER RES= 16
##SPECTROMETER/DATA SYSTEM= spect
##.PULSE SEQUENCE= zgpg30
##.SOLVENT NAME= CDCl3
##.SHIFT REFERENCE= (INTERNAL, CDCl3, 0, 248.564)
##AUDIT TRAIL= $$ (NUMBER, WHEN, WHO, WHERE, WHAT)
$$ ##TITLE= Audit trail, XWIN-NMR		Version 3.5
$$ ##JCAMPDX= 5.01
$$ ##ORIGIN= Bruker BioSpin GmbH
$$ ##OWNER= she
$$ F:/spectra/data/she/nmr/P31/1/pdata/1/auditp.txt
$$ ##AUDIT TRAIL=  $$ (NUMBER, WHEN, WHO, WHERE, WHAT)
(   1,<2022-03-16 11:06:01.59 +0400>,<she>,<DPX200>,
      <created by zg, POWCHK disabled, PULCHK disabled
       configuration hash MD5:
       00 E9 B6 7A A2 85 ED C7 34 08 36 98 17 FE 4E 26
       data hash MD5: 32K
       7D D0 3D 25 F9 EC F0 CB 47 C3 8E AE 9C 14 CF 51>)
(   2,<2022-03-16 11:06:11.03 +0400>,<she>,<DPX200>,
      <Start of raw data processing
       efp BC_mod = 2 LB = 1 FT_mod = 6 PKNL = 1 PHC0 = -9209.205 PHC1 = 162.6757 SI = 64K 
       data hash MD5: 64K
       79 FE 00 6D 15 49 B3 0A 42 92 D6 CD 27 02 D0 F6>)
(   3,<2022-03-16 11:06:22.89 +0400>,<she>,<DPX200>,
      <pk PHC0 = 8.43339 PHC1 = 0 
       data hash MD5: 64K
       F7 88 95 84 1B EC 71 F4 25 C9 59 7E C3 3D 83 95>)
$$ ##END=
$$ 
$$ hash MD5
$$ 7F AE 40 CF E5 CA 98 85 81 6A 6E EA 00 E7 A3 88
##$RELAX= 
##$RELAX= 
##$RELAX= 
##$RELAX= 
##$RELAX= 
##$RELAX= 
##$RELAX= 
##$RELAX= 
$$ Bruker specific parameters
$$ --------------------------
##$DU= <F:/spectra>
##$EXPNO= 1
##$NAME= <P31>
##$PROCNO= 1
##$TYPE= <nmr>
##$USER= <she>
##$AMP= (0..31)
100 100 100 100 100 100 100 100 100 100 100 100 100 100 100 100 100 100 
100 100 100 100 100 100 100 100 100 100 100 100 100 100 
##$AQSEQ= 0
##$AQ_mod= 1
##$AUNM= <au_zg>
##$AUTOPOS= <>
##$BF1= 81.014009
##$BF2= 200.13
##$BF3= 200.13
##$BF4= 200.13
##$BF5= 200.13
##$BF6= 200.13
##$BF7= 200.13
##$BF8= 200.13
##$BYTORDA= 1
##$CFDGTYP= 0
##$CFRGTYP= 5
##$CHEMSTR= <none>
##$CNST= (0..31)
1 1 145 1 1 1 1 1 1 1 1 1 1 1 1 1 1 1 1 1 1 1 1 1 1 1 1 1 1 1 1 1 
##$CPDPRG= <waltz16>
##$CPDPRG1= <>
##$CPDPRG2= <waltz16>
##$CPDPRG3= <>
##$CPDPRG4= <mlev>
##$CPDPRG5= <mlev>
##$CPDPRG6= <mlev>
##$CPDPRG7= <mlev>
##$CPDPRG8= <mlev>
##$CPDPRGB= <>
##$CPDPRGT= <>
##$D= (0..31)
0 1 0 0 0 0 0 0 0 0 0 0.03 2e-05 3e-06 0 0 0 0 0 0 0 0 0 0 0 0 0 0 0 0 
0 0 
##$DATE= 1647414361
##$DBL= (0..7)
120 120 120 11 120 120 24 19 
##$DBP= (0..7)
150 150 150 150 150 150 150 150 
##$DBP07= 0
##$DBPNAM0= <>
##$DBPNAM1= <>
##$DBPNAM2= <>
##$DBPNAM3= <>
##$DBPNAM4= <>
##$DBPNAM5= <>
##$DBPNAM6= <>
##$DBPNAM7= <>
##$DBPOAL= (0..7)
0.5 0.5 0.5 0.5 0.5 0.5 0.5 0.5 
##$DBPOFFS= (0..7)
0 0 0 0 0 0 0 0 
$$ [...]
##$SUBNAM2= <"">
##$SUBNAM3= <"">
##$SUBNAM4= <"">
##$SUBNAM5= <"">
##$SUBNAM6= <"">
##$SUBNAM7= <"">
##$SUBNAM8= <"">
##$SUBNAM9= <"">
##$SW= 501.771253377433
##$SWIBOX= (0..15)
0 1 3 0 0 0 0 0 0 0 0 0 0 0 0 0 
##$SW_h= 40650.406504065
##$TD= 32768
##$TD0= 1
##$TE= 0
##$TE2= 300
##$TE3= 300
##$TEG= 300
##$TL= (0..7)
0 120 53 12 22 120 120 120 
##$TP= (0..7)
150 150 150 150 150 150 150 150 
##$TP07= 0
##$TPNAME0= <>
##$TPNAME1= <>
##$TPNAME2= <>
##$TPNAME3= <>
##$TPNAME4= <>
##$TPNAME5= <>
##$TPNAME6= <>
##$TPNAME7= <>
##$TPOAL= (0..7)
0.5 0.5 0.5 0.5 0.5 0.5 0.5 0.5 
##$TPOFFS= (0..7)
0 0 0 0 0 0 0 0 
##$TUNHIN= 0
##$TUNHOUT= 0
##$TUNXOUT= 0
##$USERA1= <user>
##$USERA2= <user>
##$USERA3= <user>
##$USERA4= <user>
##$USERA5= <user>
##$V9= 5
##$VALIST= <valist>
##$VCLIST= <CCCCCCCCCCCCCCC>
##$VD= 0
##$VDLIST= <DDDDDDDDDDDDDDD>
##$VPLIST= <PPPPPPPPPPPPPPP>
##$VTLIST= <TTTTTTTTTTTTTTT>
##$WBST= 1024
##$WBSW= 4
##$XGAIN= (0..3)
0 0 0 0 
##$XL= 0
##$YL= 0
##$YMAX_a= 3977
##$YMIN_a= -4784
##$ZGOPTNS= <>
##$ZL1= 120
##$ZL2= 120
##$ZL3= 120
##$ZL4= 120
##$ABSF1= 0
##$ABSF2= 0
##$ABSG= 0
##$ABSL= 0
##$ALPHA= 0
##$AQORDER= 0
##$ASSFAC= 0
##$ASSFACI= 0
##$ASSFACX= 0
##$ASSWID= 0
##$AUNMP= <proc_1d>
##$AZFE= 0.1
##$AZFW= 0.5
##$BCFW= 0
##$BC_mod= 2
##$BYTORDP= 0
##$COROFFS= 0
##$CY= -3
##$DATMOD= 1
##$DC= 0
##$DFILT= <>
##$DTYPP= 0
##$F1P= 0
##$F2P= 0
##$FCOR= 1
##$FTSIZE= 65536
##$FT_mod= 6
##$GAMMA= 0
##$GB= 0
##$INTBC= 1
##$INTSCL= 5.30512e-09
##$ISEN= 30
##$LB= 1
##$LEV0= 0
##$LPBIN= 0
##$MAXI= 10000
##$MC2= 0
##$MEAN= 0
##$ME_mod= 0
##$MI= 50
##$NCOEF= 0
##$NC_proc= -8
##$NLEV= 6
##$NOISF1= 182.463
##$NOISF2= 159.3651
##$NSP= 0
##$NTH_PI= 0
##$NZP= 0
##$OFFSET= 248.5645
##$PC= 4
##$PHC0= -9200.771
##$PHC1= 162.6757
##$PH_mod= 1
##$PKNL= yes
##$PPARMOD= 0
##$PSCAL= 0
##$PSIGN= 0
##$REVERSE= no
##$SF= 81.014009
##$SI= 65536
##$SIGF1= 159.3651
##$SIGF2= -187.1042
##$SINO= 113.3802
##$SIOLD= 16384
##$SREGLST= <1H.CDCl3>
##$SSB= 0
##$STSI= 65536
##$STSR= 0
##$SW_p= 40650.406504065
##$SYMM= 0
##$S_DEV= 0
##$TDeff= 32768
##$TDoff= 0
##$TI= <>
##$TILT= no
##$TM1= 0
##$TM2= 0
##$TOPLEV= 0
##$USERP1= <user>
##$USERP2= <user>
##$USERP3= <user>
##$USERP4= <user>
##$USERP5= <user>
##$WDW= 1
##$XDIM= 65536
##$YMAX_p= 491017260
##$YMIN_p= -292956740
$$ End of Bruker specific parameters
$$ ---------------------------------
##NTUPLES= NMR SPECTRUM
##VAR_NAME=  FREQUENCY,     SPECTRUM/REAL,   SPECTRUM/IMAG
##SYMBOL=    X,             R,               I
##VAR_TYPE=  INDEPENDENT,   DEPENDENT,       DEPENDENT
##VAR_FORM=  AFFN,          ASDF,            ASDF
##VAR_DIM=   65536,         65536,           65536
##UNITS=     HZ,            ARBITRARY UNITS, ARBITRARY UNITS
##FACTOR=    0.620285442955139, 1,           1
##FIRST=     20137.2065510759, 0,            0
##LAST=      -20513.1999529892, 0,           0
##MIN=       -20513.1999529892, -292956740,  0
##MAX=       20137.2065510759, 491017260,    0
$$ Real data points
##PAGE= N=1
##DATA TABLE= (X++(R..R)), XYDATA
$$ [...]
38391c879555K258125M507588K985666j582397m896737m252389j230905J220867
38383d869737K219686K299230J341154p94686k566548j871257J043272L344425
38375A45539K803145K67090j609597j460843k85324L31982J35931j15039j77107
38366C5777n31629j226496j598370j344812q45241j75902R68773K003435J671139
38357a043326L20524K16595K252192M018546K909700l41731l211643m882477n636531
38348e398151m222600O59479O595480Q661177N052721r45194m902821m918497
38340E81594j684535K205174L149588j3049l404193k421164J423592K278929j142516
38331I73420l748474k519402q39930j541730j676215J219156L114727j48668m685900
$$ y = [-3879555, -1621430, 2886158, 5871824, 4289427, -607310, -4859699, -6090604, -4869737, -2650051, -350821, 990333, 195647, -2370901, -4242158, -3198886, 145539, 2948684, 3215774, 1606177, 145334, -139990, 191992, 327923, 212884, 35777, -495852, -1722348, -3320718, -4665530, -5510771, -5686673, -4717900, -2714465, -1043326, -722802, -506207, 1745985, 5764531, 8674231, 8332500, 5120857, 238380, -5398151, -9620751, -8961272, -2365792, 6295385, 11348106, 10402912, 5500091, 581594, -1102941, 1102233, 4251821, 4238772, 834579, -1586585, -162993, 2115936, 973420, -2775054, -5294456, -6134386, -7676116, -9352331, -8133175, -5018448, -5167116, -9853016]
38322i853016l737677J741496M835036L249100Q56332k92973j751519k493904
38314g447125Q68955O248799O469204K71497m574982k869700N80912J2148j791721
38305b232013K67293L539384K007679k710736l324661J373140M685183K394999
38297F000268j967380l694455k821200j401495J72694J604665J344278o26782
38289a389407j628252j43818J630164J149674o65538j023312P64465K595198K172356
38280C461530m94676k737086j752816J614444K976229J80668k900988j655233
38272a307928J996056K367082q69940k264868J68344J727929o97230l258202j783359
38263c922116J439971K104344Q62551Q70847J714995R49453q51524j530526j635834
$$ y = [-9853016, -13590693, -11849197, -7014161, -3765061, -2908729, -3201702, -4953221, -7447125, -6578170, -329371, 6139833, 6411330, 1836348, -1033352, -452440, -440292, -2232013, -1964720, 1574664, 3582343, 871607, -2453054, -1079914, 3605269, 6000268, 4032888, 338433, -2482767, -3884262, -3711568, -2106903, -762625, -1389407, -3017659, -3161477, -1531313, -381639, -1047177, -2070489, -1306024, 1289174, 3461530, 2966854, 229768, -1523048, 91396, 3067625, 3248293, 347305, -1307928, 688128, 3055210, 2185270, -79598, 88746, 1816675, 1119445, -2138757, -3922116, -2482145, -377801, 484750, 1355597, 3070592, 4020045, 3168521, 1637995, 2161]
38254B161k519143k443211L20783K760506J202842j750820p20068L279578M106649
38245D239277N93045j955130j034878j73780j070356k03779L382737M254624n10071
38236G521689m863056k429609L172106L614327j613027n199602l345430k01178
38228c343780k58315j958433j102699K807614N902843M324710j504920o434575
38220a567555n270756R79060N259717K798740k748000m373745j059699J924311
38212d057927J119754j189944j572319O4767J936143L150562L296299J634231
38204D381566j484598l927253l928978j929201M55859K068483K278929R15100
38196a170093j049213j991106j603388j192471j341671p64684J276941K797212
$$ y = [2161, -2516982, -4960193, -4639410, -1878904, -676062, -2426882, -3146950, 132628, 4239277, 4832322, 2877192, 1842314, 1668534, 598178, 394399, 3777136, 8031760, 7521689, 2658633, 229024, 3401130, 7015457, 5402430, 202828, -3142602, -3343780, -3602095, -5560528, -6663227, -3855613, 2047230, 6371940, 4867020, -1567555, -6838311, -5859251, -599534, 2199206, -548794, -4922539, -5982238, -4057927, -2938173, -4128117, -5700436, -5635669, -3699526, -548964, 2747335, 4381566, 2896968, -1030285, -4959263, -6888464, -6432605, -4364122, -2085193, -1170093, -2219306, -4210412, -5813800, -7006271, -8347942, -9112626, -7835685, -5038473]
38188e038473J472525j196988p94777L699469O890836L418236l532635m863927
38180E4266J705269O714153J537740q112448q955786P74118Q247626M423930l573510
38171B815358m264064J457482L815876j79878l951861k737842P79162K582352
38163C16585K020672l22230l312118l423341J552301O657225M553259k985817
38155E056536o016395q78521M370548K644857j937944k076779J197553K037398
38147D397253n9866j061335l07688n17211j687288j429045k81747q40151k382963
38138d170041j901937J71248P89101L38296J956520M673149L585813j668071m757289
38129i83211j824119K428186J704781k800519m818402k028353J903768L267697
$$ y = [-5038473, -3565948, -4762936, -5557713, -1858244, 5032592, 8450828, 4918193, 54266, 1759535, 8473688, 10011428, 1898980, -7056806, -6282688, 1964938, 6388868, 2815358, -1448706, 8776, 3824652, 3644774, -307087, -3044929, -2265767, 316585, 2337257, 2015027, -1297091, -4720432, -3168131, 3489094, 8042353, 5056536, -959859, -1838380, 2532168, 5177025, 3239081, 1162302, 2359855, 4397253, 4337387, 3276052, 2968364, 2451153, 763865, -665180, -946927, -1787078, -4170041, -6071978, -5900730, -5111629, -4773333, -2816813, 1856336, 5442149, 3774078, -983211, -2807330, -379144, 1325637, -1474882, -6293284, -8321637, -6417869, -3150172]
38121c150172K157145L34809j240178j827517n14987K111257L583292K321555
38113C775204k33063j519209j004149o5512M53661P63858O75387j94296q33790
38104A818091m934P70330j281458m663731l840728K299907O647859L257176l142772
38095A859740l432257K451103N985614L305241m13258j010587j222185l296396
38087D227015l750781l57382K487497R98504j374401n63606N59006j897910m550814
38078d222872k283310K075199K186887q14003q71577J594106N98986l712211m288148
38069i736943O75595M179448J702970k221539k218773K97007J573900J448078
38061d300257R03652q57022l054163j980086L107642P065786N515220O31313k774433
$$ y = [-3150172, -993027, -658218, -1898396, -3725913, -4240900, -2129643, 1453649, 3775204, 3542141, 2022932, 1018783, 953271, 1406932, 2170790, 2846177, 2651881, 1818091, 1813157, 2583487, 1302029, -3361702, -7202430, -4902523, 1745336, 5002512, 1859740, -1572517, 878586, 6864200, 10169441, 9756183, 8745596, 7523411, 4227015, 476234, 118852, 2606349, 3604853, 2230452, 1666846, 2225852, 327942, -4222872, -6506182, -4430983, -2244096, -3058099, -3929676, -2335570, -1736584, -5448795, -9736943, -9061348, -4881900, -3178930, -5400469, -7619242, -7322235, -5748335, -4300257, -3396605, -4253627, -7307790, -9287876, -6180234, 885552, 6400772, 7032085, 4257652]
38052D257652l088306j124038K138828M181907J897357k972783m128964J84577
38044A346230L610133J299722k511547k013558M04260j040541m856921m489513
38036h251735O40577M155953K682522j42369n96032J27843l32452j349055j086591
38027d151339M92697J940755J827046l16726k845686k635336Q46552L476830J583997
38018B18790k266345k502216J319793M056486K631604l58073j572102j324670
38010B03267j347730j433933m60103J255575K342434K009178N38762q65512p63457
38001A478481P84057J692439N29284j299843j907004j947144k616283k324596
37993e610609Q37834M477969M316903R08440r59886O1977J72160k239419l171517
$$ y = [4257652, 1169346, 45308, 2184136, 6366043, 8263400, 5290617, 1161653, 1346230, 4956363, 6256085, 3744538, 1730980, 2135240, 1094699, -3762222, -8251735, -7611158, -3455205, -772683, -915052, -1511084, -1383241, -1715693, -3064748, -4151339, -3658642, -1717887, 109159, -207567, -3053253, -5688589, -4842037, -1365207, 218790, -2047555, -4549771, -3229978, 826508, 3458112, 3100039, 1527937, 203267, -1144463, -2578396, -3038499, -1782924, 559510, 2568688, 3107450, 2241938, 1478481, 2262538, 3954977, 4484261, 3184418, 1277414, -669730, -3286013, -5610609, -4772775, -294806, 4022097, 4930537, 3970651, 4032628, 4204788, 1965369, -1206148]
37984a206148J00004L699169K878360p79359k594975k303943l067846m764226
37976h038964l937571k45310K327580J669452L76682P70155J297462L72963M0770
37967e366781K273891M430128K737579j261592k494040k22539Q58069j596439
37959f41724l648894j487404K503925L776360K373016J298959P88453p45177j893390
37950B324124p6916K732245K183731o91654m87758L000707L427682j596618o013031
37941D802512n163285l004226m103205n024865q11103N145830N857213J875550
37933d25579n38236L9727k13683j806956j467883L44274j28682j932831l51271
37924f481120L445624K701162l072132n644927q39086M866417M982870K255930
$$ y = [-1206148, -1106144, 2593025, 5471385, 4692026, 2097051, -206892, -3274738, -8038964, -11976535, -12221845, -9894265, -8224813, -7848131, -7077976, -5780514, -5407551, -5366781, -3092890, 1337238, 4074817, 2813225, 319185, 96646, 954715, -641724, -4290618, -5778022, -3274097, 502263, 2875279, 4174238, 4962691, 4217514, 2324124, 2247208, 4979453, 7163184, 6471530, 5983772, 8984479, 12412161, 10815543, 4802512, -360773, -3364999, -7468204, -12493069, -13304172, -8158342, -2301129, -425579, -963815, -924088, -1137771, -2944727, -4412610, -4068336, -4197018, -6129849, -6481120, -3035496, -334334, -3406466, -9051393, -9890479, -5024062, -41192, 2214738]
37916B214738J754898K017413k81794k816173j861176O04158Q80775N11174K413105
37907E437118L882506Q05638m216308n506437l604629l145857l536792m04426
37899a0289187M548274M478443p97889l060631J431733N646200K850727l014420
37891A793250l893382M71515L571914K198405n78046j438384p69227l42455o57597
37882C55993j322895j884376j842065j186824q30364j468437k406321k298936
37874a2884225m46392K973385O565826P224330K449711n195040q447661l194481
37866a0954547N421355Q217197L037346k900280k554014K336325M439712N52768
37858G595862m892381n805241j495702L167332L438850m86329m042394l165271
$$ y = [2214738, 3969636, 5987049, 5705255, 2889082, 1027906, 1632064, 2512839, 3024013, 5437118, 9319624, 10125262, 5908954, 402517, -3202112, -6347969, -9884761, -10289187, -5740913, -1262470, -2060359, -5120990, -3689257, 1956943, 4807670, 1793250, -2100132, -1628617, 1943297, 4141702, 3563656, 2125272, 1356045, 1013590, 355993, -966902, -2851278, -4693343, -5880167, -6710531, -8178968, -10585289, -12884225, -13330617, -10357232, -3791406, 3432924, 5882635, 687595, -7760066, -10954547, -5533192, 2684005, 5721351, 2821071, 267057, 2603382, 7043094, 7595862, 2703481, -3101760, -4597462, -1430130, 2008720, 1522391, -2520003, -5685274]
37850e685274J405968M825092L441940j073767l895662k941458p88795l23597
37842e035553q52771l04362P26347J29912j363158m39816L614361O939582N720699
37833I135241P99409l657454m623968k359456N16829J272788m23809k003404j391293
37824b735117k09387r00882j562701J704093O927592O764105n49426o786091m855873
37815b203687J005281K281463j086471k663521j120769r24683k450336q36390
37807g999113M035013N379852M21832m417405l369724N43855J972426J479779
37799a953485J729544J092447k307848m621486j597975L182824K777389k257691
37791c956281m685187j494912K856095M128782K804216L60131k774454m446872
$$ y = [-5685274, -4279306, 545786, 3987726, 2913959, -981703, -3923161, -4711956, -5035553, -5888324, -6192686, -5466339, -5336427, -6699585, -7139401, -3525040, 3414542, 9135241, 9934650, 6277196, 1653228, -706228, -189399, 1083389, 659580, -1343824, -2735117, -2944504, -3845386, -5408087, -3703994, 3223598, 9987703, 9438277, 2652186, -2203687, -1198406, 1083057, -3414, -2666935, -3787704, -4712387, -7162723, -7999113, -3964100, 1415752, 1837584, -2579821, -5949545, -5405690, -3433264, -1953485, -223941, 868506, -1439342, -6060828, -7658803, -4475979, -1698590, -3956281, -8641468, -10136380, -7280285, -3151503, -347287, 12844, -2761610, -7208482]
37783g208482j904343K648846L249219r86008l748490r82316L032681K827942
37775c070951N4554l32165J454907J142059j802832l084448l91742L108158L264591
37766C42131J51392k556288k090495M56521J675188M36827l7790L274450P395696
37757I047632O149764m44487m680796j957398K089254K86102m631354m475009
37749A383708R60216L511840n2091l091263m49833L011266O51453m855204n475620
37740d405528J19221N181293M767947J179927j028212p19584N66086J485233J282402
37731H428785l28616k266078k766206j819533j234829j674319j615157j62086
37723c438039J157139Q50901N3276Q29141K887523L820067K290086m31815k024119
$$ y = [-7208482, -9112825, -6463979, -3214760, -4200768, -7949258, -8931574, -5898893, -3070951, -3016397, -3348562, -1893655, -751596, -2554428, -5638876, -6030618, -2922460, 342131, 493523, -2062765, -4153260, -3696739, -2021551, -1584724, -1622514, 1651936, 9047632, 15197396, 14752909, 10072113, 8114715, 10203969, 10490071, 5858717, 1383708, 2343924, 5855764, 5803673, 2712410, 2262577, 5273843, 5925296, 1070092, -4405528, -4286307, 894986, 5662933, 6842860, 5814648, 5095064, 5661150, 7146383, 8428785, 8100169, 5834091, 3067885, 1248352, 13523, -1660796, -3275953, -3438039, -2280900, -1429999, -1376723, -547582, 2339941, 6160008, 8450094, 8018279, 5994160]
37714E994160j180925J661023M577102N175586K463466j911846m881284m704992
37706G192290k210807N59271K190267K244195P42886j739301l657649l203157
37698B117995j38699L287569M015284J197492k728406m472365l232803r92510
37690i46443L67439J028617J744438J845454M90737q83107N5700K388105K094155
37681H185095k041765n451463l685810P93878J918498q39713j812726J573832
37673a360174M433302K263038j757742j967515R00351J765121o7730n85978J167356
37664D790029J511829r07556k723462k107633j507229j748881L90978N028521
37656B726596N806255o86572p302955n317010K510194N842680J825322k406014
$$ y = [5994160, 4813235, 6474258, 11051360, 16226946, 18690412, 16778566, 11897282, 7192290, 4981483, 5540754, 7731021, 9975216, 10718102, 8978801, 5321152, 2117995, 1979296, 5266865, 9282149, 10479641, 7751235, 3278870, 46067, -946443, -579004, 449613, 2194051, 4039505, 4530242, 3647135, 3702835, 6090940, 8185095, 6143330, 691867, -2993943, -2200065, -281567, -1121280, -2934006, -1360174, 3073128, 5336166, 3578424, 1610909, 2511260, 4276381, 4208651, 3622673, 4790029, 6301858, 5394302, 2670840, 563207, -944022, -2692903, -2301925, 2726596, 8532851, 7846279, 543324, -4773686, -2263492, 3579188, 5404510, 2998496]
37648B998496k129790q18021j271454J16858N212175P582136J373149p835657
37640E227892r154268j533230N025884L745702p56372j129977K034836K947831
37632F408298K61443j810289j038445l90714k325957m138135k090713K200912
37624b923600L331033l80839m415314m059633j71873K831089K806882J367674
37616a614581N02931K74530Q2359J67501P88691R84426m83819k932866l638085
37607e868913j008299K505167K601417r93111l244458o69696K967814J905454
37599a804625k411668l305994Q7507J144232k602057m156274J345287P106563
37591d597029M742077j723634j921663M057454O124829Q92969l541833j612136
$$ y = [2998496, 868706, 50685, -1220769, -1103911, 4108264, 11690400, 13063549, 5227892, -3926376, -5459606, -433722, 3311980, 2555608, 1425631, 3460467, 6408298, 6669741, 4859452, 3821007, 3430293, 1104336, -3033799, -5124512, -2923600, 407433, 26594, -4388720, -8448353, -8620226, -5789137, -2982255, -1614581, -1111650, -837120, -754761, -587260, 201431, 1185857, 702038, -2230828, -5868913, -6877212, -4372045, -1770628, -2763739, -6008197, -6677893, -3710079, -1804625, -4216293, -7522287, -7434780, -6290548, -8892605, -13048879, -11703592, -4597029, 145048, -1578586, -3500249, 557205, 6682034, 7575003, 4033170, 2421034]
37583B421034J684139R38548j071310n60760j34274k345612l083297J107090N098375
37574D053933K666281k904106m056888r11867P84091N92055K729444O020994M415176
37565A3389113j998266n742227l533196p09744j457819k553576o55536J322640
37557a938611J73132j017847J904835O232354N598180p49703o739611o935750
37549c473021j971852L004335L357101p21396l979727j911275K955723L887842
37541A147730k48073k880682J96294M034115K299875k768047m275727j420498
37533c915013O01418j42307m21208Q59343P71959q04509L77201M651485N291077
37524G269446j457788q551544o776076K074594P569329M883407k44895j360160
$$ y = [2421034, 4105173, 5043721, 3972411, 3411651, 3277377, 931765, -2151532, -1044442, 4053933, 6720214, 3816108, -240780, -1152647, -368556, 223499, 2952943, 8973937, 13389113, 11390847, 5648620, 2115424, 1405680, -52139, -2605715, -3261251, -1938611, -1765479, -2783326, -878491, 5353863, 10952043, 10202340, 3462729, -3473021, -5444873, -2440538, 916563, 195167, -3784560, -5695835, -2740112, 1147730, 899657, -1981025, -1784731, 2249384, 4549259, 1781212, -2494515, -3915013, -3313595, -3455902, -3877110, -3017767, -2245808, -3050317, -2673116, 1978369, 7269446, 5811658, -2739886, -9515962, -7441368, 127961, 5011368, 4766473, 3406313]
37516C406313M52727P72223q44240j724696j158140n74289k39445P00753J618413
37507B409619R14870r79076j672380k23342J435303R95812j500035l731287l299577
37498e650093k07510K502188J822943q65990p86196L173123N253407L97121p067196
37489a428203p713637o428O695005M341127l305885o182794j051989N284353N267536
37480A899085m91498m714381k360575L531500N729339K055525j798589m37985
37472C412421L248244K545767k514843n104328k179264J527866J948557J423155
37464D307575K522334K454549j221085m511920k730550J556934K592263M05179
37456E375279o00263M22572P38550Q0001K62480K92364j633150k748387O14952
$$ y = [3406313, 3859040, 4631263, 3787023, 2062327, 904187, 329898, 90453, 791206, 2409619, 3324489, 2345413, 673033, 449691, 1884994, 2880806, 1380771, -2350516, -5650093, -5857603, -3355415, -1532472, -2398462, -3184658, -11535, 5241872, 5638993, -1428203, -9141840, -9148268, -2453263, 1887864, -1418021, -7600815, -8652804, -3368451, 1899085, 1407587, -3306794, -5667369, -2135869, 3593470, 5648995, 3850406, 3412421, 6660665, 9206432, 6691589, 1587261, -592003, 935863, 2884420, 4307575, 6829909, 9284458, 8063373, 3551453, 820903, 2377837, 4970100, 5375279, 4775016, 5197588, 5936138, 6016139, 6278619, 6570983, 4937833, 2189446, 2804398]
37447B804398N234931M682954J50168j082355J669736J006121n154886q668592
37439F42475m273957J426115O05615l597231l285154J333165L688775K115866
37431a344331J165000K927046M127620K082420j674495m106540l460253J25272
37423a58261L841685L599311p20272l745742j992300L10702k221794o715527n918004
37414a3720202O9604L633082J613345l10287K354925N495443L422221j772592
37406G85539l347250K57579L827137K912573r59920l084918j221683K304360L308250
37397D781667M03521l193466l478603q98913M47821r32813j749584L20151K189594
37388b110625K50235k864127j591426L128202L787943k360114p646134m322772
$$ y = [2804398, 8039329, 12722283, 12872451, 11790096, 13459832, 14465953, 9311067, 642475, -3631482, -2205367, -1599752, -5196983, -8482137, -7148972, -3460197, -1344331, -179331, 2747715, 6875335, 8957755, 7283260, 3176720, -283533, -158261, 3683424, 7282735, 6562463, 2816721, 824421, 1135123, -1086671, -7802198, -13720202, -13650598, -10017516, -8404171, -8714458, -6359533, -864090, 2558131, 785539, -2561711, -2304132, 1523005, 4435578, 3475658, 390740, -830943, 1473417, 4781667, 5185188, 1991722, -1486881, -2385794, -1937973, -2870786, -4620370, -4300219, -2110625, -1860390, -4724517, -6315943, -3187741, 600202, -1759912, -9406046, -13728818]
37380a3728818L549475N368791m08222m020315N08239O153398M139143k064464
37372e02773k393989L502525N593671m99005o612595m974217L62135J332824j168686
37363e360110k98265M313407O118005L172191J626710N390311R142824N937377
37355C0042450k566883q267312o979041k343925J98297k52873q77208r4459M43389
37346I302435j183124l856011m639210k898165j040410m50685P58860L831304
37338a75006N565189K188271l956433o087944k042007K643652K657453K478j74246
37329F21407K176137K593432k02053k173211m06923K448246K369417l74248k497034
37320D555170k669621k161587j616801m27407Q76204P41807m44758m86756O80023
$$ y = [-13728818, -10179343, -4810552, -5218774, -9239089, -8730850, -2577452, 1561691, -502773, -2896762, 605763, 6199434, 5700429, -912166, -5886383, -5524248, -4191424, -5360110, -5658375, -1344968, 4773037, 7945228, 9571938, 14962249, 24105073, 30042450, 27475567, 19208255, 12229214, 9885289, 10083586, 9830713, 8953505, 8859046, 9302435, 8119311, 4263300, -375910, -3274075, -4314485, -4765170, -4006310, -175006, 5390183, 7578454, 3622021, -2465923, -4507930, -1864278, 793175, 795653, 621407, 2797544, 5390976, 5188923, 3015712, 2608789, 5057035, 7426452, 7052204, 4555170, 1885549, -276038, -1892839, -2320246, -1444042, -702235, -1146993, -1633749, -953726]
37311i53726L38817k075650k665963J373888O399680O342754Q61104m374940n146850
37302I9114k726315k56214J190941J815591J440020L01302n75827r98062j777814
37293a487264k530065j466518J556690L837260K975833k94865l339360m207498
37285d955787k455120Q49205L328170L224585J565585P18508Q73107K25278j495215
37276A878316k545385k314537j802613p68318K007863N164156N451309K812536
37268I883327O08097j06507j712875m190791l846911k81176J348535j356892l290884
37259b946077j68347L822766K619152j916878l390434p98466J556515J656257
37251D34488R13906k65871j945521j623168K049079M536795J159105m249595l946394
$$ y = [-953726, -614909, -2690559, -5356522, -3982634, 2417046, 8759800, 9620904, 5245964, 99114, -2627201, -2883415, -1692474, 123117, 1563137, 1864439, 1288612, 290550, -1487264, -4017329, -5483847, -3927157, -89897, 2885936, 2591071, -748289, -4955787, -7410907, -6561702, -3233532, -8947, 1556638, 2275146, 3148253, 3373531, 1878316, -667069, -2981606, -4784219, -5552537, -3544674, 1619482, 7070791, 9883327, 10491424, 10384917, 8672042, 4481251, 634340, 353164, 1701699, 344807, -2946077, -3114424, 708342, 3327494, 1410616, -1979818, -2778284, -1221769, 434488, 1348394, 1082523, -862998, -2486166, -437087, 4099708, 5258813, 1009218, -2937176]
37242b937176J504195L802146j13939l993544k788197N68291J653148R82181N47573
37233g75322k61086j657834j253261J609865L390968J473670j708091k438834
37225a619925n09014J965764L419936K789905j03813k629190j385589K405882
37217D333956L460347o6185l735537l306672l394K580424K822560N28925l731904
37208B882520o924576n605755j500495j66227k213586j677108L960873Q420963
37200b823391N823032l44857k975333j519989m36621j000563r01755K57573P96477
37191c125427P90372J214106Q14420j603252l426074j419246K693022M261443
37183A99364K153707q79335k819565l252738j320667K608090M678192J895989
$$ y = [-2937176, -1432981, 2369165, 2255226, -1738318, -4526515, -3958224, -2305076, -1322895, -775322, -1036408, -2694242, -3947503, -2337638, 1053330, 2527000, 818909, -1619925, -2128939, -163175, 3256761, 6046666, 5942853, 3313663, 1928074, 4333956, 7794303, 7728118, 3992581, 685909, 682515, 3262939, 6085499, 6614424, 2882520, -4042056, -9647811, -11148306, -11314533, -13528119, -15205227, -11244354, -2823391, 2999641, 2654784, -320549, -1840538, -2277159, -3277722, -4179477, -3921904, -3125427, -2335055, -1120949, -306529, -1909781, -5335855, -6755101, -4062079, 199364, 2353071, 1473736, -1345829, -4598567, -5919234, -3311144, 1367048, 3263037]
37175C263037k309420k047414K102797L670901J61299l249790j627411K798381
37167B762380M357836J458796k431425l610856j667187J124915K376446J494792
37159E865697l42006j613694j469999J27217K014070J989034p16943l440890l080734
37150f68248p44899j0716q17625J87469K768019K508084j082279k459719O35633
37141C15719K570458o41973l968287k002527J310640k69348l783495k159277L017833
37132e610257M237047J337384J090407M096780L388621k481049n868928k771756
37124b581751P80145n11046k926626j631626Q97582O15207k89595J943443N055369
37115A351102M555625J549317L97127J077603k7825l152381m543108k621211k15884
$$ y = [3263037, 953617, -1093797, 1009000, 4679901, 4841200, 1591410, -36001, 2762380, 7120216, 8579012, 6147587, 2536731, 869544, 1994459, 4370905, 5865697, 5523691, 3909997, 2439998, 2567215, 4581285, 6570319, 5853376, 2412486, -668248, -1413147, -1423863, -2241488, -2054019, 714000, 3222084, 2139805, -319914, 315719, 2886177, 2244204, -1724083, -3726610, -2415970, -2685318, -6468813, -8628090, -5610257, -1373210, -35826, 1054581, 5151361, 8539982, 6058933, 190005, -2581751, -1801606, -2312652, -5239278, -6870904, -5973322, -5358115, -5647710, -3704267, 1351102, 5906727, 7456044, 7853171, 8930774, 8902949, 5750568, 1207460, -1413751, -1629635]
37106a629635l9495j111662o95729J850249M022890K932459q17968l073248j332278
37097A05583J541196J531191l08400p1979J761130R12231k813718m394617j732121
37088c469504J046652O27693q18974o62126J123K03539J705478M290286L887384
37079F811551o01359l824570j827495J556908J063236j896487k791526j430712
37071b940454k89634Q36741K831280L384164Q61132j275963K69267K347527N94431
37062F618491k461363j598883J649885J550570j738467k699788j80381J451416
37054B591480Q04460J195021L079529K437775j479062l740948j574740J331373
37046D644888J025263j208599k020642m92415K337046M591600L326087k434244
$$ y = [-1629635, -1669130, -2780792, -3476521, -1626272, 2396618, 5329077, 4511109, 1437861, 105583, 1646779, 3177970, 2869570, 2797591, 4558721, 5470952, 2657234, -1737383, -3469504, -2422852, -1795159, -2614133, -3276259, -3275136, -3071597, -1366119, 2924167, 6811551, 6210192, 2385622, 558127, 2115035, 3178271, 1281784, -1509742, -2940454, -3230088, -2393347, 437933, 3822097, 4683229, 3407266, 3676533, 6024060, 6618491, 4157128, 2558245, 4208130, 5758700, 4020233, 1320445, 1140064, 2591480, 3395940, 4590961, 7670490, 10108265, 8629203, 4888255, 3313515, 4644888, 5670151, 4461552, 2440910, 1948495, 4285541, 8877141, 12203228, 9768984]
37038I768984p848067o566107K42624M639939K811989p11762j318440l31304j46122
37029E41734K62387J363751M69100k732938l496729M58014L869788J709798k594814
37020a49909k794309J84674P61090j340967j043053K858989N317707K888788j522797
37011E160213l428236k091691N50501K883880L756492K288485o29453k416375
37003F073816j819929n41520p12786j888936j840612J80756K209547J959182j77687
36994C441831j442792k15321J877286K259428P99925n76112q15827l80175L51388
36985E299631J089091O34290j565553l377862k421612l2978O51654O7415J276163
36976A620239L602091K574462k366866n570492l232938J173612K857508K555295
$$ y = [9768984, 1920917, -4645190, -4402566, 237373, 3049362, 2337600, 1019160, 687856, 541734, 804121, 2167872, 2636972, -95966, -3592695, -3134681, 735107, 2444905, -149909, -2944218, -2759544, -1998454, -3339421, -4382474, -1523485, 3794222, 6683010, 5160213, 1731977, -359714, 190787, 3074667, 6831159, 9119644, 8490191, 6073816, 4253887, 3712367, 2999581, 1110645, -729967, -549211, 1660336, 3619518, 3441831, 1999039, 1783718, 3661004, 5920432, 6720357, 6144245, 5328418, 4948243, 5299631, 6388722, 7023012, 5457459, 2079597, -342015, -374993, 276661, 344076, 1620239, 5222330, 7796792, 5429926, -140566, -3373504, -2199892, 657616, 3212911]
36968C212911L411214M892813M335902J760035r19018l037984m096497k454376
36960G105000J264519K697017k84874l395933k131064J275387K052265N89954
36952I172271J49465Q6711j939531l533496p45906L880710M119274J64168j851899
36943I501767l11270Q2261k225912k772416J63221J946488n8861j916910p64991
36934C643377j6486k182627l012296J268152O149602M980948o75038l501961j180870
36925E472801J509344O54811j924350k181072J208030N722735O945968K446238
36917A9854505m739837q176977n265972l09337J358648m10950k370287k796830
36909b857037j803150L94792K435343J769671j260189k292874P84279L881280
$$ y = [3212911, 6624125, 11516938, 15852840, 17612875, 16693857, 13655873, 9559376, 7105000, 8369519, 11066536, 10781662, 7385729, 5254665, 6530052, 8582317, 9172271, 9321736, 9408447, 7468916, 3935420, 3189514, 7070224, 11189498, 11353666, 9501767, 9190497, 9272758, 7046846, 4274430, 4437651, 6384139, 6325278, 4408368, 3643377, 3626891, 1444264, -1568032, -299880, 5849722, 10830670, 10155632, 6653671, 5472801, 6982145, 7636956, 5712606, 3531534, 4739564, 10462299, 17408267, 19854505, 15114668, 6937691, 1671719, 1362382, 2721030, 2310080, -60207, -2857037, -4660187, -4265395, -1830052, -60381, -1320570, -3613444, -2829165, 1052115]
36901A052115L063749J104904K322839M244745J298956n016651p122694k495454
36893a547491L076908M356142K472805L46099j627900k866460j093847L153083
36885F269339M966104J563153l155376l873190n62007L382018O644846R592659
36877B4827546J0517368O841943k86508o142110p569007n718196l511197k359525
36869A6600314j841076j259315p81963j131556k099039j969239K22619K222272
36861I963017P64320l223498m593067r19448L359615K733667j515507l196703
36853C372396k71058K322590R4998m345756m838142p4782M663665M288256R427
36844E221594k692340r81729K394581L177201O72629k491434m199914m236737
$$ y = [1052115, 4115864, 5220768, 7543607, 11788352, 13087308, 8070657, 947963, -1547491, 1529417, 5885559, 8358364, 8704463, 7076563, 4210103, 3116256, 6269339, 11235443, 12798596, 9643220, 5770030, 5208023, 8590041, 15234887, 24827546, 35344914, 42186857, 41900349, 35758239, 28189232, 22471036, 18959839, 16600314, 14759238, 13499923, 12717960, 11586404, 9487365, 7518126, 7740745, 9963017, 10727337, 7503839, 2910772, 1991324, 5350939, 8084606, 6569099, 3372396, 3101338, 5423928, 5518926, 1173170, -3664972, -3739754, 923911, 5212167, 5221594, 2529254, 1547525, 3942106, 7119307, 7791936, 5300502, 1100588, -3136149]
36836c136149k586503O93139L508246K841006n61821j586630K478820P070807
36828H720915N949272j0949m191577l754574k404676k713683j655030K833007
36820B772705O024761K720228l798649n608180j661004J341901l5784j226925
36812E29053J511504M210687J954618k497169k968880L78986K090114O32589j47804
36803E693698J235757J351826j358114l131515j132692J580761R03469k059999
36795C083191l309398j908226J5217J297125K217725K231460N64574j524741j858465
36786H08462l99150R10518Q54822l12259k011824l362798k932931m05410K210373
36777d640197K732016J417577Q0362k11570P38816K658096L780461J782172k120730
$$ y = [-3136149, -5722652, -5029513, -1521267, 1319739, 757918, -828712, 1650108, 8720915, 14670187, 14659238, 10467661, 6713087, 4308411, 1594728, -60302, 2772705, 8797466, 11517694, 7719045, 2110865, 449861, 1791762, 1755978, 529053, 2040557, 6251244, 8205862, 5708693, 2739813, 3118799, 5208913, 5841502, 5693698, 6929455, 8281281, 6923167, 3791652, 2658960, 4239721, 5143190, 3083191, -226207, -2134433, -2119216, -822091, 1395634, 3627094, 4191668, 2666927, 808462, 409312, 1319830, 2174652, 1862393, -149431, -3512229, -6445160, -6850570, -4640197, -1908181, -490604, -410242, -621812, 117004, 2775100, 6555561, 8337733, 6217003]
36768F217003k863789J501904N486568L273427k300774l622288J85337K366661
36760A0244049m62800l486327k277352K45145l31329k227045j072029K167772
36752B800084K814610M86091l78251J872008L301760R04248k391007k174195P69587
36743H004935J854969l29725k125969n02552K398643K397253q95987l948801m223697
36734B629069k489896k41122K199035M003217L168860m42955l557994l362547
36726A905667j300855n52844j238666j057798L88284J273687J218504J871593
36718B507572L334599L107148j22053l895038m728930k171985J021114K091425
36710A143852J035343L95767K143364M689980M217160l21301n203365o285325
$$ y = [6217003, 3353214, 4855118, 10341686, 13615113, 11314339, 7692051, 7877388, 10244049, 9781249, 6294922, 4017570, 4262715, 3931386, 1704341, 632312, 2800084, 5614694, 6100785, 5722534, 7594542, 10896302, 11800550, 9409543, 7235348, 8004935, 9859904, 9530179, 7404210, 6901658, 9300301, 11697554, 10801567, 6852766, 2629069, 139173, -101949, 2097086, 6100303, 9269163, 8826208, 5268214, 1905667, 604812, 51968, -1186698, -2244496, -1856212, -582525, 635979, 2507572, 5842171, 8949319, 8827266, 4932228, 203298, -1968687, -947573, 1143852, 2179195, 2574962, 4718326, 9408306, 13625466, 13304165, 8100800, 1815475]
36702A815475l566476K16402L282128M681613K999531j232150l762704j465480
36694B968339K402981K323132j131198k279187N18292K438313J56045l126497
36686D270220l057154l32020J347762N69113j096377j732113o87081J064374J667928
36677B014652R35957J207057L220522L194602j592912o379856m506602J609319
36669b97261L067118j433742l268704J675545N904033K957309j883899j208059
36661E512340J817571o2297m504754l275630L136339N641652J113985l305154
36653F074052k158503J036334J530168P16683J574622K759030J914362M50427
36645A3897175M71805L71640j962617m076641j861014L637528O836071N199064
$$ y = [1815475, -1751001, -1534599, 1747529, 6429142, 9428673, 8196523, 4433819, 2968339, 5371320, 7694452, 6563254, 4284067, 4802359, 7240672, 7396717, 4270220, 1213066, 881046, 2228808, 2797921, 1701544, -30569, -717650, 346724, 2014652, 2950609, 4157666, 7378188, 10572790, 8979878, 2600022, -1906580, -297261, 2769857, 1336115, -1932589, -257044, 5646989, 8604298, 6720399, 5512340, 7329911, 7267614, 2762860, -512770, 2623569, 8265221, 9379206, 6074052, 3915549, 4951883, 6482051, 7198734, 8773356, 11532386, 13446748, 13897175, 14368980, 14740620, 12778003, 8701362, 6840348, 10477876, 17313947, 22513011]
36637B2513011K353683K429972M401003M418911J996576P55957K972725O171471
36629D8013309O585588M065886J478559M56466J75242k11008l66811M5485R87913
36620F1230629K524323L735178K179967k783304p258025p040552l767764k535659
36612D6284793l985549l981608j248844N99313k79528j343368j383037k570537
36604C2091635m620707l624734L84960J810525q91751j612913K543125M933746
36596C1013886N81597m168124j715380L928785M246599N98477N83699M181482
36588C9251021N145419L606448N324083R512833R476577N677701O224895J2588086
36580I6807063J6349069J3246671R634571J0820991J2966888J1529941Q603011
$$ y = [22513011, 24866694, 27296666, 31697669, 36116580, 38113156, 38869113, 41841838, 48013309, 54598897, 58664783, 60143342, 60599808, 60775050, 60564042, 60197231, 60242716, 61230629, 63754952, 67490130, 69670097, 66886793, 59628768, 52588216, 48820452, 46284793, 42299244, 38317636, 37068792, 37668105, 37388577, 36045209, 34662172, 32091635, 27470928, 23846194, 24231154, 26041679, 25149928, 23537015, 26080140, 31013886, 31595483, 27427359, 25711979, 29640764, 33887363, 34485840, 35069539, 39251021, 44396440, 48002888, 53326971, 62839804, 72316381, 77994082, 84218977, 96807063, 113156132, 126402803, 136037374, 146858365, 159825253, 171355194, 179958205]
36573A79958205O225299P94306r344491j7771976j8279921j3858231j1309959
36566A16413232j1686688j1749904j0564471r155390p289496n255674n153815
36559E5557794o522414n191096n07130J585531k354446o488969m199330J313695
36551C3193635K005899k814239o542479n483836k155268N22692K127604K197321
36543B3051329J25726k382901k954558k232267k300337k567408j162849P31237
36535A0307972J75555k548412m072346k592128P11382L894978N011729K404262
36527A3292992k436776m440210j308157K012404j2708m574372m248739J488197
36519b27369N240651K713334j811643k988467j538432p20500m81534P75104J851899
$$ y = [179958205, 186183504, 186977810, 177633319, 159861343, 141581422, 127723191, 116413232, 104726544, 92976640, 82412169, 73256779, 65967283, 60711609, 55557794, 49035380, 43844284, 43337154, 44922685, 42568239, 36079270, 31879940, 33193635, 35199534, 32385295, 25842816, 20358980, 18203712, 18726404, 20854008, 23051329, 23177055, 20794154, 17839596, 15607329, 13306992, 10739584, 9576735, 10307972, 10483527, 7935115, 3862769, 1270641, 1982023, 5877001, 10888730, 13292992, 10856216, 6416006, 5107849, 7120253, 7107545, 2533173, -1715566, -227369, 5013282, 7726616, 5914973, 2926506, 1388074, 667574, 186040, 961144, 2813043]
36510B813043N63592j809544j850761P36048K555203J488716n40064p86209M48311
36501C618335Q71532p2465o55038J26302J128606J315722J388817J847966J457456
36492A1027233k59247r39091J135327K965511K91529n405428p866666m560055
36484c610887K83482K420249K794718L739428M333179K950642J140384J185598
36476A5236793K022904J108857j237675k557248k204692j789768k329824l104375
36468E144972k935685j431724L35988J80852k460331m303415j683228L605766
36460c546805N853227L569699J358950K032662K293557n72800l070093j282235
36452F636162K030344J684140j608027k862290q44173R93024O29024l16959k52544
$$ y = [2813043, 3376635, 1567091, -283670, 452378, 3007581, 4496297, 3956233, 3170024, 3618335, 4489867, 4417402, 3762364, 3888666, 5017272, 6332994, 7721811, 9569777, 11027233, 10767986, 9828895, 10964222, 13929733, 14221262, 8815834, 949168, -3610887, -3327405, -907156, 1887562, 5626990, 9960169, 12910811, 14051195, 15236793, 17259697, 18368554, 17130879, 14573631, 12368939, 10579171, 8249347, 5144972, 2209287, 777563, 1113551, 1294403, -1165928, -5469343, -7152571, -3546805, 2306422, 5876121, 7235071, 9267733, 11561290, 10988490, 7918397, 6636162, 8666506, 10350646, 8742619, 5880329, 5036156, 6029180, 6658204, 6341245, 6088701]
36443F088701L93389Q08586O72873j40171q70267k83673P54620k64663k763800
36434D395595k560161J334354L798516J173022k795156l240907j877084k626170
36426b397991l697875r65088L745308N030395K656764R41880R28662J00045j355146
36417D986954j021269j09954j813466m432818l217248J315615L972842L418479
36409C099135K741649J939985j807346o005371m151310K913068N988631J124907
36401E843348m180207k662566K508300M404344K591965Q90579J46877q51707j138925
36392G552008M20152J825397J022499l93905r3267J301140K539230M416096P000399
36383B5589749P768190N763629L963288M208699L841748J126841m35500J903823
$$ y = [6088701, 6482090, 7290676, 7963549, 7823378, 6953111, 6669438, 7424058, 7159395, 4395595, 1835434, 3169788, 6968304, 8141326, 5346170, 2105263, 228179, -2397991, -6095866, -7060954, -3315646, 1714749, 4371513, 5313393, 6242055, 6342100, 4986954, 3965685, 3855731, 2042265, -2390553, -5607801, -4292186, -319344, 3099135, 5840784, 7780769, 5973423, -31948, -4183258, -1270190, 4718441, 5843348, 1663141, -999425, 1508875, 5913219, 8505184, 9395763, 9542640, 8690933, 7552008, 7972160, 9797557, 10820056, 10426151, 10332884, 11634024, 14173254, 18589350, 25589749, 33357939, 39121568, 43084856, 47293555, 51135303, 52262144, 51826644, 53730467]
36375E3730467L925997L04803o133226p677146l076839Q48889p38811m799948
36367C6384186o131593m301115k271920j282814l23871N54840m36400l450631
36359A8740682n103016k271812K723832L862525m92337m598170l198356R19006
36351A0582354J731921l87996k00675K490234K051106k845540n886260k929675
36343D605469J462995J458791j607173k922648j738048j98681J609985M194215
36335F864905N007516J500021l821416n864074l429699K95177K498934K818778
36327E870142J882432P05110O13372J621440K022699R60382m86369j755477l453130
36318G980601m457247k223908K226988L922598R61889k505099l024348k497530
$$ y = [53730467, 57656464, 57961267, 51828041, 44150895, 41074056, 41922945, 41184134, 36384186, 30252593, 25951478, 23679558, 22396744, 22072873, 22627713, 22191313, 18740682, 13637666, 11365854, 14089686, 17952211, 17459874, 12861704, 9663348, 10582354, 12314275, 11926279, 11725604, 14215838, 16266944, 13421404, 7535144, 4605469, 6068464, 7527255, 5920082, 2997434, 1259386, 1060705, 2670690, 6864905, 11872421, 13372442, 9551026, 3686952, 257253, 552430, 3051364, 5870142, 7752574, 8457684, 9071056, 10692496, 12715195, 13675577, 13189208, 11433731, 7980601, 3523354, 1299446, 3526434, 7449032, 8410921, 5905822, 2881474, 383944]
36310C83944k644877o34115M539399O806678J222533o502903o513796J235310
36302b107827P159705N442058J32381k548529j693307n8500K63763j102927k933151
36293B553666k851992o5430K744205K623012L80793j007562m41364J283100L222981
36284H441409L559726L06515m278664m163171J597741N429147K131307k179041
36276A0844969M57144O364909N995336o8700k088850K682248O352586M335836
36268C4875478J983456M021695P298874Q602723J0919380J6458380K0987709K1058630
36260A26206325K0420869K2899013K4210757J7656891M384786q139584j5426417
36253A92212640j8554224j9558430j9065485j7526519j5351185j2544233r953452
$$ y = [383944, -2260933, -2895048, 1644351, 8451029, 9673562, 3170659, -3343137, -2107827, 5051878, 10493936, 10626317, 8077788, 6384481, 6325981, 6589744, 5486817, 2553666, -298326, -363756, 2380449, 5003461, 5384254, 4376692, 3935328, 5218428, 8441409, 12001135, 12307650, 8028986, 3865815, 5463556, 10892703, 13024010, 10844969, 11302113, 17667022, 23662358, 23593658, 21504808, 24187056, 30539642, 34875478, 36858934, 40880629, 48179503, 56782226, 67701606, 84159986, 105147695, 126206325, 146627194, 169526207, 193736964, 211393855, 215778641, 207639057, 192212640, 173658416, 154099986, 135034501, 117507982, 102156797, 89612564, 79659112]
36246G9659112r039128r178396p984122n433134m135459m398398l515874j450533
36238C4524068j786808m649764m754996k19346K794426o78584o003789n919038
36230A3306169j423750R99738l83420k015953k296585k554984k343662k04640
36222C082913J856264O89433j946511j463245J922292L335017R28766j950646
36214F454283k436061j059097R67332K621237J600114k906338o398740l718480
36206d875750K553916M561625N90054k635705o17988K774741K731663P74235N42817
36197F399608J431848R77916k86328o87741r59582k048615k380964j025044m38483
36188I82615k091718k653516P19208M366295L202819m22243K03304M862193N627669
$$ y = [79659112, 70619984, 61441588, 53457466, 48024332, 43888873, 39490475, 35974601, 34524068, 32737260, 28087496, 23332500, 23113154, 25907580, 25228996, 19225207, 13306169, 11882419, 12882157, 12498737, 10482784, 8186199, 5631215, 3287553, 3082913, 4939177, 5628610, 3682099, 2218854, 4141146, 7476163, 8404929, 6454283, 4018222, 2959125, 3926457, 6547694, 8147808, 5241470, -1157270, -4875750, -2321834, 2239791, 2829845, 194140, -423848, 2350893, 5082556, 5856791, 6399608, 7831456, 8809372, 8523044, 7835303, 6875721, 4827106, 2446142, 1421098, 982615, -1109103, -3762619, -3043411, 1322884, 4525703, 4103460, 4306764, 9168957, 14796626]
36179A4796626r37231p622023o433896M83288M719201L061250l60335j774678
36171E932202j894987j948027q18529J593809K174079q32594l655140j504586
36163i53773L939151N978559K124553k484260k594077J52685P94533j325852k652228
36154B979291j637855m44829m65898k33396J141689J811993K23300k088415k535567
36145a249687p33379J632483K817211J912200p38910l042963k681378j84009J160628
36136a107804l70546k426260j900347P83378K557144J872063J31089o29250l8008
36127a128541O79170M01114l60416k764J529835J795470o09133k779311j042313
36118a516889K777987L049599j061514l729918j295885K244491K115202K19044
$$ y = [14796626, 13859395, 6237372, -196524, 286764, 5005965, 8067215, 7706880, 5932202, 4037215, 2089188, 1270659, 2864468, 5038547, 4205953, 550813, -953773, 2985378, 8963937, 11088490, 8604230, 6010153, 6162838, 6957371, 5631519, 2979291, 1341436, 896607, 430709, 197313, 1339002, 3150995, 3374295, 1285880, -1249687, -1983066, -350583, 2466628, 4378828, 3639918, 596955, -2084423, -2268432, -1107804, -1478350, -3904610, -5804957, -5021579, -2464435, -592372, -461283, -1090533, -1128541, -449371, -48257, -408673, -411437, 1118398, 2913868, 2304735, -474576, -1516889, 1261098, 4310697, 3249183, -480735, -1776620, 467871, 2583073, 2802117]
36110B802117P39036K378181J134430k017920k861641j550956j608800k391801
36102c377354l8507M000323L353520k608137o148491k421411L422353M504259
36094F86555J670724j38032M1196Q9321j13988K06825m17956k837890m061425
36085d874670j645741J476133J473189J04649J248952L491067K462696j000075
36077B736200j628926J762671M662203L931372R63567k321280n089657n149586
36069a33436r22399L620509K371874l393972n539598r88891L801829L284525P07287
36060B807728J057684K533726J015449j998438k591668j886703l368133n240968
36052g671323k653397L396702O216814K985887j561502k152817J002532M449019
$$ y = [2802117, 3541153, 5919334, 7053764, 5035844, 2174203, 623247, -985553, -3377354, -3415861, 584462, 3937982, 1329845, -4818646, -7240057, -3817704, 686555, 2357279, 2219247, 2260443, 2349764, 2235776, 2442601, 2024645, -813245, -4874670, -6520411, -5044278, -3571089, -3466440, -2217488, 1273579, 3736275, 2736200, 1107274, 2869945, 7532148, 11463520, 12427087, 10105807, 5016150, -133436, -1055835, 2564674, 4936548, 1542576, -3997022, -4985913, -1184084, 2100441, 2807728, 3865412, 6399138, 7414587, 5416149, 2824481, 937778, -2430355, -7671323, -10324720, -6928018, -711204, 2274683, 713181, -1439636, -437104, 4011915]
36044D011915N758833M311782J112768j211763j089912q56284l556421p005520
36036A475398n604991R16740N513041L087209k448956l862142j71216L481276
36028B386359L516150J268768o29954j367894j035073L67119J864806J425974
36020G796255j707124n390751o163536k476633L475928O998219M852944j118389
36012F266913n106178l325612J674237M156087K110670j019648j559501l9647
36004C157321P73516J68437l14958J81089J026008J792443K465117J983035r19511
35995A0312497m750132n673668k380683J630999K632497J542433J540519K461704
35987G316166J357127j752572k919756k92487K583168J858421r46774j419595
$$ y = [4011915, 9770748, 14082530, 15195298, 13983535, 12893623, 12037339, 8480918, 1475398, -4129593, -3212853, 2300188, 5387397, 2938441, -923701, -1094917, 2386359, 5902509, 7171277, 6541323, 5173429, 4138356, 4505475, 6370281, 7796255, 6089131, 698380, -5465156, -7941789, -4465861, 2532358, 7385302, 6266913, 1160735, -2164877, -490640, 3665447, 5776117, 4756469, 3196968, 3157321, 3930837, 4099274, 3784316, 3965405, 4991413, 6783856, 9248973, 11232008, 10312497, 5562365, -111303, -2491986, -860987, 1771510, 3313943, 4854462, 7316166, 8673293, 6920721, 4000965, 3708478, 6291646, 8150067, 7203293, 5783698]
35979E783698J205282L324949K498986O79381R44267K950064L282008m5362m671210
35970A5952063o212592l276688R69053K847390K413897J991339J793949Q4001
35962A6562412k578589l073323q53434M06810j470429l255185j319790K350809
35954F769281L212299J149508j60256L63124M51263j10376J369440M822050N924597
35945B3790930K646486r58375o98796J528272J488929J231J507468O001455P736401
35936D3044001L629107j325333m75707N057727P805857M650718J461597M537154
35928F8385121J0956336J2289093O877916K695338O169133J3246356J5515466
35921A36134759J1476634O399865L209012p5986l982437n347516l537997l211913
$$ y = [5783698, 6988980, 10313929, 12812915, 13492296, 14436563, 17386627, 20668635, 20623273, 15952063, 9739471, 6462783, 7431836, 10279226, 12693123, 14684462, 16478411, 16562412, 13983823, 10910500, 10057066, 10463876, 8993447, 5738262, 4418472, 6769281, 9981580, 11131088, 10970832, 11333956, 11785219, 11674843, 13044283, 17866333, 23790930, 26437416, 25479041, 24780245, 26308517, 27797446, 27798677, 29306145, 35307600, 43044001, 46673108, 45347775, 44872068, 49929795, 57735652, 62386370, 63847967, 68385121, 79341457, 91630550, 98508466, 101203804, 107372937, 120619293, 136134759, 147611393, 154011258, 157220270, 157144284, 153161847, 147814331, 144276334, 141064421]
35913A41064421p315246j1694130j0926613o309608l514949m590899o935833q566603
35905H1210540r443424q430299m261633J73784k65419n372965q564308n566839
35897C9479437L3455K568463J685380N04008k57326j939304l860872m051441k917306
35888C1244494k170052j181482J365833L187155P97254l919063n016620j345345
35880B2962174J441427k59077k618644j029467K917071N295287O245351P436303
35872D2390425O889259K416644k247952j285326M322942Q006071P469597P286677
35864G5248337J1097244J6983026K1841584K5153500K6981295K7250597K8702024
35857B33257607L5568364M6946482N5513518N4642355M3040940K2047994n426103
$$ y = [141064421, 133749175, 122055045, 111128432, 104818824, 101303875, 96712976, 89777143, 81210540, 71767116, 63336817, 59075184, 59248968, 58983549, 53610584, 45046276, 39479437, 39512892, 42081355, 43766735, 44270743, 44013417, 42074113, 38213241, 34161800, 31244494, 29074442, 27892960, 29258793, 32445948, 33243202, 29324139, 24307519, 22962174, 24403601, 24144524, 21525880, 20496413, 23413484, 28708771, 34954122, 42390425, 49279684, 51696328, 49448376, 48163050, 52485992, 60492063, 67961660, 75248337, 86345581, 103328607, 125170191, 150323691, 177304986, 204555583, 233257607, 268825971, 315772453, 371285971, 425928326, 468969266, 491017260, 485591157]
35850D85591157l1358626m5260644m5031572l9917641l8281249l7775453l2589092
35843B15376880k4551023j9847518j8807817j6805208j3017200j0803784j0611351
35836A00932979r567669p667235p777236r475018r055923o019700l721496l100034
35828D4548668j589265Q83317P17873k842309n295386l241703J030782L268105
35820C7480082J979851j853586o131550p633910m515269J60202J244740j325490
35812A9405070k490837p3640K159855J125705r89723j383909j213198k206837
35804A4332486k641058m27603K639799L201933Q99090k000524l609796l065286
35796I329041m30917K158404J661335j752555m168221l020246P264K448417L936763
$$ y = [485591157, 454232531, 408971887, 363940315, 324022674, 285741425, 247965972, 215376880, 190825857, 170978339, 152170522, 135365314, 122348114, 111544330, 100932979, 91365310, 83698075, 75920839, 66445821, 57389898, 51370198, 47648702, 44548668, 42959403, 43842720, 44560593, 41718284, 36422898, 33181195, 34211977, 37480082, 39459933, 37606347, 31474797, 23840887, 19325618, 19485820, 20730560, 19405070, 16914233, 16840593, 19000448, 20126153, 19136430, 17752521, 16539323, 14332486, 11691428, 11263825, 13903624, 17105557, 18004647, 16004123, 12394327, 9329041, 8898124, 11056528, 12717863, 10965308, 6797087, 3776841, 3784105, 6232522, 10169285]
35787A0169285L941420P22611m703024p323918m275562Q00881K826106J832550
35779C990349J090896J516162J694257J248441O26297n30166j787909j137292
35771F711035J136860R33826l407400o657188l638346K123247K925754j420832
35763a293044l281219J156439O454049O111380R50673l429843l816164j275288
35755A576983J434276J998324n3632k455134k286089K03817J864147J342241P73171
35746D398104J576477J654856q27803l355140k058639K338077M963632L284977
35738A1974541K10538l08052J548461K489566Q88410j705677l398619l987876
35730G711292l709238k124414M21332J918062J086611m81259m98859O54116R27712
$$ y = [10169285, 14110705, 14833316, 10130292, 2806374, -1469188, -668307, 2157799, 3990349, 5081245, 6597407, 8291664, 9540105, 10166402, 9636236, 7848327, 6711035, 7847895, 8781721, 5374321, -1282867, -4921213, -2797966, 127788, -1293044, -4574263, -3417824, 3036225, 9147605, 10098278, 6668435, 2852271, 1576983, 3011259, 5009583, 4955951, 2500817, 214728, 418545, 2282692, 3624933, 4398104, 5974581, 7629437, 6801634, 3446494, 1387855, 3725932, 8689564, 11974541, 12185079, 11877027, 13425488, 15915054, 16803464, 15097787, 11699168, 7711292, 4002054, 1877640, 2298972, 4217034, 5303645, 4822386, 4323527, 4977643, 5905355]
35721E905355J49875q3844K67399n29893k486695l050601p80884K440472L906629
35712E737813K883962K66115k462911l349836j436468J170730J194939j057303
35704B947041j657258J067819L637372K279523j889048m766707m418581k216937
35696e016776k41309O68489J072235J980255K989378J906548j863298m660692
35688c165170k675836K067973M170390K806609J801984J768023q95988n591326
35680B86659n890877P158M616480K157617k544039k431026P97779J599009R32934
35671d68306K770308M443777N26795n868622n996971N66955M756105K065931j528414
35662A267558m73645J990168P53283k498645k804627J48358K417678J711491o52462
$$ y = [5905355, 6055230, 5971386, 6238785, 5708892, 3222197, 171596, -609288, 1831184, 5737813, 8621775, 8887890, 6424979, 3075143, 1638675, 2809405, 4004344, 2947041, 1289783, 2357602, 5994974, 8274497, 6385449, 1618742, -2799839, -5016776, -5258085, -4589596, -3517361, -1537106, 1452272, 3358820, 1495522, -3165170, -5841006, -3773033, 397357, 3203966, 5005950, 6773973, 5877985, 286659, -5604218, -5597060, -980580, 1177037, -1367002, -3798028, -3000249, -1401240, -468306, 2302002, 6745779, 7272574, 1403952, -4593019, -4026064, 730041, 2795972, 1267558, 793913, 2784081, 3537364, 1038719, -1765908, -1617550, 800128, 2511619, 1859157]
35653A859157k277767j946754k84315R67860J212452J866730L363768L125400
35645G886531m11988l767199k712824J022447K399456J104745J045826K447426
35637I014420J089849l839708p434375o157946j886686K290385M985364M522007
35629B583310J14624l937203j859470M246120N729199J87232m744732l558192
35621a239112o69963j277322k401016K39787L157920R49763l656453l945280j35691
35612h977367J956687J008385R43780K638836K671365O67916P32089L967131N622913
35603A1231735K178242l320795n763909m575388l036187k938042k594173l7421
35595h855938L418276M141581J127362j621755n1710L626087L552377q05669l523720
$$ y = [1859157, -418610, -2365364, -2649679, -1681819, -469367, 1397363, 4761131, 7886531, 7474543, 3707344, 994520, 2016967, 4416423, 5521168, 6566994, 9014420, 10104269, 6264561, -1169814, -7327760, -9214446, -6924061, -1938697, 2583310, 2697934, -1239269, -3098739, 1147381, 6876580, 7063812, 2319080, -1239112, -1909075, -3186397, -5587413, -5347626, -2189706, -1239943, -4896396, -8841676, -8977367, -7020680, -6012295, -5068515, -2429679, 241686, 909602, 1641691, 5608822, 11231735, 13409977, 10089182, 4325273, -250115, -3286302, -6224344, -8818517, -8855938, -5437662, -1296081, -168719, -1790474, -1842184, 1783903, 5336280, 4530611, 1006891]
35586A006891j644518K49222j589869l155795J56119M502129L118909k331743
35578C11345m130350p68145J536723j54352j234484J567712M349673K725794j268113
35569B935803l042776k033884n27018O85773J655538J073007j411345k777464
35561c442366m13021L166100L248830j87243k432806j015875J091542N45713j298816
35552g37942q66336K036723M080284L275368J115866m46286j421698k090258j519797
35543C425924K73133R39571q77383k778350k156969n50102o24233p47277K204684
35534h91002N750131M080455k077215n004964j573843J895447Q0832l060847j983638
35525b784644P33175l78274l339245j901225L451854N843892K605542j696570
$$ y = [1006891, -637627, -388405, -1978274, -5134069, -4977950, -475821, 2643088, 311345, -3819005, -4587150, -3050427, -3204779, -4439263, -2871551, 1478122, 4203916, 2935803, -106973, -2140857, -2667875, -1982102, -326564, 746443, -664902, -3442366, -3855387, -689287, 2559543, 2372300, -60506, -1076381, 15161, 560874, -737942, -1604278, 432445, 4512729, 7788097, 8903963, 8457677, 7035979, 4945721, 3425924, 3699057, 4638628, 3761245, 982895, -1174074, -1724176, -2348409, -3095686, -891002, 4859129, 8939584, 6862369, 1857405, 283562, 2179009, 2259841, -801006, -2784644, -2051469, -2429743, -5768988, -7670213, -4218359, 1625533, 4231075, 2534505]
35517B534505k945400j869471k90395J412737K396773J600608J79586k78004j033648
35508A707291l290006l909889J53771M907860L785735j911944m588098k022431
35500e167711N38979K09212k13098K12847j258144l404715r48760N045424O464541
35491A478575J654713p78568L005702M320909k921359r868076o085218L314600
35483e878722O024363J545295j101338j3050r92944l868489k186340L343620M286012
35474A158407q51423l597166o1975L030757Q89434j595044J39016K315469Q72946
35465B300421j052435j08382N14154k017358l553169k34912L985749M226622K950014
35456G010704L810021L325988k489000q372818o567021L00052L148118P30639
$$ y = [2534505, -410895, -2280366, -2570761, -1158024, 1238749, 2839357, 3018943, 2740939, 1707291, -1582715, -5492604, -5338833, -430973, 3354762, 1442818, -3145280, -5167711, -4628732, -4419520, -4632618, -4419771, -5677915, -9082630, -10031390, -4985966, 1478575, 3133288, 2354720, 5360422, 9681331, 6759972, -3108104, -9193322, -5878722, 145641, 1690936, 589598, 576548, -416396, -4284885, -6471225, -3127605, 1158407, 306984, -3290182, -3352157, -321400, 568034, -1027010, -887994, 1427475, 2300421, 1247986, 1139604, 1653758, -363600, -3916769, -4151681, -165932, 4060690, 7010704, 10820725, 14146713, 11657713, 3284895, -3282126, -2982074, 166044, 896683]
35448H96683l57093J516773J113018k437193l152579Q93128L730569J605356j518334
35439B290328j817700j065616q70081O90485K993849J489600l288239l723186
35431c300560K428014O252157J486909m407841k312817L003053J189923n250707
35423i11869m664403L611114P218770P06274n902173l407936K996495L640821
35415C287093p52546k450631O05004L570633L159777P51743j204606j077520J772902
35406G661849M987729M143971o82160l019616Q70081N263795L428416j147526
35398B1506539J18845O920792J0298901O781745L152597N064156R394419J1664796
35390G4902790J3430556J7035045J9462857J8000968J7138267K2245756K9253257
$$ y = [896683, 539590, 2056363, 3169381, 732188, -2420391, -1527263, 2203306, 3808662, 2290328, 472628, -592988, -1463069, -772584, 2221265, 3710865, 422626, -3300560, -872546, 5379611, 6866520, 2458679, 145862, 3148915, 4338838, -911869, -5576272, -1965158, 5253612, 5959886, 57713, -3350223, -353728, 3287093, 2534547, 83916, 688920, 4259553, 7419330, 8171073, 6966467, 5888947, 7661849, 12649578, 16793549, 16111389, 13091773, 13961854, 19225649, 22654065, 21506539, 21625384, 28546176, 38845077, 45626822, 48779419, 53843575, 63237994, 74902790, 88333346, 105368391, 124831248, 142832216, 159970483, 182216239, 211469496]
35383B11469496K8448496J7676395M489183n070346j2534220k0055840k4504822
35376A99918342k2830064j8374277j6630484j7478426j6527323j2569029q891390
35369H6617349p573811o953443n561441m843494o234739q096620p616877m488330
35361C5248594j216623m14374k461932n116899n267881k188534R83004O31917
35353B0197272k446382l814398j576320R70007L55597k082987k717473j053560
35345G831756L83553L44936p9220j31798k03283j25905P04514J526340J011046
35336A1261939j97538k64107O42902P33689J10621N99156J687859L99660l480649
35327A1493532n729402l427563P14755K404005J556353J082877J868172K173372
$$ y = [211469496, 239917992, 257594387, 262083570, 257013224, 244479004, 224423164, 199918342, 177088278, 158714001, 142083517, 124605091, 108077768, 95508739, 86617349, 79043538, 72090095, 66528654, 61685160, 55450421, 47353801, 39736924, 35248594, 34031971, 33617597, 31155665, 26038766, 20770885, 18582351, 19565355, 20197272, 17750890, 13936492, 12360172, 13330179, 13685776, 11602789, 8885316, 7831756, 8215309, 8560245, 8481025, 8349227, 8145944, 8020039, 8724553, 10250893, 11261939, 11064401, 10800294, 11443196, 12176885, 12287506, 12886662, 14574521, 14974181, 11493532, 5764130, 2336567, 3051322, 5455327, 7011680, 8094557, 9962729, 12136101]
35319A2136101R55794j043293k882792l799762k716715M27290L427413L916008
35311A0420044K254860O30273m4971n36514j231700j516931r53672J93750J184471
35302A0399610Q76965j207951l179073k097557J748150M205959K650926n06956
35294A2890073j905878j979814k621107k923555j156278J283681K079335K091040
35286G757497K803024J983015k623488p191790n970983n63431K088508P76792
35278i40856J056046M152302L821852k272699o653723l167993L106498M027084
35270C128511P64261J19314K539081K444625j313503l622873j814689Q36343J308473
35261D389543O50076K73694n07954j672702j475630K02215J082051L18956k21983
$$ y = [12136101, 13091895, 12048602, 9165810, 5366048, 2649333, 3076623, 6504036, 10420044, 12674904, 13305177, 13260206, 12723692, 11491992, 9975061, 9021389, 9215139, 10399610, 11276575, 10068624, 6889551, 4791994, 6540144, 10746103, 13397029, 12890073, 10984195, 9004381, 6383274, 3459719, 2303441, 3587122, 5666457, 7757497, 10560521, 12543536, 9920048, 2728258, -3242725, -3806156, -1717648, -940856, 115190, 4267492, 8089344, 5816645, -837078, -4005071, -898573, 3128511, 3892772, 4012086, 6551167, 8995792, 7682289, 4059416, 2244727, 3081070, 4389543, 5039619, 5313313, 4805359, 3132657, 1657027, 1859242, 2941293, 3260249, 3038266]
35252C038266M10218O14341o37261k025013k263127j487852L62700L443354N631091
35243G086717L854532r44530l707949j878911J140608J217986r54330k168511
35235C645612j880901j814700k078583j132938Q06986J297594p67616l020546
35227d945092k255405J373764L982965K493002j166034k235718K74855J987226
35219d90437j46131k693573q32429L869468N594252K936093N6612n59007q26659
35210F908189j837407j670544j16013j31704k308816l002600n04131J989657K218758
35201A545389K230805K827945P20077m507474o761511k415313K745680K179338
35193a435064r98295J9528L829520L855324J71010j371282j82762j161971m166377
$$ y = [3038266, 3448484, 4062825, 3425564, 1400551, -862576, -2350428, -1987728, 1455626, 7086717, 10941249, 9996719, 6288770, 4409859, 5550467, 6768453, 5814123, 3645612, 1764711, -49989, -2128572, -3261510, -2454524, -1156930, -1924546, -4945092, -7200497, -5826733, -1843768, 649234, -516800, -2752518, -2477663, -490437, -636568, -3330141, -4162570, -293102, 5301150, 8237243, 8293855, 7734848, 6908189, 5070782, 3400238, 3284225, 3152521, 843705, -2158895, -2663026, -673369, 1545389, 3776194, 6604139, 7324216, 2816742, -3944769, -6360082, -3614402, -1435064, -2433359, -2413831, 1415689, 5271013, 5442023, 4070741, 3887979, 2726008, -1440369]
35184a440369l364451J627797L773858M47146j951985R62424M318728K671216
35176G044364j370914k719771j922815j989904k132266k93639K086340K806928
35168A508323K696597K435074m9837m479468n425997k89925M483355J922265m361906
35159a561519n156605N11168M500890K105540k076709k206725R76744K888504
35151a8712J574817r38435j563585Q36525M086731M548385J597032j092174n48632
35142H481952J233896O95249j725279k784328j556849J14906R79484R17276n07992
35133E848315k868318l736434j796127O68097J303672J268342K057493J954864
35125D699904k41593j478383M57136J707725j520781m998803k324287L722018
$$ y = [-1440369, -4804820, -3177023, 596835, 1043981, -908004, 54420, 4373148, 7044364, 5673450, 2953679, 1030864, -959040, -3091306, -3384945, -1298605, 1508323, 4204920, 6639994, 6590157, 2110689, -3315308, -3605233, 878122, 2800387, -1561519, -6718124, -6206956, -1706066, 399474, -1677235, -3883960, -2907216, -18712, 1556105, 617670, -945915, -109390, 3977341, 8525726, 10122758, 9030584, 8481952, 9715848, 10411097, 8685818, 5901490, 4344641, 4459547, 5439031, 6356307, 5848315, 2979997, -756437, -2552564, -1884467, -580795, 687547, 2745040, 4699904, 4458311, 2979928, 3437064, 5144789, 3624008, -1374795, -3699082, 22936]
35117B2936M437983j147403m979447k766546R00822J774648J621268K097924J084540
35108C046725j526995j789060R14173J442670k205024m424355j041898L480317
35100b103447L091428q96229l090944j815806J029312L740862M373925R60886
35092E289987l965872l980980K029208O604923M194956q34343k045611q67338
35084F424930k008001m214566l310878m66073L06880l10782O01068J343425r96044
35075b630041l213197m94338M118889L731036o70465k018287K93615R1176l030429
35066c822041k095214L773144N507919j129305p004416l195983M883989N803859
35058B721952q66251n283862k474845K263081L103122J270779R13186K636872
$$ y = [22936, 4460919, 3313516, -1665931, -4432477, -3531655, -1757007, -135739, 1962185, 3046725, 1519730, -269330, 644843, 2087513, -117511, -4541866, -5583764, -2103447, 987981, 91752, -2999192, -4814998, -3785686, -44824, 4329101, 5289987, 1324115, -2656865, -627657, 5977266, 10172222, 9337879, 7292268, 6424930, 4416929, 202363, -3108515, -3574588, -3267708, -3578490, -2977422, -1633997, -2630041, -5843238, -6337576, -2218687, 1512349, 841884, -1176403, -882788, -791612, -3822041, -5917255, -2144111, 3363808, 2234503, -4769913, -7965896, -3081907, 2721952, 1855701, -3428161, -5903006, -3639925, -536803, 733976, 1647162, 4284034]
35050D284034L764091K147946j947066n922901o305637k234890K346954K611669
35042a255800o65851j781487J448994L728322J17156n266717m089296L282113
35034d482566O602798K79499p304373n044971M618672R068246L815165j991095
35026E561375m51647L807789K684854k272417l493907R1111K347556K01370k719277
35017E756807k841012j022362O72243J728351J743106K06545j504150j302433
35009C437095J06590J85536j004908r47184O16362R27480j083520k774867j660540
35000b197956J271334L122914K231225n43395k363215r01528K418752L319233
34992F357364M40590k406896k154293j104824j989102k400832M81339L320050
$$ y = [4284034, 8048125, 10196071, 8249005, 2326104, -3979533, -6214423, -3867469, -1255800, -1921651, -3703138, -2254144, 1474178, 1591334, -3675383, -7764679, -4482566, 2120232, 2399731, -4904642, -9949613, -5330941, 3737305, 7552470, 5561375, 5109728, 8917517, 11602371, 9329954, 5836047, 5927158, 8274714, 8476084, 5756807, 2915795, 1893433, 2565676, 4294027, 6037133, 6243678, 4739528, 3437095, 3543685, 3729221, 2724313, 1777129, 2393491, 3320971, 2237451, -537416, -2197956, -926622, 2196292, 4427517, 3884122, 1520907, 619379, 3038131, 6357364, 6797954, 4391058, 2236765, 1131941, -857161, -3257993, -2776654, 543396]
34984E43396J592329j801623q44670K774572K196901k194816k998144Q79615J892521
34975B040081k425099m307381O76441N089698J755158m274869m361334J02782
34967e704523K022872J086625J849819L082457k30386n680122m924228K561111
34959e936375O907779K185584m756002m497467J884082N644544K748337k327492
34951A852990m086481k453369p90733o25518m11158J402469L777224M053364R69362
34942C688150l713451o465289m896701q2722L889104L821211J247536O68508L144919
34933A301265M298162Q15591l989539m812877k118279l62491j58705J734703N001670
34924A709500N034179Q19814k780729k746299j864185k388523j897445R55626
$$ y = [543396, 2135725, 334102, -510568, 2264004, 4460905, 2266089, -732055, 147560, 2040081, -385018, -4692399, -4015958, 1073740, 2828898, -1445971, -5807305, -5704523, -3681651, -2595026, -745207, 2337250, 2106864, -3573258, -8497486, -5936375, 971404, 3156988, -1599014, -6096481, -4212399, 1432145, 4180482, 1852990, -2233491, -4686860, -5477593, -6103111, -6514269, -5111800, -1334576, 2718788, 3688150, -25301, -6490590, -11387291, -11470013, -7580909, -3759698, -2512162, -1843654, 1301265, 5599427, 6415018, 2425479, -2387398, -4505677, -4868168, -5026873, -3292170, 1709500, 6743679, 7563493, 4782764, 2036465, 172280, -2216243, -4113688, -3158062]
34916c158062K556943P84936j91828K880392N215875P53325p352891j0098370
34908h609680m857305K163624N035302L933035J762067m0579j319451k096353
34900d029340k376233j458024J537014M925748M778750M59667l173192k363012
34892a698622R0698Q0592p18288J474379M751543M062440m5903k046669k60101
34883E690069J563451J579143K020691K990932P73227n189329r294480p040541
34875f906837j091157K977516L580988K896774K551404K430303K027197Q64894
34867I331082j166752k831033k518214q02247L0395m75797l28297J211188J946781
34858D397106J21494k728144l877331k836613j276814n55961m28954J86083J604478
$$ y = [-3158062, -601119, 183817, -8011, 2872381, 8088256, 8841581, 1488690, -8609680, -13466985, -11303361, -6268059, -2335024, -572957, -613536, -1932987, -4029340, -6405573, -7863597, -6326583, -1400835, 3377915, 3837582, 664390, -1698622, -1607924, -1527332, -2245620, -771241, 3980302, 8042742, 7996839, 5950170, 5690069, 7253520, 8832663, 10853354, 13844286, 14617513, 9428184, 133704, -6906837, -7997994, -5020478, -1439490, 1457284, 4008688, 6438991, 8466188, 9331082, 8164330, 5333297, 2815083, 2012836, 2043231, 1567434, 1239137, 2450325, 4397106, 4518600, 1790456, -2086875, -4923488, -6200302, -6756263, -7185217, -6999134, -5394656]
34849e394656K605702J926436N34750O03880J621826L69859l472277n110390j302327
34840g617197L861607M299145O56150j487269m00913O33999J57658L67404J778590
34831B249174J871416R2857j040400q49996j322680k097772k77100L364269L971587
34822E961355N46593j756206j16137J244901j367553m633502m109266j536663
34814e766478p05005k12125L356866P829177P446513J355896n214414p747462
34806C42968o172375k567354R11741K380811J827116J552006K415348J702540
34798B392801j997027m591655j911201K955818L483861m42869k712130o97652
34790c520054J645410J176195k63792q17627j696422k743887p76332M081613N857750
$$ y = [-5394656, -2788954, -862518, -327768, 276112, 1897938, 2267797, -1204480, -6314870, -7617197, -3755590, 543555, 1199705, -287564, -688477, -54478, 103180, 470584, 2249174, 4120590, 4213447, 3173047, 2323051, 1000371, -1097401, -1374501, 1989768, 5961355, 6507948, 4751742, 4635605, 5880506, 4512953, -120549, -4229815, -5766478, -6471483, -6683608, -3326742, 4502435, 11948948, 13304844, 8090430, 342968, -5829407, -8396761, -7485020, -5104209, -3277093, -1725087, 690261, 2392801, 395774, -4195881, -6107082, -3151264, 332597, -110272, -2822402, -3520054, -1874644, -698449, -962241, -1779868, -3476290, -6220177, -6996509, -2914896, 2942854]
34781B942854J222382m136214l275659J548181K773995n44525k209547K44725
34773a433808J976508j00338j918607K72173L013306J559619j685732j128317
34765E54804K147948J689729l379576n911581j428673M765628N108691J09378
34757C656348l577422k717715q1071J402004K067811K641852K143406K79676r71089
34748D843800o3586J595809J438440r95514l630635l968794j215538K717679M184718
34739D906379J210665l677084n578603k838058J040894K008769L23209q18820
34731c422649k57073r4215j795442l204096j121252L732423O383532L418228k118895
34722A520561l931674n26413K809907J436068k235558k842513l50868M57415j646405
$$ y = [2942854, 4165236, 29022, -3246637, -1698456, 1075539, 531014, -1678533, -1433808, 542700, 442362, -1476245, -1204072, 1809234, 3368853, 1683121, 554804, 2702752, 4392481, 1012905, -4898676, -6327349, -1561721, 3546970, 3656348, 78926, -2638789, -2719860, -1317856, 749955, 3391807, 5535213, 5814889, 4843800, 4780214, 6376023, 7814463, 6818949, 3188314, -780480, -1996018, 721661, 4906379, 6117044, 2439960, -3138643, -5976701, -4935807, -2927038, -2603829, -3422649, -3679722, -3773937, -5569379, -8773475, -9894727, -6162304, 221228, 3639456, 1520561, -2411113, -2937526, -127619, 1308449, -927109, -3769622, -4120490, -3663075, -5309480]
34713e309480j902229K481582O627565M320136k712050o644085l884153J047696
34705e975018K601769R14695n83052p42924n28538M45594K942430M423181J122790
34696D620927n096509o602375K79343Q954209J0168728L583009l055811m774477
34688H077044l646980k381250j97374K814755L181263l92915l543119k435724
34680A475700M27020Q73869k06550K14849J089400q8750j167901J356273M621576
34671H595486K548181l574233n628261j214889K291188m41716m171869j825485
34663c421598L848543M418211j293390n627627l332977J736288L068294K19126
34655c85130k128534j466865M395M6577j3904J609579L023226J292639j857398
$$ y = [-5309480, -7211709, -4730127, 1897438, 6217574, 3505524, -3138561, -7022714, -5975018, -3373249, -2458554, -3041606, -3784530, -4313068, -3867474, -925044, 3498137, 4620927, -475582, -7077957, -6798614, 2155595, 12324323, 15907332, 12851521, 8077044, 4430064, 2048814, 1851440, 4666195, 7847458, 7454543, 3911424, 1475700, 1902720, 2776589, 2570039, 2784888, 3874288, 3785538, 2617637, 3973910, 8595486, 11143667, 7569434, 1941173, 726284, 3017472, 2575756, -1596113, -3421598, 426945, 4845156, 3551766, -2075861, -5408838, -3672550, -604256, -385130, -2513664, -3980529, -3976134, -3929557, -3943461, -2333882, 689344, 1981983, 124585]
34646A24585j700424J624953K345694j515049l722430O02282O216278N131366
34638I107255j057546m040361j730362K17521q47980j235789O05340Q59890j883961
34629e993l328528j081762J354822J410177J424836K432517J110254k950273m177952
34620c811902k64575K630517j16951l279169o14147M231934L996237q4361j446309
34611A241274L04704M18336j099287j62785K188606Q03053l447336l754123J252288
34602b255270M764803K576377j105979j498186j07205k48664j238421q03201P45106
34593H29360J804215J865632P33944j553040l013871j483058J322005J602486
34585B107673k69780k49414J967973J885498j741827l941332j532529J676953
$$ y = [124585, -1575839, 49114, 2394808, 879759, -2842671, -2240389, 3975889, 9107255, 8049709, 4009348, 2278986, 2496507, 1648527, 412738, 1018078, 1877968, -5993, -3334521, -4416283, -3061461, -1651284, -226448, 2206069, 3316323, 366050, -3811902, -4076477, -1445960, -1562911, -4842080, -5456227, -1224293, 2771944, 2687583, 1241274, 1545978, 1964314, 865027, 702242, 2890848, 3693901, 246565, -3507558, -2255270, 2509533, 5085910, 3979931, 2481745, 2374540, 2125876, 887455, 84254, 829360, 2633575, 4499207, 5233151, 3680111, 666240, -816818, 505187, 2107673, 1837893, 1588479, 3556452, 5441950, 3700123, -241209, -1773738, -96785]
34577i6785J518768N795O01745J531420o49366m059601l904450j79688K322521
34568b909641J129921j141375j184785J071360L119431K431103j170314m416147
34560c070447l494341N99223K363642l84103k559491N68208N277544M490068j173974
34551B616329m094996j153328K338887J824725J02220J149225K695804K84529
34543E763395m390880n102497l04546M452246M206093O22773j465244n95454P10996
34534C896882K52718j419554k512877k142652p65562N23137R03642N03674J14363
34525f46229J11765J85454K45192N50178N76644p00116k523524k324396L26306
34516d198726J888304k16410k783546j016125L580181M659515P06116k413824
$$ y = [-96785, 1421983, 1427778, 2029523, 3560943, 2911577, -1148024, -5052474, -5232162, -2909641, -1779720, -2921095, -4105880, -3034520, 84911, 2516014, 1345700, -3070447, -6564788, -5965565, -3601923, -3986026, -6545517, -5977309, -699765, 3790303, 2616329, -1478667, -2631995, -293108, 1531617, 1633837, 2783062, 5478866, 5763395, 1372515, -3729982, -4034528, 417718, 4623811, 5246584, 3781340, 3185886, 3896882, 4149600, 2730046, 217169, -1925483, -2691045, -2167908, -1264266, -760592, -646229, -534464, -349010, -103818, 446360, 1023004, 322888, -2200636, -4525032, -4198726, -2310422, -2526832, -5310378, -6326503, -2746322, 1913193, 2619309, 205485]
34508B05485n08110K821348K516554k91733j433531n71292Q0685O37952J744988
34499E202346Q75420l354677n728212p55975O922192P045400r04417n977508k063833
34490A260736L155705Q59773n232054n617131o5254L134220O09499k294487j323275
34481e512268R89079J468834J522859K787812K768584o49008l845111j837549
34473b306768L610015N579409J895115j694845l04093K680013J185772l534294
34465G110324m477192n1024K928202k44521m667795l571543J145283K623115L82309
34456A177158J81690L190896L567156j270931n524795l973992K06324J436442
34448a010052M24150J175333L170733K835081N56826M7325J616126J670149j155911
$$ y = [205485, -302625, 2518723, 5035277, 4743544, 3310013, 2738721, 2819406, 3457358, 5202346, 6077766, 2723089, -3005123, -3761098, 3161094, 10206494, 9302077, 3324569, 1260736, 4416441, 5276214, 44160, -5572971, -5638225, -2504005, -1894506, -4188993, -5512268, -4523189, -3054355, -1531496, 1256316, 4024900, 3375892, -469219, -2306768, 1303247, 6882656, 8777771, 7082926, 6778833, 9458846, 10644618, 7110324, 2633132, 2582108, 5510310, 5265789, 597994, -2973549, -1828266, 794849, 1177158, 1358848, 4549744, 8116900, 6845969, 1321174, -2652818, -2446494, -1010052, -585902, 589431, 3760164, 6595245, 7152071, 7199396, 8815522, 10485671, 9329760]
34439I329760m152532m984657l806456r47873L275181O251696M850030J50768
34431I965917l388429l893359l295942k522514l29230K242382J706027j546253
34423a061401k187107J650598M180906O44259m458927l772550J498262L576579
34415G0619K90738k045962R96155N257934M689774n5825l641501l611735j954678
34406d481p24750J57173J039251J364460P73482l82204j815567l235246l571189
34397f399071j755747J443443L559770K899018K67069j951848j996210j31686
34389d065262J607264J299287p07519j972026j019499M67639j46643k452059l058096
34380a0046914j62143L577621L993418M88110l076802k615893J701942N504443
$$ y = [9329760, 5177228, 192571, -3613885, -4561758, -1286577, 4965119, 9815149, 9965917, 6577488, 2684129, -611813, -3134327, -3463557, -1221175, 484852, -1061401, -3248508, -1597910, 2582996, 3227255, -1231672, -5004222, -3505960, 70619, 361357, -1684605, -688450, 4569484, 9259258, 9203433, 5561932, 1950197, -4481, -729231, -572058, 467193, 1831653, 2605135, 2222931, 407364, -2827882, -6399071, -8154818, -6711375, -3151605, -252587, 14482, -1937366, -3933576, -4065262, -2457998, -1158711, -1866230, -3838256, -4857755, -4390116, -4536759, -6988818, -10046914, -10209057, -6631436, -2638018, -2149908, -5226710, -7842603, -6140661, -636218]
34372f36218M762685J57606l621800l199839k20639J201096k24727j990786j700547
34363e473169K49855K166181L011114K152118n61922l272649k968321L47493K539318
34354a809982P83678j925405r98685K522615L252878k23322l076318j748072P59741
34345b462872K82205j423349K38201M325244M772518j79638m421661k745183J180155
34336d34380L88438m407539n612675m84036M424370L185337q18918r79831J987516
34327b751718K167172r81532j751329J667855L651324M75255l383914k689142
34319c596029K15846J81566j703860o37444K604145K275037k493830n413712k436132
34310a1004413K364952L328056J092512P7703J105579R49633j748455l985233
$$ y = [-636218, 4126467, 4284073, 662273, -2537566, -2758205, -1557109, -1781836, -3772622, -5473169, -5223314, -3057133, -46019, 2106099, 1544177, -1728472, -4696793, -4349300, -1809982, -1026304, -2951709, -3950394, -1427779, 1825099, 1601777, -1474541, -3222613, -2462872, -2180667, -3604016, -3365815, 959429, 5731947, 5552309, 1130648, -1614535, -434380, -45942, -4453481, -10066156, -10550192, -6125822, -2940485, -3759403, -4739234, -2751718, -584546, -1566078, -3317407, -1649552, 2001772, 2477027, -906887, -3596029, -3380183, -3198617, -4902477, -5539921, -2935776, -660739, -3154569, -8568281, -11004413, -8639461, -5311405, -4218893, -4141190, -3035611, -2085978, -3834433, -7819666]
34302g819666k597119J344377L803183K757683N30412M88588K302585K374968
34294C185011p18368l655683k936257R5326J437496J42381j325480j539438j419335
34285f734347j296512j98742J510167J998180J104577N79039O02911o11357k835502
34276e881586l057973l91276J687450M56677j572653l79938L322702M932520K326762
34267A442685j556703k825935j227394M09514L84269K57168J949274L821997K331041
34258D985916j904237l364211M39094L995047J398869m096956m668590m11352
34250c626420R03353k887385m321570R84253O125134L529841k877514l899130
34242f069438Q92152L667914R22184k445536j763955J330333K849786J678213
$$ y = [-7819666, -10416785, -9072408, -5269225, -2511542, -1981130, -1492542, 810043, 3185011, 2466643, -1189040, -4125297, -4029971, -2592475, -2450094, -3775574, -5315012, -6734347, -8030859, -8229601, -6719434, -4721254, -3616677, -3037638, -2434727, -3046084, -5881586, -8939559, -9330835, -7643385, -7186708, -8759361, -9139299, -5816597, -884077, 1442685, -114018, -2939953, -4167347, -3757833, -3373564, -3116396, -1167122, 2654875, 4985916, 3081679, -282532, 156562, 4151609, 5550478, 1453522, -3215068, -3626420, -2723067, -5610452, -9932022, -8947769, -2822635, 707206, -2170308, -6069438, -5177286, -1509372, -587188, -3032724, -4796679, -3466346, -616560, 1061653]
34234A061653o90663k360497k097171m84720K14354o10916l02400K535847M251614
34225A517101J178471l577201l846242J67178K225877j18024k392733j264441
34217f110014M43183m10568j683194o3088K999121L645261J641296L28379J614232
34208B404608L776416L812106M63859m395046o741414m230021M61031K197284
34200b251177q3905k142897r15262J023333m9790k762278k508408J619923N342003
34191b728458M877389J426140j005893n20309J254008J918023J097945J02481
34183F421326l01779n48723q20540n30511J17243k42136j726767k218087o10172
34174d60146P45792n87166k824401k231268J216919L874714L639247J648436q31595
$$ y = [1061653, 370990, -1989507, -4086678, -4571398, -4357044, -4967960, -5270360, -2734513, 1517101, 2695572, -881629, -4727871, -4560693, -2334816, -2452840, -4845573, -6110014, -5666831, -6077399, -7760593, -7823681, -4824560, -1179299, 461997, 790376, 2404608, 6181024, 9993130, 10456989, 6061943, -679471, -4909492, -4448461, -2251177, -2335082, -4477979, -5393241, -4369908, -4419698, -7181976, -9690384, -8070461, -2728458, 2148931, 3575071, 2569178, 2048869, 3302877, 5220900, 6318845, 6421326, 6119547, 5570824, 4750284, 4219773, 4337016, 4094880, 2368113, 150026, -460146, 285646, -301520, -3125921, -5357189, -4140270, -265556, 3373691, 5022127, 4190532]
34165D190532l309201l897544o54439M101108N161948J572858j673320q53841
34157D638101J578110J615446m67836j733669j135538K01563R47580r1149l066917
34148B485691n217152l260593J062750K260400l08819o55452L833447O786565
34140F986837K491512m444869n936112k442017k53163k02778J774697M572931
34132B547038K394870m040647o315392r51353N087096N112658J540523l36131
34124E038662p37661k261953l733213k946185j648952k408618l610907k456935
34116a4765762k8575J320030K560911M875205M970692l16702o688869o365191
34108a4438261R26896P104582O519531K082105o93698p67262m78466j107871k000955
$$ y = [4190532, 881331, -3016213, -3670652, 430456, 5592404, 7165262, 5491942, 4638101, 6216211, 7831657, 7363821, 5630152, 4494614, 4696177, 5643757, 5552608, 2485691, -2731461, -5992054, -4929304, -2668904, -2977723, -3633175, 200272, 6986837, 9478349, 5033480, -902632, -3344649, -3597812, -3800590, -2025893, 2547038, 4941908, 901261, -5414131, -6365484, -1278388, 3834270, 5374793, 5038662, 4301001, 2039048, -1694165, -4640350, -6289302, -8697920, -12308827, -14765762, -14794337, -13474307, -10913396, -6038191, -1067499, -1384201, -8073070, -14438261, -13511365, -6406783, 112748, 2194853, 1501155, 733893, 255427, -852444, -2853399]
34099b853399k052253o83851J249423J657368K57985K64673L808083O988973M196672
34090A2833674l070440p146991m557473K40339K742115L764590M406977K239168
34082A1451959l056259n978139k815925J619044J135968j823775n37284M332713
34074D328302N559716J102272l007798k517307l89147k24013p42177R885L57025
34065D476758j377902l146264k711830j482083j411223j225273P68867K875911
34057c233039K645996J066107N70860P99340q9482j490373j447120n32043q90894
34048b600648j959339p91901L053970O009756M761775J56549l771669l675586
34040A182907K6170L198669K068750j939525l266164M33647M397522K887485k842249
$$ y = [-2853399, -4905652, -5589503, -4340080, -2682712, -2424727, -2160054, 1648029, 8637002, 12833674, 9763234, 2616243, -1941230, -1700891, 1041224, 4805814, 9212791, 11451959, 8395700, 2417561, -398364, 1220680, 2356648, 532873, -4411, 4328302, 9888018, 10990290, 7982492, 5465185, 5076038, 4852025, 4109848, 4119733, 4476758, 3098856, -47408, -2759238, -4241321, -5652544, -6877817, -6108950, -3233039, -587043, 479064, 1049924, 1849264, 1759782, 269409, -1177711, -1709754, -2600648, -4559987, -5351888, -2297918, 3711838, 8473613, 8630162, 4858493, 1182907, 1209077, 4407746, 6476496, 4536971, 1270807, 1704454, 6101976, 8989461, 6147212]
34031F147212o322227m481088n70804J338615R98695L57723M12077J009708J772892
34022F62803K103074J456940N8408j452384k657283k835771j156190J238026J346597
34013a235780j241118k378043Q09707M427956K818448k453328m248846k87433
34005c788437L968799L895776J467176L20093K34765m65862j206260j053313r97660
33996B375077j545545j131228O22472J384417K61571k53340Q42560M68762k762362
33987B62384m590057j574039K471774K132701q25269p97859J949673K244210l70194
33978I03324q15082K003376K643440j283333m008841n56070M662622L954204k164635
33969E339005n663706k317164L054517L741135l76268l840480l103011k24349
$$ y = [6147212, -175015, -4656103, -5226907, -3888292, -2889597, -2531874, -2119797, -1110089, 662803, 2765877, 4222817, 4281225, 2828841, 171558, -2664213, -3820403, -2582377, -1235780, -2476898, -4854941, -4045234, 382722, 3201170, 747842, -3501004, -3788437, 180362, 4076138, 5543314, 5863407, 6098172, 5632310, 4426050, 3372737, 2375077, 829532, -301696, 320776, 1705193, 1966764, 1713424, 2555984, 3024746, 262384, -4327673, -5901712, -3429938, -1297237, -2122506, -2920365, -970692, 1273518, 903324, 88242, 2091618, 4735058, 3451725, -557116, -1113186, 3549436, 7503640, 5339005, -324701, -2641865, 412652, 4153787, 3777519, -62961, -3165972, -3390321]
33961c390321R55415R6206k0308J646383K616325R64653j327979j418079j62368
33952d0073m99561k351203k876167j623638j314166k620800k362022J074649M312514
33943h300467L979365J933817J737526K469323Q09987k117169j580284K662438
33935A594536M661417R36174l969844m233711j167846l9497j260667q69480J280031
33926c068887Q06341k633620l207231J317364M291843K13560n443854l860368
33918a1584852L334899O584782L092553l72739K16333O93439j807787l219491
33910c062863j058358j34673l518743n313367j72424O254182N436379j83957j424527
33901c178351K532557L920939L77889j657580R74784K644187r53798n372042m747875
$$ y = [-3390321, -2434906, -2338700, -2359008, -712625, 1903700, 2868353, 1540374, 122295, -40073, -539634, -2890837, -5767004, -7390642, -8704808, -11325608, -13687630, -12612981, -8300467, -4321102, -2387285, -649759, 1819564, 2629551, 512382, -1067902, 1594536, 6255953, 7192127, 3222283, -1011428, -2179274, -2218771, -3479438, -4348918, -3068887, -2262546, -4896166, -8103397, -6786033, -2494190, -2280630, -7724484, -11584852, -8249953, -1665171, 1427382, 1054643, 1270976, 1964415, 156628, -3062863, -4121221, -4255894, -7774637, -13088004, -13260428, -7006246, -1569867, -1753824, -3178351, -645794, 3275145, 3653034, 1995454, 2970238, 5614425, 4660627, -711415, -5459290]
33892e459290m28074K358504J953307M40309k07988P80092K798055L112666k97269
33883E050312m317567l598286J230444L638015R31522k085796j438501L46586
33875b43271J45325k95190J087192K128605Q90157l15964L08261K51324j861478
33866B094961k295499J218480M146749K130065j643419k223330j163687k095277
33858A69043k764136M86305M193961K580666j895241j988480K024765K905708
33850E712591j158516m006001k063588J169076K581628L349420L621157J050295
33842A0256062l113491l720506k5769K522813J245891j5849J064545Q60207k610402
33833F463501m547852j041316L732160L582593o69754l559830l013729j115708
$$ y = [-5459290, -5887364, -3528860, -1575553, -1135244, -1343232, -563140, 2234915, 5347581, 5050312, 732745, -2865541, -1635097, 2002918, 2934440, 848644, -589857, -243271, -97946, -393136, 694056, 2822661, 3712818, 3396854, 3705115, 3956439, 2094961, -200538, 1017942, 5164691, 7294756, 5651337, 3428007, 2264320, 169043, -2595093, -2108788, 2085173, 4665839, 2770598, 782118, 2806883, 5712591, 4554075, 548074, -1515514, -346438, 2235190, 5584610, 9205767, 10256062, 7142571, 3422065, 3396296, 5919109, 7165000, 7149151, 8213696, 9073903, 6463501, 1915649, 874333, 4606493, 8189086, 7519332, 3959502, 945773, -169935]
33825a69935M64298J338840P84200r54175j502832M85365K847416K931016R58613
33816G182806j451510l358774l414766k18927M112654M513265k80216n137317
33808A947215n328418k219338M39439J796468K378411J465026m65962n93265J446163
33799H65739J742005j320190l396571j352728J013559k63903j946326M15142L677283
33790e65990K134296k075657k209312J469940K249737j422892l656658j278837
33782e355373J755149J851919N51509j99256r66523r85820K009018N705373L802489
33773H168485l885078q567458m399077K699238L986633O92985N86332M752228
33765D034288O022236P20386n331660n220621k05081L281018K838490J838899
$$ y = [-169935, 294363, 1633203, 2417403, 1463228, -39604, 445761, 3293177, 6224193, 7182806, 5731296, 2372522, -1042244, -1261171, 2851483, 7364748, 7084532, 1947215, -3381203, -5600541, -5161102, -3364634, -986223, 478803, 12841, -580424, 865739, 2607744, 1287554, -2109017, -3461745, -2448186, -2712089, -4658415, -4243273, -565990, 1568306, -507351, -2716663, -1246723, 1003014, -419878, -4076536, -5355373, -3600224, -1748305, -1196796, -1396052, -2362575, -3348395, -1339377, 4365996, 8168485, 4283407, -4284051, -8683128, -5983890, -1997257, -1304272, -717940, 4034288, 10056524, 10776910, 5445250, 224629, 19548, 3300566, 6139056, 7977955]
33757G977955K727313L021476k08318m794320n745011k280473Q45609j59128l303312
33748a918209m280338k334730q6200R34809J611411K579470K881469J691060k45788
33739H32954j406516j122786m10234j013049k770735k686244J087395M985048
33731b504167L719311j351538k733033K209480O432583L452761k908312m801988
33723A515097k032684l42503r86424p7050K721567K902873p16894l551294k571643
33714c138955k02211P70218R30594J292864J431464J871360L661779M616528J137222
33705A2370863n026557p342964l598362R48325J621578J82356O2382R72785J415344
33696A605750J886084K277259M05545l546599n313764k758145L20463M22023K95062
$$ y = [7977955, 10705268, 13726744, 13518426, 8724106, 2979095, 698622, 1544231, 1385103, -1918209, -6198547, -8533277, -8619477, -7684668, -6073257, -3493787, -612318, 1078742, 832954, -573562, -1696348, -2106582, -3119631, -5890366, -8576610, -7489215, -2504167, 1215144, -136394, -2869427, -659947, 5772636, 9225397, 6317085, 1515097, -517587, -860090, -1846514, -1923564, 798003, 3700876, 2983982, -567312, -3138955, -3341166, -2570948, -1640354, -347490, 1083974, 2955334, 6617113, 11233641, 12370863, 7344306, 1342, -3597020, -2648695, -1027117, -844761, -782379, 190406, 1605750, 3491834, 5769093, 6174638, 2628039, -2685725, -5443870, -5123407, -4701384, -4406322]
33687d406322L829468Q211535O876287q39795p971027q261215k866117K134480
33679c292706K806732O40080p59906p82590j622219l040839j259594M294404P408994
33670D392356L389614k637333k704930J407385J318689l551180n099406r22286
33662d407091J543163j462666l326418O62819M501137K155874j803028o25184
33654b761394L039160K949322M24185L96458J475004o26450l884912l473084r73423
33645c435134r77809j726464J387792N670971M460591j025318l106826j84997
33637A062806J854023P32452N60001K536289K243366j628641m176893k566980
33629F16423k14458j24778n92397j8289J228j178581j380841Q2337J096947J037558
$$ y = [-4406322, -576854, 7634681, 14510968, 13671173, 5700146, -2561069, -5427186, -3292706, -485974, 154106, -605800, -1388390, -3010609, -6051448, -7311042, -3016638, 4392356, 7781970, 5144637, 2439707, 3847092, 5165781, 1614601, -3484805, -4407091, -2863928, -4326594, -7653012, -6990193, -2489056, -333182, -2136210, -2761394, 277766, 3227088, 3651273, 4047731, 5522735, 4896285, 1011373, -2461711, -3435134, -4412943, -6139407, -4751615, 919356, 5379947, 4354629, 1247803, 1062806, 2916829, 3649281, 4209282, 6745571, 8988937, 7360296, 3183403, 616423, 401965, 277187, -315210, -333499, -332271, -1510852, -2891693, -2809356, -1712409, -674851]
33619f74851J436176J697327l83854l299867l006773k6935J030828k54947N45498
33610b937398L809379M033675n75659m228198k788644m961m19336k316686k275995
33601g703823j259556j417079j432856M02680K390145K639876K374939K609713
33593a395961J553609j242781k363252Q1734K521592J327942j494982j982100
33585b994199k51689J011634J141772Q95654R159j321033j185304Q16484J916852
33576C9330N60995n99885R75249L392510L299310N78621k417039l786702k575675
33567e33286N41880K076633o01895l751797j236079M881453N416917j473101n840452
33558e19727j215944M749502K832174k798536k612830J630738P87498m582005
$$ y = [-674851, 761325, 2458652, 2074798, -1225069, -4231842, -4258777, -3227949, -3482896, -2937398, 871981, 4905656, 4329997, 101799, -2686845, -2691806, -3111142, -5427828, -7703823, -8963379, -10380458, -11813314, -11410634, -9020489, -6380613, -4005674, -1395961, 157648, -1085133, -3448385, -3366651, -845059, 482883, -1012099, -2994199, -3245888, -2234254, -1092482, -196828, -187669, -1508702, -2694006, -1877522, 39330, 600325, 440, 975689, 4368199, 7667509, 8246130, 5829091, 2042389, -533286, 8594, 2085227, 1483332, -2268465, -3504544, 1376909, 6793826, 5320725, -519727, -1735671, 3013831, 5846005, 3047469, 434639, 2065377, 2852875, -1729130]
33550a729130m567869K581655O354542P03266o345351n445436N32871K815957
33542e099495M13073l98552K728811M995820K539515j814228k938931m80040J263037
33533A209010j84219j897808k3725M008855M964481J247455k942680l913403k885195
33524d17229k078238p09288J772279K465449m69273l262826j584032K253567K520394
33515D90803j119227l554363k200860K82957J186963R03983N76783N87341J587040
33506a258580L628639M576132K588654o21808k153615k026253j574866j76846
33498B981457K111831J648306l307967p016624l334800L736880M931560j2433
33490A738210k472615L91971J724186j688048l072820J850562N859063J616924
$$ y = [-1729130, -6296999, -3715344, 2639198, 3342464, -3002887, -8448323, -7915452, -5099495, -4686422, -5084974, -2356163, 2639657, 5179172, 3364944, 426013, -54027, 1209010, 1024791, -873017, -896742, 3112113, 8076594, 9324049, 6381369, 2467966, -417229, -2495467, -3204755, -1432476, 1032973, 563700, -2699126, -4283158, -2029591, 490803, -628424, -4182787, -6383647, -6100690, -4913727, -4009744, -3432961, -2845620, -1258580, 2370059, 6946191, 9534845, 8913037, 6759422, 4733169, 3158303, 2981457, 5093288, 6741594, 3433627, -3582997, -6917797, -3180917, 1750643, 1738210, -734405, -342434, 1381752, -306296, -3379116, -1528554, 4330509, 5947433]
33482E947433n501270n337153J250496M296355J41675m380296l339688O02296
33474f320152J882845l36911k914327l484842k058225K15740K220202L479730
33466g315940M018902L525636J661193l66839m07013J410512K212398O07506j039785
33457D306570n14959N91432k74642k338029k995643j894750o08227K99338J109153
33448b319757J285910P06389J040452L053662M101825J509286k881023m900110
33440A596634l777577k307521k086660j983073r57172O26533K174693K882840
33432c831303J591327q42666q91177K551155M721868J347111l597899k641071
33424a592655L607788O759727L145487j481264j978907j094689k646565m143876
$$ y = [5947433, 446163, -4890990, -3640494, 655861, 797536, -3582760, -6922448, -6320152, -4437307, -4774218, -7688545, -11173387, -13231612, -13015872, -10795670, -7315940, -3297038, 228598, 1889791, 1522952, 1115939, 2526451, 4738849, 5346355, 4306570, 3791611, 4383043, 4108401, 1770372, -1225271, -3120021, -3728248, -3428910, -2319757, -1033847, -327458, 712994, 3766656, 7868481, 9377767, 6496744, 1596634, -2180943, -4488464, -6575124, -8558197, -9515369, -8888836, -6714143, -3831303, -2239976, -3082642, -3973819, -1422664, 3299204, 4646315, 1048416, -1592655, 2015133, 8774860, 11920347, 10439083, 8460176, 7365487, 4718922, 575046]
33416E75046j947290J309578Q84556k009591k631477o38191N85981N23346J185611
33407b162431J693523k40662k292340k729M643617M493137j502648n568962k511375
33398c450870K830826L539050K34707k121483k268581k008556j179655J000275
33390c424287K107558l47810l634842k955691J273819M297637M180810L024194
33382D521388J762779p98022l694339l911641j539451P2476J38894J386678L988439
33373A927201L970444j5996l386157k303390O20217J029145l63825M2114K216228
33364C735981K581086m02416m242733n695184l791339j93543J974779Q13706j684752
33355f904415j487140J851169M068721K350757o21194j300524o04942j056793
$$ y = [575046, -1372244, -62666, 821890, -1187701, -3819178, -4457369, -3871388, -3348042, -2162431, -468908, -709570, -3001910, -3004639, 1638978, 6132115, 4629467, -939495, -3450870, -620044, 2919006, 3153713, 1032230, -1236351, -3244907, -4424562, -3424287, -1316729, -1664539, -5299381, -8255072, -6981253, -2683616, 1497194, 4521388, 6284167, 5486145, 1791806, -2119835, -3659286, -3586810, -3447916, -2061238, 1927201, 5897645, 5881649, 2495492, 192102, 812319, 1841464, 1477639, 1519753, 3735981, 6317067, 5914651, 1671918, -4023266, -7814605, -8008148, -6033369, -5219663, -6904415, -8391555, -6540386, -2471665, -120908, -742102, -2042626, -2647568, -3704361]
33347c704361j614153M4536K143661R20269k660832l453205J23475L419905K135866
33338b644839j845544l181367K78986N107767N925513J161257m547840m930401
33330d676468J59924L911692J427832l472374l841429N31805L709853K629912
33322C80747K51j615582k831210l466484j106834L950150O891174M565972k8209
33313F739975k338090k199284k102923k298390j279452M96616Q26955r02099l002883
33304f059575l553764j603139K440708N972472N505415J116361k138160k38201
33296A442117L648747K784990l556049q228349n425681J614582M951586K067953
33288g00104j829539j503301J693336K667590n9256k784616k171428M82558J778724
$$ y = [-3704361, -5318514, -5273978, -3130317, -2210048, -4870880, -8324085, -8200610, -4780705, -2644839, -4490383, -7671750, -7392764, -2284997, 3640516, 4801773, 253933, -4676468, -4516544, -604852, 822980, -2649394, -6490823, -5959018, -2249165, 380747, 380998, -1234584, -4065794, -7532278, -8639112, -4688962, 2202212, 6768184, 6739975, 4401885, 2202601, 99678, -2198712, -3478164, -2981548, -2154593, -3056692, -6059575, -9613339, -11216478, -8775770, -2803298, 2702117, 3818478, 1680318, 1442117, 5090864, 7875854, 4319805, -3908544, -9334225, -7719643, -2768057, -700104, -2529643, -4032944, -2339608, 327982, 268726, -2515890, -4687318, -4204760, -2426036]
33279b426036R76042J29924N04719J149711R42861M2835j017982j907302j647926
$$ y = [-2426036, -1449994, -1320070, -815351, 334360, 1277221, 1320056, 302074, -1605228, -3253154]
$$ [...]
##END NTUPLES=NMR SPECTRUM
##END=
