##TITLE=31Pdec_DPAA1412K
 CDCl3, 24 sc
 14.12.2021
##JCAMPDX= 6.0         $$ Bruker NMR JCAMP-DX V2.0
##DATA TYPE= NMR SPECTRUM
##DATA CLASS= NTUPLES
##ORIGIN= UXNMR, Bruker Analytische Messtechnik GmbH
##OWNER= root
$$ XWIN-NMR		Version 3.5
$$ Tue Dec 14 12:36:51 2021 Russian Standard Time (UT+4h)  she@DPX200
##.OBSERVE FREQUENCY= 81.013821
##.OBSERVE NUCLEUS= ^31P
##.ACQUISITION MODE= SIMULTANEOUS
##.ACQUISITION SCHEME= undefined
##.AVERAGES= 24
##.DIGITISER RES= 16
##SPECTROMETER/DATA SYSTEM= spect
##.PULSE SEQUENCE= zgpg30
##.SOLVENT NAME= CDCl3
##.SHIFT REFERENCE= (INTERNAL, CDCl3, 0, 248.564)
##AUDIT TRAIL= $$ (NUMBER, WHEN, WHO, WHERE, WHAT)
$$ ##TITLE= Audit trail, XWIN-NMR		Version 3.5
$$ ##JCAMPDX= 5.01
$$ ##ORIGIN= Bruker BioSpin GmbH
$$ ##OWNER= she
$$ F:/spectra/data/she/nmr/P31/1/pdata/1/auditp.txt
$$ ##AUDIT TRAIL=  $$ (NUMBER, WHEN, WHO, WHERE, WHAT)
(   1,<2021-12-14 12:35:29.73 +0400>,<she>,<DPX200>,
      <created by zg, POWCHK disabled, PULCHK disabled
       configuration hash MD5:
       00 E9 B6 7A A2 85 ED C7 34 08 36 98 17 FE 4E 26
       data hash MD5: 32K
       2E 63 52 52 17 A0 A1 E7 FD 56 FB 9F A5 90 FF 0A>)
(   2,<2021-12-14 12:35:32.34 +0400>,<she>,<DPX200>,
      <Start of raw data processing
       efp BC_mod = 2 LB = 1 FT_mod = 6 PKNL = 1 PHC0 = -9027.695 PHC1 = -264.13 SI = 64K 
       data hash MD5: 64K
       1D D5 7A 7E 48 E5 9D 72 5E 80 90 75 25 99 BA 24>)
(   3,<2021-12-14 12:35:48.00 +0400>,<she>,<DPX200>,
      <pk PHC0 = 9.294339 PHC1 = 0 
       data hash MD5: 64K
       01 0E 94 50 29 69 4E 23 2E E5 D0 92 2B 06 AE C4>)
(   4,<2021-12-14 12:36:08.04 +0400>,<she>,<DPX200>,
      <pk PHC0 = -0.6 PHC1 = 0 
       data hash MD5: 64K
       F0 8A 59 78 E2 7F 1B 75 B8 CD 20 0A 87 3C 38 92>)
(   5,<2021-12-14 12:36:21.25 +0400>,<she>,<DPX200>,
      <abs ABSG = 5 
       data hash MD5: 64K
       EE CC 36 1D 51 59 BB 43 FB 61 D1 10 28 1D 91 C1>)
$$ ##END=
$$ 
$$ hash MD5
$$ 91 CE 37 7C 90 C3 8F 1C 6B D5 FA 3C 51 15 FC 68
##$RELAX= 
##$RELAX= 
##$RELAX= 
##$RELAX= 
##$RELAX= 
##$RELAX= 
##$RELAX= 
##$RELAX= 
$$ Bruker specific parameters
$$ --------------------------
##$DU= <F:/spectra>
##$EXPNO= 1
##$NAME= <P31>
##$PROCNO= 1
##$TYPE= <nmr>
##$USER= <she>
##$AMP= (0..31)
100 100 100 100 100 100 100 100 100 100 100 100 100 100 100 100 100 100 
100 100 100 100 100 100 100 100 100 100 100 100 100 100 
##$AQSEQ= 0
##$AQ_mod= 1
##$AUNM= <au_zg>
##$AUTOPOS= <>
##$BF1= 81.014009
##$BF2= 200.13
##$BF3= 200.13
##$BF4= 200.13
##$BF5= 200.13
##$BF6= 200.13
##$BF7= 200.13
##$BF8= 200.13
##$BYTORDA= 1
##$CFDGTYP= 0
##$CFRGTYP= 5
##$CHEMSTR= <none>
##$CNST= (0..31)
1 1 145 1 1 1 1 1 1 1 1 1 1 1 1 1 1 1 1 1 1 1 1 1 1 1 1 1 1 1 1 1 
##$CPDPRG= <waltz16>
##$CPDPRG1= <>
##$CPDPRG2= <waltz16>
##$CPDPRG3= <>
##$CPDPRG4= <mlev>
##$CPDPRG5= <mlev>
##$CPDPRG6= <mlev>
##$CPDPRG7= <mlev>
##$CPDPRG8= <mlev>
##$CPDPRGB= <>
##$CPDPRGT= <>
##$D= (0..31)
0 1 0 0 0 0 0 0 0 0 0 0.03 2e-05 3e-06 0 0 0 0 0 0 0 0 0 0 0 0 0 0 0 0 
0 0 
$$ [...]
##$SUBNAM3= <"">
##$SUBNAM4= <"">
##$SUBNAM5= <"">
##$SUBNAM6= <"">
##$SUBNAM7= <"">
##$SUBNAM8= <"">
##$SUBNAM9= <"">
##$SW= 501.771253377433
##$SWIBOX= (0..15)
0 1 3 0 0 0 0 0 0 0 0 0 0 0 0 0 
##$SW_h= 40650.406504065
##$TD= 32768
##$TD0= 1
##$TE= 0
##$TE2= 300
##$TE3= 300
##$TEG= 300
##$TL= (0..7)
0 120 53 12 22 120 120 120 
##$TP= (0..7)
150 150 150 150 150 150 150 150 
##$TP07= 0
##$TPNAME0= <>
##$TPNAME1= <>
##$TPNAME2= <>
##$TPNAME3= <>
##$TPNAME4= <>
##$TPNAME5= <>
##$TPNAME6= <>
##$TPNAME7= <>
##$TPOAL= (0..7)
0.5 0.5 0.5 0.5 0.5 0.5 0.5 0.5 
##$TPOFFS= (0..7)
0 0 0 0 0 0 0 0 
##$TUNHIN= 0
##$TUNHOUT= 0
##$TUNXOUT= 0
##$USERA1= <user>
##$USERA2= <user>
##$USERA3= <user>
##$USERA4= <user>
##$USERA5= <user>
##$V9= 5
##$VALIST= <valist>
##$VCLIST= <CCCCCCCCCCCCCCC>
##$VD= 0
##$VDLIST= <DDDDDDDDDDDDDDD>
##$VPLIST= <PPPPPPPPPPPPPPP>
##$VTLIST= <TTTTTTTTTTTTTTT>
##$WBST= 1024
##$WBSW= 4
##$XGAIN= (0..3)
0 0 0 0 
##$XL= 0
##$YL= 0
##$YMAX_a= 2242
##$YMIN_a= -3635
##$ZGOPTNS= <>
##$ZL1= 120
##$ZL2= 120
##$ZL3= 120
##$ZL4= 120
##$ABSF1= 248.5645
##$ABSF2= -253.2056
##$ABSG= 5
##$ABSL= 3
##$ALPHA= 0
##$AQORDER= 0
##$ASSFAC= 0
##$ASSFACI= 0
##$ASSFACX= 0
##$ASSWID= 0
##$AUNMP= <proc_1d>
##$AZFE= 0.1
##$AZFW= 0.5
##$BCFW= 0
##$BC_mod= 2
##$BYTORDP= 0
##$COROFFS= 0
##$CY= -3
##$DATMOD= 1
##$DC= 0
##$DFILT= <>
##$DTYPP= 0
##$F1P= 0
##$F2P= 0
##$FCOR= 1
##$FTSIZE= 65536
##$FT_mod= 6
##$GAMMA= 0
##$GB= 0
##$INTBC= 1
##$INTSCL= 5.30512e-09
##$ISEN= 30
##$LB= 1
##$LEV0= 0
##$LPBIN= 0
##$MAXI= 10000
##$MC2= 0
##$MEAN= 0
##$ME_mod= 0
##$MI= 50
##$NCOEF= 0
##$NC_proc= -6
##$NLEV= 6
##$NOISF1= 182.463
##$NOISF2= 159.3651
##$NSP= 0
##$NTH_PI= 0
##$NZP= 0
##$OFFSET= 248.5645
##$PC= 4
##$PHC0= -9019.001
##$PHC1= -264.13
##$PH_mod= 1
##$PKNL= yes
##$PPARMOD= 0
##$PSCAL= 0
##$PSIGN= 0
##$REVERSE= no
##$SF= 81.014009
##$SI= 65536
##$SIGF1= 159.3651
##$SIGF2= -187.1042
##$SINO= 113.3802
##$SIOLD= 16384
##$SREGLST= <1H.CDCl3>
##$SSB= 0
##$STSI= 65536
##$STSR= 0
##$SW_p= 40650.406504065
##$SYMM= 0
##$S_DEV= 0
##$TDeff= 32768
##$TDoff= 0
##$TI= <>
##$TILT= no
##$TM1= 0
##$TM2= 0
##$TOPLEV= 0
##$USERP1= <user>
##$USERP2= <user>
##$USERP3= <user>
##$USERP4= <user>
##$USERP5= <user>
##$WDW= 1
##$XDIM= 65536
##$YMAX_p= 342712855
##$YMIN_p= -5974149
$$ End of Bruker specific parameters
$$ ---------------------------------
##NTUPLES= NMR SPECTRUM
##VAR_NAME=  FREQUENCY,     SPECTRUM/REAL,   SPECTRUM/IMAG
##SYMBOL=    X,             R,               I
##VAR_TYPE=  INDEPENDENT,   DEPENDENT,       DEPENDENT
##VAR_FORM=  AFFN,          ASDF,            ASDF
##VAR_DIM=   65536,         65536,           65536
##UNITS=     HZ,            ARBITRARY UNITS, ARBITRARY UNITS
##FACTOR=    0.620285442955139, 1,           1
##FIRST=     20137.2065510759, 0,            0
##LAST=      -20513.1999529892, 0,           0
##MIN=       -20513.1999529892, -5974149,    0
##MAX=       20137.2065510759, 342712855,    0
$$ Real data points
##PAGE= N=1
##DATA TABLE= (X++(R..R)), XYDATA
$$ [...]
$$ plain form
39792 -970469 -315586 238991 598159 917646 646606 -525099 -1736959 -2022304 -1591637
39783 -1591637 -1227253 -1112217 -1052625 -1176296 -1578774 -1797110 -1348235 -371599 723665
39774 723665 1686315 2148743 1720340 790626 346389 509328 308014 -500882 -658387 606830
39764 606830 2069483 2250880 1575405 1328971 1443374 1034764 406991 579979 1191158
39755 1191158 842995 -482276 -1239250 -744432 21061 397282 1011222 2071708 2395199
39746 2395199 1181574 -530945 -1267598 -957767 -382778 248257 1055670 1580754 1285637
39737 1285637 510691 -17896 -211561 -304426 -36167 858394 1738545 1690764 859554 159806
39727 159806 -172411 -700779 -1499980 -1853526 -1469671 -1007212 -976608 -966049 -519904 -97732
$$ packed form
39792i70469O54883N54577L59168L19487k71040j171705j211860k85345M30667
39783a591637L64384J15036N9592j23671m02478k18336M48875R76636J095264
39774G23665R62650M62428m28403r29714m44237J62939k01314q08896j57505J265217
39764F06830J462653J81397o75475k46434J14403m08610o27773J72988O11179
39755A191158l48163j325271p56974M94818P65493L76221O13940J060486L23491
39746B395199j213625j712519p36653L09831N74989O31035Q07413N25084k95117
39737A285637p74946n28587j93665r2865K68259Q94561Q80151m7781q31210o99748
39727A59806l32217n28368p99201l53546L83855M62459L0604J0559M46145M22172
$$ plain form
39717 -97732 -433551 -1324625 -1775023 -1247970 -231252 456212 497080 134232 -261914 -489934
39707 -489934 -536387 -493087 -479410 -577524 -776084 -946989 -917815 -629955 -213681 134038
39697 134038 307694 298064 147776 -8426 -4193 93229 -53642 -551844 -900577 -546958
39687 -546958 218952 470203 -90798 -624600 -290979 560328 872653 282828 -535981 -807813
39677 -807813 -391321 363884 984890 1106375 809926 704137 1176805 1666905 1319436 290596
39667 290596 -420187 -481903 -574204 -963753 -898377 -60128 479213 -259658 -1588737 -2183877
39657 -2183877 -1983838 -1810007 -1688595 -1028410 -141898 4783 -455781 -351112 521909
39648 521909 981038 455313 -94951 129125 554145 512241 428459 743319 786983 -111370
$$ packed form
39717i7732l35819q91074m50398N27053J016718O87464M0868l62848l96146k28020
39707d89934m6453M3300J3677r8114j98560j70905K9174K87860M16274L47719
39697A34038J73656r630j50288j56202M233R7422j46871m98202l48733L53619
39687e46958P65910K51251n61001n33802L33621Q51307L12325n89825q18809k71832
39677h07813M16492P55205O21006J21485k96449j05789M72668M90100l47469j028840
39667B90596p10783o1716r2301l89549O5376Q38249N39341p38871j329079n95140
39657b183877K00039J73831J21412O60185Q86512J46681m60564J04669Q73021
39648E21909M59129n25725n50264K24076M25020m1904q3782L14860M3664q98353
$$ plain form
39638 -111370 -1254246 -1479156 -793300 -65522 327789 549240 557819 346564 445853 1192840
39628 1192840 1918098 1800358 1092180 552139 143384 -644677 -1589059 -1984329 -1859761
39619 -1859761 -1893051 -2275051 -2590711 -2633049 -2488412 -2101731 -1556752 -1319197 -1334580 -581386
39609 -581386 1324411 2839309 2316474 518748 -423167 -116944 -3115 -561849 -659626
39600 -659626 65737 396737 -223533 -682399 -314752 -111372 -697131 -894994 282772
39591 282772 1715800 1820477 930443 431384 463414 156807 -468472 -499580 200579 717412
39581 717412 478663 -121792 -508531 -546829 -425732 -495932 -1055785 -1873203 -2272261 -2060916
39571 -2060916 -1813189 -1821053 -1527273 -603140 208371 115069 -535069 -872023 -666081 -129879
$$ packed form
39638a11370j142876k24910O85856P27778L93311K21451Q579k11255R9289P46987
39628A192840P25258j17740p08178n40041m08755p88061r44382l95270J24568
39619a859761l3290l82000l15660m2338J44637L86681N44979K37555j5383P53194
39609e81386J905797J514898n22835j797726r41915L06223J13829n58734r7777
39600f59626P25363L31000o20270m58866L67647K03380n85759j97863J177766
39591B82772J433028J04677q90034m99059L2030l06607o25279l1108P00159N16833
39581G17412k38749o00455l86739l8298J21097p0200n59853q17418l99058K11345
39571b060916K47727p864K93780R24133Q11511r3302o50138l36954K05942N36202
$$ plain form
39561 -129879 695831 1519301 1546103 631235 -42546 523312 1667932 2218748 2350502 2944210
39551 2944210 3712205 3532383 2375631 1383570 1067852 825828 358616 291039 1066122
39542 1066122 2177475 2775109 2386821 1077243 -432688 -1016650 -290441 750230 1013010
39533 1013010 784192 957803 1320560 900936 -259308 -1043038 -904399 -367495 35933
39524 35933 151585 -310033 -1387219 -2089983 -1346001 352013 1559272 1932927 2161278
39515 2161278 2109395 982007 -579905 -697921 900540 2219338 1931080 1083536 957336
39506 957336 1135618 956522 1113403 2205457 3091834 2417719 782564 -230103 -376398
39497 -376398 -557444 -985750 -1109668 -921371 -887186 -846974 -269044 591818 928198 616810
$$ packed form
39561a29879Q25710Q23470K6802r14868o73781N65858J144620N50816J31754N93708
39551B944210P67995j79822j156752r92061l15718k42024m67212o7577P75083
39542A066122J111353N97634l88288j309578j509931n83962P26209J040671K62780
39533A013010k28818J73611L62757m19624j160244p83730J38639N36904M03428
39524C5933J15652m61618j077186p02764P43982J698014J207259L73655K28351
39515B161278n1883j127388j561912j18016J598461J318798k88258q47544j26200
39506I57336J78282j79096J56881J092054Q86377o74115j635155j012667j46295
39497c76398j81046m28306j23918J88297L4185M0212N77930Q60862L36380l11388
$$ plain form
39487 616810 249675 125851 66794 -42151 -304583 -984419 -1836578 -1866921 -723046 337841
39477 337841 63548 -814508 -642551 537182 1041555 112349 -1204058 -1915376 -2227670
39468 -2227670 -2370745 -1785434 -323776 888984 794003 -146097 -756918 -861339 -1208806
39459 -1208806 -1968082 -2283573 -1528804 -317727 187297 -305637 -969757 -1026459 -649735
39450 -649735 -391244 -185495 360489 919152 665572 -315166 -876840 -493694 -63696 -355729
39440 -355729 -684299 -142807 722894 781449 270924 421563 1350774 1793210 1046408 -89564
39430 -89564 -604526 -435101 1274 466639 703925 412506 -142212 -166403 614571 1485131
39420 1485131 1632407 1055599 368353 98221 282666 387623 -290298 -1672048 -2570540
$$ packed form
39487F16810l67135j23824n9057j08945k62432o79836q52159l0343J143875J060887
39477C37841k74293q78056J71957J179733N04373r29206j316407p11318l12294
39468b227670j43075N85311J461658J212760r4981r40100o10821j04421l47467
39459a208806p59276l15491P54769J211077N05024m92934o64120n6702L76724
39450f49735K58491K05749N45984N58663k53580r80738n61674L83146M29998k92033
39440c55729l28570N41492Q65701N8555n10525J50639R29211M42436p46802j135972
39430h9564n14962J69425M36375M65365K37286k91419n54718k4191P80974Q70560
39420A485131J47276n76808o87246k70132J84445J04957o77921j381750q98492
$$ plain form
39411 -2570540 -1982674 -470635 581754 870074 1267449 2087583 2477914 1810210 595774
39402 595774 -334676 -618317 -108014 1059257 1848719 1060603 -777905 -1526622 -192359
39393 -192359 1636883 2022284 1136372 355555 32672 -336483 -559694 -60734 661967
39384 661967 539073 -218908 -318781 503692 1089188 856372 698596 1275322 1758215 1220010
39374 1220010 253807 85361 704507 1034486 690052 480791 1087650 2101923 2667849
39365 2667849 2498256 1936209 1418282 1205411 1378250 1770062 2007366 1825938 1271936
39356 1271936 498992 -419719 -1290180 -1665564 -1274780 -457962 196022 553737 860099
39347 860099 1059561 802928 213883 -30403 321275 661340 471899 87386 -6381 2198
$$ packed form
39411b570540N87866J512039J052389K88320L97375Q20134L90331o67704j214436
39402E95774r30450k83641N10303J167271P89462p88116j838508p48717J334263
39393a92359J829242L85401q85912p80817l22883l69155k23211M98960P22701
39384F61967j22894p57981r9873Q22473N85496k32816j57776N76726M82893n38205
39374A220010r66203j68446O19146L29979l44434k09261O06859J014273N65926
39365B667849j69593n62047n17927k12871J72839L91812K37304j81428n54002
39356A271936p72944r18711q70461l75384L90784Q16818O53984L57715L06362
39347H60099J99462k56633n89045k44286L51678L40065j89441l84513r3767Q579
$$ plain form
39337 2198 -174649 -107380 707668 1825770 2429794 2565578 2768732 2811944 2069893 920130
39327 920130 366365 313442 -201031 -936671 -493627 1033580 1507838 20186 -1248732
39318 -1248732 -222541 1634790 1417010 -718661 -1839831 -768794 425272 -24269
39310 -24269 -1064113 -1050898 -436223 -511443 -898012 -279009 1074157 1475381 446141 -567311
39300 -567311 -459477 32451 -161962 -614904 -216187 853794 1296089 742684 367805
39291 367805 1071354 2136343 2451959 2210323 2273410 2388471 1471464 -322619 -1290486
39282 -1290486 -476970 975450 1595096 1583409 1888952 2155380 1149464 -1032025 -2692414
39273 -2692414 -2687115 -1660512 -781510 -262437 346762 1163755 1851746 2028832 1452472 264489
$$ packed form
39337B198j76847O7269Q15048J118102O04024J35784K03154M3212p42051j149763
39327I20130n53765n2923n14473p35640M43044J527207M74258j487652j268918
39318a248732J026191J857331k17780k135671j121170J071037J194066m49541
39310b4269j039844J3215O14675p5220l86569O19003J353166M01224j029240j013452
39300e67311J07834M91928j94413m52942L98717J069981M42295n53405l74879
39291C67805P03549J064989L15616k41636O3087J15061r17007j794083r67867
39282a290486Q13516J452420O19646j1687L05543K66428j005916k181489j660389
39273b692414N299J026603Q79002N19073O09199Q16993O87991J77086n76360j187983
$$ plain form
39263 264489 -727791 -651053 206091 436456 -678982 -1993173 -1843220 -213249 1261215
39254 1261215 1367328 613138 239939 578488 926998 796467 585239 766261 934286
39245 934286 342060 -730486 -993403 110996 1431987 1570860 778553 492765 1276962
39236 1276962 2227022 2381684 1721016 648084 -507904 -1185550 -790356 319831 930955
39227 930955 598955 321129 934731 1719774 1485337 330837 -701539 -1180694 -1370001
39218 -1370001 -1159112 -204691 917109 964768 -252867 -1385783 -1155497 271008 1784935
39209 1784935 2456032 1870836 205055 -1532345 -2050252 -1203381 -332306 -579050 -1397206
39200 -1397206 -1459854 -587789 153271 91398 -293053 -378385 -302640 -450700 -660762 -475719
$$ packed form
39263B64489r92280P6738Q57144K30365j115438j314191J49953J629971J474464
39254A261215J06113p54190l73199L38549L48510j30531k11228J81022J68025
39245I34286n92226j072546k62917J104399J320991J38873p92307k85788P84197
39236A276962R50060J54662o60668j072932j155988o77646L95194J110187O11124
39227I30955l32000k77826O13602P85043k34437j154500j032376m79155j89307
39218a370001K10889R54421J121800M7659j217635j132916K30286J426505J513927
39209A784935O71097n85196j665781j737400n17907Q46871Q71075k46744q18156
39200a397206o2648Q72065P41060o1873l84451q5332P5745j48060k10062J85043
$$ plain form
39190 -475719 128249 712959 926183 774596 496257 399957 640537 902912 554308 -532321
39180 -532321 -1530876 -1525601 -713974 -188677 -510085 -1140178 -1496849 -1869992 -2761977 -3837271
39170 -3837271 -4270460 -3930462 -3491440 -3382436 -3321215 -3039136 -2815811 -2938752 -3098931 -2755925
39160 -2755925 -1850495 -805688 2898 492508 734065 811471 736016 409700 -125077 -366491
39150 -366491 275984 1545841 2258926 1658693 518538 269582 1188591 2130493 2091894
39141 2091894 1357335 826603 763412 684036 208255 -477905 -1022717 -1432377 -1985891 -2685148
39131 -2685148 -3018501 -2514821 -1489951 -849908 -973094 -1238117 -1066363 -942299 -1629169
39122 -1629169 -2672062 -2758676 -1672218 -744473 -891077 -1303595 -950547 -400327 -852179
$$ packed form
39190d75719O03968N84710K13224j51587k78339r6300K40580K62375l48604j086629
39180e32321r98555N275Q11627N25297l21408o30093l56671l73143q91985j075294
39170c837271m33189L39998M39022J09004O1221K82079K23325j22941j60179L43006
39160b755925R05430J044807Q08586M89610K41557P7406p5455l26316n34777k41414
39150c66491O42475J269857P13085o00233j140155k48956R19009R41902l8599
39141B091894p34559n30732o3191p9376m75781o86160n44812m09660n53514o99257
39131b685148l33353N03680J024870O40043j23186k65023J71754J24064o86870
39122a629169j042893q6614J086458R27745j46604m12518L53048N50220m51852
$$ plain form
39113 -852179 -1929436 -1993723 -633512 651158 632903 -83689 -336758 -100909 -13386 -127243
39103 -127243 -213899 -641511 -1762013 -2835853 -2804456 -1949662 -1543377 -1866265 -1891681 -1162238
39093 -1162238 -604571 -900459 -1321506 -1070711 -698024 -1051873 -1683142 -1623560 -1150669 -1279775
39083 -1279775 -1806347 -1513847 -433545 -174230 -1364477 -2297207 -1232948 1036353 2229247
39074 2229247 1517598 115890 -714426 -924813 -956977 -972185 -1084498 -1413500 -1562100 -860579
39064 -860579 492140 1312218 944796 192545 124976 557651 462043 -504898 -1651808 -2219714
39054 -2219714 -1996975 -1125811 -16392 605519 300422 -365907 -378366 355224 890393
39045 890393 661202 206289 120617 99226 -327207 -753446 -452564 382234 809392 436012
$$ packed form
39113h52179j077257o4287J360211J284670j8255p16592k53069K35849Q7523j13857
39103a27243q6656m27612j120502j073840L1397Q54794M06285l22888k5416P29443
39093a162238N57667k95888m21047K50795L72687l53849o31269N9582M72891j29106
39083a279775n26572K92500J080302K59315j190247r32730J064259K269301J192894
39074B229247p11649j401708q30316k10387l2164j5208j12313l29002j48600P01521
39064h60579J352719Q20078l67422p52251o7569M32675r5608r66941j146910n67906
39054b219714K22739Q71164J109419O21911l05097o66329j2459P33590N35169
39045H90393k29191m54913q5672k1391m26433m26239L00882Q34798M27158l73380
$$ plain form
39035 436012 -217503 -630234 -838263 -997242 -1060195 -1086257 -1302874 -1619600 -1549630 -860214
39025 -860214 73187 732483 916719 662194 174038 -66874 299146 827083 626134 -299867
39015 -299867 -791724 -140623 716187 381168 -1072059 -2244183 -2295814 -1789292 -1575179
39006 -1575179 -1648568 -1470671 -920843 -477956 -572180 -998775 -1064500 -402825 412621 435943
38996 435943 -312540 -587991 506372 2087661 2372032 891127 -887018 -1291726 -247912
38987 -247912 884472 865197 -296192 -1547569 -1902769 -1321247 -484035 137196 569332
38978 569332 693840 64315 -1181425 -1943286 -1463134 -461870 -73522 -137168 321157
38969 321157 1257151 1639034 1262694 1053751 1273255 912630 -476278 -1694016 -1571845
$$ packed form
39035D36012o53515m12731k08029j58979o2953k6062k16617l16726O9970O89416
39025h60214R33401O59296J84236k54525m88156k40912L66020N27937k00949r26001
39015b99867m91857O51101Q56810l35019j453227j172124n1631N06522K14113
39006a575179p3389J77897N49828M42887r4224m26595o5725O61675Q15446K3322
38996D35943p48483k75451J094363J581289K84371j480905j778145m04708J043814
38987b47912J132384j9275j161389j251377l55200N81522Q37212O21231M32136
38978E69332J24508o29525j245740p61861M80152J001264L88348o3646M58325
38969C21157R35994L81883l76340k08943K19504l60625j388908j217738J22171
$$ plain form
38960 -1571845 -663225 -215559 -333437 -308090 -82761 -130768 -285786 53773 708245 863455
38950 863455 453945 314206 740871 911416 214075 -619611 -418666 751596 1534938
38941 1534938 978284 -226572 -578324 335678 1315358 1111540 -21752 -849355 -792986
38932 -792986 -280381 250175 709811 824209 382682 124542 1092021 2753156 3173822
38923 3173822 1726884 205385 244610 1019517 862640 -65285 -454606 -286041 -602374
38914 -602374 -1291363 -1122949 10310 755512 458540 -8952 32389 88317 -229958 -382553
38904 -382553 -68911 3889 -683252 -1474767 -1513819 -931752 -428033 -334472 -605272 -1094419
38894 -1094419 -1437005 -1280253 -883029 -771742 -696968 88667 1334172 1763044 961440
$$ packed form
38960a571845R08620M47666j17878K5347K25329m8007j55018L39559O54472J55210
38950H63455m09510j39739M26665J70545o97341q33686K00945J170262P83342
38941A534938n56654j204856l51752R14002R79680k03818j133292q27603N6369
38932g92986N12605N30556M59636J14398m41527k58140R67479J661135M20666
38923C173822j446938j521499L9225P74907j56877r27925l89321J68565l16333
38914f02374o88989J68414J133259P45202k96972m67492M1341N5928l18275j52595
38904c82553L13642P2800o87141p91515l9052N82067N03719R3561k70800m89147
38894a094419l42586J56752L97224J11287P4774P85635J245505M28872q01604
$$ plain form
38885 961440 104620 229663 944397 1517520 2050773 2695894 2812194 1938098 713198
38876 713198 -138159 -877791 -1830336 -2284374 -1460350 114764 1264761 1567382 1189396
38867 1189396 156478 -1145507 -1621270 -857765 -44206 -215358 -515254 234708 1206370
38858 1206370 796664 -517235 -880370 -321101 -760349 -2503983 -3299293 -1786247 369794
38849 369794 1083282 692148 660340 1005575 849991 493232 1014422 2239100 2779464 2062307
38839 2062307 996608 508866 482609 398319 218606 273917 685735 1161164 1270394 960963
38829 960963 759600 1112603 1522778 981020 -531076 -1745932 -1769922 -1233669 -1100576
38820 -1100576 -1138716 -614394 95084 -69286 -948700 -1086270 95686 1201647 679307
$$ packed form
38885I61440q56820J25043P14734N73123N33253O45121J16300q74096j224900
38876G13198q51357p39632r52545m54038Q24024J575114J149997L02621l77986
38867A189396j032918j301985m75763P63505Q13559j71152k99896P49962R71662
38858A206370m09706j313899l63135N59269m39248j743634p95310J513046K156041
38849C69794P13488l91134l1808L45235j55584l56759N21190J224678N40364p17157
38839B062307j065699m87742k6257q4290j79713N5311M11818M75429J09230l09431
38829I60963k01363L53003M10175n41758j512096j214856k3990N36253J33093
38820a100576l8140N24322P09478j64370q79414j37570J181956J105961n22340
$$ plain form
38811 679307 -1037670 -2111942 -1684848 -731958 -444134 -635007 -400888 128370 -252855
38802 -252855 -1913397 -3422648 -3292950 -2033686 -1364286 -1708402 -1830002 -1043918 -274875
38793 -274875 -303605 -373566 370461 1170119 764928 -511180 -1223216 -1009150 -760261 -809025
38783 -809025 -510731 202112 361903 -436410 -1265534 -1350196 -1202791 -1487588 -1733723 -1171737
38773 -1171737 -153726 325303 128311 -7715 201503 158159 -620486 -1722536 -2233022
38764 -2233022 -1557856 120223 1861910 2539682 1801961 485165 -207848 130895 986030
38755 986030 1684458 1869977 1426047 509822 -301751 -375573 329250 1251337 1854393 1959917
38745 1959917 1567482 840084 291262 435225 1048938 1241785 523348 -588371 -1304048
$$ packed form
38811F79307j716977j074272M27094R52890K87824j90873K34119N29258l81225
38802b52855j660542j509251J29698J259264O69400l44116j21600P86084P69043
38793b74875k8730o9961P44027P99658m05191j276108p12036K14066K48889m8764
38783h09025K98294P12843J59791p98313q29124q4662J47405k84797k46135N61986
38773a171737J018011M79029j96992j36026K09218m3344p78645j102050n10486
38764b233022O75166J678079J741687O77772p37721j316796o93013L38743Q55135
38755I86030O98428J85519m43930r16225q11573p3822P04823R22087O03056J05524
38745A959917l92435p27398n48822J43963O13713J92847p18437j111719p15677
$$ plain form
38736 -1304048 -1516571 -1640965 -1831050 -1845169 -1535347 -1001428 -304794 548171 1314136 1588838
38726 1588838 1273780 684426 133803 -306737 -592105 -620094 -525237 -712933 -1322312 -1871712
38716 -1871712 -1720447 -771793 474791 1436793 1852841 1864201 1886728 2205113 2529453 2281543
38706 2281543 1576054 1417731 2341719 3301403 2838316 1203495 191890 651615 1342145
38697 1342145 911718 -69420 -125831 813327 1459837 1238164 935796 1152581 1379369 1130235
38687 1130235 964050 1601503 2645591 2944972 1947322 188627 -1282381 -1588217 -536247
38678 -536247 1053623 1847260 1313452 296201 -128987 6105 -91693 -662813 -1166004
38669 -1166004 -1207251 -953705 -606608 -121613 454032 941128 1411332 2040198 2490786 2098061
$$ packed form
38736a304048k12523j24394j90085j4119L09822N33919O96634Q52965P65965K74702
38726A588838l15058n89354n50623m40540k85368k7989R4857j87696o09379n49400
38716a871712J51265R48654J246584R62002M16048J1360K2527L18385L24340k47910
38706B281543p05489j58323R23988R59684m63087j634821j011605M59725O90530
38697A342145m30427r81138n6411R39158O46510k21673l02368K16785K26788k49134
38687A130235j66185O37453J044088K99381r97650j758695j471008l05836J051970
38678e36247J589870P93637n33808j017251m25188J35092r7798n71120n03191
38669a166004m1247K53546L47097M84995N75645M87096M70204O28866M50588l92725
$$ plain form
38659 2098061 902904 -117144 -207565 292914 635076 712055 904284 1244833 1360191
38650 1360191 1096626 661653 179843 -411756 -981363 -1143342 -734624 -62482 479562
38641 479562 835898 1172638 1491520 1562351 1224604 612062 18886 -375314 -554285 -512456
38631 -512456 -259844 -14456 -119841 -578280 -895203 -662276 -87490 393438 783849 1274936
38621 1274936 1496414 759260 -826751 -2160767 -2356277 -1578758 -454991 641912 1307522
38612 1307522 895495 -624047 -2093102 -2309336 -1482542 -777620 -640347 -455261 194112
38603 194112 853275 998796 764702 543992 425043 347171 379647 540856 663256 674280
38593 674280 748871 1013673 1314946 1360560 906209 -128157 -1440194 -2371198 -2533630 -2273672
$$ packed form
38659B098061j195157j020048r0421N00479L42162P6979J92229L40549J15358
38650A360191k63565m34973m81810n91599n69607j61979M08718O72142N42044
38641D79562L56336L36740L18882P0831l37747o12542n93176l94200j78971M1829
38631e12456K52612K45388j05385m58439l16923K32927N74786M80928L90411M91087
38621A274936K21478p37154j586011j334016j95510P77519J123767J096903O65610
38612A307522m12027j519542j469055k16234Q26794P04922J37273J85086O49373
38603A94112O59163J45521k34094k20710j18949p7872L2476J61209J22400J1024
38593F74280P4591K64802L01273M5614m54351j034366j312037r31004j62432K59958
$$ plain form
38583 -2273672 -2085770 -1821280 -1104642 -277254 -37866 -217662 71412 951915 1519805
38574 1519805 1343713 1078401 1104235 776126 -181716 -708880 29215 1064035 962717
38565 962717 44869 -253876 195020 105986 -914990 -1622019 -1122523 -205422 29077 -242968
38555 -242968 -193791 249287 499721 325157 14362 -173027 -170571 10804 148686 -96918
38545 -96918 -574967 -587409 54109 405776 -423624 -1755793 -1923889 -464032 1086286
38536 1086286 1010348 -479082 -1542693 -970925 461540 1113742 507952 -305895 -326205
38527 -326205 153627 242777 -148595 -303957 122193 676649 904287 901196 908578 950293 1064376
38516 1064376 1301788 1296874 535225 -634556 -1049333 -339801 295907 -244861 -1192276 -913476
$$ packed form
38583b273672J87902K64490P16638Q27388K39388j79796K89074Q80503N67890
38574A519805j76092k65312K5834l28109r57842n27164P38095J034820j01318
38565I62717r17848k98745M48896q9034j020976p07029M99496R17101K34499k72045
38555b42968M9177M43078K50434j74564l10795j87389K456J81375J37882k45604
38545i6918m78049j2442O41518L51667q29400j332169j68096J459857J550318
38536A086286p5938j489430j063611N71768J432465O52202o05790q13847k0310
38527c26205M79832Q9150l91372j55362M26150N54456K27638l091P382M1715J14083
38516A064376K37412m914p61649j169781m14777P09532O35708n40768r47415K78800
$$ plain form
38506 -913476 639453 1763607 1362052 251427 -319431 -408372 -867138 -1789937 -2422794
38497 -2422794 -2394267 -2213039 -2435606 -2881455 -2889431 -2082902 -751448 354602 557097 -229766
38487 -229766 -1384882 -2045023 -1762725 -763255 324487 921459 844721 423909 240887
38478 240887 548770 948848 871696 408472 329549 1053961 1922130 1970110 1301831 1039378
38468 1039378 1701164 2295905 1641068 161126 -513922 259259 1244623 1004865 -253459
38459 -253459 -1153451 -996988 -357393 8428 46432 70434 185956 371343 709903 1179276
38449 1179276 1460684 1287577 837702 490797 290539 -56244 -643829 -1122680 -1148714 -906748
38439 -906748 -922436 -1334617 -1632309 -1341927 -787811 -761051 -1421723 -2009592 -1876972 -1356199
$$ packed form
38506i13476J552929J124154m01555j110625n70858q8941m58766r22799o32857
38497b422794K8527J81228k22567m45849p976Q06529J331454J106050K02495p86863
38487b29766j155116o60141K82298R99470J087742N96972p6738m20812j83022
38478B40887L07883M00078p7152m63224p8923P24412Q68169M7980o68279k62453
38468A039378O61786N94741o54837j479942o75048P73181R85364k39758j258324
38459b53459q99992J56463O39595L65821L8004K4002J15522J85387L38560M69373
38449A179276K81408j73107m49875l46905k00258l46783n87585m78851k6034K41966
38439i06748j5688m12181k97692K90382N54116K6760o60672n87869J32620N20773
$$ plain form
38429 -1356199 -1167608 -1314490 -1165181 -473230 332406 870393 1163842 1154165 549422 -499606
38419 -499606 -1146956 -760444 282542 1126294 1415782 1312570 907005 214288 -429266
38410 -429266 -558970 -148379 445381 997999 1421395 1404203 676751 -341232 -792372 -481070
38400 -481070 -204602 -709016 -1687950 -2084110 -1152962 863961 2808036 3315452 1947738
38391 1947738 -190876 -1364764 -910450 340054 1356849 1969582 2407627 2582154 2405710
38382 2405710 2222834 2228901 1908153 776270 -665604 -1464585 -1430899 -1074219 -605414 114718
38372 114718 773626 720112 -36421 -782899 -1167730 -1479542 -1739559 -1453062 -592458 37210
38362 37210 -131781 -718281 -1164873 -1473800 -1711028 -1586470 -1163631 -1228079 -2140898 -2938171
$$ packed form
38429a356199J88591j46882J49309O91951Q05636N37987K93449r677o04743j049028
38419d99606o47350L86512J042986Q43752K89488j03212m05565o92717o43554
38410d29266j29704M10591N93760N52618M23396j7192p27452j017983m51140L11302
38400d81070K76468n04414r78934l96160R31148K016923J944075N07416j367714
38391A947738k138614j173888M54314J250504J016795O12733M38045J74527j76444
38382B405710j82876O067l20748j131883j441874p98981L3686L56680M68805P20132
38372A14718O58908n3514p56533p46478l84831l11812k60017K86497Q60604O29668
38362C7210j68991n86500m46592l08927k37228J24558M22839o4448r12819p97273
$$ plain form
38352 -2938171 -2477847 -1036992 166126 708488 1201611 1909140 2166631 1430320 171072
38343 171072 -626657 -475217 265058 762773 439364 -413838 -847097 -360563 424340 576014
38333 576014 59129 -368145 -235456 224542 603451 723834 603487 437444 448661 413742
38323 413742 -249268 -1423931 -1922047 -1004218 263136 309885 -606228 -718867 605299
38314 605299 1954345 1952719 996675 333557 443682 994220 1559228 1723431 1142329 81707
38304 81707 -649835 -688512 -428191 -148465 280766 567509 44082 -916680 -825729 684888
38294 684888 1793147 894281 -976597 -1616847 -730726 157608 310629 394832 623632
38285 623632 249543 -710512 -1012412 -184379 484747 -121587 -1259737 -1618207 -1233615
$$ packed form
38352b938171M60324J440855J203118N42362M93123P07529K57491p36311j259248
38343A71072p97729J51440P40275M97715l23409q53202m33259M86534P84903J51674
38333E76014n16885m27274J32689M59998L78909J20383j20347j66043J1217l4919
38323D13742o63010j174663m98116R17829J267354M6749r16113j12639J324166
38314F05299J349046j626r56044o63118J10125N50538N65008J64203n81102j060622
38304H1707p31542l8677K60321K79726M29231K86743n23427r60762R0951J510617
38294F84888J108259q98866j870878o40250Q86121Q88334J53021Q4203K28800
38285F23632l74089r60055l01900Q28033O69126o06334j138150l58470L84592
$$ plain form
38276 -1233615 -887554 -477526 479404 1213263 341363 -1715775 -2628744 -1196817 834668
38267 834668 1107223 -155398 -741121 211678 1164698 724352 -340316 -501205 276806
38258 276806 899863 1021228 1182346 1408057 1062576 178555 -311894 31029 569607 716656
38248 716656 665241 625739 334917 -172654 -245519 324786 765906 485880 -7439 -6636 309087
38237 309087 350330 -2378 -569041 -1151302 -1129096 194754 2145284 2769904 1401706
38228 1401706 -71941 199428 1361477 1455786 651511 741375 1934535 2445533 1367930
38219 1367930 -81274 -572512 -182796 534704 1409652 2070127 1926675 1252176 1002628
38210 1002628 1209444 913622 642 -459809 -134902 -2367 -383076 -175154 1040799
$$ packed form
38276a233615L46061M10028R56930P33859q71900k057138r12969J431927K031485
38267H34668K72555j262621n85723R52799R53020m40346j064668j60889P78011
38258B76806O23057J21365J61118K25711l45481q84021m90449L42923N38578J47049
38248G16656n1415l9502k90822n07571p2865N70305M41120k80026m93319Q03L15723
38237C09087M1243l52708n66663n82261K2206J323850J950530O24620j368198
38228A401706j473647K71369J162049R4309q04275Q9864J193160N10998j077603
38219A367930j449204m91238L89716P17500Q74948O60475j43452o74499k49548
38210A002628K06816k95822r12980m60451L24907J32535l80709K07922J215953
$$ plain form
38201 1040799 1868629 1249085 171777 -76004 123105 -28668 32204 1007870 1986040
38192 1986040 1848973 1406154 2011069 2871067 2112697 113755 -755711 167339 852477
38183 852477 -122000 -1527177 -1739321 -1087545 -623528 -141231 960505 1941370 1595732
38174 1595732 351936 -91158 854719 1937822 1850540 700112 -564731 -1327155 -1476742
38165 -1476742 -1049895 -268428 332899 316033 -101963 -170865 592287 1781954 2369965 1679028
38155 1679028 129549 -1073990 -1115027 -369405 109965 -142302 -550191 -429690 -14871
38146 -14871 -89743 -723075 -1018261 -365852 644564 1085875 1023721 1229391 1754836 1705503
38136 1705503 638271 -607092 -957342 -474967 -142295 -557359 -1334361 -1717589 -1442520
$$ packed form
38201A040799Q27830o19544j077308k47781J99109j51773O0872R75666R78170
38192A986040j37067m42819O04915Q59998p58370j998942q69466R23050O85138
38183H52477r74477j405177k12144O51776M64017M82297J101736R80865l45638
38174A595732j243796m43094R45877J083103q7282j150428j264843p62424j49587
38165a476742M26847P81467O01327j6866m17996o8902P63152J189667N88011o90937
38155A679028j549479j203539m1037P45622M79370k52267m07889J20501M14819
38146a4871p4872o33332k95186O52409J010416M41311o2154K05670N25445m9333
38136A705503j067232j245363l50250M82375L32672m15064p77002l83228K75069
$$ plain form
38127 -1442520 -942534 -807807 -1053710 -1053531 -369518 589695 1140989 1299081 1538698 1780658
38117 1780658 1524855 1021603 1231023 2277201 3025168 2775912 2313946 2432508 2448464
38108 2448464 1402078 1658 -88618 1349267 2749016 2875817 2132907 1562203 1521613
38099 1521613 1659634 1463913 605645 -647203 -1301127 -632844 645677 1051419 295185
38090 295185 -340783 89012 858849 774111 -33815 -357843 384437 1466292 1821334 1161932
38080 1161932 63048 -728370 -928594 -766372 -509243 -115422 480617 938942 788380
38071 788380 119733 -425095 -451778 -212104 -84083 -50395 118276 505243 1059087 1623259
38061 1623259 1775694 1061839 -278175 -1179873 -834846 266647 845014 340409 -545022
$$ packed form
38127a442520M99986J34727k45903J79O84013R59213N51294J58092K39617K41960
38117A780658k55803n03252K09420J046178P47967k49256m61966J18562J5956
38108B448464j046386j400420r0276J437885J399749J26801p42910n70704m0590
38099A521613J38021j95721q58268j252848o53924O68283J278521M05742p56234
38090B95185o35968M29795P69837q4738q07926l24028P42280J081855L55042o59402
38080A161932j098884p91418k00224J62222K57129L93821N96039M58325j50562
38071G88380o68647n44828k6683K39674J28021L3688J68671L86967N53844N64172
38061A623259J52435p13855j340014r01698L45027J101493N78367n04605q85431
$$ plain form
38052 -545022 -884061 -622877 -345831 -312286 -248112 5864 233084 400947 914376 1880343
38042 1880343 2568152 2244518 1302545 836498 1177720 1612888 1567523 1219504 791764 174957
38032 174957 -420105 -423860 -31947 -324289 -1497110 -2024798 -694731 1394212 2217354
38023 2217354 1546638 751224 355118 -354234 -1311765 -1287228 -111487 523617 -426876
38014 -426876 -1509946 -845088 980930 1731858 750752 -293324 42717 1148599 1612570
38005 1612570 1173273 571650 135822 -479711 -1312890 -1757583 -1421536 -686583 -107639
37996 -107639 204417 215310 -404904 -1584390 -2263218 -1509496 -27776 588623 142085
37987 142085 48697 939276 1557064 935793 260950 1122205 2899062 3573359 2607742 1313503
$$ packed form
38052e45022l39039K61184K77046L3545O4174K53976K27220J67863N13429R65967
38042A880343O87809l23634r41973m66047L41222M35168m5365l48019m27740o16807
38032A74957n95062l755L91913k92342j172821n27688J330067K088943Q23142
38023B217354o70716p95414l96106p09352r57531K4537J175741O35104r50493
38014d26876j083070O64858J826018P50928r81106j044076L36041J105882M63971
38005A612570m39297o01623m35828o15533q33179m44693L36047P34953N78944
37996a07639L12056J0893o20214j179486o78828P53722J481720O16399m46538
37987A42085r3388Q90579O17788o21271o74843Q61255J776857O74297r65617j294239
$$ plain form
37977 1313503 591358 39855 -586519 -708087 -179894 167375 -138223 -454401 -216194
37968 -216194 100748 -120879 -570261 -528114 56914 529808 250358 -832349 -1973595
37959 -1973595 -2126701 -1228249 -682465 -1626462 -3024560 -2835399 -1017962 249146 -290947
37950 -290947 -1278912 -983455 238695 862370 466268 -154364 -433412 -472513 -459733 -489781
37940 -489781 -635388 -696314 -374447 -15225 -375541 -1277495 -1516073 -668214 124474 -68741
37930 -68741 -557842 -358274 168729 162786 -193143 -244957 -208941 -654694 -1283369 -1464840
37920 -1464840 -1407898 -1572388 -1512575 -606999 586906 1040151 833440 672436 324377 -896160
37910 -896160 -2374948 -2584429 -1248279 321530 1102648 1209262 845362 -80079 -1025697
$$ packed form
37977A313503p22145n51503o26374j21568N28193L47269l05598l16178K38207
37968b16194L16942k21627m49382M2147N85028M72894k79450j082707j141246
37959a973595j53106Q98452N45784r43997j398098J89161J817437J267108n40093
37950b90947r87965K95457J222150O23675l96102o20632k79048l9101J2780l0048
37940d89781j45607o0926L21867L59222l60316r01954k38578Q47859P92688j93215
37930f8741m89101J99568N27003n943l55929n1814L6016m45753o28675j81471
37920a464840N6942j64490N9813R05576J193905M53245k06711j61004l48059j220537
37910h96160j478788k09481J336150J569809P81118J06614l63900r25441r45618
$$ plain form
37901 -1025697 -936919 199826 1059765 722776 -227476 -711010 -374757 458351 1173083
37892 1173083 995824 -295553 -1588072 -1390344 138097 1162547 562057 -695887 -1074078
37883 -1074078 -379087 492362 905242 853146 533434 206339 134186 241720 158091 -164289
37873 -164289 -277069 122531 773443 1180214 974380 20929 -1295595 -2023626 -1582971
37864 -1582971 -651053 -339847 -631557 -586500 -13924 239388 -188621 -573519 -386956 -71879
37854 -71879 -82552 -184337 -211257 -522838 -1138631 -1354420 -829679 -205128 -72370 -193276
37844 -193276 -289799 -642348 -1221644 -1195483 -155543 982366 1182276 683220 356964 384801
37834 384801 463845 659638 1082365 1263760 825994 323734 499014 1097808 1317885 1073406
$$ packed form
37901a025697Q8778J136745Q59939l36989r50252m83534L36253Q33108P14732
37892A173083j77259j291377j292519J97728J528441J024450o00490j257944l78191
37883a074078O94991Q71449M12880n2096l19712l27095p2153J07534q3629l22380
37873a64289j12780L99600O50912M06771k05834r53451j316524p28031M40655
37864a582971R31918L11206k91710M5057N72576K53312m28009l84898J86563L15077
37854g1879j0673j01785k6920l11581o15793k15789N24741O24551J32758j20906
37844a93276r6523l52549n79296K6161J039940J137909J99910m99056l26256K7837
37834C84801P9044J95793M22727J81395m37766n02260J75280N98794K20077k44479
$$ plain form
37824 1073406 956205 1258697 1809964 2410030 2685412 2021161 518465 -506634 -37094
37815 -37094 1053760 1081880 -85127 -1013065 -914895 -511316 -507959 -532776 -114531 305589
37805 305589 25643 -892430 -1807651 -2249475 -2059113 -1207245 77582 1228749 1724701
37796 1724701 1478898 772733 -24992 -639079 -984346 -1122994 -1061537 -747017 -374794 -397371
37786 -397371 -996869 -1870967 -2765109 -3730968 -4509918 -4297595 -2760630 -763084 631196
37777 631196 1350092 1712211 1318998 -224332 -1917281 -2176879 -1013757 11580 122336
37768 122336 144384 673286 995346 553182 62611 182769 307335 -154066 -402096 396962
37758 396962 1232443 445832 -1577097 -2671981 -1914252 -715229 -484916 -739886 -377919
$$ packed form
37824A073406j17201L02492N51267O00066K75382o64251j502696j025099M69540
37815c7094J090854K8120j167007r27938R8170M03579L357k4817M18245M20120
37805C05589k79946r18073r15221m41824J90362Q51868J284827J151167M95952
37796A724701k45803p06165p97725o14087l45267j38648O1457L14520L72223k2577
37786c97371n99498q74098q94142r65859p78950K12323J536965J997546J394280
37777F31196P18896L62119l93213j543330j692949k59598J163122J025337J10756
37768A22336K2048N28902L22060m42164m90571J20158J24566m61401k48030P99058
37758C96962Q35481p86611k022929j094884P57729J199023K30313k54970L61967
$$ plain form
37749 -377919 407794 671328 403645 402660 773782 782831 263130 87846 857681 1941648
37739 1941648 2372300 2096167 1687212 1258887 491421 -392593 -588903 76774 632909
37730 632909 205172 -711442 -934119 -334199 -71680 -892730 -1906179 -1645371 -35117
37721 -35117 1385508 1296064 104200 -733064 -538165 39010 285759 505719 1290395 2138096
37711 2138096 1712304 -321076 -2464343 -2990198 -1990906 -1139591 -1508710 -2351281 -2281300
37702 -2281300 -1069532 236393 665533 207352 -596338 -1322413 -1690208 -1431345 -640578
37693 -640578 7689 -32699 -365231 -185953 381625 346311 -462136 -752332 399176 1912259
37683 1912259 2095434 1175077 962539 2070253 3066067 2811116 2065849 1876563 1730805
$$ packed form
37749c77919P85713K63534k67683r85L71122R049n19701j75284P69835J083967
37739A941648M30652k76133m08955m28325p67466q84014j96310O65677N56135
37730F32909m27737r16614k22677N99920K62519q21050j013449K60808J610254
37721c5117J420625q9444j191864q37264J94899N77175K46749K19960P84676Q47701
37711B138096m25792k033380k143267n25855R99292Q51315l69119q42571O9981
37702b281300J211768J305925M29140m58181q03690p26075l67795K58863P90767
37693f40578O48267m0388l32532J79278N67578l5314q08447k90196J151508J513083
37683A912259J83175r20357k12538J107714R95814k54951p45267j89286j45758
$$ plain form
37674 1730805 640597 -887869 -1487444 -1035005 -643841 -759136 -709963 -236451 -74106
37665 -74106 -604873 -1064197 -682926 212962 820949 941695 908814 933345 990418 1008809
37655 1008809 856145 462359 114027 181842 437870 224581 -506446 -979177 -717432 -222352
37645 -222352 -112248 -205351 25433 590853 1094818 1287779 1092337 549955 122159 429781
37635 429781 1226497 1382078 542647 -44887 652837 1624113 1176254 -379181 -1061262
37626 -1061262 -166376 851030 798356 350213 446263 614508 107573 -457840 -64492 851601
37616 851601 1042219 539507 568150 1449444 2094858 1822692 1295158 1155682 975560 292766
37606 292766 -327126 -181444 365024 508583 287482 281037 446369 277706 -94121 -17489
$$ packed form
37674A730805j090208j528466n99575M52439L91164j15295M9173M73512J62345
37665g4106n30767m59324L81271Q95888O07987J20746l2881K4531N7073J8391
37655A008809j52664l93786l48332O7815K56028k13289p31027m72731K61745M95080
37645b22352J10104r3103K30784N65420N03965J92961j95442n42382m27796L07622
37635D29781P96716J55581q39431n87534O97724R71276m47859j555435o82081
37626a061262Q94886J017406n2674m48143R6050J68245n06935n65413L93348R16093
37616H51601J90618n02712K8643Q81294O45414k72166n27534j39476j80122o82794
37606B92766o19892J45682N46468J43559k21101o445J65332j68663l71827P6632
$$ plain form
37596 -17489 447179 421806 -399036 -1124164 -898067 -112234 192580 -234535 -592141 -143641
37586 -143641 795122 1136847 242757 -1238882 -1958105 -1356877 -247167 339178 422248
37577 422248 671544 1158622 1344434 1123100 932231 813394 380147 -77845 440748 2070626
37567 2070626 3453223 3413183 2465973 1865889 1864439 1827851 1505905 1150280 725687 23596
37557 23596 -611920 -594940 -39702 421700 616653 778641 692861 -79822 -1105170 -1250722
37547 -1250722 -201503 1093521 1751493 1864108 1776590 1391593 721818 344386 625352
37538 625352 1035666 879288 303248 6218 250119 687143 953821 990370 896111 766196
37528 766196 571213 119759 -602989 -1102322 -898832 -410768 -588593 -1482327 -2026815 -1643590
$$ packed form
37596a7489M64668k5373q20842p25128K26097P85833L04814m27115l57606M48500
37586a43641R38763L41725q94090j481639p19223O01228J109710N86345Q3070
37577D22248K49296M87078J85812k21334j90869j18837m33247m57992N18593J629878
37567B070626J382597m0040r47210o00084j450l6588l21946l55625m24593p02091
37557B3596o35516J6980N55238M61402J94953J61988q5780p72683j025348j45552
37547a250722J049219J295024O57972J12615q7518l84997o69775l77432K80966
37538F25352M10314j56378n76040k97030K43901M37024K66678L6549r4259j29915
37528G66196j94983m51454p22748m99333K03490M88064j77825q93734n44488L83225
$$ plain form
37518 -1643590 -1120017 -1244706 -1509778 -1131980 -559659 -730352 -1376721 -1456704 -994370 -1025114
37508 -1025114 -1697905 -1915376 -1173186 -362288 -199947 -147416 375429 855077 668752 222539
37498 222539 132534 151859 -48303 77967 863023 1198963 -21610 -1788898 -2107091 -1040060
37488 -1040060 -673026 -1830872 -2868728 -2442479 -1553990 -1631604 -2200219 -2015543 -1272196
37479 -1272196 -933253 -746418 189720 1379815 1363996 91149 -913539 -874818 -578985
37470 -578985 -557746 -130875 1098366 2214818 2268199 1491252 575362 -216137 -611386 -191081
37460 -191081 554673 222280 -1511081 -3008762 -2856099 -1818850 -1351230 -1216965 -264613
37451 -264613 1127680 1276529 -238307 -1857674 -2088259 -1014857 358220 1147722 893032
$$ packed form
37518a643590N23573j24689k65072L77798N72321j70693o46369p9983M62334l0744
37508a025114o72791k17471P42190Q10898J62341N2531N22845M79648j86325m46213
37498B22539r0005J9325k00162J26270P85056L35940j220573j767288l18193J067031
37488a040060L67034j157846j037856M26249Q88489p7614n68615J84676P43347
37479a272196L38943J86835R36138J190095j5819j272847j004688L8721K95833
37470e78985K1239M26871J229241J116452N3381p76947r15890p91499l95249M20305
37460a91081P45754l32393j733361j497681J52663J037249M67620J34265R52352
37451b64613J392293J48849j514836j619367k30585J073402J373077P89502k54690
$$ plain form
37442 893032 -95633 -635367 36567 941205 542856 -819690 -1184339 151345 1603623
37433 1603623 1704840 993089 663935 734524 666914 678024 1124604 1373664 588207 -849879
37423 -849879 -1840762 -2088853 -2067130 -1852999 -1143977 -221978 219500 172761 246482 512860
37413 512860 413328 -107997 -356264 18626 560125 869980 1040814 920543 -71167 -1811784
37403 -1811784 -3034463 -2823559 -1898440 -1509471 -1583293 -1062815 181082 1052861 1001799
37394 1001799 861287 1371292 1907115 1545370 615754 105393 6772 -490661 -1313039 -1354714
37384 -1354714 -292366 695453 627457 90757 96738 444364 271723 -356320 -575233 -164253
37374 -164253 239820 311986 406597 668809 708509 386874 150804 320767 684401 992053
$$ packed form
37442H93032r88665n39734O71934R04638l98349j362546l64649J335684J452278
37433A603623J01217p11751l29154P0589o7610J1110M46580K49060p85457j438086
37423h49879r90883k48091K1723K14131P09022R21999M41478m6739P3721K66378
37413E12860r9532n21325k48267L74890N41499L09855J70834j20271r91710j740617
37403a811784j222679K10904R25119L88969p3822N20478J243897Q71779n1062
37394A001799j40512N10005N35823l61745r29616n10361r8621m97433q22378m1675
37384a354714J062348R87819o7996n36700N981L47626j72641o28043k18913M10980
37374a64253M04073P2166R4611K62212L9700l21635k36070J69963L63634L07652
$$ plain form
37364 992053 1234460 1284553 957482 623252 1016726 2118109 2916435 2685228 1877477 1345292
37354 1345292 1282329 1412178 1615504 1738750 1248040 -180607 -1903130 -2751405 -2226009
37345 -2226009 -880096 392199 1111506 1338323 1366994 1356770 1200906 806492 392139
37336 392139 209963 52129 -481467 -1188257 -1345762 -814289 -426028 -831907 -1474909 -1301265
37326 -1301265 -193080 892306 1088687 447837 -337293 -610997 -143864 776418 1482598
37317 1482598 1347176 275760 -1145852 -2044570 -1946047 -1142301 -260562 516521 1451430
37308 1451430 2392229 2552001 1644438 644273 588760 1028604 698591 -468094 -1175384
37299 -1175384 -707357 138829 409832 219258 110258 135452 181301 429459 872745 1011549
$$ packed form
37364I92053K42407N0093l27071l34230L93474J101383P98326k31207q07751n32185
37354A345292o2963J29849K03326J23246m90710j428647j722523q48275N25396
37345b226009J345913J272295P19307K26817K8671j0224j55864l94414m14353
37336C92139j82176j57834n33596p06790j57505N31473L88261m05879o43002J73644
37326a301265J108185J085386J96381o40850p85130k73704M67133R20282P06180
37317A482598j35422j071416j421612q98718R8523Q03746Q81739P77083R34909
37308A451430R40799J59772r07563j000165n5513M39844l30013j166685p07290
37299a175384M68027Q46186K71003j90574j09000K5194M5849K48158M43286J38804
$$ plain form
37289 1011549 575346 -31581 -398786 -531976 -274974 745303 2041336 2153139 484867
37280 484867 -1556737 -2200602 -1429985 -556998 -352238 -643719 -1223107 -1963946 -2301744
37271 -2301744 -1687730 -503965 309787 435662 275311 102317 -121050 -294078 -293158 -341961
37261 -341961 -596495 -662413 -235372 173834 -3522 -327692 -58276 413717 53017 -1016221
37251 -1016221 -1485553 -824146 -60183 -172189 -727045 -751102 -222693 5780 -594657 -1640892
37241 -1640892 -2294164 -2034110 -1094296 -209558 190285 416629 911181 1430891 1291834
37232 1291834 295583 -1060160 -2202733 -2845636 -2838604 -2218141 -1447062 -1146327 -1497557
37223 -1497557 -2166598 -2704730 -2728471 -1956209 -546031 766026 1350943 1396886 1519254
$$ packed form
37289A011549m36203o06927l67205j33190K57002J020277J296033J11803j668272
37280D84867k041604o43865P70617Q72987K04760k91481n79388p40839l37798
37271b301744O14014J183765Q13752J25875j60351j72994k23367j73028R20m8803
37261c41961k54534o5918M27041M09206j77356l24170K69416M71993l60700j069238
37251a016221m69332O61407P63963j12006n54856k4057N28409K28473o00437j046235
37241a640892o53272K60054R39814Q84738L99843K26344M94552N19710j39057
37232A291834r96251j355743j142573o42903P032O20463P71079L00735l51230
37223a497557o69041n38132k3741P72262J410178J312057N84917M5943J22368
$$ plain form
37214 1519254 1855582 2016837 1732660 1039377 49688 -902469 -1126872 -278914 917524
37205 917524 1351557 911171 506332 672683 893181 555631 -76081 -338431 -241354 -460807
37195 -460807 -1226125 -1732227 -1127219 95072 449357 -472075 -1110953 6523 1981239
37186 1981239 2631765 1573680 586829 800769 1320997 1247870 1229421 1886377 2275955 1395277
37176 1395277 42798 -311766 390079 1195324 1722931 2020749 1803531 1248274 1527261
37167 1527261 2962275 3703851 2125159 -389537 -1152799 36991 1051405 850489 320631
37158 320631 -84216 -989694 -2155740 -2277466 -1282109 -718658 -1223091 -1555736 -900348
37149 -900348 -291748 -842620 -2051513 -2735827 -2444938 -1375000 -69381 441883 -479370
$$ packed form
37214A519254L36328J61255k84177o93283r89689r52157k24403Q47958J196438
37205I17524M34033m40386m04839J66351K20498l37550o31712k62350R7077k19453
37195d60807p65318n06102O05008J222291L54285r21432o38878J117476J974716
37186A981239O50526j058085r86851K13940N20228p3127j8449O56956L89578q80678
37176A395277j352479l54564P01845Q05245N27607K97818k17218n55257K78987
37167A527261J435014P41576j578692k514696p63262J189790J014414k00916n29858
37158C20631m04847r05478j166046j21726R95357N63451n04433l32645O55388
37149i00348O08600n50872j208893o84314K90889J069938J305619N11264r21253
$$ plain form
37140 -479370 -1789916 -1776410 -542109 146771 -296650 -516526 218239 717496 36127
37131 36127 -879099 -800038 29097 768048 1242157 1394455 818373 -220832 -533968 363732
37121 363732 1536656 2201486 2681079 3128252 2816187 1589376 601365 637381 959376
37112 959376 677576 16792 -552158 -1117443 -1518697 -1117564 -104380 388124 127453
37103 127453 168863 793780 903290 235629 140537 1091817 1529849 516627 -496010 -102066
37093 -102066 769203 680073 15255 -251159 -407337 -840982 -720196 288385 650736 -684130
37083 -684130 -2151268 -1863779 -498814 267943 650564 1677034 2644997 2272742 1292012
37074 1292012 1284898 1836582 1423440 369215 319010 1326119 1960279 1889456 1990243 2291906
$$ packed form
37140d79370j310546J3506J234301O88880m43421k19876P34765M99257o81369
37131C6127r15226P9061Q29135P38951M74109J52298n76082j039205l13136Q97700
37121C63732J172924O64830M79593M47173l12065j226811r88011L6016L21995
37112I59376k81800o60784n68950n65285m01254M01133J013184M92504k60671
37103A27453M1410O24917J09510o67661r5092R51280M38032j013222j012637L93944
37093a02066Q71269q9130o64818k66414j56178m33645J20786J008581L62351j334866
37083f84130j467138K87489J364965P66757L82621J026470R67963l72255r80730
37074A292012p114N51684m13142j054225n0205J007109O34160p0823J00787L01663
$$ plain form
37064 2291906 2109458 1839361 2379147 3161613 2992531 2376655 2672779 3382484 2799238
37055 2799238 1115658 320269 1002806 1738190 1796046 2051095 2848003 3199753 2650876
37046 2650876 2074750 2162622 2668571 3291117 3786716 3347407 1549876 -282847 -448854
37037 -448854 644048 1183927 797890 662444 1072447 1110129 673252 696963 1327361 1864433
37027 1864433 2432545 3667679 4880424 4679324 3369711 2620846 2826026 2906747 2584016
37018 2584016 2614371 2884478 2541216 1927806 2134972 2778229 2519648 1558096 1199843 1307509
37008 1307509 803647 328000 1437794 3337248 3523706 1788976 514446 801739 1365209
36999 1365209 1482723 1915591 2560136 2269264 1387287 1510647 2542514 2972227 2989430
$$ packed form
37064B291906j82448k70097N39786P82466j69082o15876K96124P09705n83246
37055B799238j683580p95389O82537P35384N7856K55049P96908L51750n48877
37046B650876n76126Q7872N05949O22546M95599m39309j797531j832723j66007
37037d48854J092902N39879l86037j35446M10003L7682m36877K3711O30398N37072
37027A864433N68112J235134J212745k01100j309613p48865K05180Q0721l22731
37018B584016L0355K70107l43262o13410K07166O43257k58581r61552l58253J07666
37008A307509n03862m75647J109794J899454J86458j734730j274530K87293N63470
36999A365209J17514M32868O44545k90872q81977J23360J031867M29713J7203
$$ plain form
36990 2989430 4053132 5602930 5809811 5318561 6321455 8258969 8741727 8344492 9780985
36981 9780985 12869345 15595546 19375232 26992349 36129724 42406349 48139442 59313153
36973 59313153 75226185 93853074 127580650 194264874 282462085 342712855 332385127
36966 332385127 262346875 183253441 131170960 103606094 84511636 69842372 61962839
36959 61962839 56795472 48852846 40174476 34945324 31303722 25690005 19971642 17603725
36951 17603725 17030981 14856152 11919929 10824222 10586911 8821846 6553297 6169095
36943 6169095 6846816 6297801 5036468 4924253 5309688 4438033 3100507 3223808 4143203
36934 4143203 3714512 2095419 1281354 1714658 2150844 2146617 2194406 2120308 1558863 1230882
$$ packed form
36990B989430J063702J549798K06881m91250J002894J937514M82758l97235J436493
36981I780985L088360K726201L779686P617117R137375O276625N733093J1173711
36973E9313153J5913032J8626889L3727576O6684224Q8197211O0250770j0327728
36966C32385127p0038252p9093434n2082481k7564866j9094458j4669264p879533
36959F1962839n167367p942626q678370n229152l641602n613717n718363k367917
36951A7603725n72744k174829k936223j095707k37311j765065k268549l84202
36943F169095O77721n49015j261333j12215L85435q71655j337526J23301R19395
36934D143203m28691j619093q14065M33304M36186m227M7789p4098n61445l27981
$$ plain form
36924 1230882 1776397 2241248 1549627 381759 -195587 -667073 -1725394 -2356942 -1388763
36915 -1388763 240075 860964 647456 788899 1221765 1246753 1282422 1859124 1954718 585848
36905 585848 -948387 -777566 466829 760634 141016 401831 1720359 2298096 1475163
36896 1475163 734506 1149893 1920993 2037178 1668877 1314983 1029662 1058887 1992493 3690603
36886 3690603 4971195 4820090 3334015 1407036 70901 -55973 602921 735645 -354785
36877 -354785 -1713786 -1894439 -697390 956681 2233844 2594607 1607538 -231096 -1153421
36868 -1153421 22642 2134926 3118190 2768357 2583806 3164462 3482036 2864030 2081431
36859 2081431 1905434 1813377 889914 -697307 -1775049 -1438246 51605 1507410 1931716
$$ packed form
36924A230882N45515M64851o91621j167868n77346m71486j058321o31548R68179
36915a388763J628838O20889k13508J41443M32866K4988L5669N76702R5594j368870
36905E85848j534235J70821J244395K93805o19618K60815J318528N77737q22933
36896A475163p40657M15387P71100J16185l68301l53894k85321K9225R33606J698110
36886C690603J280592j51105j486075j926979j336135j26874O58894J32724j090430
36877c54785j359001j80653J197049J654071J277163L60763r87069j838634r22325
36868a153421J176063K112284R83264l49833j84551N80656L17574o18006p82599
36859B081431j75997r2057r23463j587221j077742L36803J489851J455805M24306
$$ plain form
36850 1931716 1442380 860024 443161 -267205 -1189740 -1317471 -205831 1081232 1333048
36841 1333048 708808 58503 -437970 -970797 -1212128 -820842 -219392 124508 515960
36832 515960 1167046 1375457 747214 358296 1277975 2677339 2932904 1978950 983563
36823 983563 310320 -426527 -782299 53225 1411941 1769465 1247114 1521965 3011997
36814 3011997 4117616 3745261 2704266 1898358 929367 -505588 -1395767 -856710 326677
36805 326677 819488 607588 644789 1213315 1677388 1573575 1105610 640566 277816 -53036
36795 -53036 -318481 -264996 290613 939391 879823 75057 -341308 421791 1457181 1405039
36785 1405039 583525 458789 1215914 1523875 868224 373460 754136 1101711 601796
$$ packed form
36850A931716m89336n82356m16863p10366r22535j27731J111640J287063K51816
36841A333048o24240o50305m96473n32827k41331L91286O01450L43900L91452
36832E15960O51086K08411o28243l88918R19679J399364K55565r53954r95387
36823I83563o73243p36847l55772Q35524J358716L57524n22351K74851J490032
36814C011997J105619l72355j040995q05908r68991j434955q90179N39057J183387
36805C26677M92811k11900L7201N68526M64073j03813m67965m65044l62750l30852
36795e3036k65445N3485N55609O48778n9568q04766m16365P63099J035390n2142
36785A405039q21514j24736P57125L07961o55651m94764L80676L47575m99915
$$ plain form
36776 601796 6828 243159 712667 298999 -733950 -1163526 -669985 -133923 -312249
36767 -312249 -1092222 -1832187 -1763205 -441125 1472562 2322793 1205261 -751090 -1719940
36758 -1719940 -1454681 -1199876 -1544501 -1649493 -885526 -48819 -185088 -946838 -1058310
36749 -1058310 -145359 777008 738839 22455 -419686 -241575 149807 447125 771619 1153777
36739 1153777 1347611 1353035 1499013 1698212 1275146 36021 -1112204 -1284863 -804878
36730 -804878 -452824 -89059 860411 1913676 1935307 1059283 731631 1406532 1654005 439694
36720 439694 -967747 -701941 867089 1551610 403234 -1132135 -1428589 -799151 -653878
36711 -653878 -1359185 -1922693 -1547434 -612202 11358 -29259 -489501 -957931 -1026507 -451585
$$ packed form
36776F01796n94968K36331M69508m13668j032949m29576M93541N36062j78326
36767c12249p79973p39965O8982J322080J913687Q50231j117532j956351r68850
36758a719940K65259K54805l44625j04992P63967Q36707j36269p61750j11472
36749a058310R12951R22367l8169p16384m42141J78111L91382K97318L24494L82158
36739A153777J93834N424J45978J99199m23066j239125j148225j72659M79985
36730h04878L52054L63765R49470J053265K1631q76024l27652O74901K47473j214311
36720D39694j407441K65806J569030O84521j148376j535369k96454O29438J45273
36711f53878p05307n63508L75259R35232O23560m0617m60242m68430o8576N74922
$$ plain form
36701 -451585 412032 662923 -136393 -1232224 -1523371 -914684 -171630 338174 848080
36692 848080 1220611 907490 123170 -79247 635535 1363083 1562656 1930719 2788840 2904223
36682 2904223 1297494 -783295 -1352794 -507318 -9973 -432680 -577205 242872 1190375
36673 1190375 1598645 2083562 3301227 4851340 6070856 6846042 7042468 6184597 4408466
36664 4408466 2847442 2364751 2614854 2907105 3185888 3507117 3338266 2230606 704904
36655 704904 -274726 -412258 -144903 74340 106765 44444 165917 688608 1311238 1355283
36645 1355283 596644 -392140 -901122 -730763 -116100 547448 845168 680437 479437
36636 479437 588982 634299 126556 -535632 -582917 -218625 -332307 -922800 -1101886 -801664
$$ packed form
36701d51585Q63617K50891p99316j095831k91147O08687P43054N09804N09906
36692H48080L72531l13121p84320k02417P14782P27548J99573L68063Q58121J15383
36682B904223j606729k080789n69499Q45476M97345m22707j44525Q20077R47503
36673A190375M08270M84917J217665J550113J219516P75186J96426q57871j776131
36664D408466j561024m82691K50103K92251K78783L21229j68851j107660j525702
36655G04904r79630j37532K67355K19243L2425o2321J21473N22691O22630M4045
36645A355283p58639r88784n08982J70359O14663O63548K97720j64731k01000
36636D79437J09545M5317n07743o62188m7285L64292j13682n90493j79086L00222
$$ plain form
36626 -801664 -1017130 -1913135 -2180638 -1054107 352845 690024 217660 -30819 70050
36617 70050 51889 50203 486771 1089346 1286095 1156541 1098698 1008842 647070 365793 653330
36606 653330 1368048 2116076 2859406 3501075 3602239 3331155 3906646 6086013 8917864
36597 8917864 11082082 12752484 14850400 17050050 17995190 17204609 15401391 13181315
36589 13181315 10727840 8681184 7794911 7618037 6877257 5368138 4179683 3807558 3419080
36580 3419080 2487402 1863160 2413879 3543734 3945771 3231618 2068798 1134414 623387
36571 623387 560847 994272 1804260 2566312 2721269 2032713 984586 439836 616048 751516
36561 751516 213351 -510752 -580798 -130181 59276 -112054 -118440 -43683 -541414 -1432533
$$ packed form
36626h01664k15466q96005k67503J126531J406952L37179m72364k48479J00869
36617G0050j8161j686M36568O02575J96749j29554n7843q9856l61772k81277K87537
36606F53330P14718P48028P43330O41669J01164k71084N75491K179367K831851
36597H917864K164218J670402K097916K199650R45140p90581j803218k220076
36589A3181315k453475k046656q86273j76874p40780j509119j188455l72125l88478
36580C419080r31678o24242N50719J129855M02037p14153j162820r34384n11027
36571F23387o2540M33425Q09988P62052J54957o88556j048127n44750J76212J35468
36561G51516n38165p24103p0046M50617J89457j71330o386P4757m97731q91119
$$ plain form
36551 -1432533 -1569520 -521637 662584 916282 462421 91758 14729 127350 629931
36542 629931 1528027 2081349 1616059 531812 -251412 -540681 -837870 -1328866 -1667822
36533 -1667822 -1629210 -1261291 -483327 735196 1794977 1837517 879022 -99988 -448990
36524 -448990 -560139 -912283 -1126558 -701083 -179450 -574854 -1709178 -2170911 -1250231
36515 -1250231 -2215 238696 -319160 -431300 345059 1316046 1921334 2257942 2293036
36506 2293036 1648722 514314 -183607 -35162 227961 -74974 -511785 -374618 47873
36497 47873 -129112 -1077835 -2085731 -2451898 -1981111 -890141 196339 464121 -269304
36488 -269304 -1183766 -1403062 -1002263 -602594 -410999 -263550 -180893 -193256 -8142 462824
$$ packed form
36551a432533j36987J047883J184221K53698m53861l70663p7029J12621N02581
36542F29931Q98096N53322m65290j084247p83224k89269k97189m90996l38956
36533a667822L8612L67919P77964J218523J059781M2540r58495r79010l49002
36524d48990j11149l52144k14275M25475N21633l95404j134324m61733R20680
36515a250231J248016K40911n57856j12140P76359R70987O05288L36608L5094
36506B293036o44314j134408o97921J48445K63123l02935m36811J37167M22491
36497D7873j76985r48723j007896l66167M70787J090970J086480K67782p33425
36488b69304r14462k19296M00799L99669J91595J47449Q2657j2363J85114M70966
$$ plain form
36478 462824 692270 400563 307354 1078135 1990793 1791751 592097 -316815 -431639 -541450
36468 -541450 -1147363 -1642276 -1484266 -1148578 -1328820 -1903195 -2234267 -2050960 -1658792 -1534135
36458 -1534135 -1822745 -2048099 -1539192 -479961 -52219 -911493 -2080372 -2258757 -1671958
36449 -1671958 -1412976 -1416633 -645128 822634 1559742 932309 -32173 -347864 -242570 -118860
36439 -118860 272526 936160 1147541 621342 93910 66856 43573 -331273 -519918 -214356
36429 -214356 -45394 -344226 -364785 338131 938520 784552 591223 934283 767775 -929158
36419 -929158 -2945931 -3130992 -1426620 139894 296834 -304529 -766224 -1160710 -1723341
36410 -1723341 -2169417 -2338795 -2536538 -2775150 -2492798 -1457799 -294493 293237 328447
$$ packed form
36478D62824K29446k91707r3209P70781R12658j99042j199654r08912j14824j09811
36468e41450o05913m94913J58010L35688j80242n74375l31072J83307L92168J24657
36458a534135k88610k25354N08907J059231M27742q59274j168879j78385N86799
36449a671958K58982l657P71505J467762P37108o27433r64482l15691J05294J23710
36439a18860L91386O63634K11381n26199n27432k7054k3283l74846j88645L05562
36429b14356J68962k98832k0559P02916O00389j53968j93329L43060j66508j696933
36419i29158k016773j85061J704372J566514J56940o01363m61695l94486n62631
36410a723341m46076j69378j97743k38612K82352J034999J163306N87730L5210
$$ plain form
36401 328447 280598 376026 457643 291862 -139828 -560610 -665985 -534812 -519305 -635175
36391 -635175 -504804 -95810 69364 -229968 -497451 -401585 -367949 -741368 -1121428 -1210021
36381 -1210021 -1479836 -2104453 -2068074 -542433 1449370 2046561 910368 -577535 -1192804
36372 -1192804 -879975 -217891 66318 -570844 -1603798 -1462918 329459 1794195 912481
36363 912481 -1234055 -1787728 -241842 1098537 880914 422842 993108 1761547 1638865
36354 1638865 1150392 1098921 1064295 656812 696038 1605263 2078550 1043071 -332502 -429464
36344 -429464 147774 -259163 -1378126 -1445562 -205899 796245 913207 1213021 2225435
36335 2225435 2844738 2231527 1231491 1024847 1573535 2207869 2686561 2862531 2249063
$$ packed form
36401C28447m7849R5428Q1617j65781m31690m20782j05375J31173J5507j15870
36391f35175J30371M08994J65174k99332k67483R5866L3636l73419l80060q8593
36381a210021k69815o24617L6379J525641J991803N97191j136193j487903o15269
36372a192804L12829O62084K84209o37162j032954J40880J792377J464736q81714
36363I12481k146536n53673J545886J340379k17623m58072N70266P68439j22682
36354A638865m88473n1471l4626m07483L9226R09225M73287j035479j375573r6962
36344d29464N77238m06937j118963o7436J239663J002144J16962K99814J012414
36335B225435O19303o13211j000036k06644N48688O34334M78692J75970o13468
$$ plain form
36326 2249063 825451 -433002 -678402 -294287 -127165 -158697 197797 843900 976045
36317 976045 302231 -457148 -463414 302020 1170441 1550598 1355252 816003 137215 -522658
36307 -522658 -849882 -533231 192093 532125 74886 -544386 -449245 258476 772973 877831
36297 877831 1031399 1145089 415793 -1197172 -2414135 -2322484 -1731777 -1864808 -2410965
36288 -2410965 -2096681 -767320 460031 1035564 1565808 2299336 2410436 1507700 719261
36279 719261 1220670 2412182 2724850 1862494 1052486 1109008 1393150 1013789 122198 -541299
36269 -541299 -726753 -669720 -457145 -74701 150073 -175245 -814809 -1066207 -706416 -277462
36259 -277462 -254620 -389188 -182559 350110 803398 1030463 1156947 1013373 169832 -1197888
$$ packed form
36326B249063j423612j258453k45400L84115J67122l1532L56494O46103J32145
36317I76045o73814p59379o266P65434Q68421L80157j95346n39249o78788o59873
36307e22658l27224L16651P25324L40032m57239o19272R5141P07721N14497J04858
36297H77831J53568J13690p29296j612965j216963R1651N90707j33031n46157
36288b410965L14284J329361J227351N75533N30244P33528J11100r02736p88439
36279G19261N01409J191512L12668q62356q10008N6522K84142l79361q91591o63497
36269e41299j85454N7033K12575L82444K24774l25318o39564k51398L59791M28954
36259b77462K2842j34568K06629N32669M53288K27065J26484j43574q43541j367720
$$ plain form
36249 -1197888 -1988436 -1297878 313946 1317899 1081364 620747 1109542 2168401 2369441
36240 2369441 1274925 135509 280959 1437961 2149754 1535408 117608 -964259 -1097415
36231 -1097415 -535286 40710 167391 -40379 -134110 25994 42412 -437778 -1133370 -1449001
36221 -1449001 -1246929 -904479 -659175 -354509 89115 418414 495352 617820 1042428 1437857
36211 1437857 1237202 467668 -171186 -146165 313442 654404 777915 1018061 1413754 1474837
36201 1474837 916156 258420 238428 787269 1134679 923373 627895 709765 968091 1055264
36191 1055264 1055116 1081633 852000 280164 15583 605542 1448522 1451696 560603 -239653
36181 -239653 -339377 21460 644058 1616589 2465325 2225934 885583 -236797 -187337 434781
$$ packed form
36249a197888p90548O90558J611824J003953k36535m60617M88795J058859K01040
36240B369441j094516j139416J45450J157002P11793o14346j417800j081867j33156
36231a097415N62129N75996J26681k07770r3731J60104J6418m80190o95592l15631
36221a449001K02072L42450K45304L04666M43624L29299P6938J22468M24608L95429
36211A437857k00655p69534o38854K5021M59607L40962J23511K40146L95693O1083
36201A474837n58681o57736j9992N48841L47410k11306k95478Q1870K58326Q7173
36191A055264j48K6517k29633n71836k64581N89959Q42980L174q91093q00256
36181b39653r9724L60837O22598R72531Q48736k39391j340351j122380M9460O22118
$$ plain form
36171 434781 694907 826325 1532181 2458449 2515211 1442965 90843 -709497 -744339 -103938
36161 -103938 901220 1641867 1738408 1576281 1575353 1297868 202017 -1051312 -1248828 -502608
36151 -502608 -174076 -736322 -1044286 -232176 888429 1100595 492979 37944 173104
36142 173104 620638 1048313 1177711 776605 211367 369588 1278722 1523507 49921
36133 49921 -2048262 -2740143 -1671935 -319203 230336 263705 213309 -85069 -517482 -381005
36123 -381005 429189 980165 697324 242326 329975 653057 805548 1282146 2433866 3227065
36113 3227065 2422473 575272 -516243 -219517 363242 240344 -338625 -797987 -1043582
36104 -1043582 -958367 -226594 800145 1092380 422843 -130413 103032 184159 -889326
$$ packed form
36171D34781K60126J31418P05856R26268N6762j072246j352122q00340l4842O40401
36161a03938J005158P40647R6541j62127r28k77485j095851j253329j97516P46220
36151e02608L28532n62246l07964Q12110J120605K12166o07616m55035J35160
36142A73104M47534M27675J29398m01106n65238J58221R09134K44785j473586
36133D9921k098183o91881J068208J352732N49539L3369n0396k98378m32413J36477
36123c81005Q10194N50976k82841m54998Q7649L23082J52491M76598J151720P93199
36113C227065q04592j847201j091515K96726N82759j22898n78969m59362k45595
36104a043582Q5215P31773J026739K92235o69537n53256K33445Q1127j073485
$$ plain form
36095 -889326 -2283681 -2310529 -863462 494738 777666 604970 792728 1088395 833456
36086 833456 86850 -492740 -458307 90945 668800 734757 206863 -325324 -297603 20488
36076 20488 -4453 -213783 187329 1226011 1845271 1357763 413533 42015 399193 949688
36066 949688 1293608 1344923 1242126 1469454 2438727 3592024 3706618 2548691 1316835
36057 1316835 855140 503522 -392645 -993382 -334604 742735 698174 -246691 -532223
36048 -532223 137697 494535 46501 -186066 313537 601894 48738 -517946 -332617 21369
36038 21369 -168081 -456322 -235526 65505 -115091 -322936 16399 399719 101372 -545703
36028 -545703 -879025 -1139553 -1733074 -2031420 -1339288 -417697 -485491 -1185924 -1205749 -580567
$$ packed form
36095h89326j394355k6848J447067J358200K82928j72696J87758K95667k54939
36086H33456p46606n79590L4433N49252N77855O5957n27894n32187K7721L18091
36076B0488k4941k09330M01112J038682O19260m87508r44230l71518L57178N50495
36066I49688L43920N1315j02797K27328R69273J153297J14594j157927j231856
36057A316835m61695l51618q96167o00737O58778J077339m4561r44865k85532
36048e32223O69920L56838m48034k32567M99603K88357n53156n66684J85329L53986
36038B1369j89450k88241K20796L01031j80596k07845L39335L83320k98347o47075
36028e45703l33322k60528n93521k98346O92132R21591o7794p00433j9825O25182
$$ plain form
36018 -580567 -570012 -1309624 -1479153 -582904 236453 178151 -87773 44330 31056 -457490
36008 -457490 -494082 665208 2177389 2752473 2328245 1604240 740503 -418002 -1504579
35999 -1504579 -2041493 -2139113 -1956877 -1172336 116011 769077 23707 -1148697 -1308243
35990 -1308243 -576218 -124917 -210095 -179706 -39970 -387821 -919245 -660875 202274 352668
35980 352668 -499375 -1063334 -585134 10955 -167593 -539770 -275688 237411 236064 -92316
35970 -92316 -231833 -436296 -1027272 -1310392 -482055 856283 1377344 960516 724836 1239357
35960 1239357 1868726 1965577 1656185 1242234 720337 155835 -174372 -203158 -61906 325494
35950 325494 937471 1068746 28448 -1519971 -2030436 -1191853 -445196 -844047 -1527211
$$ packed form
36018e80567J0555p39612j69529Q96249Q19357n8302k65924J32103j3274m88546
36008d57490l6592J159290J512181N75084m24228p24005q63737j158505j086577
35999a504579n36914r7620J82236P84541J288347O53066p45370j172404j59546
35990a308243P32025M51301q5178L0389J39736l47851n31424K58370Q63149J50394
35980C52668q52043n63959M78200N96089j78548l72177K64082N13099j347l28380
35970i2316j39517k04463n90976k83120Q28337J338338N21061m16828k35680N14521
35960A239357O29369R6851l09392m13951n21897n64502l30207k8786J41252L87400
35950C25494O11977J31275j040298j548419n10465Q38583P46657l98851o83164
$$ plain form
35941 -1527211 -1212656 -273981 -114102 -974377 -1634386 -1225190 -263459 317764 352635 333408
35931 333408 622906 1035420 962775 -36540 -1464346 -1946866 -669674 1378395 2309121
35922 2309121 1503336 146477 -480717 -370150 -128190 118734 455130 500214 -75873
35913 -75873 -703482 -522243 229935 335800 -696770 -1823402 -1794857 -769971 -34823
35904 -34823 -355783 -1177792 -1495025 -1066676 -510636 -417498 -716622 -923767 -697961 5375
35894 5375 1035648 1966618 2141028 1318687 245563 -17472 531392 762126 6740 -957048
35884 -957048 -1056640 -425586 48272 203788 603474 1232372 1344285 793436 464462 906321
35874 906321 1410088 1104523 322236 92889 616884 989244 401492 -883289 -1803649
$$ packed form
35941a527211L14555R38675J59879q60275o60009M09196R61731N81223L4871j9227
35931C33408K89498M12514p2645r99315j427806m82520J277192K048069R30726
35922B309121q05785j356859o27194J10567K41960K46924L36396M5084n76087
35913g5873o27609J81239P52178J05865j032570j126632K8545J024886P35148
35904c4823l20960q22009l17233M28349N56040R3138k99124k07145K25806P03336
35894E375J030273R30970J74410q22341j073124k63035N48864K30734p55386r63788
35884i57048r9592O31054M73858J55516L99686O28898J11913n50849l28974M41859
35874I06321N03767l05565p82287k29347N23995L72360n87752j284781r20360
$$ plain form
35865 -1803649 -1501822 -100738 1381112 2009298 1859912 1724622 1945711 2045478 1605477
35856 1605477 896349 347321 -25874 -286863 -247104 53292 53472 -585432 -1360486 -1565346
35846 -1565346 -1151343 -495632 188032 683395 589412 -40037 -418740 -101793 234350 -124414
35836 -124414 -716671 -766229 -598641 -926250 -1231319 -401707 1201404 1913852 1143728 81686
35826 81686 -251182 -206225 -298602 -212488 280526 594030 290130 -174619 -301704 -238714
35816 -238714 -97174 391377 993214 877102 38877 -386147 19601 124871 -730927 -1289541
35806 -1289541 -332495 1129212 1308036 380434 -38005 458756 837133 731980 875298
35797 875298 1385466 1408101 750747 295599 386408 266487 -376872 -701844 -211621 295877
$$ packed form
35865a803649L01827J401084J481850O28186j49386j35290K21089R9767m40001
35856A605477p09128n49028l73195k60989L9759L00396J80o38904p75054k04860
35846a565346M14003O55711O83664M95363r3983o29449l78703L16947L36143l58764
35836a24414n92257m9558J67588l27609l05069Q29612J603111P12448p70124j062042
35826H1686l32868M4957r2377Q6114M93014L13504l03900m64749j27085O2990
35816b38714J41540M88551O01837j16112q38225m25024M05748J05270q55798n58614
35806a289541R57046J461707J78824r27602m18439M96761L78377j05153J43318
35797H75298N10168K2635o57354m55148R0809j19921o43359l24972M90223N07498
$$ plain form
35787 295877 100716 -207860 146750 640025 223493 -896621 -1415165 -812607 -127591
35778 -127591 -546633 -1837466 -2701072 -2480928 -1931769 -2024726 -2472781 -2173031 -987031
35769 -987031 -90268 -233774 -682766 -562631 -259227 -422808 -439913 652631 2209846
35760 2209846 2540696 1367496 202658 75788 322904 77203 -321926 -73788 878237
35751 878237 1999205 2804563 2926551 2231184 1197836 531809 247304 -113808 -364454
35742 -364454 150920 1130508 1326887 388997 -527268 -532374 -191027 -268530 -467458 -261113
35732 -261113 69231 165967 410858 1009916 1142821 156614 -1080566 -1188867 -175347
35723 -175347 750040 915102 753499 849348 1246829 1563385 1210349 -165075 -1909197
$$ packed form
35787B95877j95161l08576L54610M93275m16532j120114n18544O02558O85016
35778a27591m19042j290833q63606K20144N49159r2957m48055K99750J186000
35769i87031Q96763j43506m48992J20135L03404j63581j7105J092544J557215
35760B209846L30850j173200j164838j26870K47116k45701l99129K48138R52025
35751H78237J120968Q05358J21988o95367j033348o66027k84505l61112k50646
35742c64454N15374R79588J96379r37890r16265n106L41347p7503j98928K06345
35732b61113L30344R6736K44891N99058J32905r86207j237180j08301J013520
35723a75347R25387J65062j61603R5849L97481L16556l53036j375424j744122
$$ plain form
35714 -1909197 -2542406 -1419048 241618 720177 -194404 -1251923 -1392656 -640860 300109
35705 300109 675067 196453 -543901 -568568 183625 667873 293219 -164381 135419 790977
35695 790977 1024116 965597 1035035 873053 110652 -501631 -57031 968879 1469498 1486118
35685 1486118 1822092 2312909 2046316 1121225 636063 884750 965741 316194 -609541 -1277863
35675 -1277863 -1504446 -951725 500128 1808137 1568605 23799 -1013704 -569891 384911
35666 384911 641396 361189 370364 780924 985483 492618 -591620 -1521779 -1379489 -111354
35656 -111354 1150167 1497549 1534283 2285189 3350079 3450386 2417062 1163301 23368
35647 23368 -1206052 -1854927 -1005761 459167 550899 -800084 -1540168 -752275 141832
$$ packed form
35714a909197o33209J123358J660666M78559r14581j057519j40733P51796R40969
35705C00109L74958m78614p40354k4667P52193M84248l74654m57600K99800O55558
35695G90977K33139n8519O9438j61982p62401o12283M44600J025910N00619J6620
35685A486118L35974M90817k66593r25091m85162K48687Q0991o49547r25735o68322
35675a277863k26583N52721J451853J308009k39532j544806j037503M43813R54802
35666C84911K56485k80207R175M10560K04559m92865j084238r30159J42290J268135
35656a11354J261521L47382L6734P50906J064890J00307j033324j253761j139933
35647B3368j229420o48875Q49166J464928R1732j350983p40084P87893Q94107
$$ plain form
35638 141832 135140 211198 1065342 1556054 892657 259078 567584 554966 -940933 -2559935
35628 -2559935 -2444310 -1235439 -787882 -1099894 -878696 -207851 -217460 -738693 -662938 -208981
35618 -208981 -520132 -1293437 -1138647 -200089 -82379 -1015554 -1374836 -424788 597846
35609 597846 718586 555465 725073 805942 724478 1367027 2758352 3277224 1982479 369652
35599 369652 359392 1523795 1830515 586141 -806257 -927543 -34821 582803 280364
35590 280364 -306517 -218734 450805 530705 -628623 -2028513 -2163591 -921875 513092
35581 513092 1364831 1822511 2075699 2006415 1877948 2108598 2246300 1460071 234227 107251
35571 107251 1301202 2138698 1526191 542291 583840 1266396 1365843 758209 140763 -308635
$$ packed form
35638A41832o692P6058Q54144M90712o63397o33579L08506j2618j495899j619002
35628b559935J15625J208871M47557l12012K21198O70845r609n21233P5755M53957
35618b08981l11151p73305J54790R38558J17710r33175l59282R50048J022634
35609E97846J20740j63121J69608Q0869q1464O42549J391325N18872j294745j612827
35599C69652j0260J164403L06720j244374j392398j21286Q92722O17624l02439
35590B80364n86881Q7783O69539P9900j159328j399890j35078J241716J434967
35581E13092Q51739M57680K53188o9284j28467K30650J37702p86229j225844j26976
35571A07251J193951Q37496o12507r83900M1549O82556R9447o07634o17446m49398
$$ plain form
35561 -308635 -728752 -789186 -383604 -430214 -1618624 -2877881 -2502220 -487697 1583286
35552 1583286 2720336 3202094 3232055 2445239 990437 -219665 -758806 -1117266 -1502156
35543 -1502156 -1277627 -166512 897712 839247 -223085 -1312505 -1810133 -1789814 -1504316
35534 -1504316 -1089906 -648987 -281658 -87739 -200985 -591957 -843560 -525959 147539
35525 147539 513638 401523 294611 340329 -91759 -1349306 -2589912 -2694804 -1789892
35516 -1789892 -1071767 -1204679 -1668225 -1806817 -1747055 -1866730 -1956784 -1542830 -751840 -221139
35506 -221139 -212653 -395570 -542188 -814294 -1133742 -912265 66637 962388 803213 -92009
35496 -92009 -401047 428616 1443530 1494969 613586 -382175 -1081016 -1610700 -1903617 -1628535
$$ packed form
35561c08635m20117o0434M05582m6610j188410j259257L75661K014523K070983
35552A583286J137050M81758K9961p86816j454802j210102n39141l58460l84890
35543a502156K24529J111115J064224n8465j062332j089420m97628K0319K85498
35534a504316M14410M40919L67329J93919j13246l90972k51603L17601O73498
35525A47539L66099j12115j06912M5718m32088j257547j240606j04892R04912
35516a789892P18125j32912m63546j38592N9762j19675r0054M13954P90990N30701
35506b21139Q486j82917j46618k72106l19448K21477R78902Q95751j59175q95222
35496i2009l09038Q29663J014914N1439q81383r95761o98841n29684k92917K75082
$$ plain form
35486 -1628535 -911851 -487935 -839194 -1547118 -1801753 -1365134 -738456 -435272 -395837 -270023
35476 -270023 -59724 -105652 -403003 -391725 226964 839831 677318 26943 -64446 653808
35466 653808 1210416 851702 96495 -213726 -215433 -571049 -1197474 -1387722 -1017662 -717809
35456 -717809 -790388 -751261 -157270 734733 1374599 1486987 1027279 49132 -1100119 -1802828
35446 -1802828 -1688244 -977507 -210514 218022 288979 368620 908771 1853842 2498755 2298960
35436 2298960 1589740 996817 434586 -532192 -1535928 -1667089 -971770 -545881 -766297
35427 -766297 -599803 631115 1882103 1810684 742309 26745 3123 -99740 -536816
35418 -536816 -659347 -162096 476017 929609 1295587 1263454 235757 -1314831 -1817013
$$ packed form
35486a628535P16684M23916l51259p07924k54635M36619O26678L03184L9435J25814
35476b70023K10299m5928k97351J1278O18689O12867j62513o50375r1389P18254
35466F53808N56608l58714p55207l10221j707l55616o26425j90248L70060K99853
35456g17809p2579L9127N93991Q92003O39866J12388m59708r78147j149251p02709
35446a802828J14584P10737P66993M28536P0957P9641N40151R45071O44913j99795
35436B298960p09220n92923n62231r66778j003736j31161O95319M25889k20416
35427g66297J66494J230918J250988p1419j068375p15564k3622j02863m37076
35418e36816j22531M97251O38113M53592L65978l2133j027697j550588n02182
$$ plain form
35409 -1817013 -656685 718743 622288 -715885 -1740320 -1669301 -937130 7191 1110349
35400 1110349 1974042 1848246 681455 -615527 -1288240 -1499198 -1663137 -1625834 -984628
35391 -984628 130674 1057802 1244124 627515 -430646 -1304576 -1348623 -352921 1156923
35382 1156923 2254213 2371015 1716177 920129 319857 -292004 -1167607 -2030460 -2251238
35373 -2251238 -1569736 -382724 689047 1213832 943580 -105219 -1374743 -2063947 -2017521
35364 -2017521 -1864684 -1952725 -1744510 -828826 85105 43833 -653548 -784215 121988 1313671
35354 1313671 1917428 1619717 379569 -1472846 -2814584 -2572580 -1267429 -620243 -1243057
35345 -1243057 -1832430 -1171375 222567 1183696 1519660 1560974 1057458 -230842 -1477781
$$ packed form
35409a817013J160328J375428r6455j338173j024435P1019P32171R44321J103158
35400A110349Q63693j25796j166791j296982o72713k10958j63939L7303O41206
35391i84628J115302R27128J86322o16609j058161q73930m4047R95702J509844
35382A156923J097290J16802o54838p96048o00272o11861q75603q62853k20778
35373b251238O81502J187012J071771N24785k70252j048799j269524o89204M6426
35364b017521J52837q8041K08215R15684R13931m1272o97381j30667R06203J191683
35354A313671O03757k97711j240148j852415j341738K42004J305151O47186o22814
35345a243057n89373O61055J393942R61129L35964M1314n03516j288300j246939
$$ plain form
35336 -1477781 -1628200 -983287 -782853 -1365633 -1829771 -1489199 -650230 172746 911011
35327 911011 1550570 1780196 1380601 615360 46791 94535 681751 1209078 1185385 986818
35317 986818 1418310 2323366 2500698 1510467 579581 865856 1753358 1951462 1408302 828677
35307 828677 121967 -1060236 -1881071 -1274762 -14956 114754 -878400 -1239154 -422678
35298 -422678 130928 -359723 -735582 -75277 812842 1080844 1167512 1298747 537365 -1227534
35288 -1227534 -2120947 -906615 735771 585368 -694647 -757355 662303 1599084 1101161
35279 1101161 231811 -239051 -866485 -1745396 -1729461 -364132 965221 910977 77126
35270 77126 -36308 745543 1182321 441731 -844313 -1403301 -763381 288668 644959
$$ packed form
35336a477781j50419O44913K00434n82780m64138L40572Q38969Q22976P38265
35327I11011O39559K29626l99595p65241n68569M7744N87216N27327k3693j98567
35317I86818M31492R05056J77332r90231r30886K86275Q87502J98104n43160n79625
35307H28677p06710j182203q20835O06309J259806J29710r93154l60754Q16476
35298d22678N53606m90651l75859O60305Q88119K68002Q6668J31235p61382j764899
35288a227534q93413J214332J642386j50403j280015o2708J419658R36781m97923
35279A101161q69350m70862o27434q78911J5935J365329J329353n4244q33851
35270G7126j13434P81851M36778p40590j286044n58988O39920J052049L56291
$$ plain form
35261 644959 173672 -202704 180591 845715 995077 693605 574232 753600 805330 585936
35251 585936 374388 364675 620320 1227922 1869226 1713016 554958 -440639 -157517 782701
35241 782701 945027 269580 -117447 -20373 -377705 -1237980 -1347620 -328306 378296 -376711
35231 -376711 -1744649 -2274057 -1874933 -1355332 -982748 -629239 -578660 -1056033 -1496427 -1285660
35221 -1285660 -754937 -530437 -416267 82457 585898 301807 -580242 -1028757 -643492
35212 -643492 -45276 203282 169315 -44588 -603128 -1385292 -1809433 -1536393 -873455 -230398
35202 -230398 400931 1150762 1791639 1897257 1391568 728099 461417 651507 781735 416792
35192 416792 -150657 -245255 210578 554320 365054 6678 -126393 -261093 -572348 -453087
$$ packed form
35261F44959m71287l76376L83295O65124J49362l01472j19373J79368N1730k19394
35251E85936k11548r713K55645O07602O41304j56210j158058r95597K83122R40218
35241G82701J62326o75447l87027R7074l57332q60275j09640J019314P06602p55007
35231c76711j367938n29408L99124N19601L72584L53509N0579m77373m40394K10767
35221a285660N30723K24500J14170M98724N03441k84091q82049m48515L85265
35212f43492N98216K48558l3967k13903n58540p82164m24141K73040O62938O43057
35202b30398O31329P49831O40877J05618n05689o63469k66682J90090J30228l64943
35192D16792n67449r4598M55833L43742j89266l58376j33071j34700l11255J19261
$$ plain form
35182 -453087 671032 2115644 2516704 1648307 755272 849722 1488231 1665064 1258559
35173 1258559 972330 1205055 1612149 1703692 1383714 857526 387175 244279 569139 1041784
35163 1041784 916203 -262371 -1977090 -3082752 -2939211 -1962144 -951780 -255041 112744
35154 112744 -45819 -836027 -1636867 -1535308 -580220 82551 -316539 -1133641 -1205220 -319565
35144 -319565 715188 1099038 595236 -592788 -1834092 -2183940 -1256842 1213 137556
35135 137556 -1018394 -2012471 -1524151 46040 1167391 984711 36733 -633670 -561126
35126 -561126 -29556 399253 350108 -102063 -439271 -152367 630076 1131006 778746 -53717
35116 -53717 -461900 -107700 441226 502907 45195 -465191 -624582 -321130 257444 630119
$$ packed form
35182d53087J124119J444612M01060q68397q93035R4450O38509J76833m06505
35173A258559k86229K32725M07094R1543l19978n26188m70351j42896L24860M72645
35163A041784j25581j178574j714719j105662J43541R77067J010364O96739L67785
35154A12744j58563p90208q00840J01559R55088O62771l99090q17102p1579Q85655
35144c19565J034753L83850n03802j188024j241304l49848R27098J258055J36343
35135A37556j155950r94077M88320J570191J121351j82680r47978o70403P2544
35126e61126N31570M28809m9145m52171l37208K86904P82443N00930l52260q32463
35116e3717m08183L54200N48926O1681m57712n10386j59391L03452N78574L72675
$$ plain form
35106 630119 387772 -214644 -439879 -109037 89325 -232325 -346143 460337 1489122
35097 1489122 1442061 377815 -310289 90427 762724 781925 314917 -41737 -166478 -85678
35087 -85678 453170 1441860 2254201 2376506 1956702 1229909 103700 -1192773 -1831395
35078 -1831395 -1446819 -813526 -746451 -961606 -811099 -515578 -703826 -1180749 -1166298 -519922
35068 -519922 169288 525435 596875 327393 -335367 -933224 -922273 -540872 -500100 -864162
35058 -864162 -952878 -312448 864579 2171629 3183364 3403867 2761630 1998134 1810387
35049 1810387 1818465 1240180 344280 143191 705133 973189 454084 -70061 104906 592676
35039 592676 768344 719319 766432 809779 728778 737066 764179 160028 -1323247 -2809454
$$ packed form
35106F30119k42347o02416k25235L30842J98362l21650j13818Q06480J028785
35097A489122m7061j064246o88104M00716O72297J9201m67008l56654j24741Q0800
35087h5678N38848R88690Q12341J22305m19804p26793j126209j296473o38622
35078a831395L84576O33293O7075k15155J50507K95521j88248m76923J4451O46376
35068e19922O89210L56147P1440k69482o62760n97857J0951L81401M0772l64062
35058h64162q8716O40430J177027J307050J011735K20503o42237p63496j87747
35049A810387Q078n78285q95900k01089N61942K68056n19105n24145J74967M87770
35039E92676J75668m9025M7113M3347q1001Q288K7113o04151j483275j486207
$$ plain form
35029 -2809454 -3235438 -2595342 -1669937 -953064 -475257 -297729 -446682 -546659 -181722 432647
35019 432647 665474 336706 -74387 -106027 147468 225692 -169262 -818237 -1048423 -295784
35009 -295784 1225723 2546797 2796529 1949227 692214 -213149 -356044 213238 1033266
35000 1033266 1522834 1383994 661731 -519676 -1981721 -3252154 -3715567 -3213368 -2255450
34991 -2255450 -1494531 -1174066 -1110178 -944815 -411302 338376 696340 260208 -519353 -805441
34981 -805441 -429762 65427 359536 585598 596142 -76456 -1205844 -1724050 -1147848 -386905
34971 -386905 -450274 -999902 -987599 -240739 451191 554176 285942 16800 -136069 -146041
34961 -146041 -35252 50297 87244 275877 524474 240534 -788496 -1716538 -1610891 -809018
$$ packed form
35029b809454m25984O40096R25405P16873M77807J77528j48953r9977L64937O14369
35019D32647K32827l28768m11093l1640K53495P8224l94954o48975k30186P52639
35009b95784J521507J321074K49732q47302j257013r05363j42895N69282Q20028
35000A033266M89568j38840p22263j181407j462045j270433m63413N02199R57918
34991b255450P60919L20465O3888J65363N33513P49678L57964m36132p79561k86088
34981h05441L75679M95189K94109K26062J0544o72598j129388n18206N76202P60943
34971c86905o3369n49628J2303P46860O91930J02985k68234k69142j52869r972
34961a46041J10789Q5549L6947J88633K48597k83940j029030r28042J05647Q01873
$$ plain form
34951 -809018 -413898 -596290 -428488 492616 1311363 1217427 596874 253296 155566 -234264
34941 -234264 -752837 -545856 641532 1862134 2007374 1119638 268743 185864 399694
34932 399694 -68095 -1380748 -2634696 -2931619 -2325889 -1539849 -1068895 -865246 -685921
34923 -685921 -394634 22779 484908 870543 1156942 1368983 1318258 705021 -310051 -1001558
34913 -1001558 -908992 -447014 -245167 -216146 97943 506054 336840 -338270 -536995 200374
34903 200374 941116 567818 -589539 -1118415 -453811 311616 -124250 -1512964 -2333840
34894 -2333840 -1735137 -572575 -223633 -852103 -1428800 -1225683 -527796 160260 741654
34885 741654 1015346 422221 -955814 -1810622 -1028886 626987 1301390 410265 -835364
$$ packed form
34951h09018L95120j82392J67802R21104Q18747r3936o20553l43578r7730l89830
34941b34264n18573K06981J187388J220602J45240q87736q50895q2879K13830
34932C99694m67789j312653j253948k96923O05730P86040M70954K03649J79325
34923f85921K91287M17413M62129L85635K86399K12041n0725o13237j015072o91507
34913a001558R2566M61978K01847K9021L14089M08111j69214o75110j98725P37369
34903B00374P40742l73298j157357n28876O64604P65427m35866j388714q20876
34894b333840N98703J162562L48942o28470n76697K03117O97887O88056N81394
34885G41654K73692n93125j378035q54808P81736J655873O74403q91125j245629
$$ plain form
34876 -835364 -1350022 -1459286 -1817948 -2099964 -1609002 -554768 173350 212941 -23747 -114962
34866 -114962 29432 473574 1221509 1825578 1613624 498549 -813152 -1550095 -1515527
34857 -1515527 -968632 -261434 272632 429228 349099 369585 485255 238872 -604031 -1539362
34847 -1539362 -1858301 -1567698 -1345386 -1528088 -1572942 -823470 427282 1079406 520264
34838 520264 -545862 -853510 -52999 926414 1096399 631193 483920 961164 1281479
34829 1281479 756656 -126369 -317842 398197 1258677 1696876 1949667 2302470 2412260
34820 2412260 1848372 837753 -59181 -679521 -1136064 -1303048 -1095901 -1030496 -1686231
34811 -1686231 -2632657 -2742543 -1759042 -734790 -558549 -810010 -600718 115457 734061
$$ packed form
34876h35364n14658j09264l58662k82016M90962J054234P28118L9591k36688r1215
34866a14962J44394M44142P47935O04069k11954j115075j311701p36943L4568
34857a515527N46895P07198N34066J56596q0129K0486J15670k46383q42903r35331
34847a539362l18939K90603K22312j82702m4854P49472J250752O52124n59142
34838E20264j066126l07648Q00511R79413J69985m65206j47273M77244L20315
34829A281479n24823q83025j91473P16039Q60480M38199K52791L52803J09790
34820B412260n63888j010619q96934o20340m56543j66984K07147O5405o55735
34811a686231r46426j09886R83501J024252J76241k51461K09292P16175O18604
$$ plain form
34802 734061 966571 876648 392443 -367646 -615298 238369 1317388 992394 -903494
34793 -903494 -2604284 -2632508 -1536190 -702108 -352693 143688 570603 -21596 -1475771
34784 -1475771 -2290296 -1789122 -1255437 -1917362 -2814919 -2090543 100470 1591712 1201656
34775 1201656 184146 133198 808502 1024534 653776 454194 493946 116838 -672121 -1027866
34765 -1027866 -629579 -215123 -448825 -1041224 -1337503 -1171388 -797419 -413531 -22200
34756 -22200 474951 1061943 1280095 454501 -1246624 -2429355 -2005934 -778184 -429956
34747 -429956 -1156506 -1581327 -1021529 -360392 -338212 -457451 -213673 -42291 -233562 -185591
34737 -185591 316453 305214 -759397 -1719842 -1382188 -482311 -508351 -1298482 -1407037 -423848
$$ packed form
34802G34061K32510q9923m84205p60089k47652Q53667J079019l24994j895888
34793i03494j700790k8224J096318Q34082L49415M96381M26915n92199j454175
34784a475771q14525N01174N33685o61925q97557P24376K191013J491242l90056
34775A201656j017510n0948O75304K16032l70758j99582L9752l77108p88959l55745
34765a027866L98287M14456k33702n92399k96279J66115L73969L83888L91331
34756b2200M97151N86992K18152q25594j701125j182731M23421J227750L48228
34747d29956p26550m24821N59798O61137K2180j19239K43778J71382j91271M7971
34737a85591N02044j1239j064611r60445L37654Q99877k6040p90131j08555R83189
$$ plain form
34727 -423848 633762 1047449 1075829 953042 529130 3763 -100765 182231 318092 176983
34717 176983 41133 -111600 -418288 -481577 78359 683577 485705 -281620 -776402 -1024234
34707 -1024234 -1571687 -1956398 -1119753 664672 1878110 1943857 1782096 1939179 1765741
34698 1765741 894254 7897 -411249 -685310 -784350 -57476 1276935 1914860 1499725
34689 1499725 1328408 2099411 2500281 1257875 -728821 -1670916 -1279285 -584309 -246312
34680 -246312 -251468 -505829 -652074 -100638 808051 705963 -682725 -1559030 -567434 935944
34670 935944 880545 -297397 -505311 600422 1306307 771806 121515 357752 1019355
34661 1019355 1360253 1349270 1074790 472185 -26046 187038 696564 488533 -252444 -225725
$$ packed form
34727d23848J057610M13687K8380j22787m23912n25367j04528K82996J35861j41109
34717A76983j35850j52733l06688o3289N59936O05218j97872p67325m94782k47832
34707a024234n47453l84711Q36645J784425J213438O5747j61761J57083j73438
34698A765741q71487q86357m19146k74061r9040P26874J334411O37925m15135
34689A499725j71317P71003M00870j242406j986696r42095L91631O94976L37997
34680b46312n156k54361j46245N51436R08689j02088j388688q76305R91596J503378
34670I35944n5399j177942k07914J105733P05885n34501o50291K36237O61603
34661A019355L40898j0983k74480o02605m98231K13084N09526k08031p40977K6719
$$ plain form
34651 -225725 807621 1526474 1288370 1242200 2292338 3408724 3189673 2008302 1285806
34642 1285806 1400306 1608973 1525204 1417959 1302748 863514 226629 -118673 -198449 -547920
34632 -547920 -1218156 -1486081 -810826 378303 1117183 909347 145130 -364284 -202083
34623 -202083 277339 387172 -165402 -1134541 -2149528 -2896476 -2976740 -2163751 -964253
34614 -964253 -371627 -721406 -1209095 -917090 13584 616965 251060 -830740 -1831389
34605 -1831389 -2014706 -1183409 96404 887565 779386 275139 109560 426356 880679
34596 880679 1264479 1622658 1888005 1807582 1259492 419458 -376025 -818684 -819558 -654778
34586 -654778 -727093 -1004781 -946071 -240945 630078 941510 634447 263638 152641 70150
$$ packed form
34651b25725J033346P18853k38104m6170J050138J116386k19051j181371p22496
34642A285806J14500K08667q3769j07245j15211m39234o36885l45302p9776l49471
34632e47920o70236k67925O75255J189129P38880k07836p64217n09414J62201
34623b02083M79422J09833n52574r69139j014987p46948q0264Q12989J199498
34614i64253N92626l49779m87689K92005R30674O03381l65905j081800j000649
34605a831389j83317Q31297J279813P91161j08179n04247j65579L16796M54323
34596H80679L83800L58179K65347q0423n48090q40034p95483m42659q74J64780
34586f54778p2315k77688N8710P05126Q71023L11432l07063l70809j10997q2491
$$ plain form
34576 70150 -245760 -675965 -926057 -800089 -211479 703636 1404413 1321263 614362 128904
34566 128904 306383 576765 264478 -319477 -355316 143558 285540 -333213 -1032996 -1153349
34556 -1153349 -1020046 -1237975 -1580182 -1341060 -500661 256746 611364 935310 1443031
34547 1443031 1699620 1270450 377955 -406315 -810468 -973115 -1163520 -1552510 -2039673
34538 -2039673 -2245234 -1932009 -1418946 -1215567 -1268483 -1030584 -306595 484640 964083 1147472
34528 1147472 1029790 452199 -360774 -727978 -323162 409220 917557 1145267 1267709
34519 1267709 1388327 1697037 2287873 2617544 1929019 497288 -451602 -463109 -461429 -1050948
34509 -1050948 -1379529 -652323 289771 181811 -661699 -941618 -419489 63493 259915
$$ packed form
34576G0150l15910m30205k50092J25968N88610R15115P00777q3150p06901m85458
34566A28904J77479K70382l12287n83955l5839M98874J41982o18753o99783j20353
34556a153349J33303k17929l42207K39122Q40399P57407L54618L23946N07721
34547A443031K56589m29170q92495p84270m04153j62647j90405l88990m87163
34538b039673k05561L13225N13063K03379n2916K37899P23989P91235M79443J83389
34528A147472j17682n77591q12973l67204M04816P32382N08337K27710J22442
34519A267709J20618L08710N90836L29671o88525j431731r48890j1507J680n89519
34509a050948l28581P27206R42094j07960q43510k79919N22129M82982J96422
$$ plain form
34500 259915 742584 1556975 2012890 1892899 1669028 1427820 733013 -295672 -879359
34491 -879359 -804400 -781075 -1316176 -2049300 -2406950 -2203811 -1536220 -759492 -462232 -739174
34481 -739174 -788040 -100524 435875 -177987 -1188229 -1102007 -231070 -288790 -1423300 -1778319
34471 -1778319 -499080 910935 1090668 724672 813120 857338 212588 -304426 195714
34462 195714 916998 691642 17098 32341 323657 -334612 -1576329 -1746447 -497606
34453 -497606 720674 949742 885057 1329708 1884197 1862142 1479562 1339301 1367403 1018333
34443 1018333 258757 -272719 -112452 410050 627579 454543 449270 842241 1077494 843275
34433 843275 935197 2062810 3216481 2689448 736349 -434711 256011 1367066 1369366
$$ packed form
34500B59915M82669Q14391M55915j19991k23871k41208o94807j028685n83687
34491h79359P4959K3325n35101p33124l57650K03139O67591P76728K97260k76942
34481g39174m8866O87516N36399o13862j010242Q6222Q70937n7720j134510l55019
34471a778319J279239J410015J79733l65996Q8448M4218o44750n17014N00140
34462A95714P21284k25356o74544J5243K91316o58269j241717j70118J248841
34453d97606J218280K29068o4685M44651N54489k2055l82580j40261K8102l49070
34443A018333p59576n31476J60267N22502K17529j73036n273L92971K35253k34219
34433H43275R1922J127613J153671n27033j953099j171060O90722J111055K300
$$ plain form
34424 1369366 741309 465817 86925 -1088893 -2150707 -1841318 -771624 -464539 -825507
34415 -825507 -531696 441780 717917 -65034 -615339 -55262 961658 1558963 1686896
34406 1686896 1507543 966985 352090 226358 544979 754619 809347 1067066 1272767 886320
34396 886320 376482 769572 1799872 2022968 1072192 262395 443343 766096 310080
34387 310080 -471973 -852364 -1124062 -1707069 -1957697 -1078084 422023 1289800 1198156 934627
34377 934627 1141447 1628449 1876217 1678905 1236550 847676 554464 181489 -179276 -117922
34367 -117922 269502 83110 -1084507 -2147184 -1952568 -1193662 -1384075 -2225690 -1876316
34358 -1876316 6352 1487890 1245148 342453 175558 394878 124281 -290151 -227222
$$ packed form
34424A369366o28057k75492l78892j175818j061814L09389J069694L07085l60968
34415h25507K93811R73476K76137p82951n50305N60077J016920N97305J27933
34406A686896j79353n40558o14895j25732L18621K09640N4728K57719K05701l86447
34396H86320n09838L93090J030300K23096r50776q09797J80948L22753m56016
34387C10080p82053l80391k71698n83007k50628Q79613J500107Q67777r1644k63529
34377I34627K06820M87002K47768j97312m42355l88874k93212l72975l60765O1354
34367a17922L87424j86392j167617j062677J94616P58906j90413q41615L49374
34358a876316J882668J481538k42742r02695j66895K19320k70597m14432O2929
$$ plain form
34349 -227222 -235554 -961097 -1621788 -1147643 -64979 345079 149687 405631 1116521 1198038
34339 1198038 384379 -323137 -251911 120704 167311 -33697 -70545 270945 940391 1565972
34329 1565972 1591080 956266 337881 202385 129099 -302975 -638416 -436653 -331365 -1028783
34319 -1028783 -1811055 -1431048 -213928 192073 -813355 -1993782 -2070811 -1165904 -176570
34310 -176570 293830 84983 -599304 -1142630 -1040386 -553280 -222419 79085 742360 1288897
34300 1288897 813883 -378051 -796557 222945 1553140 1777246 864852 -60839 -16602
34291 -16602 1022611 2065677 1874134 420337 -658789 18823 1515015 1718974 398217
34282 398217 -541205 -43694 678537 394301 -274407 -371190 -436752 -1311612 -2269427 -2019734
$$ packed form
34349b27222q332p25543o60691M74145J082664M10058j95392K55944P10890Q1517
34339A198038q13659p07516P1226L72615M6607k01008l6848L41490O69446O25581
34329A565972K5108o34814o18385j35496p3286m32074l35441K01763J05288o97418
34319a028783p82272L80007J217120M06001j005428j180427p7029R04907R89334
34310a76570M70400k08847o84287n43326J02244M87106L30861L01504O63275N46537
34300A288897m75014j191934m18506J019502J330195K24106r12394r25691M4237
34291a6602J039213J043066j91543j453797j079126O77612J496192K03959j320757
34282C98217r39422M97511P22231k84236o68708r6783o5562q74860r57815K49693
$$ plain form
34272 -2019734 -834262 -54326 25724 197991 590470 526169 108732 328798 1261634 1600806
34262 1600806 591982 -746091 -1097746 -641644 -512057 -1111805 -1866508 -2298883 -2456988
34253 -2456988 -2354745 -1789773 -900582 -292412 -266649 -334751 88592 776097 973494 493251
34243 493251 -58545 -256998 -444495 -987840 -1513965 -1484587 -1128404 -1058553 -1198487 -914255
34233 -914255 -130587 562889 954570 1401286 1778810 1294792 -148597 -1355870 -1321442
34224 -1321442 -551999 -119258 -63463 326070 1121738 1660504 1609212 1228008 709217 99651
34214 99651 -204542 243374 1079935 1361040 836698 332782 616116 1406429 1794703 1305567
34204 1305567 350589 -194077 130520 759548 635381 -375446 -1045950 -350310 962465
$$ packed form
34272b019734J185472P79936Q0050J72267L92479o4301m17437K20066R32836L39172
34262A600806j008824j338073l51655M56102J29587n99748p54703m32375j58105
34253b456988J02243N64972Q89191O08170K5763o8102M23343O87505J97397m80243
34243D93251n51796j98453j87497n43345n26125K9378L56183O9851j39934K84232
34233i14255P83668O93476L91681M46716L77524m84018j443389j207273L4428
34224a321442P69443M32741N5795L89533P95668N38766n1292l81204n18791o09566
34214I9651l04193M47916Q36561K81105n24342n03916K83334P90313L88274m89136
34204A305567r54978n44666L24597O29028j24167j010827o70504O95640J312775
$$ plain form
34195 962465 1214432 -3770 -1448179 -1993361 -1757689 -1304202 -781442 -287863 -181321
34186 -181321 -454730 -504789 -44926 403749 421780 377281 621406 745067 401618 183718
34176 183718 706699 1325775 907029 -326693 -867514 52044 1472852 2006749 1344796
34167 1344796 195592 -589516 -513727 318351 1075521 834533 -293966 -1131640 -879510
34158 -879510 -130500 4975 -623450 -1139301 -799283 286085 1430893 1915336 1394197
34149 1394197 258293 -466721 -68010 965527 1417198 760190 -310379 -844842 -675385
34140 -675385 -276745 -42073 -81385 -423669 -916877 -1035340 -303160 969602 1758503 1376027
$$ packed form
34195I62465K51967j218202j444409n45182K35672M53487N22760M93579J06542
34186a81321k73409n0059M59863M48675J8031m4499K44125J23661l43449k17900
34176A83718N22981O19076m18746j233722n40821R19558J420808N33897o61953
34167A344796j149204p85108P5789Q32078P57170k40988j128499q37674K52130
34158h79510P49010J35475o28425n15851L40018J085368J144808M84443n21139
34149A394197j135904p25014L98711J033537M51671o57008j070569n34463J69457
34140f75385L98640K34672l9312l42284m93208j18463P32180J272762P88901l82476
$$ [...]
##END NTUPLES=NMR SPECTRUM
##END=
