##TITLE=31Pdec_DPAA1103
 CDCl3, 24 sc
 14.3.2022
##JCAMPDX= 6.0         $$ Bruker NMR JCAMP-DX V2.0
##DATA TYPE= NMR SPECTRUM
##DATA CLASS= NTUPLES
##ORIGIN= UXNMR, Bruker Analytische Messtechnik GmbH
##OWNER= root
$$ XWIN-NMR		Version 3.5
$$ Mon Mar 14 10:41:06 2022 Russian Standard Time (UT+4h)  she@DPX200
##.OBSERVE FREQUENCY= 81.013821
##.OBSERVE NUCLEUS= ^31P
##.ACQUISITION MODE= SIMULTANEOUS
##.ACQUISITION SCHEME= undefined
##.AVERAGES= 24
##.DIGITISER RES= 16
##SPECTROMETER/DATA SYSTEM= spect
##.PULSE SEQUENCE= zgpg30
##.SOLVENT NAME= CDCl3
##.SHIFT REFERENCE= (INTERNAL, CDCl3, 0, 248.564)
##AUDIT TRAIL= $$ (NUMBER, WHEN, WHO, WHERE, WHAT)
$$ ##TITLE= Audit trail, XWIN-NMR		Version 3.5
$$ ##JCAMPDX= 5.01
$$ ##ORIGIN= Bruker BioSpin GmbH
$$ ##OWNER= she
$$ F:/spectra/data/she/nmr/P31/1/pdata/1/auditp.txt
$$ ##AUDIT TRAIL=  $$ (NUMBER, WHEN, WHO, WHERE, WHAT)
(   1,<2022-03-14 10:40:14.10 +0400>,<she>,<DPX200>,
      <created by zg, POWCHK disabled, PULCHK disabled
       configuration hash MD5:
       00 E9 B6 7A A2 85 ED C7 34 08 36 98 17 FE 4E 26
       data hash MD5: 32K
       99 94 C9 B1 0E 49 B4 0D 90 CA A3 B2 82 AE 02 73>)
(   2,<2022-03-14 10:40:18.54 +0400>,<she>,<DPX200>,
      <Start of raw data processing
       efp BC_mod = 2 LB = 1 FT_mod = 6 PKNL = 1 PHC0 = -9199.14 PHC1 = 147.4745 SI = 64K 
       data hash MD5: 64K
       9A 03 D0 6E 67 C5 4D 85 1E E7 D1 0A 2A 39 65 20>)
(   3,<2022-03-14 10:40:32.43 +0400>,<she>,<DPX200>,
      <pk PHC0 = -2.054161 PHC1 = 0 
       data hash MD5: 64K
       29 05 A0 FA CE D6 EB 50 4E D7 58 D6 20 54 E4 95>)
(   4,<2022-03-14 10:40:35.79 +0400>,<she>,<DPX200>,
      <abs ABSG = 5 
       data hash MD5: 64K
       2D EC D2 44 72 A0 FF B1 F1 67 A4 70 BB 2A 41 28>)
$$ ##END=
$$ 
$$ hash MD5
$$ 4B C2 60 AA 60 8D 05 F8 8D C5 09 93 B1 20 6B AD
##$RELAX= 
##$RELAX= 
##$RELAX= 
##$RELAX= 
##$RELAX= 
##$RELAX= 
##$RELAX= 
##$RELAX= 
$$ Bruker specific parameters
$$ --------------------------
##$DU= <F:/spectra>
##$EXPNO= 1
##$NAME= <P31>
##$PROCNO= 1
##$TYPE= <nmr>
##$USER= <she>
##$AMP= (0..31)
100 100 100 100 100 100 100 100 100 100 100 100 100 100 100 100 100 100 
100 100 100 100 100 100 100 100 100 100 100 100 100 100 
##$AQSEQ= 0
##$AQ_mod= 1
##$AUNM= <au_zg>
##$AUTOPOS= <>
##$BF1= 81.014009
##$BF2= 200.13
##$BF3= 200.13
##$BF4= 200.13
##$BF5= 200.13
##$BF6= 200.13
##$BF7= 200.13
##$BF8= 200.13
##$BYTORDA= 1
##$CFDGTYP= 0
##$CFRGTYP= 5
##$CHEMSTR= <none>
##$CNST= (0..31)
1 1 145 1 1 1 1 1 1 1 1 1 1 1 1 1 1 1 1 1 1 1 1 1 1 1 1 1 1 1 1 1 
##$CPDPRG= <waltz16>
##$CPDPRG1= <>
##$CPDPRG2= <waltz16>
##$CPDPRG3= <>
##$CPDPRG4= <mlev>
##$CPDPRG5= <mlev>
##$CPDPRG6= <mlev>
##$CPDPRG7= <mlev>
##$CPDPRG8= <mlev>
##$CPDPRGB= <>
##$CPDPRGT= <>
##$D= (0..31)
0 1 0 0 0 0 0 0 0 0 0 0.03 2e-05 3e-06 0 0 0 0 0 0 0 0 0 0 0 0 0 0 0 0 
0 0 
##$DATE= 1647240013
##$DBL= (0..7)
120 120 120 11 120 120 24 19 
##$DBP= (0..7)
150 150 150 150 150 150 150 150 
##$DBP07= 0
##$DBPNAM0= <>
##$DBPNAM1= <>
##$DBPNAM2= <>
$$ [...]
##$SUBNAM3= <"">
##$SUBNAM4= <"">
##$SUBNAM5= <"">
##$SUBNAM6= <"">
##$SUBNAM7= <"">
##$SUBNAM8= <"">
##$SUBNAM9= <"">
##$SW= 501.771253377433
##$SWIBOX= (0..15)
0 1 3 0 0 0 0 0 0 0 0 0 0 0 0 0 
##$SW_h= 40650.406504065
##$TD= 32768
##$TD0= 1
##$TE= 0
##$TE2= 300
##$TE3= 300
##$TEG= 300
##$TL= (0..7)
0 120 53 12 22 120 120 120 
##$TP= (0..7)
150 150 150 150 150 150 150 150 
##$TP07= 0
##$TPNAME0= <>
##$TPNAME1= <>
##$TPNAME2= <>
##$TPNAME3= <>
##$TPNAME4= <>
##$TPNAME5= <>
##$TPNAME6= <>
##$TPNAME7= <>
##$TPOAL= (0..7)
0.5 0.5 0.5 0.5 0.5 0.5 0.5 0.5 
##$TPOFFS= (0..7)
0 0 0 0 0 0 0 0 
##$TUNHIN= 0
##$TUNHOUT= 0
##$TUNXOUT= 0
##$USERA1= <user>
##$USERA2= <user>
##$USERA3= <user>
##$USERA4= <user>
##$USERA5= <user>
##$V9= 5
##$VALIST= <valist>
##$VCLIST= <CCCCCCCCCCCCCCC>
##$VD= 0
##$VDLIST= <DDDDDDDDDDDDDDD>
##$VPLIST= <PPPPPPPPPPPPPPP>
##$VTLIST= <TTTTTTTTTTTTTTT>
##$WBST= 1024
##$WBSW= 4
##$XGAIN= (0..3)
0 0 0 0 
##$XL= 0
##$YL= 0
##$YMAX_a= 14048
##$YMIN_a= -16898
##$ZGOPTNS= <>
##$ZL1= 120
##$ZL2= 120
##$ZL3= 120
##$ZL4= 120
##$ABSF1= 248.5645
##$ABSF2= -253.2056
##$ABSG= 5
##$ABSL= 3
##$ALPHA= 0
##$AQORDER= 0
##$ASSFAC= 0
##$ASSFACI= 0
##$ASSFACX= 0
##$ASSWID= 0
##$AUNMP= <proc_1d>
##$AZFE= 0.1
##$AZFW= 0.5
##$BCFW= 0
##$BC_mod= 2
##$BYTORDP= 0
##$COROFFS= 0
##$CY= -3
##$DATMOD= 1
##$DC= 0
##$DFILT= <>
##$DTYPP= 0
##$F1P= 0
##$F2P= 0
##$FCOR= 1
##$FTSIZE= 65536
##$FT_mod= 6
##$GAMMA= 0
##$GB= 0
##$INTBC= 1
##$INTSCL= 5.30512e-09
##$ISEN= 30
##$LB= 1
##$LEV0= 0
##$LPBIN= 0
##$MAXI= 10000
##$MC2= 0
##$MEAN= 0
##$ME_mod= 0
##$MI= 50
##$NCOEF= 0
##$NC_proc= -5
##$NLEV= 6
##$NOISF1= 182.463
##$NOISF2= 159.3651
##$NSP= 0
##$NTH_PI= 0
##$NZP= 0
##$OFFSET= 248.5645
##$PC= 4
##$PHC0= -9201.193
##$PHC1= 147.4745
##$PH_mod= 1
##$PKNL= yes
##$PPARMOD= 0
##$PSCAL= 0
##$PSIGN= 0
##$REVERSE= no
##$SF= 81.014009
##$SI= 65536
##$SIGF1= 159.3651
##$SIGF2= -187.1042
##$SINO= 113.3802
##$SIOLD= 16384
##$SREGLST= <1H.CDCl3>
##$SSB= 0
##$STSI= 65536
##$STSR= 0
##$SW_p= 40650.406504065
##$SYMM= 0
##$S_DEV= 0
##$TDeff= 32768
##$TDoff= 0
##$TI= <>
##$TILT= no
##$TM1= 0
##$TM2= 0
##$TOPLEV= 0
##$USERP1= <user>
##$USERP2= <user>
##$USERP3= <user>
##$USERP4= <user>
##$USERP5= <user>
##$WDW= 1
##$XDIM= 65536
##$YMAX_p= 282047103
##$YMIN_p= -18733885
$$ End of Bruker specific parameters
$$ ---------------------------------
##NTUPLES= NMR SPECTRUM
##VAR_NAME=  FREQUENCY,     SPECTRUM/REAL,   SPECTRUM/IMAG
##SYMBOL=    X,             R,               I
##VAR_TYPE=  INDEPENDENT,   DEPENDENT,       DEPENDENT
##VAR_FORM=  AFFN,          ASDF,            ASDF
##VAR_DIM=   65536,         65536,           65536
##UNITS=     HZ,            ARBITRARY UNITS, ARBITRARY UNITS
##FACTOR=    0.620285442955139, 1,           1
##FIRST=     20137.2065510759, 0,            0
##LAST=      -20513.1999529892, 0,           0
##MIN=       -20513.1999529892, -18733885,   0
##MAX=       20137.2065510759, 282047103,    0
$$ Real data points
##PAGE= N=1
##DATA TABLE= (X++(R..R)), XYDATA
$$ [...]
38983E81989l03816q71399n87853L38591Q72041N39033j07115m23665l57699j13236
38973d33129J58329K06923j20517m17874j27223M89013N52080p5972m89998j31698
38963c90066L79804L16938n6321j19598M4172l374j66912q9784N7869j22117m17966
38952e67355k67367K75772N81739M03574J03988o6852k35846l82849k24429J93865
38942a85760L80862J38676q2802J07847L92338J96233m52609r22049p65051j97848
38932a390163K54451L71862L55286M09196M20076J80949j99551l76811k54124
38923b28829r1355n1155L5864K70291L73768R0152l24527l67340M4648M58905
38913B10422M17385o6523n18496m35355J48627N41357J54898o05855p29940j9253
$$ y = [581989, 278173, -593226, -1181079, -842488, 29553, 568586, 461471, 37806, -319893, -433129, -274800, -67877, -188394, -606268, -733491, -244478, 307602, 231630, -258368, -390066, -10262, 306676, 250355, 130757, 174929, 171555, 4643, -85141, -27272, -149389, -567355, -834722, -558950, 22789, 426363, 530351, 463499, 227653, -155196, -379625, -185760, 195102, 333778, 250976, 358823, 751161, 947394, 494785, -427264, -1192315, -1390163, -1135712, -763850, -408564, 632, 420708, 601657, 402106, 25295, -228829, -320184, -371339, -335475, -65184, 308584, 398736, 74209, -293131, -248483, 210422, 627807, 561284, 42788, -392567, -243940, 297417, 452315, -153540, -883480, -902733]
38903i02733N53598K94698j45535J25723P14134N46909l28325p46528k55237K27970
38893H4674n3691n31444l11260M06266O76954J82107m52933n53151q7830M70595
38883a69713O32765K89628j70691k62236k3730L4217k51136l50553J41006P48734
38873F18291P15243J09376k89434j59480l0636l38487o84667m63668J56028M31611
38863F4177J15892k23024q3255K38724J46210l18880n18944j53087L29765L95012
38853g410J11755q0855j2577J34548K10379K30498J86092N339k74689m75426m36194
38842d08540j42778K27869L70184J53465r6332O5514M75501M23599k80718q18460
38832c0696m54605L17945M51151j07317l94809N1326N34332L11683l53575o72298
$$ y = [-902733, -349135, -54437, -199972, -74249, 639885, 1186794, 858469, 111941, -143296, 84674, 30983, -500461, -811721, -405455, 271499, 453606, 673, -552478, -640308, -169713, 463052, 752680, 581989, 319753, 296023, 330240, 79104, -271449, -130443, 618291, 1333534, 1442910, 1153476, 993996, 963360, 624873, -59794, -523462, -367434, 64177, 180069, -42955, -126210, 112514, 258724, -60156, -579100, -732187, -402422, -7410, 104345, 23490, 10913, 145461, 355840, 586338, 772430, 777769, 503080, 27654, -408540, -551318, -323449, 46735, 200200, 103868, 169382, 644883, 1068482, 787764, -30696, -485301, -167356, 283795, 176478, -218331, -167005, 367327, 679010, 325435, -346863]
38822c46863l65452J91733N27154M34000K5927l15129k63483J8209L3995l33116
38812c93025n98977l51589J81490M70733L21805m4185l17918l15627o3984J80415
38802i30862J75710K3086J6312J46536R6777j98082l67167j36432K76563M64465
38792d33094K75788j26460m09629k91771R4559J92384k20086n14306j07309M09408
38782a130516M4038p90662n83040Q47053J677287O64831r04209j062125N8494
38773a178849P57574M03611q7005j26610j82164n00263n47045j09193K06314J6931
38763a346699k53286k34436j51830j21227J81775O90654O94499q233n42967k18788
38753a310538M03975M62748J24836R1792L17747K10575k09368l42089q4958L5980
$$ y = [-346863, -712315, -520582, 6572, 440572, 466499, 151370, -112113, -93904, -59909, -393025, -992002, -1343591, -1162101, -691368, -369563, -413748, -731666, -1047293, -1111277, -930862, -755152, -732066, -715754, -569218, -472441, -670523, -1037690, -1174122, -897559, -433094, -157306, -283766, -693395, -985166, -890607, -698223, -918309, -1432615, -1539924, -1130516, -1086478, -1877140, -2460180, -1613127, 64160, 728991, -175218, -1237343, -1178849, -421275, -17664, -104669, -231279, -413443, -913706, -1460751, -1569944, -1363630, -1346699, -1599985, -1834421, -1986251, -2107478, -1925703, -1235049, -540550, -548783, -1091750, -1310538, -906563, -443815, -318979, -227187, 90560, 301135, 91767, -250322, -335280, -299300]
38743b99300j59791k29725M9524K92544J99777L3053R8995K39510J53761j25670
38733B52678l52726l94434k39511N9878K97709K39435j4266p9880J40112K69245
38723A78240M7613k28933j66582J06392J51648j15455l49563k91249l1312K21237
38713d77964L57697L47412K20984R2953M7777L8389K0069N6197J22844J2455k94426
38702E44387l95403k2018L69036J41375m58207m99774K23874P56889L52533m03956
38692F08736m88569N5882L15065n8954m68231m22256j60326k0040J09905L40715
38682a88073L51788r5600n71124m38734K30787O79647M14498k17727n17195k54212
38672f05945J75144L21363K02318J50954K50994J77907k75029p28612n88116J39978
$$ y = [-299300, -459091, -688816, -639292, -346748, -146971, -113918, -14923, 224587, 378348, 252678, -100048, -494482, -733993, -674115, -376406, -136971, -151237, -231117, -91005, 178240, 225853, -3080, -169662, -63270, 88378, -27077, -376640, -667889, -699201, -477964, -120267, 227145, 448129, 541082, 588859, 627248, 647317, 703514, 826358, 838813, 544387, 148984, 126966, 496002, 637377, 179170, -320604, -96730, 660159, 1012692, 608736, 120167, 176049, 491114, 432160, -36071, -458327, -618653, -638693, -528788, -188073, 163715, 68115, -503009, -941743, -710956, -31309, 383189, 165462, -351733, -605945, -430801, -109438, 92880, 243834, 494828, 672735, 397706, -330906, -919022, -779044]
38662g79044P19371N19714k15121o40231k93870L78527N62318M2459n47611n25153
38652g78641j0703L00350J29032o5587J17819L72867J95835k75587m07816N6036
38642c66395O64152P86090K35490n65670q93592l98766L68553M60032k13484o35861
38632e59451j17051O29325N49136j38668l60940R8338M17079J84193j14534j79797
38622D07630l35440n88798l58315L86443P30541J77340m84063l72426K01522L97250
38612A61684J24272j30177k10005k47867j54669J23003K30909l7203k28577M7721
38602c20909L38835N2223m64540m12007J64356M52604J37381k38041j83799J61267
38592c12630M33400M64206K42277j07034l04275k15790o5213o4527q6444j8255
$$ y = [-779044, -59673, 460041, 244920, -395311, -689181, -310654, 251664, 294123, -253488, -778641, -789344, -488994, -359962, -425549, -307730, 65137, 260972, -14615, -422431, -366395, 297757, 1083847, 1319337, 753667, -139925, -538691, -170138, 289894, 76410, -559451, -676502, -47177, 501959, 363291, 2351, 100689, 517768, 701961, 587427, 407630, 72190, -516608, -874923, -488480, 242061, 419401, -64662, -437088, -235566, 161684, 285956, 155779, -54226, -302093, -456762, -333759, -102850, -140053, -368630, -320909, 17926, 70149, -394391, -806398, -642042, -189438, -52057, -290098, -473897, -312630, 120770, 584976, 827253, 720219, 415944, 200154, 134941, 70414, -16030, -34285]
38582c4285p2721l45019m80236k50591R81J1921J34024N68476O98860N9917o00378
38571c09051k94542N92449Q43265K88887j11359K6360M2332l92040o86396m56826
38561d56921j42023q1092M7231M13415N58308K25215j06416j6539K08431J82738
38551H32347L5398k2124j26813l15768k26372K82510P03909N31587n8485n30518
38541A105671o22134l96157n8890P3553j46627l35112m908N67595N74971p9484
38531F78478n48304l27997K3150j15564m64077m32389m6159L08647N52700P50177
38521C78662P08092K87151k18501m59473m76279m25443k45954O2475K34526J49953
38511d791N3130Q0738K2575j74364j80953J19816L37029J99734l5355j00867r1076
$$ y = [-34285, -107006, -452025, -932261, -1182852, -1181871, -1169950, -1035926, -467450, 231410, 291327, -309051, -603593, -11144, 832121, 1121008, 1009649, 1036009, 1078341, 686301, -95, -456921, -598944, -680036, -632805, -219390, 338918, 564133, 457717, 441178, 649609, 832347, 867745, 845621, 718808, 403040, 176668, 459178, 1163087, 1694674, 1636189, 1105671, 483537, 87380, 28490, 102043, -44584, -379696, -384604, 182991, 757962, 678478, 130174, -197823, -174673, -290237, -754314, -1186703, -1232862, -924215, -371515, 378662, 1086754, 1373905, 1155404, 695931, 219652, -205791, -451745, -389270, -154744, -4791, 48339, 129077, 151652, -22712, -203665, -83849, 253180, 452914, 417559, 316692, 225616]
38500B25616n4427J50273L30692M3941m91913m41054K87422O91510K37331k85324
38490F94067j93725p5215n25792q18507j40276P32566N17564m27464o39457J31432
38480g44807P41352O24464L46998J82592k59163p66661m69927N11188Q46967L9497
38470A052500p02746m05384J73662l076m61988j62889N94834O35517j41695o51606
38460g2871l79554j234o4617j48331K16211O22466M18422k33622n55002k07039
38450d05171L54263N36717K48574j58468l06563p9636L12448M88842K61564j25056
38440A127514k78818j77839j45621k71002k35652Q6704K91430Q7781j23551J12163
38430D73109M24014J39643m98160n75106m795K47931k51092o47158k14565M26963
$$ y = [225616, 171189, 321462, 652154, 696095, 204182, -236872, 50550, 742060, 979391, 694067, 500342, 425127, -100665, -919172, -1059448, -326882, 190682, -236782, -876239, -744807, -3455, 621009, 968007, 1150599, 891436, 124775, -345152, 166036, 1013003, 1052500, 349754, -55630, 118032, 114956, -347032, -509921, 84913, 720430, 578735, -72871, -452425, -453659, -518276, -666607, -450396, 172070, 590492, 356870, -198132, -405171, -50908, 485809, 734383, 575915, 269352, 189716, 502164, 991006, 1252570, 1127514, 848696, 670857, 525236, 254234, 18582, 105286, 396716, 484497, 360946, 473109, 897123, 1036766, 538606, -36500, -41295, 206636, -44456, -691614, -906179, -479216]
38420d79216L74484n4683N0484N72422N50084j87289o98435l62444K89761M42288
38410D97456R770m80580n34027n4625N38993N58150j58598p91692m62954M70584
38400d07523P74790M9107p22981o01188R3041M58818L08087J42855J95581J68932
38390D59519j13484l34322j29969L75890O98777N67073J88480r2618k22961l33556
38380A062829l48591q2121K66393K01547k86802n35358j56553L07166J85812k84629
38370C29693l84764o8251O0166j95088l44014n8720L55728M84108K78597r5811
38360C61644m31883m44110m0549L35616J49416m01912n69315j32295L15948L23692
38350e33748J74767K34861L17575J43117o5464J9371J73959n0796n07190n42194
$$ y = [-479216, -104732, -159415, -108931, 463491, 1013575, 826286, 127851, -234593, 55168, 497456, 507226, 26646, -507381, -562006, -23013, 535137, 376539, -415153, -878107, -407523, 367267, 416374, -306607, -907795, -814754, -355936, -47849, 95006, 290587, 459519, 346035, 11713, -118256, 257634, 956411, 1523484, 1711964, 1619346, 1396385, 1062829, 714238, 632117, 898510, 1100057, 813255, 277897, 121344, 428510, 614322, 329693, -55071, -123322, -63156, -258244, -602258, -660978, -305250, 178858, 457455, 361644, -70239, -514349, -554898, -219282, -69866, -471778, -1041093, -1173388, -857440, -533748, -358981, -124120, 193455, 336572, 271108, 290479, 464438, 413642, -93548, -635742]
38340f35742K9154N45523L66435k07974l17310K33659O52567L05470l09025l15139
38330C47618J30115O3948o36994q80930n9927Q57981P16735j28881m96586j95599
38320b82520j6719k08517j85156K30904M08013J2624l97215k51607K37117M86876
38310C3800K52550k69585o22021l59251L90515P68599J97749o43463o44054J10508
38300g84653N07064J60392j23308J69599M53333J62554l16308l98379j69120N0495
38290b88331K77969M78914K96332k80532o03739k66024K44651K82494r4387m40126
38280c92779n61575m35209l2521L96059M22220J26265L8766J60595j07172p23013
38270a108364p32383J79922R13980N49361k40139l45625M9520L8154l72794m16754
$$ y = [-635742, -606588, -61065, 305370, 97396, -219914, 13745, 666312, 971782, 662757, 347618, 477733, 541681, -95313, -976243, -1036170, -178189, 538546, 409665, -86921, -282520, -299239, -507756, -692912, -462008, -53995, -41371, -438586, -690193, -453076, 33800, 286350, 16765, -605256, -964507, -573992, 194607, 392356, -251107, -895161, -784653, -277589, -117197, -240505, -70906, 382427, 544981, 228673, -169706, -338826, -288331, -10362, 468552, 764884, 484352, -119387, -385411, -140760, 141734, 47347, -392779, -954354, -1389563, -1422084, -1026025, -603805, -477540, -438774, -278179, -385351, -1108364, -1840747, -1660825, -746845, -197484, -437623, -783248, -733728, -695574, -1068368, -1485122]
38260a485122M4379M27052M67921L68880J54713j96955k84912J38816M74083J30551
38250B39406l25349j8698O08790L82193n64449q36579j9313O34070K23833m58852
38240a34948l63272J93217K78294r9071k12120Q5797K46277J4005k55784k48419
38230d96024p0555P8835J95372L23226L85269K72283N559k34726k48771k6900
38220A83568K13767K76494J88187N3976j32677l42445l56099n1503K92943L12403
38210F38614P0988p4089k3796J3367n6750j24911j56225j87855j19504J15023
38200I4862K67555R3861j58987p7739K02353J83046j44932k87531j20588o1458
38190i558k13680r9315M29428P39887L76825j49743j52372J47924M1341m77711
$$ y = [-1485122, -1440743, -1013691, -545770, -176890, -22177, -219132, -504044, -365228, 108855, 239406, -85943, -104641, 504149, 886342, 321893, -514686, -533999, 100071, 323904, -134948, -498220, -305003, -26709, -125780, -337900, -252103, -5826, 8179, -247605, -496024, -566579, -487744, -292372, 30854, 416123, 688406, 693965, 459239, 210468, 183568, 397335, 673829, 862016, 915992, 783315, 440870, 84771, 33268, 326211, 638614, 709602, 635513, 611717, 625084, 568334, 443423, 287198, 99343, -20161, 94862, 362417, 456278, 297291, 219552, 421905, 604951, 460019, 172488, 51900, -9558, -223238, -322553, 106875, 846762, 1223587, 1073844, 921472, 1069396, 1110737, 633026]
38180F33026o99527k84069L28715O20962N11271R7050n12209r17344n75877M06289
38170c91713J085988P51339j36580n73814l43171r4586j91163k26721J00581L54394
38160C34554R6024k90216j83773J96832R3562n20233p95944k87355L81773M74684
38150e00092J48556L5380K74435M91964M64833L02936J12283j05500k72299k57843
38140F94653p2287J15172Q6383k94050q19151q67044o2804R41457J008942Q2759
38130H14030n56243q0936O40762M07106m16754n17168K22277N44237j34930q08437
38120A13944n06524K35222L32698j52724k36514L81456Q56048M40130m85679r49479
38110B8578n92368L7210K90459J68410J20169L10302M11716J52109k48133l80035
$$ y = [633026, -66501, -350570, -21855, 599107, 1110378, 1207428, 695219, -222125, -798002, -391713, 694275, 1445614, 1309034, 735220, 392049, 297463, 106300, -120421, -19840, 334554, 430578, 140362, -43411, 153421, 246983, -273250, -1069194, -1356549, -974776, -500092, -351536, -316156, -41721, 450243, 915076, 1218012, 1330295, 1224795, 952496, 694653, 622366, 737538, 823921, 529871, -289280, -1156324, -1219128, -277671, 731271, 814030, 257787, 176851, 817613, 1224719, 807965, 290797, 513074, 1057311, 922381, 113944, -392580, -157358, 175340, 22616, -213898, 167558, 1023606, 1463736, 978057, 28578, -563790, -526580, -236121, -67711, 52458, 362760, 774476, 926585, 678452, 298417]
38100B98417j83711N6641J29929P1371j3101q0094j24795j65413k17993k11701
38090d40450m0273K21047L17036J51905m9600o1221M2746N4271p0329k20116k78199
38079c73183j69987N0037J33606o3878k30782L9681N07440M69689j50618n39572
38069c27567j46267N13725O56933K74820j31301l36427l53469r5777L25002M15548
38059G95220J2226k98921r3948J13556k34857o50023l51541L45908M94215O5165
38049A97000j05580K01788L24670k7807l47636l17143k35060k50097r1518K10944
38039d40439K18079o9490j03206K29560L64430P0884j54961k6482N9579j33905
38029A4049k02364Q9946L07764J60020P3304L77380N94310J97764m52553o07325
$$ y = [298417, 114706, 171347, 301276, 372647, 359546, 279452, 154657, -10756, -228749, -440450, -480723, -259676, 57360, 209265, 159665, 98444, 141190, 195461, 125132, -94984, -373183, -543170, -493133, -359527, -423405, -654187, -614506, -107066, 362623, 212005, -327567, -473834, 39891, 696824, 971644, 840343, 503916, 150447, 54670, 379672, 795220, 807446, 508525, 414577, 528133, 293276, -356747, -708288, -362380, 131835, 197000, 91420, 293208, 617878, 590071, 242435, -74708, -309768, -559865, -651383, -440439, -222360, -291850, -395056, -165496, 198934, 269818, 114857, 88375, 147954, 14049, -188315, -98369, 209395, 369415, 442719, 820099, 1414409, 1612173, 1159620, 552295]
38019E52295j87004K46859L08101P9953j95315l28950k55907j39463k00276l21771
38009d41478j59299K48699M10314R2796l21034l79953q3878K76581M14505J36225
37999A93478m11402o11413o8549O22646N29164k14359n37835p6280L38433J22098
37989a14019j86950j8608K54050J26693r7824L4440K38772O6910k09534r2866
37979A064K35833K65434J6549j34377j32281j21735j6189K28624K99275L5993
37969F78190j70925l9283N9776j79021k98103J54557O83892N43536l0870k07560
37959A194189R9935K26783l1517j33781K02850M97832K31249m40505q88365o64072
37949B94598O8103O10576M34922q9076q8881N21765Q09292K47567m10550l42682
$$ y = [552295, 365291, 612150, 920251, 1000204, 804889, 475939, 220032, 80569, -119707, -441478, -600777, -352078, 58236, 151032, -170002, -549955, -633833, -357252, 57253, 193478, -217924, -829337, -897886, -275240, 253924, 39565, -498270, -574550, -236117, -114019, -300969, -319577, -65527, 61166, -36658, -2218, 236554, 303464, 93930, 1064, 236897, 502331, 518880, 384503, 252222, 130487, 114298, 342922, 642197, 678190, 507265, 467982, 527758, 348737, 50634, 205191, 889083, 1432619, 1401749, 1194189, 1294124, 1520907, 1489390, 1355609, 1558459, 2056291, 2287540, 1847035, 958670, 294598, 362701, 973277, 1408199, 1319123, 1230242, 1752007, 2561299, 2808866, 2398316, 2055634]
37939B055634L1255j32032n87841m30388L25233P40149M21067n5928k08298j88645
37929A970206j67894k3215J96958J98891k2511j53844j17620j21783j92157j88062
37919A378969j72274k19417p0083L87826N74365m7475r18469r73553j69780N05116
37909B75225M94484J81672n7331k85903l81847j1476N45692N25717q7659m10797
37899G87777m8563L41294K58011J24999L13815L72932o3403m36421j53384L42947
37889A840004K53207l10662n70823k73691J28454K79288K32200R2914q0164j01459
37879A489268J49594M34357M18050J22886j73688l26838l37800j93977K1050Q3185
37869A686087l5138l9739K00486L48122J04142k84161l97824k50684j17457j8561
$$ y = [2055634, 2086889, 1954857, 1367016, 936628, 1261861, 2002010, 2423077, 2367149, 2158851, 1970206, 1802312, 1779097, 1976055, 2174946, 2152435, 1998591, 1880971, 1759188, 1567031, 1378969, 1206695, 987278, 917195, 1305021, 1879386, 1831911, 913442, -60111, -229891, 275225, 769709, 951381, 894050, 608147, 226300, 214824, 760516, 1286233, 1198574, 787777, 739214, 1080508, 1338519, 1463518, 1777333, 2150265, 2086862, 1650441, 1497057, 1840004, 2093211, 1782549, 1211726, 938035, 1066489, 1345777, 1577977, 1670891, 1590727, 1489268, 1638862, 2073219, 2491269, 2614155, 2440467, 2113629, 1775829, 1581852, 1602902, 1686087, 1650949, 1611210, 1811696, 2159818, 2263960, 1979799, 1581975, 1331291, 1213834, 1195273]
37859A195273J78977L58894L18178J72141J41500Q3896k62841o68622o00190m9772
37849H67434L63071K52473o3585j77346k10115m35308o24508l05270M11872Q05869
37839H84587N10928O3528J18132M28936J89487o62851j168022o70701J73953L15451
37829A83428j74247l02943K44807O37174K71146k36697l5306N87160O28434q1515
37819A721441o08813k84333L83274N24126J26277r8919J50199L59736L8157n02611
37809A808534n57228j2800M86228L84105j24247m46983l58676j49472j32353k75489
37799F21619l36998j74020J38292L91175M12155K16314j747o9592j9403l0818
37789A146977j96782l66970k61943J71492N32451L25827l15472n79872L0P55260
$$ y = [1195273, 1374250, 1733144, 2051322, 2223463, 2364963, 2448859, 2186018, 1517396, 917206, 867434, 1230505, 1482978, 1419393, 1242047, 1031932, 596624, -27884, -333154, 78718, 884587, 1395515, 1459043, 1577175, 2006111, 2195598, 1532747, 364725, -305976, -132023, 183428, 9181, -293762, -48955, 588219, 859365, 622668, 587362, 1174522, 1802956, 1721441, 1112628, 828295, 1211569, 1735695, 1861972, 1763053, 1913252, 2272988, 2311145, 1808534, 1251306, 1238506, 1724734, 2108839, 1984592, 1537609, 1178933, 1029461, 897108, 621619, 284621, 110601, 248893, 640068, 1052223, 1268537, 1266790, 1197198, 1177795, 1146977, 950195, 583225, 321282, 492774, 1025225, 1351052, 1035580, 455708, 455738, 1210998]
37779A210998O77276j44874o18186k26662L10539K66205k7357R3146M86784N32461
37769B560330J59901j65348k14668j15438P0733K99846L07099j4002k47686m9987
37759B590780J94065l0611m17579k78847K68914M27932k3837m47966l79190o5536
37749A838125J37798J99678J11836j70130l63332r4246L87761M09780q1696l84805
37739A990769j38966J58422J8472l11574l51468r4817J37260J52097m8953l13355
37729A197887l37092m852K75737O8462l30574k63524K03640L44314k7835k84694
37719H41469r3356Q3627r3257k67897j29440N4766O3726J31046L12950K19452
37709A123086j73523k50924J79836L87624q6692n57275k93542K56054K48332j59232
$$ y = [1210998, 1888274, 1743400, 1125214, 898552, 1209091, 1475296, 1447939, 1541085, 2027869, 2560330, 2720231, 2554883, 2340215, 2224777, 2295510, 2595356, 2902455, 2888453, 2640767, 2590780, 2784845, 2754234, 2336655, 2057808, 2326722, 2754654, 2730817, 2282851, 1903661, 1838125, 1975923, 2175601, 2287437, 2117307, 1753975, 1659729, 2047490, 2457270, 2375574, 1990769, 1851803, 2010225, 2028697, 1717123, 1365655, 1270838, 1408098, 1560195, 1511242, 1197887, 860795, 855943, 1131680, 1200142, 869568, 606044, 809684, 1153998, 1126163, 841469, 748113, 831740, 738483, 470586, 341146, 395912, 459638, 590684, 903634, 1123086, 949563, 698639, 878475, 1266099, 1179407, 622132, 328590, 584644, 832976, 673744]
37699F73744j90994K00008L72765J42119n3538k8300p1450k99136m56537l89864
37689a01183j97199N0427L01812L60365J37112j02785j26900j18494k80138l82549
37679d59532j69868J29187K03172K11558L78669M13176r648n10573m71750k651
37669b88260K73848K03105J42636J89268J15756j5956P6020K52913J09449k43619
37659H15160k75595O2168K63397J65226J59242L41495K21673l89258q63189n85179
37649h4860J54474N53586L11174j33275k41909R865J64923j27715n78055n14458
37639d86250J73352O95482L65944l72781n34783J508M21381K76177J4408K0376
37629E74814k5942l78240n47333o1575O02942O13904K9318l19439j01747J37475
$$ y = [673744, 482750, 682758, 1055523, 1197642, 1144104, 1115804, 1044354, 745218, 288681, -101183, -298382, -247955, 53857, 414222, 551334, 448549, 321649, 203155, -76983, -459532, -629400, -500213, -297041, -85483, 293186, 706362, 696714, 186141, -285609, -288260, -14412, 188693, 331329, 520597, 636353, 620397, 696417, 949330, 1058779, 815160, 539565, 601733, 865130, 1030356, 1189598, 1531093, 1752766, 1363508, 500319, -84860, 69614, 623200, 934374, 801099, 559190, 569055, 733978, 606263, 28208, -486250, -312898, 382584, 748528, 375747, -159036, -157528, 263853, 540030, 554438, 574814, 548872, 170632, -376701, -438276, 164666, 778570, 807888, 488449, 386702, 524177]
37619E24177l077j52017O9754L06452R9420j97535O9568O35288N26931m06154
37609A472807j107994q34474j66877J00901K19101O99153J010626L32026p92001
37600I33268r62088m1138O46530L98699r241O1241R7719k83524m15799J21313
37590E46980M83100o3583p71779o11294O5470L21881K86885O01954Q96112L73727
37580B129453n05994n44927J87290M34893j54293n55014j85440K42632J03043
37571A151643j76272n7440K19282K29833M3192j23384k46263k26441N7720L09180
37561A181050J51307r1851J62233N67104K06707p62167j076600k97990M78311
37552E18104L58332j03486p6576K16697J74813p9798j36091j12202k37467k50058
$$ y = [524177, 521100, 369083, 438837, 745289, 844709, 647174, 716742, 1352030, 1878961, 1472807, 364813, -469661, -636538, -535637, -316536, 382617, 1393243, 1725269, 933268, -28820, -69958, 576572, 975271, 966030, 1027271, 1124990, 841466, 425667, 546980, 1030080, 966497, 194718, -416576, -351106, -29225, 257660, 859614, 1755726, 2129453, 1623459, 1078532, 1265822, 1700715, 1546422, 991408, 805968, 1048600, 1151643, 975371, 917931, 1137213, 1367046, 1410238, 1286854, 1040591, 814150, 871870, 1181050, 1332357, 1240506, 1402739, 1969843, 2176550, 1414383, 337783, 39793, 518104, 876436, 772950, 696374, 913071, 1087884, 1008086, 871995, 759793, 522326, 272268]
37542B72268N0003K44307n929k81730j00766K74276L70146K70535K12895L3389
37532A339394l10465l03319K87772P46812L92093l38334o16288m75197m26371
37523B96097l67289Q5890N78738M27105j82838m32897j56460R7937J51198L26689
37513H24170N47307L28774k38178m55509j28331J68647J12298N8652K12676K08316
37503A638822j40196m00312k21687J25650K48564J23635j63389n83667q19752
37494a92332m11658M19699P70944L03805j84694J4392M03136J42162m97221n06833
37484B61400K56966Q25239N46655r1969l54959k57356k29571k97139j55585J83409
37474F87090L48064J72579q7999j60017q5099o9687j91720l32753k97644j2808
$$ y = [272268, 322271, 566578, 560649, 278919, 178153, 452429, 822575, 1093110, 1306005, 1339394, 1028929, 725610, 1013382, 1760194, 2152287, 1813953, 1197665, 722468, 296097, -71192, 14698, 593436, 1020541, 837703, 404806, 248346, 346283, 497481, 824170, 1371477, 1700251, 1462073, 1006564, 878233, 1046880, 1159178, 1217830, 1430506, 1638822, 1498626, 1098314, 876627, 1002277, 1250841, 1374476, 1211087, 627420, -192332, -603990, -184291, 586653, 890458, 705764, 720156, 1123292, 1265454, 768233, 261400, 518366, 1343605, 1890260, 1798291, 1443332, 1185976, 956405, 659266, 503681, 687090, 1035154, 1207733, 1119734, 959717, 874618, 804931, 613211, 280458, -17186, -29994]
37464b9994K89200K03268k93673n56576L5829J102557J508248P94192j77096l96030
37454B479925j4885J17673j63775k44107J10926L64544J47443j65141j44280L2611
37444B520934J6653j01435n2635J06292J73002J93110K81994L06821J26243o9146
37434C501833j8127J98513L40435M01762M71126L96365J994m69903n48376j58442
37424D117180K63912L03599k5106m05098n51466m09374j54196k086J3176L690
37414C154231L534k2106J7119K03140K86518n6948n62032n26080J29990N58134
37404C185500J72005m40203m10164Q7862K03014j99006m03645o4735L10347K67398
37394B708373N3595M2601J05437m3202k91457l31374j45059N5220J78824K51184
$$ y = [-29994, 259206, 462474, 168801, -387775, -351946, 750611, 2258859, 3053051, 2875955, 2479925, 2465040, 2582713, 2418938, 2174831, 2285757, 2650301, 2797744, 2632603, 2488323, 2520934, 2537587, 2436152, 2383517, 2489809, 2662811, 2855921, 3137915, 3444736, 3570979, 3501833, 3483706, 3682219, 4022654, 4424416, 4895542, 5291907, 5293901, 4823998, 4275622, 4117180, 4381092, 4684691, 4659585, 4254487, 3703021, 3293647, 3139451, 3137365, 3150541, 3154231, 3157765, 3135659, 3152778, 3355918, 3642436, 3585488, 3023456, 2497376, 2627366, 3185500, 3357505, 2917302, 2507138, 2595000, 2798014, 2599008, 2195363, 2130628, 2440975, 2708373, 2761968, 2804569, 2910006, 2866804, 2575347, 2243973, 2098914, 2154134, 2332958, 2584142]
37384B584142K13368J8612j63173j11209R8496J52253n4883k43060j39404J08780
37374B463922J23160j51377l46440k08078L5891O1024l6705N8583L16090L84640
37364B700710J23093k73216o11544p64784n11493J54327O44892L86261k06488
37355A641758j70048M92123P01041J6277o09548l83764Q0474m1167l03768J17495
37345A540873P89594O45430j76631n26286j06746K30265P1842k8013J84582J63920
37335B788830k73950m65660r1355K00010n6076l18395l9567L61129K60013j42546
37325B222433k97760k20088k09338j86072p47O7592j98981m14940k09502O0760
37315F13357p7897l42711k19888M6445j03885m15719j39847O17713Q97912L48577
$$ y = [2584142, 2797510, 2816122, 2652949, 2541740, 2640236, 2792489, 2737606, 2494546, 2355142, 2463922, 2587082, 2435705, 2089265, 1881187, 1917078, 1978102, 1941397, 1999980, 2316070, 2700710, 2823803, 2550587, 1939043, 1174259, 662766, 817093, 1461985, 1848246, 1641758, 1471710, 1963833, 2664874, 2681151, 2071603, 1687839, 1768313, 1727146, 1423378, 1540873, 2330467, 2975897, 2799266, 2272980, 2166234, 2396499, 2468341, 2440328, 2624910, 2788830, 2514880, 2049220, 1957865, 2157875, 2101799, 1783404, 1743837, 2104966, 2364979, 2222433, 1924673, 1704585, 1495247, 1309175, 1308428, 1376020, 1177039, 762099, 552597, 613357, 535460, 192749, -27139, 19306, -84579, -500298, -640145, -22432, 875480, 1224057]
37305A224057k75512l32115j30148j44129j82401P8827L40216J54159k20793j56041
37295C56120L16303M90166M4717m75869m52896q371K90363K26824L8931j07665
37285G18623k95954m85784l98300L1428M08662L60333M0721j28229l7764R8629
37275C12365J57723J69645Q2683j47615l05861j51753J47737K39028J64922K31770
37265I00644L47602J10188l89683n37867j58259J83392J18618J0834J59836K02505
37255I47810j44574m37750k85175j26124m03624n56116J13737R84478P77064m30690
37245D39036j125844n05543M82242O86851K78405N3084R4599r95j46003O3489
37235C19321M66885M75580K8761k92620j62985P4270M2182j18553r4571M9897
$$ y = [1224057, 948545, 616430, 486282, 342153, 159752, 238579, 578795, 732954, 512161, 356120, 672423, 1162589, 1207306, 731437, 278541, 270170, 560533, 787357, 826288, 718623, 422669, -63115, -461415, -429987, -21325, 339008, 379729, 251500, 213736, 312365, 470088, 639733, 722416, 574801, 268940, 117187, 264924, 503952, 668874, 900644, 1248246, 1358434, 968751, 430884, 272625, 456017, 574635, 585469, 745305, 947810, 803236, 365486, 80311, -45813, -449437, -1005553, -891816, 92662, 869726, 439036, -686808, -1192351, -710109, -23258, 255147, 308231, 402830, 401835, 255832, 319321, 786206, 1261786, 1290547, 997927, 834942, 909212, 951394, 832841, 738270, 788167]
37225G88167j477k87069m65890k72839J29698L81057L92635L88346M84534M96971
37215B034133L01852J18038J59300K34291O5392j76779j34649N2783q9756n21395
37205B043210o42202k55274R5407L3158p9558R3434J87418j59842n01503k49001
37195E65247K72762L02003q8421j24524L40954N75489J64575l94201n41601l51978
37185G20305r4828J95123L89059J91288k34977k47275K52362M85133R358m82314
37175A183234k87812J04397j11236n63736k66550O22747Q94281J81114m83838
37166A272601l25952R8971M7651j90288N932M13195L84491k5260k26038j11585
37156A343718q6616k02517n3125M25890P35193N45950J24738j49026k55294l49953
$$ y = [788167, 786690, 499621, 33731, -239108, -109410, 271647, 664282, 1052628, 1537162, 2034133, 2335985, 2454023, 2613323, 2847614, 2913006, 2736227, 2601578, 2654361, 2564605, 2043210, 1401008, 1145734, 1241141, 1274299, 1194741, 1288175, 1475593, 1315751, 814248, 565247, 838009, 1140012, 1051591, 927067, 1268021, 1843510, 2008085, 1613884, 1072283, 720305, 625477, 820600, 1209659, 1400947, 1165970, 918695, 1171057, 1656190, 1665548, 1183234, 895422, 999819, 888583, 324847, 58297, 681044, 1575325, 1756439, 1272601, 946649, 1045620, 1093271, 902983, 908915, 1322110, 1706601, 1681341, 1455303, 1343718, 1257102, 1054585, 1001460, 1427350, 2162543, 2708493, 2833231, 2684205, 2428911, 2078958]
37146B078958m71528n90664o55883m97368p313N12415N73666K04318J550K60809
37136A408960M92581J78029l71496m38818J2383K69020q4675n88185n81778o2570
37126B33451M35011N50957L64110J03152o3511q418K46389L81080P0804m82658
37116A830367o58511k49912J60791O148l79673k08616N35549R59625N14963j98710
37106B312021k80486K49345O07038L87944m0918k55079l01664l55640l29590j27114
37096A865857N0550Q023n3851J54526M33948K90767k40058m54938M8766O60443
37086B764033N22084j91951m32899J86728P36632L02930o16109q12055j38894
37077B320499L66614J50200q9145L05584P87341M90812l21317o14343j27560L28203
$$ y = [2078958, 1607430, 1016766, 360883, -136485, -143798, 368617, 942283, 1146601, 1148151, 1408960, 1901541, 2079570, 1708074, 1269256, 1281639, 1550659, 1465984, 877799, 296021, 233451, 668462, 1219419, 1583529, 1686681, 1623170, 1614752, 1861141, 2242221, 2313025, 1830367, 1171856, 921944, 1082735, 1088883, 709210, 500594, 1036143, 1995768, 2510731, 2312021, 2031535, 2280880, 2887918, 3275862, 3234944, 2979865, 2678201, 2322561, 1992971, 1865857, 1916407, 1924430, 1870579, 2025105, 2459053, 2749820, 2509762, 2054824, 2103590, 2764033, 3286117, 3094166, 2661267, 2847995, 3584627, 3887557, 3271448, 2459393, 2320499, 2687113, 2837313, 2748168, 3053752, 3841093, 4331905, 4010588, 3396245, 3268685, 3596888]
37067C596888J28933l81495n53274k63962J67807M49857M54747K39323J08598
37058C947422L38222P04842O64519J54675j91250J26309Q01098J181398J081947
37049H809182P90992N38050L67597L85915P03988J144400J346663J222488J062945
37040A6372220J130957J340559J425739J302916J173867J300728J708537K113636
37032B7869159K179852J854083J392466J050363Q39723O24166L47704Q7520p8737
37023C6166299k09856n05385j130084j983854k719269l073007l083011k879552
37015B0582281k454598j866474j462867j503427j666294j408448q16450n60425
37007H843298q73473j143772q15894j91105Q2852q9476l30380m33848m22256k25697
$$ y = [3596888, 3725821, 3344326, 2791052, 2527090, 2694897, 3144754, 3599501, 3838824, 3947422, 4285644, 4990486, 5655005, 5809680, 5618430, 5744739, 6545837, 7727235, 8809182, 9600174, 10138224, 10505821, 10891736, 11595724, 12740124, 14086787, 15309275, 16372220, 17503177, 18843736, 20269475, 21572391, 22746258, 24046986, 25755523, 27869159, 30049011, 31903094, 33295560, 34345923, 35185646, 35809812, 36157516, 36245036, 36166299, 35956443, 35451058, 34320974, 32337120, 29617851, 26544844, 23461833, 20582281, 18127683, 16261209, 14798342, 13294915, 11628621, 10220173, 9403723, 8843298, 7969825, 6826053, 6010159, 5819054, 5901906, 5812430, 5482050, 5048202, 4625946, 4400249]
36997D400249J41775K80845j21062o27325m96842K13117O39870L24028k17037
36988D537618l57354j86322r0150n3901J01135J82601o7888l59076j55169M62928
36978D014422Q14864N66308J49632Q3054L14174M78511M37667K54733p1253m78080
36968F564032o38954k94531K73117M80301J96872p5006J02213N09474N80312J24761
36958G822591m84194p78355o42124k72388J41793N57044R03419R40755M93442
36949H681983j66311m35097o2128M86888O09753L29552J20954J30771P9269q2480
36939I693154j9232L15104M45222J46296r0981J74027N61703M35617j05884m20429
36929A1134597k75541P583K02570L42838L46407J15210n7177J62456M35348J35193
$$ y = [4400249, 4542024, 4822869, 4701807, 4074482, 3577640, 3790757, 4430627, 4754655, 4537618, 4180264, 3993942, 3903792, 3849891, 3951026, 4133627, 4065739, 3706663, 3551494, 4014422, 4829286, 5395594, 5545226, 5628280, 5942454, 6420965, 6858632, 7113365, 7042112, 6564032, 5925078, 5630547, 5903664, 6383965, 6580837, 6505831, 6608044, 7117518, 7697830, 7822591, 7338397, 6560042, 5917918, 5645530, 5787323, 6344367, 7247786, 8188541, 8681983, 8515672, 8080575, 8018447, 8505335, 9115088, 9444640, 9565594, 9696365, 9775634, 9693154, 9673922, 9989026, 10434248, 10580544, 10489563, 10663590, 11225293, 11660910, 11555026, 11134597, 10859056, 10866639, 11069209, 11412047, 11758454, 11873664, 11816487, 11978943, 12414291, 12549484]
36919A2549484n30160o35172K1520M84444Q6443m98798l16601L93187O06941N2098
36909A2213386n03733m29838L890J74884n8535k93415j45744K72063M51647J21565
36899A1806170l14810k63712J74815K89615j52020m83229j48243M27199N12505
36890A1848290J77526N9637K96668L97715J03126k62237l48751j90139K5177J76993
36880A2284005J44793j14293l54804k34819K14606N74995N33486J73255k17588
36871A3003636m19655l93261k86767k75470k99213j47593J03202Q9929k03475
36862A1171333k67814J18772L96304P7671l67407j95845L97632N86699K18927
36853A2136272p6608q761P1032L6034K18206N69312M86440j76766p18292o13432
$$ y = [12549484, 12019324, 11384152, 11405672, 11890116, 11976559, 11477761, 11161160, 11554347, 12161288, 12213386, 11709653, 11279815, 11283705, 11458589, 11400054, 11106639, 10960895, 11232958, 11684605, 11806170, 11491360, 11227648, 11402463, 11692078, 11540058, 11056829, 10908586, 11335785, 11848290, 12025816, 12085453, 12382121, 12779836, 12882962, 12620725, 12271974, 12081835, 12107012, 12284005, 12428798, 12314505, 11959701, 11724882, 11939488, 12514483, 13047969, 13221224, 13003636, 12583981, 12190720, 11903953, 11628483, 11329270, 11181677, 11284879, 11374808, 11171333, 10903519, 11022291, 11418595, 11496266, 11128859, 10933014, 11330646, 11917345, 12136272, 12059664, 12050903, 12121935, 12157969, 12376175, 12945487, 13431927, 13255161, 12536869, 11923437]
36843A1923437k22824n5392j4853J32417J84580l8097k12063n7706J19080p181
36833A1751398j57061L247J47768j73410o50098o17949j13337K17005J23167l9005
36823A0491725l8060k0472k7025R7380K41067P3403l30653m75075k02465O6054
36813I875879M3643Q59J91244L41098J24478k05348j47932K44474L76835n1943
36803A0793287o05276o75546k60031R0475L9833j13459N7865M10277L96878q5269
36793A0049034m44169k02568K95412L61054o7479l83658k03774J41599J33042
36784I678493k51976n88178n49868k10524J20010K04836M5073j70707k64265k38460
36774G774434k50210m05945n92582n50733j81428K31302K60007j13334l81827
$$ y = [11923437, 11700613, 11645221, 11630368, 11762785, 11947365, 11909268, 11697205, 11639499, 11758579, 11751398, 11594337, 11597584, 11745352, 11571942, 10921844, 10303895, 10190558, 10407563, 10530730, 10491725, 10453665, 10433193, 10406168, 10503548, 10744615, 10818018, 10487365, 10012290, 9809825, 9875879, 9919522, 9920381, 10111625, 10452723, 10577201, 10371853, 10223921, 10468395, 10845230, 10793287, 10188011, 9512465, 9252434, 9342909, 9382742, 9269283, 9327148, 9737425, 10134303, 10049034, 9604865, 9402297, 9697709, 10058763, 9991284, 9607626, 9403852, 9545451, 9678493, 9426517, 8838339, 8288471, 8077947, 8197957, 8402793, 8447866, 8277159, 8012894, 7774434, 7524224, 7118279, 6525697, 5974964, 5793536, 6024838, 6284845, 6171511, 5789684]
36765E789684j67938K06944J73353k08205l39016n3449J15299j58362m29624k20088
36755D708598J90075K14237j66554n03143n62242m01361l4498M26710N37228L0022
36745D439072n99626o36496j57446J26643m6446k55485k44297k72727m67176m90927
36735A395089j26402L44300N83332N67515L50511n2218l77477k47340K03628L66192
36725C007130M3811k61405k12013j64148m43886o83926m05239J82231M85094L07707
36715A855356j02871m65083n40267j83607L07702L36295j16504k98316J41055
36706I33760M39651q8745p85961n61958L56881P43931K53199k26005j56938p6253
36696H31562l83941n41547r6099L95659K33756k71535l14186J45970M17659J91040
$$ y = [5789684, 5621746, 5828690, 6002043, 5793838, 5454822, 5401373, 5516672, 5358310, 4928686, 4708598, 4898673, 5112910, 4946356, 4443213, 3880971, 3479610, 3445112, 3871822, 4409050, 4439072, 3839446, 3202950, 3045504, 3172147, 3125701, 2870216, 2625919, 2353192, 1886016, 1395089, 1268687, 1612987, 2196319, 2763834, 3114345, 3062127, 2684650, 2437310, 2640938, 3007130, 3050941, 2789536, 2577523, 2413375, 1969489, 1285563, 880324, 1062555, 1547649, 1855356, 1752485, 1287402, 747135, 563528, 871230, 1207525, 1091021, 792705, 933760, 1373411, 1284666, 498705, -63253, 293628, 1037559, 1290758, 1064753, 907815, 831562, 447621, -93926, -190025, 205634, 439390, 167855, -146331, -361, 417298, 608338]
36686F08338p2927J12990O14166Q78108N41845k01944p49576o77556k13731Q2068
36676I21781Q1683J44972L67889L32187j36142n21764l71049q790L1411j18647
36666G23531L090K86918K14875k11827m33058k16827P8224J92446K80772M06933
36656A325077L33621K5087j94684k14828l22244n51141m37521J79543O61733M12883
36646A217526k10356m26921j48570P5072J1303m6839M9265J05798J02137K59479
36636I87894M65507K59798l70188p63036m88662K7757J79387K0361k2923J14875
36626D10770K27917L51436N94662O76705K59429l58415n14065j45326J31130k8897
36616A605346k78802k59465r4800K8309K15730M86378N26064J72076k67957m88386
$$ y = [608338, 535411, 648401, 1262567, 2140675, 2682520, 2480576, 1731000, 1053444, 839713, 921781, 1003464, 1148436, 1516325, 1848512, 1712370, 1190606, 819557, 810767, 842178, 723531, 726621, 1013539, 1228414, 1016587, 583529, 366702, 444926, 637372, 918144, 1325077, 1658698, 1683785, 1489101, 1274273, 952029, 400888, -36633, 142910, 804643, 1217526, 1007170, 580249, 431679, 506751, 518054, 471215, 520480, 626278, 728415, 987894, 1453401, 1713199, 1343011, 579975, 91313, 119070, 298457, 318818, 295895, 410770, 638687, 990123, 1584785, 2261490, 2520919, 2162504, 1648439, 1503113, 1634243, 1605346, 1326544, 1067079, 972279, 1000588, 1216318, 1702696, 2228760, 2400836, 2132879, 1644493]
36606A644493n45027m61178k7762N95830O88587k0405o84392m30200L21025M87273
36596A568244m7799m29359k93198j51035k42440r7328M25502O58035K10460k84597
36586A316485j46700K96935L15092q9032l57213l14375k15510j06757J68506M47114
36576A314545L60916l8488k93420k05331m7127p2248j98051k45203j75423j3402
36566C86768K21482M29248M43426J90267k27341n64334n33807m4912N72421P81537
36556A654755M11879j52226m40191l37057j0872K84552K56091j88921o25149m78266
36546C74595J27862M19471Q9171k63872j50374O9356m301P54M55102P89236L13726
36535B220726m74144n05123J71774M43763j38670p72817p06702j68511K68983
$$ y = [1644493, 1099466, 638288, 610526, 1206356, 1894943, 1874538, 1190146, 759946, 1080971, 1568244, 1520445, 1091086, 797888, 646853, 404413, 307085, 732587, 1390622, 1601082, 1316485, 1169785, 1466720, 1781812, 1692780, 1335567, 1021192, 805682, 698925, 867431, 1314545, 1675461, 1636973, 1343553, 1138222, 1091095, 1018847, 820796, 575593, 400170, 386768, 608250, 1037498, 1480924, 1671191, 1443850, 879516, 345709, 300797, 873218, 1654755, 2066634, 1914408, 1474217, 1137160, 1126288, 1410840, 1666931, 1478010, 852861, 374595, 502457, 921928, 1011099, 747227, 596853, 666209, 661908, 662662, 1117764, 1907000, 2220726, 1746582, 1241459, 1413233, 1856996, 1718326, 945509, 238807, 70296, 339279]
36526C39279M21955L11115k2489k57169k0941M16655L75570j48708m09588j29221
36516H76458P2841j81609l39096J10567P20633P60173K23960l75547p11320o67763
36506D89297k06422L32688L58127q9313k02885L44415P35119K45166n55756o76307
36496G74129j91941Q3987k2040j4821J77519J10602k37083l66647j56191k9509
36486A28005j25726o8570K66002M45499J77251k64946n28618n85006m46125M889
36476i97345O26442Q99407N36584p1295l21536j28008Q2675R930j40849j414L60956
36465H55547M29094m3397n40298l96522K31331N63122L50970J28319J59328L127
36455A740621m72357n71926K7426M29845j51876r54434p48098J78299M97620J4922
$$ y = [339279, 761234, 1072349, 1049860, 792691, 771750, 1188405, 1563975, 1415267, 1005679, 876458, 949299, 767690, 428594, 539161, 1259794, 2019967, 2243927, 1868380, 1157060, 489297, 282875, 615563, 973690, 884377, 681492, 1025907, 1761026, 2006192, 1450436, 774129, 582188, 666175, 644135, 629314, 806833, 917435, 680352, 313705, 157514, 128005, 2279, -66291, 199711, 645210, 822461, 557515, 28897, -556109, -1002234, -997345, -370903, 528504, 1065088, 993793, 672257, 544249, 626924, 636854, 496005, 494591, 855547, 1284641, 1241244, 700946, 304424, 535755, 1098877, 1449847, 1578166, 1737494, 1740621, 1268264, 696338, 723764, 1153609, 1001733, 47299, -700799, -522500, -24880, -9958]
36445i958j54109M06572P58718L12933k30400k28748j27840l97342n45310r1012
36435c06496L99676K33653j96480j44547J46042o1076n63349m56859L23649Q17099
36425A91312N11704L7158O7756L31588K01570k67117m65627j70672J54791M2963
36415F35426l32854m13073m7131K60005M5241m11962m43692M7200M46115L21450
36405A06725j5872p0623J42726K86374K48193J53276P4591N0562J67947L45664
36395A489563K94658j4736j56443J14702L61496Q9021m03682m06309J01399L92703
36385A862372P8159l86197m67660k75546j83958j74231R099K98105L53330J05062
36375A218535j44606j91641j67223j94043j19274J62437L50870Q8519m02595m84932
$$ y = [-9958, -164067, 242505, 1001223, 1314156, 1083756, 855008, 727168, 329826, -215484, -306496, 93180, 326833, 130353, -14194, 131848, 70772, -492577, -949436, -625787, 191312, 703016, 740174, 807930, 1139518, 1341088, 1073971, 608344, 437672, 592463, 635426, 302572, -110501, -157632, 102373, 147614, -264348, -708040, -660840, -214725, 106725, 90853, 20230, 162956, 449330, 697523, 850799, 925390, 975952, 1143899, 1489563, 1784221, 1769485, 1613042, 1727744, 2089240, 2178261, 1774579, 1368270, 1469669, 1862372, 1940531, 1554334, 1086674, 811128, 627170, 452939, 462038, 760143, 1113473, 1218535, 1073929, 882288, 715065, 521022, 401748, 564185, 915055, 1003574, 600979, 116047]
36365A16047k0226L45010J13658k72923r9031M70714O01440R2914k87888J6272
36355A075987N33249N26528M3232l15463k96764j27448J3157J11712M7598k77462
36345A334326n71192l93480J81564N63801M07761O320k18208k66319l57486m35893
36335B51194k38732J99686M53594K47043j35947k15970K2062J50921l025p7067
36325F53759K06001N10730L90346M4028K3325K97664K51405k96429o94239l70306
36315A016284L41222O63740L44844j95683m66979l53430r3311q827j56474k11671
36305H79715Q9962M52453L55478j17416l21412k9344K36569Q8409j38889n2814
36295A442711J32300O5760j21637j74934k14318l52800k83899J74818N65232M16184
$$ y = [116047, 95821, 440831, 554489, 281566, 182535, 653249, 1254689, 1347603, 1059715, 1075987, 1609236, 2135764, 2178996, 1863533, 1566769, 1439321, 1452478, 1564190, 1611788, 1334326, 763134, 369654, 551218, 1115019, 1522780, 1529100, 1310892, 1044573, 687087, 251194, 12462, 212148, 665742, 912785, 776838, 560868, 582930, 733851, 730826, 653759, 859760, 1370490, 1760836, 1804864, 1828189, 2125853, 2377258, 2080829, 1386590, 1016284, 1357506, 2021246, 2366090, 2170407, 1703428, 1349998, 1256687, 1247860, 1091386, 879715, 969677, 1422130, 1777608, 1660192, 1338780, 1309436, 1546005, 1634414, 1495525, 1442711, 1575011, 1640771, 1519134, 1344200, 1129882, 777082, 493183, 668001, 1233233, 1649417]
36285A649417k8932l00611m32144n37229k35092O23591J177732N88449m99849
36276B005332p20518j4117L86162q536k98702J16946N37283K34402l68949n27955
36266A341348l13829j83616j21758O5681J81743L2654j11392k7038J8157j24831
36256G57119n2223L87175N25332p7173o37390k06613P35395Q83831Q6127m82813
36246A918767j72816K84788J16719l10908k43652K55051N34413L71249J25330
36237B878941P3938R2399m0858l38187o00936n79006k08001K35565L65905J42680
36227B022440j00461j37397q5038n1923J03542M26502N93891L39203p8207k30695
36217B801857j88217l46112o38605m94439K45137Q82966P24964L4524l44656j30415
$$ y = [1649417, 1620485, 1319874, 887730, 350501, 115409, 739000, 1916732, 2505181, 2005332, 1284814, 1270697, 1656859, 1648323, 1349621, 1466567, 2003850, 2238252, 1869303, 1341348, 1027519, 843903, 722145, 787826, 969569, 1002223, 890831, 863793, 881950, 757119, 704896, 1092071, 1617403, 1540230, 902840, 696227, 1431622, 2315453, 2401580, 1918767, 1745951, 2030739, 2147458, 1836550, 1592898, 1847949, 2382362, 2753611, 2878941, 2952879, 3045278, 3004420, 2666233, 2065297, 1486291, 1278290, 1513855, 1879760, 2022440, 1921979, 1784582, 1699544, 1647621, 1751163, 2177665, 2771556, 3110759, 3032552, 2801857, 2613640, 2267528, 1628923, 1134484, 1379621, 2262587, 2987551, 3022075, 2677419, 2547004]
36207B547004J49592K5300l11297m12290j69656K19516N63232P01953M88641R882
36197C811877l71088m27767l30190k83656j80088R9405L21637K41315P5306J79804
36187C136555M28956M19904J72305O4395J27415J2140k97109l56701j338L72717
36177D079239M63335M43894M53321K81398j07984k82890J3475L85181L77698J37960
36167F244627N0095J10511J28811J83687L90290N37274M30746K81459K94161K48010
36157H899671j3114j13822K10192M57240J14687l40344j17169N17662O05762Q2680
36147A0303445j65519J26539K08369k26522m12364J11546O07294L65989j22195
36138A0796582r1821K13776J61439k3814K80824Q27924Q17267K62444l4978J85711
$$ y = [2547004, 2696596, 2721896, 2410599, 1998309, 1828653, 2048169, 2611401, 3313354, 3801995, 3811877, 3440789, 3013022, 2682832, 2399176, 2219088, 2318493, 2640130, 2881445, 2956751, 3136555, 3565511, 3985415, 4157720, 4222115, 4349530, 4361670, 4064561, 3707860, 3706522, 4079239, 4542574, 4986468, 5439789, 5721187, 5613203, 5330313, 5343788, 5728969, 6106667, 6244627, 6294722, 6405233, 6534044, 6717731, 7108021, 7645295, 8076041, 8357500, 8651661, 8899671, 8886557, 8772735, 8982927, 9440167, 9554854, 9214510, 9097341, 9615003, 10220765, 10303445, 10137926, 10264465, 10472834, 10246312, 9833948, 9945494, 10552788, 10918777, 10796582, 10704761, 10918537, 11079976, 11056162, 11336986, 12164910, 12982177, 13244621, 13209643, 13395354]
36128A3395354L63360K29599K27189N89422Q67503P18883M60950M74181O37514
36119A7963955P00501P07055P38586P10350O99199R85538J488232J673164J356571
36110B7023151J083444J309628J705445J748622J563232J617666J939617K212899
36102D0203704K402327K712451L103760L391674L690638M235333M861332N183580
36094F9784799N243054N486617O112432O871138P505036P985158Q353875Q725120
36086A26067229R361662J0338511J1249180J1711570J2004135J2621576J3348530
36079B06702393J3492944J2977380J2358295J1675743J0209354P679868M798310
36072B79894287K152816o03928l831844o945844r190789j0780086j2374302j3855205
$$ y = [13395354, 13758714, 13988313, 14215502, 14804924, 15672427, 16391310, 16852260, 17326441, 17963955, 18664456, 19371511, 20110097, 20820447, 21519646, 22505184, 23993416, 25666580, 27023151, 28106595, 29416223, 31121668, 32870290, 34433522, 36051188, 37990805, 40203704, 42606031, 45318482, 48422242, 51813916, 55504554, 59739887, 64601219, 69784799, 75027853, 80514470, 86626902, 93498040, 101003076, 108988234, 117342109, 126067229, 135428891, 145767402, 157016582, 168728152, 180732287, 193353863, 206702393, 220195337, 233172717, 245531012, 257206755, 267416109, 275095977, 279894287, 282047103, 281443175, 277611331, 270665487, 261474698, 250694612, 238320310, 224465105]
36064B24465105j4548646j4397664j3981685j3499347j2648250j1510149j0655026
36057A33224338j0211364r631698q620124p592101o938216o474530n951868n532655
36049G2271782n370436n183242m652255l905086l270039k848958k605033k559949
36041D1876784k627293k534372k166963j744229j466744j279984j139395j149195
36033B7768609j256793j207727j010824j008993j252304j308725j009708q12590
36025A8900945r84589j035940n84050j98711n43217j110258q44727J53019O44695
36016A4397167P1334p00367p83271m65214m40201o20726m55909M9571L73526K87571
36006A1713481J3101k77550n68506p04859m96959j04033J03984N7739l632R680
$$ y = [224465105, 209916459, 195518795, 181537110, 168037763, 155389513, 143879364, 133224338, 123012974, 113381276, 104761152, 97169051, 90230835, 83756305, 77804437, 72271782, 66901346, 61718104, 57065849, 53160763, 49890724, 47041766, 44436733, 41876784, 39249491, 36715119, 34548156, 32803927, 31337183, 30057199, 28917804, 27768609, 26511816, 25304089, 24293265, 23284272, 22031968, 20723243, 19713535, 18900945, 17916356, 16880416, 16296366, 16097655, 15554438, 14444180, 13599453, 13752472, 14397167, 14468501, 13768134, 12984863, 12519649, 12079448, 11458722, 11002813, 11052384, 11425910, 11713481, 11726582, 11449032, 10880526, 10175667, 9678708, 9574675, 9678659, 9736398, 9732766, 9742446]
35996I742446k8412q8353J3979J88855R1869k83231m58327j61999K06540J43513
35986I366880k13901l28825r7966K5801k30525n36287m70641j51711m1581k58092
35976G063152m20555k28149Q9398R2955k44936n03352l97414j41375r4669k44772
35966D970283k81751r8413O7138K0278j20016j59357j21754j26056j30544k9843
35956C989965P8969k2351l16623m90966l14759N4758K35531L3971l52079n24559
35946B371857k85776J42074L59370K62071J26475J57106J84000J5217j50991l3228
35936C148175J68947M331m46917n62620j13823L09207J28286l86533n28734j11811
35926A608508M11338N83480L04842k57291p24185o43645J220N66606M76123K7131
$$ y = [9742446, 9714034, 9625681, 9639660, 9828515, 9920384, 9637153, 9178826, 9016827, 9223367, 9366880, 9152979, 8824154, 8726188, 8751989, 8521464, 7985177, 7514536, 7362825, 7321244, 7063152, 6642597, 6414448, 6503846, 6596801, 6351865, 5848513, 5451099, 5309724, 5215055, 4970283, 4688532, 4590119, 4657257, 4677535, 4557519, 4398162, 4276408, 4150352, 4019808, 3989965, 4068934, 4046583, 3729960, 3238994, 2924235, 2978993, 3214524, 3248495, 2896416, 2371857, 2086081, 2228155, 2587525, 2849596, 2976071, 3133177, 3317177, 3332394, 3181403, 3148175, 3317122, 3321453, 2874536, 2311916, 2198093, 2507300, 2635586, 2249053, 1720319, 1608508, 2019846, 2603326, 2908168, 2650877, 1926692, 1283047, 1284267, 1850873, 2326996, 2354127]
35916B354127m3189L27459M81947J25545k38990j60755J01012J05327r1355j81707
35906B779421j45623j42488j54629r2775k2725n342L8287P5396q7494l52321k59950
35895A629757K65139N67402J69104m01697l46883J73233L30452l2599k23568J00408
35885B230748M02104J81903k88848n06335m32533k80768r3434P3212l2526m34300
35875H19223o65831l49473K35535N46899M92481L72943L40560L08059K23638P5284
35865B399318k19541n94328o92995l18966J51548K07713q7511k43356p3752J62478
35855F90608K75589L31308L34432J73645p9284k07744k10402k53093k92934j75208
35845E86917n2431j84203l36807j7292O04553P25361J14056m34870k73557J55385
$$ y = [2354127, 2310938, 2638397, 3120344, 3245889, 3006899, 2846144, 2947156, 3052483, 2961128, 2779421, 2633798, 2491310, 2336681, 2243906, 2221181, 2215839, 2254126, 2329522, 2242028, 1889707, 1629757, 1894896, 2462298, 2631402, 2229705, 1882822, 2056055, 2386507, 2353908, 2130340, 2230748, 2632852, 2814755, 2525907, 2019572, 1587039, 1306271, 1212837, 1286049, 1253523, 819223, 153392, -196081, 39454, 586353, 1078834, 1451777, 1792337, 2100396, 2324034, 2399318, 2179777, 1585449, 892454, 573488, 725036, 932749, 845238, 601882, 528130, 690608, 966197, 1297505, 1631937, 1805582, 1726298, 1518554, 1308152, 1055059, 762125, 586917, 534486, 350283, 13476, -3816, 600737, 1326098, 1440154, 1005284, 731727, 887112]
35835H87112J19916k61198l97848k65110k23825j42028L59531R18022O90858k63103
35825A422327q10434l04943M92257N69523O8058j46017J43768L35285O1457l01391
35815A529890k85212K5818K17407R4036k00672m19442l97861j37177J47462J54160
35805G28409j67725m48255k49985L70284Q37670P25202K71712J916k2378j74252
35795A872598m99375n13968q659M49206K87240j64440j44710L59249N85841J48535
35785B371517m44808n72627k36377J92292M55374L96548n1569n64891n50422P6147
35775A071184O16943M74865l8745k15900J3478P5799l30022p91719p29723r9772
35765D6388N48022O30594J59486k36677q2852K63933J12798m29552m79181K57287
$$ y = [887112, 1007028, 745830, 347982, 82872, -140953, -282981, 76550, 994572, 1685430, 1422327, 611893, 306950, 799207, 1368730, 1436788, 1290771, 1434539, 1769824, 1831281, 1529890, 1244678, 1270496, 1487903, 1581939, 1381267, 961825, 563964, 426787, 574249, 728409, 560684, 112429, -137556, 232728, 1070398, 1795600, 2067312, 2069228, 2046850, 1872598, 1373223, 859255, 850596, 1299802, 1587042, 1422602, 1277892, 1637141, 2222982, 2371517, 1926709, 1354082, 1117705, 1309997, 1765371, 2161919, 2110350, 1545459, 995037, 1071184, 1688127, 2162992, 2124247, 1908347, 1921825, 1997624, 1667602, 875883, 146160, 46388, 594410, 1225004, 1384490, 1147813, 1064961, 1328894, 1441692, 1012140, 532959, 790246]
35755G90246Q71534N39718k18492l40732J58301L04601k58166p78108o16549j10410
35745C41943J25077Q1313Q2578J09817o8274l37583l16879M3086L24761K10143
35735E95982o1190N66M34855O72110K23077o18368j039509o66390M1821M18564
35725A518K93764m3520k51384j31710K59076N21510K74675k45577l85328l7750
35715B55274J68634p3179k12025J50348M57265J36760l35420k33420J38508N0655
35705E03400k35894O8275O83750N59533k47956m98722J50358M90990k20048r87691
35695B65995p08055J09043L40802O0817J20688N21121M63468k09713p34568n93412
35685c63814j08033K05897K18299N4673r5614j6943K80812M15849J13852l18321
$$ y = [790246, 1661780, 2201498, 1983006, 1642274, 1800575, 2105176, 1847010, 1068902, 452353, 341943, 467020, 548333, 630911, 740728, 672454, 334871, 17992, 61078, 385839, 595982, 534792, 535358, 970213, 1642323, 1865400, 1247032, 207523, -458867, -417046, 1518, 295282, 251762, 378, -131332, 127744, 649254, 923929, 678352, 293024, 255274, 423908, 350729, 138704, 289052, 746317, 883077, 547657, 314237, 452745, 503400, 267506, 335781, 1019531, 1579064, 1331108, 832386, 982744, 1473734, 1253686, 265995, -442060, -333017, 7785, 68602, 189290, 710411, 1173879, 964166, 229598, -363814, -471847, -265950, -47651, 7022, -88592, -105535, 175277, 591126, 704978, 386657]
35675C86657m07135k10176j25733j77845l8810L07532M74601K88903L1350l6046
35665D93298r813q7004k46993l22065k24129j7869J66194K80951M02333N18278
35655I53181L76909j57855o63105n50874K4074K39858j78430m73880k3122O45341
35645A92097O50071Q3152k46394r1770L9525j35282k95836j90260k9598n6532
35635h0827k05455l10860k81028m7635L03606M33588J83493m3409J64091M70245
35625E85809K55612k72575k63288L85511P07286J07520o78453o59008k854L43944
35615E09504P0488k46463j55811J36980L07573L51254K98853K4477l77144m59870
35605D59841n4041L13829R6957m16074m93503r7005O9252k54131m22003m464L76736
$$ y = [386657, -20478, -230654, -356387, -534232, -573042, -265510, 209091, 497994, 529344, 493298, 483485, 396481, 149488, -172577, -396706, -414575, -248381, 32570, 434903, 953181, 1330090, 1172235, 509130, -41744, -17670, 222188, 43758, -430122, -453244, 192097, 842168, 925320, 678926, 587156, 626681, 491399, 195563, 5303, -24295, -80827, -286282, -597142, -878170, -925805, -622199, -188611, -5118, -48527, 115564, 585809, 841421, 568846, 305558, 691069, 1398355, 1505875, 827422, 168414, 165560, 509504, 579992, 333529, 177718, 314698, 622271, 973525, 1272378, 1296855, 919711, 459841, 405800, 719629, 816586, 400512, -92991, -189996, -120744, -374875, -796878, -801342, -424606]
35594d24606L1162n55208l91828M18961Q08874M07885m200J14125K93821P0035
35584G69021k08184j44287j8977j17874j17748J67636K00852l14151o21732m0998
35574d46442P34095N86979k34341n13330P624L73589P3568k86879j76377R9669
35564B18155J69501J86866K61968J22492k44034l36586M5539L77120K12470j63813
35554H49678k98483k37697k08436j24330J33802L31884K07426j02467k86801k56670
35544G906q2002J73959L62213L04391R7147K0802N3021q7668l26013k27659K01258
35533D97355L50822l2239l59523j35229K20510Q0005l46849l77749N0213L76269
35523C23585L43125K38453K36697J31037j75553m21879l92447j94347k154J45790
$$ y = [-424606, -393444, -948652, -1340480, -921519, -112645, 295240, 291040, 405165, 698986, 769021, 560837, 416550, 397573, 279699, 161951, 329587, 530439, 216288, -405444, -446442, 287653, 874632, 640291, 126961, 134585, 508174, 581742, 294863, 118486, 218155, 387656, 574522, 836490, 958982, 714948, 378362, 423901, 801021, 1013491, 849678, 551195, 313498, 105062, -19268, 114534, 446418, 653844, 551377, 264576, 7906, -74096, 99863, 462076, 766467, 863614, 884416, 937437, 849769, 523756, 296097, 497355, 848177, 815938, 456415, 321186, 541696, 621701, 274852, -102897, -52684, 323585, 666710, 905163, 1141860, 1272897, 1097344, 675465, 283018, 88671, 86517, 232307]
35513B32307J87590R841k62659k61149J17215M45824K96426j51019l59514j87271
35503F7591K0408R0702K59970N36900L91054l92857r92218m93228O24011R33022
35493A045355J07035n64291j61647M50867O9584q89747j081059l34226K61076
35484a097053J80724M7339K92834M81330K94653J13966J71355O3369l78429n79682
35474d09594j73657K72834J28577l01867l12938J08253L56166R9195l94454o33013
35464a260498l18577L58440P19727L14447l08137j82589O01321Q71722J31119
35455I26975o44764n45424p4076r5329l15209N5428P40375P66675Q5162l92501
35445E07312k65676j7266Q0104L03787N82434L52916l61461p23878l81626q1907
$$ y = [232307, 419897, 429738, 167079, -94070, 23145, 468969, 765395, 614376, 254862, 67591, 87999, 178701, 438671, 975571, 1366625, 973768, -18450, -511678, 112333, 1045355, 1152390, 588099, 426452, 877319, 946903, 57156, -1023903, -1358129, -1097053, -916329, -868990, -576156, -94826, 199827, 313793, 485148, 548517, 170088, -409594, -583251, -310417, -181840, -483707, -796645, -688392, -332226, -233031, -627485, -1260498, -1579075, -1220635, -500908, -186461, -494598, -677187, -75866, 795856, 926975, 282211, -263213, -337289, -432618, -747827, -692399, 47976, 814651, 899813, 507312, 241636, 224370, 304474, 608261, 1190695, 1543611, 1182150, 458272, 76646, -5261]
35435e261m08353p26363j87609Q03486J067295L39225m26181m70481j38338q6081
35425b38661k47529j35631J95781J79791k81607n10914l2596O33066O62689J20407
35415C44796j85218M8594K30789q8146m81604l68113O2779K05702j1712j30558
35405c72691M1129J94527R0486r3601r1099Q6870K20768J46647r0866k58665j68438
35394b94933L8846J0758k92897m36373r0833M54308O67608M78197K48079J63397
35384I46157N0602k00739m00139l64876k16295j88022k49997j17648L04700O25348
35374A89091L54431l60812p21489k65722M43383N68255J62577n7996O4571k052
35364C74237l44295l14514K73006O10917J65485l70182j85056K97928J59566m24218
$$ y = [-5261, -413614, -1139977, -1327586, -524100, 543195, 882420, 456239, -14242, -152580, -238661, -486190, -621821, -426040, -246249, -527856, -1038770, -1071366, -438300, 224389, 344796, 159578, 208172, 438961, 350815, -130789, -498902, -436123, -230421, -242133, -372691, -331562, -137035, -46549, -140150, -231249, -144379, 76389, 223036, 132170, -126495, -294933, -256087, -245329, -538226, -974599, -1065432, -611124, 56484, 534681, 782760, 946157, 996759, 796020, 395881, 31005, -185290, -373312, -623309, -740957, -436257, 189091, 543522, 182710, -538779, -804501, -361118, 207137, 369714, 311718, 376289, 374237, 29942, -284572, -11566, 599351, 764836, 394654, 209598, 507526, 667092, 242874]
35354B42874m45407K64094P16700K58087n19184o66315p0694N74445O29465J03629
35344A087694m22131l99900O8085L58794J67024j43385k32495l04131n21069m80686
35334h22200Q4401N95861M15248p9056r4543K46896K06148j82586j70660K89258
35324D88767L79758j46546n12021k42337J06596J5588j72643n7081O3736j25961
35314b02144k78831n6779J83852O1242q7610J57422M75898L77504J11274J96871
35304I38699M40531K66967k43433m98685l95187l27207k98656Q5028O78598P23786
35294A370441k5251q24769r34252n03659j10021O6886J67825J70708p234j65720
35284g95046n3113J84652K01886K5291J8023K64795L97699J67105j48938j38360
$$ y = [242874, -202533, 61561, 778261, 1036348, 517164, -149151, -219845, 354600, 984065, 1087694, 665563, 265663, 333748, 692542, 859566, 716181, 483686, 179555, -341514, -822200, -737799, -141938, 273310, 194254, 99711, 346607, 552755, 370169, 199509, 488767, 868525, 721979, 209958, -32379, 74217, 89805, -82838, -139919, -76183, -202144, -480975, -537754, -353902, -292660, -380270, -222848, 253050, 630554, 741828, 938699, 1379230, 1646197, 1402764, 904079, 508892, 181685, -116971, -31943, 646655, 1370441, 1345190, 520421, -413831, -917490, -1027511, -960625, -792800, -622092, -629326, -795046, -848159, -663507, -461621, -436330, -418307, -153512, 244187, 411292, 262354, 123994]
35274A23994J58954L33078J77513q2395j42902P712J49447J30322J1002m7707
35264H19018M799K3104j52967m13067m20764o6174K95911K91050N5681j2861P5295
35253D99025n0136l95515m79102j17583K11207J34523R257K84798O47098M33960
35243A177532l06393q22108o82282k18107J01128K04606K10885J36564R88j01506
35233b98693j72383k80395k95765K2954N70587Q51006N71130L7465k23716p7769
35223G04421J39771N6632l28170o38854n27112r9043J84927J03761n5859P595
35213d51931J38660O4531n8288J05711M26892M27707J8572l58663l64219j17542
35203a68570J29012K72995K49384Q757l01234m31853l44100j65931O8427L07864
$$ y = [123994, 282948, 616026, 793539, 711144, 568242, 575954, 725401, 855723, 866725, 819018, 823817, 846921, 693954, 280887, -139877, -206051, 89860, 380910, 436591, 423730, 499025, 448889, 53374, -425728, -543311, -332104, -197581, -188324, 96474, 743572, 1177532, 871139, 49031, -633251, -851358, -750230, -545624, -334739, -198175, -197187, -298693, -471076, -751471, -1047236, -1024282, -453695, 397311, 968441, 1005906, 782190, 704421, 844192, 900824, 572654, -66200, -593312, -692355, -507428, -403667, -459526, -451931, -313271, -248740, -307028, -201317, 225575, 653282, 671854, 313191, -51028, -168570, -39558, 233437, 482821, 491578, 190344, -241509, -585609, -751540, -683113, -375249]
35193c75249K97503k4539j46731L51019Q94789N13641o26979j234688p02171N2662
35183a000743P1597k31726N5722P62775R25735L10887l33997m62826l09886k23809
35173d36271j66661n7825j3535j7817J52732M49890M51694R249m10047l63240
35163d01831p7235l9612j95815p7629L42540N07493J49555k21248q5849K41300
35153A41669J14706l38723l68315J27793L22415j97628o16002j05701P54555P41837
35143E76606j34160n91229L4190Q81631R04849K48626k70069l93803m38976m80955
35133C36710k62297J84443M18130J86095k25638l60441j21861J48764P0696l20310
35123E4291n75063l89319l4696K7473j41866n3698L83994O39444L55075q8897
$$ y = [-375249, -77746, -102285, -249016, 102003, 996792, 1510433, 883454, -351234, -1053405, -1000743, -929146, -1160872, -1105150, -342375, 583360, 894247, 560250, 97424, -212462, -436271, -602932, -660757, -674292, -692109, -539377, -89487, 362207, 371456, -38591, -401831, -479066, -518678, -714493, -792122, -449582, 57911, 207466, -13782, -99631, 141669, 256375, -82348, -450663, -322870, -455, -198083, -814085, -919786, -165231, 576606, 442446, -148783, -114593, 767038, 1671887, 1920513, 1650444, 1256641, 817665, 336710, 74413, 258856, 676986, 863081, 637443, 277002, 155141, 303905, 374601, 54291, -520772, -910091, -944787, -917314, -1059180, -1112878, -728884, -89440, 265635, 176738]
35113A76738j40509J44017K72255M3892k64076l28779j07742K08673L83154L29293
35103G16916K07325K01551K05986m038k80739k04970J86714K70681k49651p53930
35093B95845n10252K54578O60147L88132M387M9689L49469M25590K02042n130
35083B114497j2329K4426p5181k26822k47378j83618k29115l05374n7326N31977
35073A333757Q53672M05836m04098p07693l26391J07455J72648J27300J95732
35064A758218R5258l44814o84501m89227j751K86768L37386L31462J43799l29145
35054A103453o28090k46431M50886N66378l6652m83301j35610N16665N85489j5431
35044A677356n57092m99527q3561J14460p9870l26998k88071k9937J55534J62806
$$ y = [176738, 36229, 180246, 452501, 496393, 232317, -96462, -204204, 4469, 387623, 716916, 924241, 1125792, 1331778, 1327740, 1047001, 842031, 1028745, 1299426, 1049775, 295845, -214407, 40171, 700318, 1088450, 1092837, 1142526, 1491995, 1917585, 2119627, 2114497, 2102168, 2126594, 2051413, 1824591, 1577213, 1393595, 1164480, 859106, 801780, 1333757, 2187429, 2593265, 2189167, 1481474, 1155083, 1262538, 1435186, 1562486, 1758218, 1853476, 1508662, 824161, 334934, 333183, 619951, 957337, 1288799, 1432598, 1103453, 475363, 228932, 679818, 1246196, 1209544, 726243, 590633, 1107298, 1692787, 1677356, 1120264, 620737, 537176, 651636, 571766, 244768, -43303, -73240, 82294, 245100]
35034B45100J10835O4763k2842j09013p9482p074r5701k95363k99776n2028R7249
35023d43332o7038k65066j67693J05796K39101J97478J26305J5895j71589k48330
35013f78473o0902J58275R6320j12656q6508J58682K14762m9441k61770j12621
35003g34332K07401L17944J43671r3995k13409k15461j68867j03266j9167O8280
34993h11201J28484J56905J85340K07101J29849r7134l27686l30165o8540K67619
34983e59428N14251O32179N54606J98755k80015n09848l44480p4818k6550j42417
34973c7765j58416j1952J56845K69202L22499K35125n6616l66013l75875o3600
34963h6566J86470L9383l25381m06962o2635K43284P5684k78556j63859M24092
$$ y = [245100, 355935, 420698, 397856, 288843, 209361, 202287, 106586, -188777, -488553, -540581, -443332, -510370, -775436, -943129, -837333, -598232, -400754, -274449, -258554, -430143, -678473, -739375, -581100, -484780, -597436, -683944, -525262, -310500, -359941, -621711, -734332, -526931, -208987, -65316, -159311, -372720, -588181, -757048, -860314, -879481, -811201, -682717, -525812, -340472, -133371, -3522, -100656, -428342, -758507, -827047, -559428, -45177, 587002, 1141608, 1340363, 1060348, 550500, 206020, 131202, 104652, -37765, -196181, -208133, -51288, 217914, 540413, 775538, 718922, 352909, -22966, -86566, 99904, 139287, -186094, -593056, -655691, -412407, -336723, -615279, -779138, -355046]
34953c55046P16521K89105k53429j67317L15715L98758n7102m45178m16400k36461
34943b10834j37511j0801J51297J28075q0111k13116k35789l22105l51608n0732
34933a333235L62175L95581J73077K72248N93627L63807m83414r64557n29890
34924a150581J11150K26287J41885L53920M90619R1146l53280j72051K67420J81211
34914A87726k53011k42631J98130K87150j73886n22634l55671k8338P9939L7041
34904g86185l1861j44185j62360J02073M02760K63567k27808m01434N2513O19793
34894c13127O60005J91793k47746k89355q0815k5698k53388m15812j52894L23806
34884f03231M73175K50718J67925L87018L92687j01020n57847m30377J800J79024
$$ y = [-355046, 361475, 650580, 397151, 229834, 545549, 944307, 887205, 442027, 25627, -210834, -348345, -359146, -207849, -79774, -159885, -373001, -608790, -930895, -1282503, -1333235, -971060, -575479, -402402, -130154, 463473, 827280, 343866, -620691, -1150581, -1039431, -813144, -671259, -317339, 173280, 264426, -88854, -260905, 6515, 187726, -65285, -307916, -109786, 177364, 3478, -519156, -874827, -903165, -823226, -786185, -818046, -962231, -1124591, -1022518, -619758, -356191, -583999, -985433, -932920, -313127, 346878, 538671, 290925, 1570, -79245, -104943, -358331, -774143, -927037, -603231, -130056, 120662, 288587, 675605, 1068292, 967272, 409425, -20952, -19152, 159872]
34874A59872J33630J76948J76299j39321m95671m07786L5145L35448L14066J39009
34864D27639r0478k73623j57159K28046L61423j4039l82104k52594N2663M3675
34854e6551q1818M3404J69201j5542j23967K15817M66082K0046o02405n21598
34844d87331J8753J39519j21013l8625L33904L02419o3770m2522L16844K49832
34834F08010k60218m32994j35176j5767j45342P1052N13350L61116k93253l71595
34824a00817L01431N88385K1188l64143J10043N39582P976q76877j036545n00806
34814a310583L4689L58178N45749L95250r2665l49742q8968J61469O499j09955
34804d50079J83319L89472L2678m14604l16037P7270J72503M3173R4931K35746
$$ y = [159872, 293502, 470450, 646749, 507428, 11757, -396029, -360884, -25436, 288630, 427639, 337161, 63538, -93621, 134425, 495848, 481809, 99705, -152889, -100226, -56551, -138369, -94965, 74236, 58694, -65273, 150544, 616626, 636672, 34267, -487331, -468578, -329059, -450072, -488697, -154793, 147626, 83856, 41334, 358178, 608010, 347792, -85202, -220378, -236145, -381487, -310435, 202915, 564031, 270778, -100817, 200614, 788999, 810187, 446044, 556087, 1095669, 1103645, 226768, -809777, -1310583, -1275894, -917716, -371967, 23283, -69382, -419124, -508092, -346623, -340124, -450079, -266760, 122712, 155390, -259214, -575251, -497981, -325478, -282305, -187374, 48372]
34794D8372J41858o6789q5441J153o4862k77873n09762o48499m01738L81436J042336
34783d39809O80052l62179o83106R4111O81848K05742m29041j95967L28307J45801
34773B5759l55800k16634L15012L17999q7099m3602M26245N28742J60223o3762
34763A007083o0568k98400o66207n39746K2607K59121n7220l36694j87627J54961
34753g02690M28379N73606M23540p4811m55329l10844m7673k33828n11003j62650
34743a073303N11375N67432L4315j18832L15649M41128r2377l89868J63898P94336
34733A153753N33506k98034o64046l40284k8693j71022l73290q9305N59217Q75063
34723A156865M31143l38618o00711j80481K06979j4312m66183m55657k5240K41413
$$ y = [48372, 190230, 123441, 38000, 39153, -25709, -303582, -813344, -1461843, -1863581, -1482145, -439809, 240243, -121936, -805042, -710931, -29083, 176659, -252382, -448349, -120042, 25759, -330041, -546675, -231663, 86336, -763, -44365, 381880, 910622, 1070845, 1007083, 946515, 648115, -18092, -557838, -535231, -276110, -333330, -670024, -857651, -702690, -274311, 299295, 722835, 648024, 192695, -118149, -165822, -399650, -910653, -1073303, -561928, 5504, 39819, -79013, 236636, 677764, 585387, 195519, 359417, 1153753, 1687259, 1389225, 725179, 384895, 356202, 185180, -188110, -277415, 281802, 1156865, 1588008, 1249390, 648679, 468198, 675177, 660865, 194682, -260975, -286215, -44802]
34713d4802J90143J80376L11734K49533j38767n32608o23225m09948k8819L39782
34703e06601M54528K61915M3375j2496j38073m84540o25200j29230O28981Q68057
34693C60716M44871r0798l28512l00334j17582R8729P7415k39593l89327l1997
34683e16412L62070J62365l43275l28969K73101P07492N67315K00493n8590k56867
34673G68723l66108k23217j2265r9841l32016k01300K43864L98814R0380j79617
34663H7417r6520Q4637J54546K31338K63657l8821n59008p08935k61643L09064
34653e34268N14269L56954K9587l41874n20550k70602K05854M17445K45101J970
34643A03886j41001k68769l17369j28157J38569J99491J51702K20911K36887K2478
$$ y = [-44802, 145341, 325717, 637451, 886984, 748217, 215609, -407616, -817564, -846383, -506601, -52073, 209842, 253217, 240721, 102648, -381892, -1007092, -1136322, -507341, 360716, 805587, 714789, 386277, 85943, -31639, 67090, 144505, -95088, -484415, -516412, -154342, 8023, -335252, -664221, -391120, 316372, 883687, 1084180, 1025590, 768723, 402615, 179398, 167133, 67292, -264724, -466024, -222160, 176654, 267034, 87417, -9103, 75534, 230080, 461418, 725075, 686254, 127246, -581689, -843332, -534268, -19999, 336955, 366542, 24668, -495882, -766484, -560630, -143185, 101916, 103886, -37115, -305884, -623253, -751410, -612841, -413350, -261648, -40737, 196150, 218628]
34633B18628k7583L94394O38898k1468r29626p83672K54453O68097l8566o27605
34623b54050k37263L26217J57243k63205j29279K73279K92034J49249L53279N70141
34613A237645J87220m87456o24610j64493J87353N8318k40878l28160j31704K13104
34603i3661M35338K90724o2641j59280Q3141K08296k0680k48044j72826J6936
34593B77303J25556K27588K18249j66036o15004m21031K73276M36847j66762m36113
34583b46127K15800P21479J17779p25262m98512L58147M36855k93424n83189m6694
34573e43148M06735K67239O6519J51199J38861j00674q2513L03697M50051P6297
34563A134263k58704j01112K02371J58663j59090m11943m68975l05963O8653L83002
$$ y = [218628, 191045, 585439, 1224337, 1202869, 273243, -510429, -255976, 412121, 373555, -254050, -491313, -165096, -7853, -271058, -400337, -127058, 164976, 314225, 667504, 1237645, 1424865, 937409, 312799, 148306, 335659, 393977, 153099, -175061, -306765, -93661, 341677, 632401, 569760, 410480, 493621, 701917, 681237, 433193, 260367, 277303, 402859, 630447, 848696, 682660, 67656, -353375, -80099, 356748, 189986, -246127, -30327, 691152, 808931, 83669, -414843, -56696, 380159, 86735, -496454, -543148, -136413, 130826, 197345, 348544, 487405, 386731, 304218, 607915, 1057966, 1134263, 875559, 774447, 976818, 1135481, 976391, 564448, 95473, -210490, -141837, 241165]
34553B41165K91496n7152j50911Q7557K02442J0606j26468j8880M495k53889m41919
34542b11458k40943J01677J81369J6360r7921l3671J22174K41413K06474j1368
34532B74106k42689k85604j68490k5398J64040L85035L31433j78075o78154n39478
34522i63274R4952M80365L51969J60169J98076K35426J47852J48680J79675j55956
34512H77934p49438q55111k15736M28363M52954K41411L53045N07024J85491l14005
34502I11932l40730m5689j38077o49853q38662l38303L69342P28108O90837M21969
34492G70874L3792k34953j33783J47651J42689j60824k87644r6405j3170k12726
34482d4499k31746J86767M73008N5970o28763o60243N1014O45891M81372j69799
$$ y = [241165, 532661, 475509, 324598, 412155, 614597, 625203, 498735, 479855, 484350, 230461, -211458, -452401, -350724, -169355, -152995, -250916, -284587, -162413, 79000, 285474, 274106, 31417, -254187, -422677, -448075, -284035, 101000, 432433, 254358, -423796, -963274, -868322, -387957, -35988, 124181, 322257, 557683, 705535, 854215, 1033890, 877934, 128496, -726615, -942351, -513988, -61034, 180377, 533422, 1040446, 1225937, 911932, 571202, 525513, 387436, -262417, -1101079, -1439382, -1070040, -341932, 348905, 770874, 804666, 569713, 435930, 583581, 726270, 565446, 277802, 181397, 168227, -44499, -276245, -89478, 383530, 439500, -189263, -849506, -798492, -152601, 328771, 158972]
34472A58972o37455n73181n4304N79125Q32718L87090m64936r70894o89851O3149
34462a369567O20057O03123J35123l29108l34237J33669N05292K52870l35502
34453a18280m57445M7205M19511J31469k93070j18736M25920N08173k6882m69963
34443D7902l21623J02718K73262J15664j40608l72861n38623m85971q2546N08197
34433h94489Q41943N71301j42161o62120n21840j5759J68938o6428j15067K93221
34423e42461N68777K32471k08244n8232L77402K90006k46443l77399J12136M69075
34413F17088K06412k20702k43107N9132L15371L66786J72674k15141m27036j18033
34403E13444L73532L80229l4410j82598J3540r4318n36165m30998M39648R27649
$$ y = [158972, -478483, -1051664, -1105968, -526843, 305875, 692965, 228029, -742865, -1432716, -1369567, -749510, -146387, -11264, -340372, -674609, -540940, -35648, 217222, -118280, -575725, -528520, -109009, 22460, -270610, -389346, 36574, 544747, 517865, 47902, -273721, -171003, 102259, 217923, 77315, -295546, -834169, -1320140, -1402686, -894489, -52546, 518755, 376594, -285526, -807366, -823125, -654187, -720615, -835682, -542461, 26316, 258787, 50543, -7689, 369713, 659719, 413276, 35877, 148013, 617088, 823500, 602798, 359691, 418823, 734194, 1100980, 1273654, 1058513, 631477, 513444, 886976, 1267205, 1232795, 1050197, 1063737, 969419, 433254, 2256, 441904, 1369553]
34393A369553K13008p91051p45316J76606P57897N65322J52546j75512o06415
34384I16638r50001o38356K67015R29535Q03266K12525k62017m22113l59280k00062
34374B97150q4639q5618r6995m569J35341K69773M63255O19454M31605r8270m85880
34363A360607m51274l28821m01749l68940O737K91172Q5606j91940k10L41036
34353C42224K32990p0620R1495N27651M55514j34198m66427l05546k07706l61651
34343A03726k57484K41086N03631J92257j65485r9275Q8599J3161q1724J40935
34333F79427M10325K70137j60712l79981k37755m3906m8700j49885j20167N1548
34323B70331J23361n6069k22432K5053N42142O47631Q4068m82944l74683J16049
$$ y = [1369553, 1582561, 791510, 46194, 222800, 980697, 1546019, 1698565, 1523053, 916638, -33363, -671719, -404704, 524831, 1328097, 1540622, 1278605, 856492, 497212, 297150, 212511, 126893, 29898, 25329, 160670, 430443, 893698, 1513152, 1944757, 1846487, 1360607, 909333, 580512, 178763, -190177, -183440, 107732, 193338, 1398, 1188, 342224, 575214, 504594, 596089, 1123740, 1579254, 1445056, 978629, 673083, 465377, 103726, -153758, 87328, 590959, 783216, 617731, 518456, 607055, 620216, 538492, 679427, 1089752, 1359889, 1199177, 819196, 581441, 537535, 488835, 338950, 218783, 270331, 393692, 337623, 115191, 140244, 682386, 1330017, 1414085, 931141, 556458, 672507]
34313F72507K31339j21354m09192l60418j24888K02253N27174M96864K2569k50762
34303H86092J66486N86530K7155j122610j479124o54487L06376N62532L75881
34294c45169J68769j41667m84538l67753K38912O12146L09082k34078m45277k50931
34284i40504K06120P08657P47403N0959o43574l86191M22135M98282k44945n61187
34274a42845k6370L21005l7815k16787K48700M38224j26365m20711J31259L72695
34264E40990m68198j065603j95507Q90707M38435p14657m66519R47231J305165
34255A212044O4101r14442n06097J82150N3487l03283n6759L92697L59165P2528
34245E55591N3666J98092J71632j959k01192l90196l23457J90795O54504L81688
$$ y = [672507, 903846, 782492, 373300, 12882, -112006, 90247, 617421, 1114285, 1136854, 886092, 1052578, 1639108, 1666263, 543653, -935471, -1589958, -1283582, -721050, -345169, -176400, -318067, -802605, -1170358, -931446, -319300, -10218, -244296, -689573, -940504, -734384, -25727, 721676, 772635, 129061, -257130, 165005, 663287, 418342, -142845, -169215, 151790, 113975, -102812, 145888, 584112, 457747, 37036, 168295, 540990, 72792, -992811, -1188318, -297611, 140824, -573833, -1040352, -93121, 1212044, 1276145, 361703, -144394, 37756, 91243, -212040, -268799, 123898, 483063, 555591, 609257, 807349, 978981, 977022, 775830, 385634, 62177, 252972, 907476, 1289164]
34235A289164l27015n01047k9817K22759q5838l62308l20174l72457n20926j62394
34225a170053O12440Q32391K37219k31044o1839L1100l87830n38059J35104Q07404
34215B66833N67939j71820n36093m99757m14415j71582K24045K09411k63455k49981
34205a038875N68791R57523P7127q34241l36387P04820M27657r11648j284081
34196a669314j14158R54018P05243j35642m88666l57334r8247L16045O69350L90532
34186A71827l07464l46805N16963J051895L50046p65085r82219k88116L71072
34177b27886N10882L20446M949k64773j62893L25513O14939K88291k43970m00463
34167G65035k80614k67839k64566j0274K48723J40115j07898n5002J06533j37610
$$ y = [1289164, 962149, 461102, 431285, 654044, 568206, 205898, -114276, -486733, -1007659, -1170053, -557613, 274778, 511997, 280953, 219114, 250214, -137616, -675675, -540571, 266833, 834772, 662952, 126859, -372898, -787313, -958895, -734850, -525439, -788894, -1038875, -470084, 487439, 564566, -269675, -606062, 98758, 526415, -385233, -1669314, -1783472, -829454, -124211, -259853, -748519, -1105853, -1204100, -888055, -218705, 171827, -135637, -482442, 34521, 1086416, 1436462, 671377, -310842, -598958, -227886, 282996, 603442, 608391, 343618, 180725, 506238, 1121177, 1409468, 1165498, 765035, 484421, 216582, -47984, -58258, 190465, 330580, 222682, 167680, 274213, 136603]
34157A36603o48229p55501l14931R1356O8628j20480j19091N0331K34458M06163
34147i70693N06538M03976J50741k4030n6299q8793j34763k4423K48275M30160
34137D40689L46481R1629j55843k72874j60166J35280K63256j13598p54084r25529
34127a104759k60612O91417J008624M24590l67246m90353J10369O01206L04433
34118I17669l89543n27262O1805N06284J68168m65061o16774l52358j90006p7872
34108i64950L27295O60700K18169o84174q48424L1859Q11211O07803O9193J59526
34098C88208N46626K50233o26509r79731l90985L21309L74604k3285k76638k54650
34088f70818j52313j2025J97257L51646L71192L98906M95854M05585n6014n62168
$$ y = [136603, -511626, -1267127, -1582058, -1490702, -1422074, -1542554, -1661645, -1611314, -1376856, -970693, -464155, -60179, 90562, 66532, 10233, -78560, -213323, -237746, 10529, 440689, 787170, 878799, 722956, 450082, 289916, 425196, 688452, 574854, -179230, -1104759, -1365371, -673954, 334670, 759260, 392014, -98339, 12030, 613236, 917669, 528126, 864, 62669, 568953, 737121, 272060, -344714, -697072, -887078, -964950, -637655, 23045, 241214, -442960, -1291384, -1259525, -448314, 159489, 228682, 388208, 934834, 1185067, 558558, -421173, -812158, -490849, -116245, -139530, -416168, -670818, -823131, -835156, -637899, -286253, 84939, 483845, 979699, 1385284, 1329270, 767102]
34078G67102n84224q2514M08306M01802m4599m85028n70888l36275j02377j26905
34068g55600l08593l02796k652K40219Q4307k26381j09379M92301Q97360N75806
34058E84592q6357l01228N0527L36420J04171l82228o09071l88956J37479O55062
34048A00411P06365N8915p44598p38388K08214J002661O83461l06769p97249m33162
34038b60139J54645M11021L12980k8263m18783l75930K95776Q38522L76902o46134
34028F60597r36058k96079J25883j96744l37083L22619Q55304L37779m97540m35555
34018c96877K45820L82930p4706j73581K31135K96517j64127l06008J98906N28786
34008G68795J03613m78533m85241j40587l0299j17676j1944K76258M30384L41475
$$ y = [767102, 182878, 100364, 508670, 910472, 865873, 380845, -190043, -526318, -628695, -755600, -1064193, -1366989, -1369641, -1129422, -1045115, -1271496, -1380875, -888574, 8786, 584592, 498235, 197007, 247534, 583954, 688125, 305897, -303174, -692130, -554651, 100411, 806776, 865691, 121093, -617295, -409081, 593580, 1277041, 970272, 173023, -260139, -105494, 305527, 618507, 590244, 171461, -204469, 91307, 929829, 1306731, 660597, -275461, -571540, -445657, -642401, -979484, -656865, 198439, 536218, 38678, -396877, -151057, 231873, 157167, -16414, 214721, 511238, 347111, 41103, 240009, 768795, 872408, 393875, -91366, -231953, -262252, -379928, -391872, -115614, 314770, 656245]
33998F56245J07614j65005k73488j8061L55595K74403l14124p13259m48790M3307
33988d95563J43836j7103Q9369M71011O53437M38829P5025k22941m30361m51847
33978B53692j62984K57362M09190J65030j83213l31958k97754k60429k53728j62860
33968e67652J5889Q0574p8587j79125J51016O94280O86912j31072r17405p48495
33958i93665N3169L64292r0689m29167o5320M58599M81454K21391J77858K15588
33948C93510m5436m02694l59859M3963L21728K50915j4313l12355m83977k92324
33938i00842J75953L42454q4734m93502j73719N43333P02867J24903m07303l45097
33928e15687L120J63647J25507O2508j4019q7502m7387O3618Q0640O1346J89790
$$ y = [656245, 763859, 598854, 325366, 307305, 662900, 937303, 623179, -90080, -538870, -495563, -351727, -368830, -279461, 191550, 844987, 1283816, 1358841, 1135900, 705539, 253692, 90708, 348070, 757260, 922290, 739077, 407119, 109365, -151064, -404792, -567652, -551763, -471189, -549776, -728901, -577885, 116395, 803307, 672235, -245170, -993665, -940496, -576204, -666893, -1096060, -1161380, -702781, -221327, 64, 177922, 393510, 348074, -54620, -414479, -370516, -48788, 202127, 187814, -124541, -608518, -900842, -724889, -382435, -467169, -960671, -1134390, -591057, 111810, 236713, -170590, -515687, -512567, -348920, -223413, -160905, -174924, -262426, -309813, -246195, -165555, -104209, 85581]
33917H5581L15245Q7016l83074n42220k27546P3882J6330q9087J30550M56824
33907g6499M15744l2576m79103n47792j87593L09053M71490J12112l23108k42256
33897e80528K22677L65526K9611j10607L02586O30676K71125l00950l03881M8138
33887E74373l9411n10712m99744J85450O44836K54078m15566n29395j64616M8288
33877d52419j4174N1773L45656M50194R9762l82425m83039j21693K68517K43824
33867E976j19229k79902P6123N28238M03441k68320p16309m74880R215J15973
33857g19674n1310J3702L28612M35939J66884j66592l04482k64024o1652K74655
33847c47942M20258N1507m98291m80761J99463P55482O07863J04890j84155k78593
$$ y = [85581, 400826, 487842, 104768, -437452, -664998, -591116, -574786, -663873, -533323, -76499, 339245, 306669, -172434, -720226, -907819, -598766, -127276, -15164, -338272, -580528, -357851, 7675, 37286, -73321, 229265, 859941, 1131066, 830116, 526235, 574373, 534962, 24250, -475494, -290044, 354792, 608870, 193304, -336091, -500707, -452419, -466593, -414820, -69164, 381030, 480792, 98367, -384672, -506365, -237848, 5976, -113253, -393155, -317032, 211206, 614647, 346327, -369982, -844862, -835647, -719674, -770984, -757282, -428670, 7269, 174153, 7561, -296921, -560945, -622597, -347942, 72316, 123823, -374468, -855229, -655766, 99716, 707579, 812469, 628314, 349721]
33837C49721m00223l45215J03646N45161M49782J4222j69617q4893j77822m07397
33827a22635k49436K89276M92569K8313m94784m30676L0509L02462K21747j7600
33817D9745l31362o53679o86212k49932K95451M49426K69666K32490M61805N52959
33807C90357K21025k71975m93565l60384r9326J00235J83290J18841n3142j07784
33797c72428J54594N18841M63739j37326o81391n44796N2328L48749J19233j31659
33787b10116r1980n7113j76861l9490N04677Q00150L44592l01971l55275k0439
33777C96174M1822m6084K11917M40397r9459r35281q15818J89504O07781m3492
33767e2539m24738L22727J039655M70260o28469p58090o8986J29464l64567n04942
$$ y = [349721, -50502, -395717, -292071, 253090, 702872, 717094, 547477, 462584, 284762, -122635, -372071, -82795, 409774, 438087, -56697, -487373, -456864, -154402, 67345, 49745, -281617, -935296, -1621508, -1871440, -1575989, -1126563, -856897, -624407, -162602, 390357, 611382, 339407, -154158, -514542, -613868, -513633, -330343, -211502, -264644, -372428, -217834, 301007, 764746, 627420, -53971, -598767, -546439, -197690, -78457, -210116, -302096, -359209, -536070, -575560, -70883, 729267, 1073859, 771888, 416613, 396174, 437996, 391912, 603829, 1044226, 944767, 9486, -806332, -616828, -9047, -52539, -477277, -154550, 885105, 1355365, 726896, -31194, -100180, 29284, -335283, -840225]
33757h40225J00790O36852M85796k2998l95511m97303k24652M16712Q72662N89364
33747A121487j2071o3703K88428P2120p63988j046785k34499O01751L48699n35174
33737b23735q16488k32370M29738N87091L76977J02304j32214k23019k4591L75966
33727B19659O19930M22180j21237n75610n43271r2777K62008J73232r5601j03814
33717A64699P9548N8000j55620j46401J56255L28605J64273l2789n6605j42659
33707D17306m15905m98750o2450N82513Q32120N09617m1052m01113m04435j79732
33697C38119j2445m0166p7706O8285K26513J46809J3357J54028L35474M2762n01849
33686F93181m44536K96535O19109j84328j187875j015084K10158J039287O71398
$$ y = [-840225, -739435, -102583, 383213, 360215, -35296, -532599, -757251, -340539, 532123, 1121487, 1109416, 1045713, 1334141, 1406261, 642273, -404512, -639011, -37260, 311439, -223735, -1040223, -1272593, -842855, -255764, 121213, 223517, 91303, -131716, -156307, 219659, 839589, 1261769, 1140532, 564922, 21651, -71126, 190882, 364114, 268513, 164699, 244247, 302247, 146627, 226, 156481, 485086, 649359, 616570, 559965, 417306, 1401, -497349, -559799, 22714, 854834, 1364451, 1323399, 922286, 517851, 338119, 325674, 285508, 207802, 276087, 502600, 649409, 662766, 816794, 1152268, 1195030, 693181, 248645, 545180, 1164289, 979961, -207914, -1222998, -1012840, 26447, 697845]
33677F97845j52372l61868Q0338M05336J71651k90133m50130k43180l3852n3891
33667b30256j08582M6124K40904J22397k26824l15067J7148L02226J28846k37812
33657b60896k60382R0779L44908K05379j35426l45686l29956j84085K9004L15699
33647e30662N96558O33029K44442l67556o81645m13381J03615L00147M7656k76166
33637c43963l18903r8407J29259J18549j65811l95086j16058N79109R11382L83382
33627F83453m03107n06916N389K42592p7609k78572O1058M43722L50612K4020
33617E44642r7422p2361j08419q6609Q3235J31338p9027j92706M2700K72961J03196
33606E41528k47509l35593j62791j565R3747J74469J48375L3595Q3583K98078
$$ y = [697845, 545473, 183605, 263943, 669279, 840930, 550797, 100667, -142513, -176365, -230256, -338838, -292714, -51810, 70587, -156237, -471304, -454156, -151930, -23084, -260896, -521278, -430499, -85591, 119788, -15638, -361324, -691280, -875365, -846361, -530662, 65896, 698925, 943367, 575811, -105834, -519215, -415600, -115453, -67797, -343963, -662866, -761273, -632014, -513465, -679276, -1074362, -1190420, -611311, 300071, 683453, 280346, -226570, -221181, 21411, -56198, -334770, -273712, 170010, 520622, 544642, 447220, 374859, 266440, 179831, 263066, 394404, 315377, 122671, 165371, 438332, 541528, 294019, -41574, -204365, -205930, -112183, 62286, 210661, 244256, 327839, 625917]
33596F25917K56480j78786n02851l49617q3191j09417j84626m24J49006j7952
33586c95461q6977L06488O16970K24156l63006k21388M24110N35750k8630l80803
33576F31209j75025o1369l55540m62344n2282K64863K5546k43246M4462M93788
33566A10062L84539j57313m09167j54985J59114K14040J54783J55849J27755n1211
33556E33466k99447m19727k85867P1401M67621O61193N21616J32684k56517m02634
33546G23789k78375j15027j09229j33875L275Q2302k59734p24614n13840L83006
33536i42322Q39998J65517p17197n78950K38222M44885p5600j89493M61079Q39465
33526D85604L04691l41581k75673M6273j14280m31776k02499L11803L27007r5738
$$ y = [625917, 882397, 703611, 200760, -148857, -232048, -341465, -526091, -526515, -377509, -395461, -482438, -175950, 441020, 665176, 302170, 80782, 504892, 1040642, 1012012, 631209, 456184, 394815, 39275, -423069, -475351, -210488, -184942, -428188, -383726, 110062, 494601, 337288, -71879, -226864, -67750, 146290, 301073, 456922, 584677, 533466, 234019, -185708, -471575, -400174, 67447, 728640, 1250256, 1382940, 1126423, 723789, 445414, 330387, 221158, 87283, 90558, 172860, -86874, -811488, -1325328, -942322, -102324, 63193, -654004, -1232954, -994732, -549847, -625447, -814940, -353861, 485604, 790295, 448714, 173041, 219314, 105034, -326742, -529241, -217438, 109569, 13831]
33516A3831j99630J45480K78690q5687m17593k69050J05532K74999K16737J09053
33506A72362j4385j21365m0810K42802M05768J84814k02582l19764j11014M2550
33496B38376j13987l58632l44433r3318J03351J49355J81616J82059l0227l19998
33486d05838k27615K80238N18862N679p11204p43245j19417L32281K31276K4534
33476h14449Q6756J88838P8777m4345N8978K73582M12287M68227L81717R435m63943
33465F35860n56330j78385J58579P9929j56773j75696m1029J3246M369L4770O5396
33454a16064J16780L12212M93396K57501l44028o46410k73341K72056L20407q8593
33444C03916m48071m88157k36758K05510N44163L79772j58986l39961J47287N98596
$$ y = [13831, -185799, -40319, 238371, 152684, -264909, -533959, -428427, -153428, 63309, 172362, 157977, 36612, -4198, 238604, 644372, 829186, 626604, 306840, 195826, 238376, 124389, -234243, -578676, -671994, -568643, -419288, -237672, -55613, -85840, -405838, -633453, -353215, 165647, 171326, -539878, -1283123, -1402540, -1070259, -838983, -814449, -727693, -538855, -460078, -504423, -445445, -171863, 240424, 708651, 1090368, 1099803, 635860, 79530, -98855, 59724, 139653, -17120, -192816, -233845, -220599, -216230, -181460, -116064, 716, 312928, 806324, 1063825, 719797, 73387, -199954, 72102, 392509, 303916, -144155, -632312, -869070, -663560, -119397, 260375, 101389, -238572, -91285, 507311]
33434E07311K98449l69865m99895L6261N80738O96182M68466K6037n37801q94760
33424C11123p62715l56109m8083K00648N50937P40866M77095P2495j3305K0724
33414A193676k56195n76603l80400P6273M0063m12204m52956N4628L23233L2397
33404c58088j87358M218O4515k81707l91998J13176N17313J91985k61117k7172
33394f16233M94551L92936j65835k77908O9738J4321n38843n96991K33236R08012
33384h3016M89005l67973l86170M20077Q41991L11556l90628m54042j48350j07799
33374A24651k31086p1571J29511k26559q43843o66380M62592J259345P18969m20070
33364B35559p51175j53802L07314R9156k32377j88837K0668J31167K64187M21081
$$ y = [507311, 805760, 435895, -64000, -27739, 552999, 1249181, 1717647, 1743684, 1205883, 311123, -451592, -807701, -855784, -655136, -104199, 636667, 1113762, 1186257, 1172952, 1193676, 937481, 360878, -19522, 56751, 96814, -315390, -768346, -713718, -390485, -358088, -545446, -541228, -476713, -758420, -1150418, -1037242, -519929, -327944, -589061, -616233, -121682, 271254, 105419, -172489, -102751, -88430, -627273, -1224264, -991028, -83016, 405989, 38016, -348154, 71923, 913914, 1225470, 834842, 380800, 232450, 124651, -106435, -178006, -48495, -275054, -1118897, -1785277, -1322685, -63340, 655629, 235559, -515616, -669418, -362104, -262948, -495325, -684162, -663494, -532327, -268140, 152941]
33354A52941K67985k30837n82736m95137k72063j88608n1355K73595M57963K49740
33344d18512n5582q0653J01886K38695K84906K26767l3013l19577k13760K51126
33334a7717M63076J51529j60242l9222J57050j2694k95394k90470j76252k03379
33324d23715n8971M64007P29082J36306p11348p64478j31205J76193j00363k36638
33314i21130O1701K24417R17n4689L23612N39260J78593k13029j3794M72222N26431
33303A124511O4235l92938m72962k35736N0863J06629j51615m19666l24492p128
33293f58299M6445j81561j75319K21856N08224L73166J64779J62652Q8778j98606
33283C52115k38638J96873M66572J7514n70311l81198L73739O41788R9208n03488
$$ y = [152941, 420926, 190089, -392647, -887784, -1159847, -1348455, -1399810, -1126215, -668252, -418512, -474094, -554747, -452861, -214166, 70740, 297507, 264494, -55083, -268843, -17717, 445359, 596888, 436646, 397424, 554474, 541780, 246386, -44084, -220336, -423715, -482686, -18679, 710403, 846709, 135361, -629117, -760322, -584129, -684492, -921130, -859429, -635012, -634095, -688784, -365172, 174088, 352681, 139652, 125858, 598080, 1124511, 1188746, 795808, 322846, 87110, 137973, 244602, 92987, -326679, -651171, -658299, -611854, -793415, -968734, -746878, -238654, 134512, 299291, 461943, 550721, 352115, 113477, 310350, 776922, 794436, 224125, -157073, 216666, 858454, 957662, 454174]
33273D54174n76992l87691l21755k29506J15903M49812L56102r1504l82722j87929
33263h02108K65275M45489J33415k57603j53291L75846O28540K52827k30758k31724
33253D25908L8288K7932k08388k18386m2184r7738k87076p8863M48894N24814
33243E33201r1448o08746l60676K22448L41724j3544k53300j45157N4447J98069
33233a22982L56232M16063J37908l44117n44912k76951P4660Q0767j90438l44992
33223g58762k07078K2363J14957J29909K65398M82594M93928K01026q0589m8946
33213F14800J19803O4221j36224q2140K08628K26774j96464n25852l36565j6252
33203e9271j51048n55489n32206M8797N58685N32045K23570Q4506J48151J86943
$$ y = [454174, -122818, -510509, -832264, -1061770, -945867, -496055, -139953, -231457, -614179, -802108, -536833, -91344, 42071, -215532, -368823, 7023, 635563, 888390, 657632, 425908, 464196, 492128, 283740, 65354, 23170, -74568, -361644, -440507, 8387, 533201, 441753, -166993, -527669, -305221, 36503, 22959, -230341, -375498, -321051, -122982, 233250, 649313, 787221, 443104, -101808, -378759, -304099, -223332, -413770, -758762, -965840, -943477, -828520, -698611, -433213, 49381, 543309, 744335, 663746, 614800, 734603, 798824, 662600, 580460, 789088, 1015862, 819398, 293546, -43019, -59271, -210319, -765808, -1298014, -1249217, -690532, -158487, 65083, 149589, 297740, 484683]
33193D84683J38166Q9309N5452J3009N517L3711j2725j57303k34802j50268o0710
33182B04039j06322j50589l5825Q1378l1866k44759k38215m8730m420j12747r001
33171f97057L52993M86286J38442k19068j08926J63063J3283m25096m98256r6058
33161h90394J91750J8199k88769l59707k25103L1303M22593O67551L44947k79236
33151c66866l34726L30670P22456J98033m31877j73111M98388L91945m52332q57668
33141d75088l92477J31803J39432L1490J46634J33348j58117j89624K49794M59645
33131G6840k6082n14623k07656M73086N35374n7253m46424k20974J74264K81813
33121F8365J23135j43520m00760l94429K5702M63304L52163j66998l32050J36568
$$ y = [484683, 622849, 712158, 767610, 780619, 786136, 819847, 807122, 649819, 415017, 264749, 204039, 97717, -52872, -88697, -7319, -39185, -283944, -522159, -570889, -575309, -688056, -697057, -344064, 142222, 280664, 61596, -47330, 115733, 129016, -296080, -794336, -890394, -698644, -680445, -969214, -1328921, -1554024, -1522721, -1100128, -432577, -87630, -366866, -701592, -370922, 351534, 549567, 117690, -55421, 442967, 834912, 382580, -475088, -867565, -735762, -596330, -564840, -418206, -284858, -442975, -632599, -382805, 76840, 50758, -463865, -671521, -198435, 336939, 279686, -166738, -387712, -213448, 68365, 191500, 47980, -352780, -747209, -721507, -258203, 93960, -73038, -405088, -268520]
$$ [...]
##END NTUPLES=NMR SPECTRUM
##END=
