##TITLE=31Pdec_DPAA1003
 aceton-d6, 24 sc
 11.3.2022
##JCAMPDX= 6.0         $$ Bruker NMR JCAMP-DX V2.0
##DATA TYPE= NMR SPECTRUM
##DATA CLASS= NTUPLES
##ORIGIN= UXNMR, Bruker Analytische Messtechnik GmbH
##OWNER= root
$$ XWIN-NMR		Version 3.5
$$ Fri Mar 11 10:46:53 2022 Russian Standard Time (UT+4h)  she@DPX200
##.OBSERVE FREQUENCY= 81.013821
##.OBSERVE NUCLEUS= ^31P
##.ACQUISITION MODE= SIMULTANEOUS
##.ACQUISITION SCHEME= undefined
##.AVERAGES= 24
##.DIGITISER RES= 16
##SPECTROMETER/DATA SYSTEM= spect
##.PULSE SEQUENCE= zgpg30
##.SOLVENT NAME= Acetone
##.SHIFT REFERENCE= (INTERNAL, Acetone, 0, 248.564)
##AUDIT TRAIL= $$ (NUMBER, WHEN, WHO, WHERE, WHAT)
$$ ##TITLE= Audit trail, XWIN-NMR		Version 3.5
$$ ##JCAMPDX= 5.01
$$ ##ORIGIN= Bruker BioSpin GmbH
$$ ##OWNER= she
$$ F:/spectra/data/she/nmr/P31/1/pdata/1/auditp.txt
$$ ##AUDIT TRAIL=  $$ (NUMBER, WHEN, WHO, WHERE, WHAT)
(   1,<2022-03-11 10:45:50.32 +0400>,<she>,<DPX200>,
      <created by zg, POWCHK disabled, PULCHK disabled
       configuration hash MD5:
       00 E9 B6 7A A2 85 ED C7 34 08 36 98 17 FE 4E 26
       data hash MD5: 32K
       C0 A3 04 36 2E B9 33 A2 6A C0 AB C8 B6 86 25 09>)
(   2,<2022-03-11 10:45:53.85 +0400>,<she>,<DPX200>,
      <Start of raw data processing
       efp BC_mod = 2 LB = 1 FT_mod = 6 PKNL = 1 PHC0 = -9168.621 PHC1 = 67.27451 SI = 64K 
       data hash MD5: 64K
       CF 7F 29 43 6B 52 10 A6 C5 10 90 17 8F 79 CC F1>)
(   3,<2022-03-11 10:46:12.75 +0400>,<she>,<DPX200>,
      <pk PHC0 = -6.774863 PHC1 = 28.8 
       data hash MD5: 64K
       C9 E9 4B FA 2A 19 19 CF D3 81 7F CE 62 A3 D5 2D>)
(   4,<2022-03-11 10:46:16.45 +0400>,<she>,<DPX200>,
      <abs ABSG = 5 
       data hash MD5: 64K
       28 24 17 20 53 54 FE 1E 39 5B A4 AD 0A 30 62 B0>)
$$ ##END=
$$ 
$$ hash MD5
$$ CF CF F1 B3 50 B5 3A 05 FD 76 B6 F2 67 EB 0E 2E
##$RELAX= 
##$RELAX= 
##$RELAX= 
##$RELAX= 
##$RELAX= 
##$RELAX= 
##$RELAX= 
##$RELAX= 
$$ Bruker specific parameters
$$ --------------------------
##$DU= <F:/spectra>
##$EXPNO= 1
##$NAME= <P31>
##$PROCNO= 1
##$TYPE= <nmr>
##$USER= <she>
##$AMP= (0..31)
100 100 100 100 100 100 100 100 100 100 100 100 100 100 100 100 100 100 
100 100 100 100 100 100 100 100 100 100 100 100 100 100 
##$AQSEQ= 0
##$AQ_mod= 1
##$AUNM= <au_zg>
##$AUTOPOS= <>
##$BF1= 81.014009
##$BF2= 200.13
##$BF3= 200.13
##$BF4= 200.13
##$BF5= 200.13
##$BF6= 200.13
##$BF7= 200.13
##$BF8= 200.13
##$BYTORDA= 1
##$CFDGTYP= 0
##$CFRGTYP= 5
##$CHEMSTR= <none>
##$CNST= (0..31)
1 1 145 1 1 1 1 1 1 1 1 1 1 1 1 1 1 1 1 1 1 1 1 1 1 1 1 1 1 1 1 1 
##$CPDPRG= <waltz16>
##$CPDPRG1= <>
##$CPDPRG2= <waltz16>
##$CPDPRG3= <>
##$CPDPRG4= <mlev>
##$CPDPRG5= <mlev>
##$CPDPRG6= <mlev>
##$CPDPRG7= <mlev>
##$CPDPRG8= <mlev>
##$CPDPRGB= <>
##$CPDPRGT= <>
##$D= (0..31)
0 1 0 0 0 0 0 0 0 0 0 0.03 2e-05 3e-06 0 0 0 0 0 0 0 0 0 0 0 0 0 0 0 0 
0 0 
##$DATE= 1646981149
##$DBL= (0..7)
120 120 120 11 120 120 24 19 
##$DBP= (0..7)
150 150 150 150 150 150 150 150 
##$DBP07= 0
##$DBPNAM0= <>
##$DBPNAM1= <>
$$ [...]
##$SUBNAM3= <"">
##$SUBNAM4= <"">
##$SUBNAM5= <"">
##$SUBNAM6= <"">
##$SUBNAM7= <"">
##$SUBNAM8= <"">
##$SUBNAM9= <"">
##$SW= 501.771253377433
##$SWIBOX= (0..15)
0 1 3 0 0 0 0 0 0 0 0 0 0 0 0 0 
##$SW_h= 40650.406504065
##$TD= 32768
##$TD0= 1
##$TE= 0
##$TE2= 300
##$TE3= 300
##$TEG= 300
##$TL= (0..7)
0 120 53 12 22 120 120 120 
##$TP= (0..7)
150 150 150 150 150 150 150 150 
##$TP07= 0
##$TPNAME0= <>
##$TPNAME1= <>
##$TPNAME2= <>
##$TPNAME3= <>
##$TPNAME4= <>
##$TPNAME5= <>
##$TPNAME6= <>
##$TPNAME7= <>
##$TPOAL= (0..7)
0.5 0.5 0.5 0.5 0.5 0.5 0.5 0.5 
##$TPOFFS= (0..7)
0 0 0 0 0 0 0 0 
##$TUNHIN= 0
##$TUNHOUT= 0
##$TUNXOUT= 0
##$USERA1= <user>
##$USERA2= <user>
##$USERA3= <user>
##$USERA4= <user>
##$USERA5= <user>
##$V9= 5
##$VALIST= <valist>
##$VCLIST= <CCCCCCCCCCCCCCC>
##$VD= 0
##$VDLIST= <DDDDDDDDDDDDDDD>
##$VPLIST= <PPPPPPPPPPPPPPP>
##$VTLIST= <TTTTTTTTTTTTTTT>
##$WBST= 1024
##$WBSW= 4
##$XGAIN= (0..3)
0 0 0 0 
##$XL= 0
##$YL= 0
##$YMAX_a= 5557
##$YMIN_a= -5758
##$ZGOPTNS= <>
##$ZL1= 120
##$ZL2= 120
##$ZL3= 120
##$ZL4= 120
##$ABSF1= 248.5645
##$ABSF2= -253.2056
##$ABSG= 5
##$ABSL= 3
##$ALPHA= 0
##$AQORDER= 0
##$ASSFAC= 0
##$ASSFACI= 0
##$ASSFACX= 0
##$ASSWID= 0
##$AUNMP= <proc_1d>
##$AZFE= 0.1
##$AZFW= 0.5
##$BCFW= 0
##$BC_mod= 2
##$BYTORDP= 0
##$COROFFS= 0
##$CY= -3
##$DATMOD= 1
##$DC= 0
##$DFILT= <>
##$DTYPP= 0
##$F1P= 0
##$F2P= 0
##$FCOR= 1
##$FTSIZE= 65536
##$FT_mod= 6
##$GAMMA= 0
##$GB= 0
##$INTBC= 1
##$INTSCL= 5.30512e-09
##$ISEN= 30
##$LB= 1
##$LEV0= 0
##$LPBIN= 0
##$MAXI= 10000
##$MC2= 0
##$MEAN= 0
##$ME_mod= 0
##$MI= 50
##$NCOEF= 0
##$NC_proc= -6
##$NLEV= 6
##$NOISF1= 182.463
##$NOISF2= 159.3651
##$NSP= 0
##$NTH_PI= 0
##$NZP= 0
##$OFFSET= 248.5645
##$PC= 4
##$PHC0= -9175.396
##$PHC1= 96.07451
##$PH_mod= 1
##$PKNL= yes
##$PPARMOD= 0
##$PSCAL= 0
##$PSIGN= 0
##$REVERSE= no
##$SF= 81.014009
##$SI= 65536
##$SIGF1= 159.3651
##$SIGF2= -187.1042
##$SINO= 113.3802
##$SIOLD= 16384
##$SREGLST= <1H.CDCl3>
##$SSB= 0
##$STSI= 65536
##$STSR= 0
##$SW_p= 40650.406504065
##$SYMM= 0
##$S_DEV= 0
##$TDeff= 32768
##$TDoff= 0
##$TI= <>
##$TILT= no
##$TM1= 0
##$TM2= 0
##$TOPLEV= 0
##$USERP1= <user>
##$USERP2= <user>
##$USERP3= <user>
##$USERP4= <user>
##$USERP5= <user>
##$WDW= 1
##$XDIM= 65536
##$YMAX_p= 482415295
##$YMIN_p= -50913524
$$ End of Bruker specific parameters
$$ ---------------------------------
##NTUPLES= NMR SPECTRUM
##VAR_NAME=  FREQUENCY,     SPECTRUM/REAL,   SPECTRUM/IMAG
##SYMBOL=    X,             R,               I
##VAR_TYPE=  INDEPENDENT,   DEPENDENT,       DEPENDENT
##VAR_FORM=  AFFN,          ASDF,            ASDF
##VAR_DIM=   65536,         65536,           65536
##UNITS=     HZ,            ARBITRARY UNITS, ARBITRARY UNITS
##FACTOR=    0.620285442955139, 1,           1
##FIRST=     20137.2065510759, 0,            0
##LAST=      -20513.1999529892, 0,           0
##MIN=       -20513.1999529892, -50913524,   0
##MAX=       20137.2065510759, 482415295,    0
$$ Real data points
##PAGE= N=1
##DATA TABLE= (X++(R..R)), XYDATA
$$ [...]
48418b302073P52335K90095R4344L58875M85423J55442j86184k21168k48211l15200
48408a136322J64022J201439J610065O05740p57129r41010j16417K92129j79589
48399G42928o69208o32844m39946l00723N1110M40233K94613j65404o8076M96601
48389b50716M03525m99767q24612J04165R03085K63882q12891m96876R74543J603747
48379A368085N12648j091421j817192j527051p19248K08348P54288N31615P5928
48370a704000L84544J282231J385064K14599q65697o53561Q9953J308o44390n35150
48360a045099L56485P08511Q7341l50891J77994Q27785N95648p1772j57766K46927
48350A375163K99199n3820j12133J70082N4621n48953p02594K7262O80603L10872
$$ y = [-2302073, -1549738, -1259643, -1165299, -806424, -321001, -165559, -351743, -572911, -821122, -1136322, -972300, 229139, 1839204, 2444944, 1687815, 746805, 630388, 922517, 742928, 73720, -559124, -999070, -1299793, -1248683, -808450, -513837, -679241, -747317, -250716, 152809, -346958, -1171570, -1067405, -164320, 99562, -713329, -1210205, -235662, 1368085, 1880733, 789312, -1027880, -2554931, -3274179, -3065831, -2311543, -1779928, -1704000, -1319456, -37225, 1347839, 1562438, 696741, 43180, 133133, 134441, -509949, -1045099, -688614, 19897, 107238, -243653, -65659, 762126, 1357774, 1286002, 1128236, 1375163, 1674362, 1620542, 1508409, 1678491, 1733112, 1184159, 481565, 508827, 1189430, 1500302]
48340A500302n09241n58366J72315N96888L06073M1021K53755L35243k16597q02028
48330A119365o44501m6028J26689k14428m13565k20147n6542j81291l39012l09276
48320a178736j73001K4720K93564L71938J7745l63626j13061N66587O92275o8405
48310G0000q54567q55928l16593J59246N19776Q62941Q24004J49447o05776p25259
48300g72709l23851j0954P8647K09701L32297J97019n4285j29168j86358m75736
48290a135397o27840j35553O00103N99656k76958j042130q55986N6652Q84172
48281a933281J061784N63140j20346k82702K32522O78835L38828m29401p56807
48272f47428n84897n19978n79112k04393M59575N26495j10542m07165J74154P30923
$$ y = [1500302, 991061, 432695, 605010, 1201898, 1507971, 1548992, 1802747, 2137990, 1921393, 1119365, 474864, 428836, 555525, 341097, -72468, -292615, -349157, -530448, -869460, -1178736, -1351737, -1327017, -1033453, -661515, -643770, -1007396, -1120457, -553870, 138405, 70000, -784567, -1640495, -1957088, -1797842, -1278066, -415125, 408879, 558326, -47450, -772709, -1096560, -1107514, -1028867, -819166, -486869, -289850, -344135, -473303, -659661, -1135397, -1763237, -1898790, -1298687, -699031, -975989, -2018119, -2874105, -2817453, -1933281, -871497, -308357, -428703, -711405, -478883, 199952, 538780, 109379, -647428, -1232325, -1752303, -2331415, -2535808, -2076233, -1549738, -1660280, -2067445, -1893291, -1162368]
48262a162368L62046l95143m65583J06250L77875L0321k30644K55280J243591
48253A21625J842406J333928j57883j612800j919042r24699M70342J282971J208561
48244A645409N05724l25989p02255l90002Q6700O4607j88226J88198J083228J199269
48234C166663q5730j553067j636726m49709N30081L99384l56709p88483n13234
48225a287530J43506N48706L11461k92167n68783k62595J19620O4706k17957j56916
48215a597949L70440R29773J048433N88525k21603r16894j090913p06411o5768
48206a662367M66991O23045L57684M4468J82305O03112N08766k40615o40076j26117
48196A17196K58369m62033j223495m10416J238248J403639j76286j196342l85280
$$ y = [-1162368, -800322, -1195465, -1661048, -1554798, -1176923, -1146602, -1377246, -1121966, 121625, 1964031, 3297959, 3140076, 1527276, -391766, -1316465, -846123, 436848, 1645409, 2151133, 1825144, 1122889, 732887, 819587, 884194, 695968, 884166, 1967394, 3166663, 3080933, 1527866, -108860, -558569, -28488, 370896, 14187, -774296, -1287530, -1144024, -595318, -283857, -576024, -1144807, -1407402, -1287782, -1223076, -1441033, -1597949, -1227509, -297736, 750697, 1339222, 1117619, 200725, -890188, -1596599, -1662367, -1195376, -572331, -214647, -170179, 12126, 615238, 1124004, 883389, 243313, 117196, 375565, -86468, -1309963, -1720379, -482131, 921508, 745222, -451120, -836400]
48187h36400P03964M53087m05512m63903O5610K56884K46713N72381Q50561N12454
48177A955839o9135l34130m66752o34507m39892j1173k46132j011609p65964Q14597
48167a208858J686599N07150j003560p37911M86058N95798k39879l71871J98666
48158h7808J46920m61846l98591K71661L97329J0132P2247L64982o6539p63631
48148e15144m75993M40326N65384n3247k63907j84408o70875r90091J20924J547114
48138d79917J124100l96332k11907J618085J914794l18058k151380j508524p9186
48129d88325J57892m0934M17053N95587k55264p88503m8366N77204N486m04727
48119b72897L89227P20869q09450k258058j208600J117990J713914L66437o41134
$$ y = [-836400, -132436, 320651, -84861, -548764, -483154, -226270, 20443, 592824, 1443385, 1955839, 1886704, 1552574, 1085822, 451315, 11423, 250, -245882, -1257491, -2023455, -1208858, 477741, 984891, -18669, -756580, -270522, 325276, 85397, -286474, -87808, 59112, -402734, -801325, -529664, -132335, -122203, -49956, 315026, 248487, -515144, -991137, -550811, 14573, -38674, -302581, -486989, -1157864, -2147955, -2027031, -479917, 644183, 247851, 35944, 1654029, 3568823, 3250765, 1099385, -409139, -488325, -330433, -371367, 45686, 641273, 386009, -402494, -450860, 126344, 131830, -272897, 116330, 837199, 27749, -2230309, -3438909, -2320919, -607005, -240568, -881702]
48110h81702l83877Q2625K55634N89959Q01514K25688m79070j91201N47589L99413
48100I66572k97957j54676O29072N71135l97887q64045n00845m63083j058855
48091a570569j145465k15946P56003R74717P48826M41182m5705m77817l61593
48082h96367r740k13850p16405l73901R32196J851287J381166P4541q69653q91183
48072B68091l04480R5452k51609q66069o54263L20339N13338o95580j569907n36735
48062c681423J098085J024276m49289j085591m15537k774j75554N38555K196688
48053i52564K529545M56454j832377j837706l5518J313615J253088N35358m5525
48044A384370l19467l15215j97657k48818l74083j85421J49054N363m62474k77865
$$ y = [-881702, -1265579, -1182954, -927320, -337361, 464153, 689841, 210771, 19570, 567159, 966572, 668615, 513939, 1143011, 1714146, 1316259, 452214, -48631, -511714, -1570569, -2716034, -2931980, -2175977, -1201260, -452434, -11252, -56957, -534774, -896367, -906107, -1119957, -1836362, -2210263, -1278067, 573220, 1954386, 2028927, 1159274, 268091, -36389, 59063, -192546, -1058615, -1712878, -1392539, -879201, -1574781, -3144688, -3681423, -2583338, -1559062, -2008351, -3093942, -3509479, -3512253, -3687807, -3149252, -952564, 1576981, 2033435, 201058, -1636648, -1672166, -358551, 894537, 1429895, 1384370, 1064903, 749688, 552031, 303213, -70870, -256291, -107237, -101874, -564348, -842213]
48034h42213P18153J326538P22364l25050o72961l07266Q1993J61898q8162o63005
48024A12289j130530p68113K63363P43199R6361n91463j22530R96021J278098
48015H76695L25616p94947j042045m75967J52585L59024L36394N50899R74583
48006A262837R57113J61151p10647p43885j17639K10101m3102k60446r9048R4127
47996G10562R7156R5998P7434j46955l19966j14046M118n43416j074930m40926
47986a654971Q54145J067588k7183p15196j78674K86396k06098m78997M20399
47977f32591J150367J78814j431564j443651J73453J314376Q25794k62305n57635
47968f84942O8863P98290Q24246l554q67420o67522M30737Q83655m0859r58573
$$ y = [-842213, -124060, 1202478, 1924842, 1599792, 926831, 619565, 701558, 863456, 775294, 112289, -1018241, -1786354, -1522991, -779792, -683431, -1274894, -1397424, -401403, 876695, 1202311, 407364, -634681, -1110648, -958063, -599039, -262645, 288254, 1262837, 2219950, 2381101, 1670454, 926569, 808930, 1019031, 975929, 715483, 616435, 710562, 807718, 903716, 981150, 834195, 514229, 400183, 404301, -139115, -1214045, -1654971, -800826, 266762, 239579, -475617, -654291, -367895, -573993, -1052990, -632591, 517776, 696590, -734974, -2178625, -2005172, -690796, 134998, -127307, -684942, -616079, 182211, 1006457, 1002903, 135483, -532039, -101302, 782353, 741494, -217079]
47958b17079m01904Q19459Q23260m73377j388937j031524j56179M11619O46199
47949i68463N65836K7642n65222n58035j24836L7748k5651K15807M84576J18546
47939g92052l57667K04083J359688J300446k84443j476928j011309l9639N0380
47930a047441j75384L40843R74591N16191n51374p51158j6587L97956R8168j13235
47920c27430n680k72656q76612p18437M61766J320110Q60838p4989k41701J30859
47910B56068N5253l94319l22490L24241O78127M64716L33348M95437K36012p41593
47900A384800j519888j230905l41626J27208Q0182J55677M61585N00812K36243
47891a45912K44691O54142P83750K02333n13234n46143N7397N05866K56384m47147
$$ y = [-217079, -618983, 200476, 1023736, 550359, -838578, -1870102, -2026281, -1614662, -968463, -402627, -374985, -940207, -1498242, -1623078, -1585330, -1610981, -1395174, -910598, -792052, -1149719, -945636, 414052, 1714498, 1430055, -46873, -1058182, -1097821, -1047441, -1222825, -881982, 92609, 608800, 57426, -693732, -710319, -312363, -214195, -327430, -333110, -605766, -1482378, -2200815, -1739049, -418939, 441899, 366910, 125209, 256068, 311321, -82998, -405488, -81247, 596880, 1061596, 1394944, 1890381, 2126393, 1384800, -135088, -1365993, -1707619, -1580411, -1500229, -1344552, -882967, -382155, -145912, 98779, 752921, 1536671, 1739004, 1225770, 679627, 737024, 1242890, 1499274, 1052127]
47881A052127r07010o55512P9500N48811L11779j76383j64986K98938M73456J62602
47871A023322N8235M90506O70858r4372j090800j101066k70614R2545m15693o58061
47861a295140J72883J151204R53515j60976q05039n18079j71749l36169m54998
47852a464548k9906M52475M41725K65551L06009N1034r16718j630332q51560Q34647
47842b541623J586016R58898L58525N59842N73767k81115r57318n48734k6130
47833c17872n36290j255086p77812L39502M86952k06917j90427P02886J037118
47824g17946M35090J81629P29832Q02927k14878j005527n20157L00138K54809
47815B45917j85896m3258L70070K48899j48006j41752M1174q3886j11449M12379
$$ y = [1052127, 145117, -510395, -430895, 117916, 429695, 253312, 88326, 387264, 860720, 1023322, 1081557, 1572063, 2242921, 2148549, 1057749, -43317, -313931, -221386, -637079, -1295140, -1122257, 28947, 982462, 821486, 16447, -501632, -673381, -1009550, -1464548, -1494454, -1041979, -600254, -334703, -28694, 22340, -894378, -2524710, -3376270, -2541623, -955607, 3291, 361816, 921658, 1495425, 1214310, 256992, -291742, -317872, -854162, -2109248, -2887060, -2547558, -2060606, -2267523, -2457950, -1755064, -717946, -282856, -101227, 628605, 1431532, 1216654, 211127, -309030, -8892, 245917, 60021, 16763, 386833, 635732, 487726, 345974, 387148, 303262, 191813, 604192]
47805F04192P75453J52214p77420p31926J49496O51791M50428K43727K09553j18885
47795A608623n32679k58833M82793N16282l74099r39352l94097L72678K30964
47786G12280n21484p84361l11857J40969P1501j27738J15296O31149O23555k78225
47776B71085j320631j320580o2673J398939J934548J382575L00201o80236r79955
47767I23273l09083P35213R76875J15787p63661o66143N4179M63777K41904n05218
47757A266903j588967k139316r43755J496140K636623J170065p43610n35482P87975
47748A406576L94052j517003j893198J15208J695759Q83022n92226n40156K77795
47739B29829N2265q43869q68705j31203R4591k47020j94266K57913K81761r5628
$$ y = [604192, 1379645, 1531859, 754439, 22513, 172009, 823800, 1274228, 1517955, 1727508, 1608623, 1075944, 817111, 1299904, 1816186, 1442087, 502735, 108638, 481316, 712280, 190796, -593565, -905422, -764453, -692952, -820690, -705394, -74245, 549310, 271085, -1049546, -2370126, -2432799, -1033860, 900688, 2283263, 2583464, 1903228, 923273, 614190, 1349403, 2326278, 2442065, 1678404, 1012261, 1066440, 1530217, 1772121, 1266903, -322064, -2461380, -3405135, -1908995, 727628, 1897693, 1154083, 618601, 1406576, 1800628, 283625, -1609573, -1494365, 201394, 1084416, 492190, -47966, 229829, 282094, -561775, -1430480, -1561683, -1467092, -1714112, -1908378, -1650465, -1368704, -1464332]
47729a464332j31464J20669P892k79870J6660O89088P62427J58776k17291m4483
47719c81928P7297j00376j32416N9600k4120m11439m75882k6833L85637M31629
47709e98831L46933K04511k07587o60685o00162j12499J74359K11958M79693P67376
47699E066L17539n68950n28612O80800J425809N52466p59559p14382M66867J017891
47689A894935K23038p91909p57343K84338J279604J242893P0423j249826j463419
47680G32734n06999K76647j23878j020901j107099k97285M44533O19388M52766
47671e30094K4373o44672q69185q123J128528R98428l35017j034596j44604J018528
47661c96434R48772J36846J5806O61650Q91729J91579o89991r46370n73536o2312
$$ y = [-1464332, -1595796, -1475127, -1467235, -1747105, -1730445, -1041357, -278930, -120154, -337445, -381928, -304631, -405007, -537423, -477823, -501943, -913382, -1389264, -1416097, -1030460, -598831, -251898, -47387, -254974, -915659, -1515821, -1628320, -1453961, -1242003, -762310, 5066, 322605, -246345, -774957, -94157, 1331652, 1884118, 1124559, 410177, 877044, 1894935, 2117973, 1326064, 568721, 853059, 2132663, 3375556, 3445979, 2196153, 732734, 225735, 502382, 378504, -642397, -1749496, -2046781, -1602248, -982860, -530094, -505721, -1150393, -2019578, -2027701, -899173, 99255, -235762, -1270358, -1414962, -396434, 552338, 689184, 704990, 1366640, 2258369, 2449948, 1759957, 813587, 240051, 177739]
47651A77739Q6263l41377r10860p62178K45209J045667P27094j32717l94625j11326
47641c71111j61786m86470j59592P57000R85175P9681p29740m57270J66212R6768
47631b81133k76581l6909M43413O7940r81208j295088l60046O62241O32367j23836
47621a548840n70992l47624J91275O87699Q94895N33835k81059p53262k35127
47612a429200P65544J076506L65284n06904p38587m68841j16874L59943R25426
47603B32297Q90445j45105j201061r49081K71775P57702n5250p74977k97337N36100
47593g34492N16038N1013J94197O46855L88982l03226k64127M13747M86560j88931
47583A206616m20977J9306j31723j168455j398448K17430K077651K108980O38710
$$ y = [177739, 264002, -77375, -988235, -1750413, -1505204, -459537, 267557, 134840, -259785, -371111, -532897, -1019367, -1178959, -421959, 563216, 642897, -86843, -544113, -377901, -281133, -557714, -594623, -151210, -83270, -1064478, -2359566, -2719612, -2057371, -1425004, -1548840, -2119832, -2467456, -2276181, -1588482, -693587, -159752, -440811, -1194073, -1429200, -663656, 412850, 778134, 271230, -467357, -936198, -1053072, -693129, 232297, 1122742, 977637, -223424, -1172505, -900730, -143028, -198278, -973255, -1270592, -734492, -218454, -167441, 26756, 673611, 1062593, 759367, 495240, 908987, 1395547, 1206616, 785639, 804945, 673222, -495233, -1893681, -1676251, 401400, 2510380, 3149090]
47574C149090n25765q48415j079360j217023m60823R07338J422901N62091m79267
47565A430767o19593k97772l89203o76675l09231O57705J070270J59015j281319
47556b56036j638503m19989J026199J153112J86799l56875O2267M02053q1658
47547G7369o58184m89393L4559K59857M63024R31535Q82844k62973j354765r10411
47537a026538M77910Q75858j04224r08415n55186J90311M60548M97350O63842
47528E71456O05438P6902m51256o04634o20132o08188k36661M10191O06651J20846
47518a29387k99867q2568L47675L81895Q2815k40693n55700p52151n10777M8660
47508a710098L18043J56659P8523J45480l15813j342416j736032o83160Q66682
$$ y = [3149090, 2623325, 1774910, 695550, -521473, -982296, -74958, 1347943, 1910034, 1430767, 811174, 513402, 124199, -552476, -861707, -204002, 866268, 1025283, -256036, -1894539, -2314528, -1288329, -135217, 51582, -305293, -243026, 159027, 77369, -580815, -1070208, -1035649, -775792, -312768, 618767, 1501611, 1238638, -116127, -1026538, -548628, 327230, 223006, -685409, -1240595, -1050284, -589736, -92386, 571456, 1176894, 1253796, 802540, 197906, -422226, -1030414, -1267075, -856884, -250233, -129387, -429254, -511822, -164147, 217748, 300563, 59870, -495830, -1247981, -1758758, -1710098, -1392055, -1235396, -1156873, -1011393, -1327206, -2669622, -4405654, -5088814, -4222132]
47499d222132J404409Q34084K80007L42077M99685J21529o66216j146391o86833
47490c239781N97547J661703J416844P6953q86787n11612M73392P13687k5092
47481B76854p95746q24641k92471J53064K01457J19586L30433P91039R70586O41741
47471A571902L21107M13899L62944m68828j404223j162241Q2034P30663J22081
47462E69338n67663l38306J31713j08215n96624l48348M38697P65367L89604m6061
47452B89502j22870n8510k31317p99018j462428j372825L8607J856611K256441
47443C94193P76224r64436j374395o45343K22066Q66250J146778N96121n29108
47434D88350q41476K16920J136695M99036p64466r39968k87307k34834o42141
$$ y = [-4222132, -2817723, -1983639, -1703632, -1361555, -861870, -740341, -1406557, -2552948, -3239781, -2642234, -980531, 436313, 513266, -373521, -885133, -411741, 301946, 276854, -518892, -1343533, -1636004, -1482940, -1281483, -1161897, -831464, -40425, 930161, 1571902, 1893009, 2306908, 2669852, 2201024, 796801, -365440, -283406, 447257, 569338, 1675, -336631, -204918, -313133, -909757, -1258105, -819408, -54041, 335563, 289502, 166632, 108122, -123195, -922213, -2384641, -3757466, -3718859, -1862248, 394193, 1170417, 205981, -1168414, -1813757, -1591691, -725441, 421337, 1017458, 488350, -353126, -136206, 1000489, 1499525, 735059, -204909, -492216, -727050, -1369191]
47425a369191j40642J147681J522738M39904p10068q67351n32316l29079m0050
47416h78374L62149K06650o70908j360062j076851n3739J024340J588879J195544
47407C37628K8169o89777j5012J108536R82903k26918p23623j887M12216l77100
47397H35135j182904q15250J03665M79588M37685N12333L93907k90674r23211
47388d49726p72193j65804J73125K51725M23258N66009M00157R589m82197j038090
47378a084147j175047l14243R71426J293944N04759k341L74520M90189k80241
47369G78819o84619J30299P96962K185j010102m27487Q91487P15080p71963j190539
47359g69878J55147J238925N82804p17789j052508n32713j60305j42054o5283
$$ y = [-1369191, -1509833, -362152, 1160586, 1600490, 890422, 23071, -509245, -838324, -878374, -516225, -309575, -980483, -2340545, -3417396, -3471135, -2446795, -857916, 337628, 365797, -323980, -338992, 769544, 1752447, 1525529, 801906, 800019, 1212235, 835135, -347769, -1163019, -1059354, -579766, -142081, 370252, 764159, 473485, -449726, -1221919, -1387723, -1214598, -962873, -539615, 26394, 426551, 436140, -46057, -1084147, -2259194, -2573437, -1602011, -308067, 196692, 194351, 568871, 1059060, 778819, 94200, 224499, 1021461, 1023646, 13544, -413943, 477544, 1192624, 420661, -769878, -614731, 624194, 1206998, 489209, -563299, -1096012, -1256317, -1398371, -1463654]
47350a463654J63318L79146N27349M64720j663n65716n64529P9471O90534P84516
47340D93492N57120L39315K09680J96006K47681O2291m52675p70264m94231j32016
47330B56399k46499l66222Q9333L77019m90888j630620j199877N83039J452577
47321a175739N31302m10131M7060Q08624L89364o19227p99586k15612J88142L71694
47311h84109P34034Q02391O3391o50300k83792N30375L86543n08888o13064M61358
47301C7939J377013J059689j25743j241510j609007q69928N39802J159673J20433
47292D48361j216965q18082R62292J736305O45846n08164l07518J99882l87733
47283G54224j420310j437245n05586K76880O50572J000687J044739L10026n48976
$$ y = [-1463654, -1300336, -921190, -393841, 70879, 69216, -496500, -1061029, -981558, -291024, 493492, 1050612, 1389927, 1599607, 1795613, 2043294, 2105585, 1652910, 882646, 388415, 256399, 9900, -356322, -266989, 110030, -380858, -2011478, -3211355, -2628316, -1175739, -644437, -1054568, -1007508, -198884, 190480, -428747, -1228333, -1443945, -1255803, -884109, -150075, 652316, 715707, 65407, -218385, 311990, 698533, 189645, -423419, 37939, 1414952, 2474641, 2348898, 1107388, -501619, -1371547, -831745, 327928, 448361, -768604, -1586686, -624394, 1111911, 1757757, 1249593, 942075, 1141957, 754224, -666086, -2103331, -2608917, -2332037, -1681465, -680778, 363961, 673987, 125011]
47274A25011m35674M32427Q20793L50466k32591n06355p18783p08949O4005J170648
47264C60998J291497J54662q41114o17462N5939j06016r09532j081035j86926
47255a878989Q78378J206602Q38123L18140p0400l62503n46422m62161o6802L38077
47245A92043L39690q320o4428N96061J387134J244052J8397j197587j383612p64441
47235C58989l24573n22565r28539r42938m46837K37142P21622Q23295O08156K63291
47225a52957m6296k11198k18448k37923m35600n52990p1747Q44569J089584J6719
47215B3713j297551j204632K64860J464306J475208J028403P61012J16224j148618
47206A482925j800786q43498O54050R78444K86443N0701N04575M92813k33727
$$ y = [125011, -310663, 121764, 942557, 1293023, 1060432, 554077, -164706, -873655, -809650, 360998, 1652495, 1807157, 966043, 348581, 404520, 298504, -611028, -1692063, -1878989, -1000611, 205991, 1044114, 1362254, 1291854, 929351, 382929, -79232, -146034, 192043, 531733, 523413, 458985, 1055046, 2442180, 3686232, 3704629, 2507042, 1123430, 358989, 34416, -488149, -1416688, -2359626, -2806463, -2569321, -1847699, -1024404, -416248, -152957, -199253, -410451, -628899, -866822, -1302422, -1855412, -1927159, -1082590, 6994, 23713, -1273838, -2478470, -2213610, -749304, 725904, 1754307, 2515319, 2631543, 1482925, -317861, -1161359, -507309, 471135, 757578, 808279, 1312854, 1805667, 1571940]
47197A571940m92926J79789N94576j32635j106628j079286k51241L35468L64766
47188a6177K41880J47206j5228j67320k56023m63617o72677l30331N44882R48827
47178c8578K82477n52324m21737L06883M44617j07170m30109k66387j92501j90287
47168a165116M12829J323818J175359l01636j404879p62561O23707Q76005m0543
47159G36983n24694J40352R50466R22537L67688K5986m1573j11845j04512R7251
47149B458639J22435m04405j108618j224506o43868o8280l6440k44016p7854M34047
47139g92866N85651k0019p43709n73685M52670J021257J87524j155833j270248
47130b309258N9510J170440Q57897j7717o7112M36761K24159o32685o93760M14412
$$ y = [1571940, 1079014, 1258803, 1853379, 1720744, 614116, -465170, -716411, -380943, -16177, 225703, 372909, 357681, 190361, -65662, -529279, -1201956, -1532287, -987405, -38578, 243899, -308425, -730162, -423279, 21338, -85832, -515941, -782328, -974829, -1165116, -752287, 571531, 1746890, 1445254, 40375, -722186, -98479, 777526, 736983, 212289, 352641, 1303107, 2225644, 2593332, 2619318, 2577745, 2465900, 2361388, 2458639, 2581074, 2176669, 1068051, -156455, -800323, -868603, -905043, -1149059, -1226913, -792866, -207215, -227234, -970943, -1544628, -1091958, -70701, 116823, -1039010, -2309258, -2249748, -1079308, -221411, -239128, -306240, 130521, 354680, -278005, -971765, -557353]
47120e57353J164962M38010o87937n74437M99152Q74126N3123p34331n02337K56774
47110B29752O50592O04346M05529r7624j004757j595390j002572M51791J424096
47101F5763J201144M88967K30766K95483q474n61151n49000N0643J95283n18226
47091H91198q94958J16657J465444J196692o27597j783156r37475O57412J193418
47082A277635O40868M2790l15522o83112o82256Q1740P82137L34208o59326n53577
47072B65585P21021J329579K16450j365948j702027p81676K06599O10964O28342
47063A28889M96606K32052j05625m20035o21733m60727K08603Q30656N26061n97092
47053B17655j266132o86818L37512N66640j664l79177r1949L81287N33795M82363
$$ y = [-557353, 607609, 1045619, 357682, -216755, 282397, 1156523, 1209646, 475315, -27022, 229752, 880344, 1484690, 1890219, 1792595, 787838, -807552, -1810124, -1358333, 65763, 1266907, 1755874, 1986640, 2282123, 2273649, 1712498, 1163498, 1214141, 1409424, 891198, -3760, 112897, 1578341, 2775033, 2147436, 364280, -573195, 84217, 1277635, 1918503, 1961293, 1645771, 962659, 280403, 362143, 1144280, 1478488, 819162, 265585, 986606, 2316185, 2532635, 1166687, -535340, -1317016, -1110417, -499453, 128889, 625495, 857547, 751922, 331887, -289846, -750573, -541970, 288686, 814747, 217655, -1048477, -1735295, -1397783, -831143, -832807, -1211984, -1303933, -922646, -388851, 93512]
47043I3512N75595P67643O06603j67354j071113j194710l33955N21195L64060
47034A61476m66478q46220n09715j32527O2346N06861J006117O90962l23156o74109
47024e24443J33948P31869j6216j145131j041454J83086J057211Q17019q0138
47015A15751r73392j441214j159652k57932N60204R01456J083634J156528N71080
47006E56463m70679o83819K20489O00385n38917j572216p51734P78837Q49751
46997a011440n7032J64138J306405J149042m45501j047546K07039J164349L69933
46988A799387o76346m33697J24440l25124r48943m56685M36145L33413l75221
46979e22631l63551L30187O76681M96400K73616r0507p65463r81824j07220R24236
$$ y = [93512, 669107, 1436750, 2043353, 1875999, 804886, -389824, -723779, -202584, 161476, -305002, -1151222, -1660937, -1793464, -1731118, -1224257, -218140, 472822, 149666, -524443, -390495, 341374, 325158, -819973, -1861427, -1678341, -621130, 195889, 115751, -857641, -2298855, -3458507, -3716439, -3156235, -2254779, -1171145, -14617, 556463, 85784, -598035, -377546, 222839, -316078, -1888294, -2640028, -1861191, -1011440, -1068472, -904334, 402071, 1551113, 1105612, 58066, 265105, 1429454, 1799387, 1123041, 689344, 813784, 488660, -460283, -916968, -480823, -147410, -522631, -886182, -555995, 120686, 617086, 890702, 800195, 34732, -947092, -1054312, -130076]
46969a30076P94975j58993n67889j24832M05086P23851J020375R13297n8156j199583
46959A618055j402971q40453m88328l34124L32322J117475Q28870l67717q72897
46950d09768o8880Q07402P06125J92526J40329K82782m2568o19410p23201k46860
46940A8477K27134K10969k09684n04486k41966K87555K35534o14450j251782p22982
46930b565681M30500R37443O30699M19854O68833Q08780N12256P1832m02350r96739
46920E15427j211806m30499P61261J055845L71299r6902J3361l14508j388749
46911g25271j838213o76400J025984J635172J065655L43325j9191j31601M9262
46902G28722N51782R39285Q26415L94524j03910o60342r20898k99131P51990Q03152
$$ y = [-130076, 664899, 505906, -61983, -186815, 218271, 942122, 1962497, 2875794, 2817638, 1618055, 215084, -625369, -1113697, -1447821, -1115499, 1976, 830846, 463129, -409768, -478648, 328754, 1034879, 1227405, 1367734, 1650516, 1607948, 988538, 265337, 18477, 245611, 456580, 246896, -257590, -499556, -212001, 23533, -590917, -1842699, -2565681, -2135181, -1197738, -567039, -147185, 521648, 1330428, 1842684, 1914516, 1512166, 515427, -696379, -1126878, -365617, 690228, 1061527, 964625, 977986, 663478, -725271, -2563484, -3239884, -2213900, -578728, 486927, 830252, 811061, 679460, 728722, 1280504, 2219789, 3046204, 3440728, 3336818, 2676476, 1755578, 1456447, 2208437, 3011589]
46892C011589l88994j115927k62188P52489J67408j174680j124054K67880Q43350
46883I76873j71123j042742m08679O80986N82528m80151r50097j60839R93207
46874A9963J300246M86499o55177j072031m63167M67282Q55080N41967j01439
46865A379223p29469r51378l29562Q06743J164716J21448r84652m72252J134762
46856A139579J664994L26852j374665j922823j435067o29020K96949J050501R11187
46847B8487p0141o48118o5650P93063P66833k052o86380j016309r95972l34732
46837b230971Q03350J347555P06571j88270l02741q2135l75982p06687j79752
46828a209062O06791L75958n09338m41624P82689J568044R94547k4612m44699
$$ y = [3011589, 2622595, 1506668, 1244480, 1996969, 2164377, 989697, -134357, 133523, 976873, 805750, -236992, -645671, 35315, 617843, 137692, -812405, -973244, 19963, 1320209, 1806708, 1151531, 79500, -383667, 83615, 938695, 1480662, 1379223, 649754, -301624, -631186, 175557, 1340273, 1461721, 477069, 4817, 1139579, 2804573, 3131425, 1756760, -166063, -1601130, -2230150, -1933201, -882700, 28487, -41654, -689772, -755422, 37641, 804474, 802422, 116042, -900267, -1896239, -2230971, -1427621, -80066, 626505, 438235, 135494, 53359, -322623, -1029310, -1209062, -602271, -226313, -735651, -1177275, -394586, 1173458, 2168005, 2143393, 1698694]
46819A698694l74787k05503N5108Q6108o17689j409413q82380P52253J421548
46810E23939K55183r20923m64089N11798K47779n58238j03762J109318Q84391
46801A485396r56284k061261j069866O15614J222185Q12515K53093k93458p77210
46792g69276n80100L94080J021761M61642n18563p24863k29781J26924J69268
46783f48908K32849J98389k07205n68328k81337L81641O00745J57634m72239q38406
46773a445165o77002J26125J012927Q73060m04134j258781m98220P81847Q05700
46764f83643n7986j1688R87173J048276l82316j396186o48746N61465N60266j05643
46754a29028o983N77615L33751o23990q90213q8696O43765N18373K5747j59054
$$ y = [1698694, 1323907, 1118404, 1173512, 1259620, 641931, -767482, -1649862, -897609, 523939, 779122, -141801, -605890, -94092, 153687, -404551, -508313, 601005, 1485396, 529112, -1532149, -2602015, -1986401, -764216, 48299, 301392, 7934, -769276, -1349376, -955296, 66465, 528107, 9544, -715319, -945100, -818176, -648908, -416059, -217670, -424875, -993203, -1274540, -892899, -292154, -134520, -606759, -1445165, -2122167, -1996042, -983115, -110055, -514189, -1772970, -2271190, -1489343, -683643, -741629, -753317, 233856, 1282132, 899816, -496370, -1145116, -583651, -23385, -129028, -136011, 441604, 775355, 151365, -738848, -827544, -183779, 334594, 360341, 201287]
46744B01287m5171R7375R8864k60185r10691j069450j19551J140557J233680O5453
46734D32168r06722p69438j98985j7231L4353L60864M70428j39158q39901o86413
46724b260035J22629N93712M26630J98917K36922K33162K1687p1583J57656M30293
46714H9990M53525L15729K22080J56850k9349l82343p51046q38537m74774M0713
46704a197162J65252p9846L7170Q37889J443035Q67184m20194j016607n89656
46695D7065k31257n87675q35088j64509P53718P78280N8200l39945j51029o7016
46685g39256k98985j92899M95127R95791O70547m7527m02282l65988l44759l36162
46675e66393o6920L00292K58277k83209q06545q06337l07601K54816M87100L75731
$$ y = [201287, 156116, 253491, 352355, 92170, -818521, -1887971, -2007522, -866965, 366715, 432168, -474554, -1243992, -1442977, -1460208, -1425855, -1064991, -594563, -733721, -1573622, -2260035, -2137406, -1543694, -1117064, -918147, -681225, -448063, -426376, -497959, -340303, 89990, 543515, 859244, 1081324, 1238174, 1208825, 826482, 75436, -763101, -1237875, -1197162, -1031910, -1111756, -1074586, -236697, 1206338, 2073522, 1653328, 636721, 47065, -184192, -771867, -1606955, -1771464, -1017746, -239466, -181266, -521211, -672240, -739256, -1038241, -1231140, -736013, 259778, 930325, 882798, 480516, 114528, -230231, -566393, -633313, -333021, -74744, -357953, -1164498, -1970835, -2278436, -2023620, -1536520, -1160789]
46665a160789K55327L70400N20179L73777M2070j06424j52598m97393r29430o67615
46655a952496K88725P60629L8529q83529o79642L40830P83480K77906k15085o7049
46645a307702K77288L16770J67562L7326n8845L4154L46040K65669o40313j441195
46635b003246q52997N94572J077389L58879J56872J012443J052975p79525k405186
46626a787824j539843P18117J644555J015333P54735J176132O10761j125928j866467
46617d00429n48698R57521P46330m22715p71434k11719J77323J32703P2039j09761
46607c78840n96469p12707J21585J064961R13621N1351j22334N49047Q08821R4002
46597A793038o45425n43500J9223L14227K72619P1441l57113q18288p02110j0349
$$ y = [-1160789, -905462, -535062, -14883, 358894, 400964, 294540, 141942, -355451, -1284881, -1952496, -1663771, -903142, -864613, -1748142, -2427784, -2086954, -1303474, -1025568, -1240653, -1307702, -1030414, -713644, -546082, -508756, -567601, -533447, -187407, 78262, -562051, -2003246, -2856243, -2261671, -1184282, -825403, -668531, 343912, 1396887, 617362, -1787824, -3327667, -2609550, -964995, 50338, 805073, 1981205, 2591966, 1466038, -400429, -949127, 8394, 754724, 332009, -439425, -651144, -473821, -341118, -269079, -378840, -975309, -1688016, -1566431, -501470, 412151, 463502, 341168, 890215, 1699036, 1793038, 1147613, 604113, 623336, 937563, 1210182, 1281623, 924510, 106222, -595888, -606237]
46587f06237K44087n19862j303051q56320L40606O98716m6267m55348K49987Q96625
46577a357064L06365o76658m70838O88789J140160M87394R5168N96515P41992
46568A551823l43625j362942p68292O57065R04984j93179q73299k69226M98019
46559a98672L83259p9778m3145K06428n161m50397m06762J76604O86127P02223
46549I70726L19590j38447l87242l87164l92152n04442l39831L09052P60050L04150
46539E14290m33948k28940O71433P02899m82261j278043o23663L62080L06941
46530d89212k89489j96355M48430O48612K84119p9096l78657p27492o31349J38259
46520a272230O52975J77688m29897j62239K54762k77009r34709k63200R63967
$$ y = [-606237, -362150, -882012, -2185063, -3041383, -2700777, -2002061, -2048328, -2503676, -2253689, -1357064, -1050699, -1727357, -2198195, -1509406, -369246, 118148, 213316, 809831, 1551823, 1208198, -154744, -923036, -265971, 639013, 445834, -427465, -696691, -198672, 184587, 104809, 61664, 268092, 262931, -187466, -594228, -417624, 268503, 970726, 1290316, 1151869, 764627, 377463, -14689, -519131, -858962, -549910, 210140, 514290, 80342, -148598, 522835, 1225734, 743473, -534570, -1158233, -796153, -489212, -778701, -975056, -526626, 121986, 406105, 327009, -51648, -779140, -1410489, -1272230, -619255, -441567, -871464, -1033703, -778941, -1055950, -1990659, -2253859, -1289892]
46511a289892P61683n16736n04621J104195J773785K44082j378307j015929L45778
46502d75962P40221K79104J85126L82163O9553m61177m32719q5839J2073J88266
46492D00809O68795M89414q66064j861378r59268O63177O90450p26715j361770
46483b862550n35871K06033P5334J06704P56104Q99437J43294q2822J002011J846251
46473A553925Q55869j068924j839715r95677K17908Q16639Q17304N52590L33381
46464A243300L92365M35801j43695j038421r97543J87598Q69194j10862j419804
46455e82067j124063L67997J076974N21998J3858J66048K03898j34112n6051M66810
46445I21290K78696q10157j240418j14779J182064J056722Q0689j90239K52880
$$ y = [-1289892, -528209, -1044945, -1549566, -445371, 1328414, 1572496, 194189, -821740, -475962, 264259, 543363, 728489, 1110652, 1180205, 719028, 286309, 200470, 212543, 400809, 1069604, 1559018, 692954, -1168424, -2127692, -1464515, -774065, -1500780, -2862550, -3398421, -3192388, -3117054, -3010350, -2254246, -1354809, -1211515, -1294337, -292326, 1553925, 2409794, 1340870, -498845, -1494522, -1276614, -459975, 357329, 909919, 1243300, 1635665, 2071466, 1927771, 889350, -108193, 79405, 948599, 837737, -582067, -1706130, -1338133, -261159, 260839, 274697, 440745, 644643, 510531, 454480, 921290, 1199986, 389829, -850589, -965368, 216696, 1273418, 1354107, 1163868, 1416748]
46436A416748J78436o46055j170684q41864k26755J89047N88009J005807R88289
46427A480978L97709k33168m58764m05185k80841j0431L77384N04189J04164n51799
46417I24236q97428o03183J27024O68395N47187K8422j98308n6829j89033o85401
46407c34918n97580M95355J318113N46124j001377j354144k85583M89675P5636
46398f48699m42666r5841M06305J11556n49994o49648k22371J73396M61359O61632
46388g94971L81698l26075m69503M52640J343725R82417j56743p75881p02310
46379f5003n85366l22624N81710J486323J171545j36973r21167o26439k01150
46370C80856k21680j28075K73934K21004l87127l44013Q61432J755454R07670
$$ y = [1416748, 1595184, 949129, -221555, -1063419, -1290174, -1101127, -513118, 492689, 1480978, 1878687, 1645519, 1186755, 781570, 500729, 490298, 867682, 1371871, 1476035, 924236, 26808, -576375, -449351, 219044, 766231, 794653, 596345, 539516, 350483, -334918, -932498, -437143, 880970, 1427094, 425717, -928427, -1214010, -724335, -648699, -1091365, -1187206, -780901, -669345, -1219339, -1868987, -2091358, -1917962, -1456603, -794971, -413273, -739348, -1208851, -756211, 587514, 1569931, 1413188, 637307, -65003, -650369, -972993, -391283, 1095040, 2266585, 2129612, 1208445, 582006, 380856, 159176, 31101, 305035, 526039, 138912, -205101, 656331, 2411785, 3319455]
46361C319455p57515j172944p7531P77821K56485p54478r12065k82907P3771k34972
46351B35120n56331l88980j79406n07485r60409n76124O40967J497154J216064
46342D20570M53668J41991J25886j97695o19320o27557n83437j018823j208327
46333c113044r4872J524625J629657M4471j071139m36672N89045M99914o150K75851
46323a58314O30908k63554j643958j509714K32411J535631J149936l970o30433
46314f61057o02514k64489L70329J050949J032976J32915p42017p33989q7755
46305e04652M16210M89912L31910J13164o3136o9220J9935o6357l30363m30682
46295i3279k57897j34269k21687k19715N5685K71626J33635o6685R8782M83058
$$ y = [3319455, 2561940, 1388996, 1311465, 2089286, 2345771, 1591293, 679228, 396321, 470092, 235120, -321211, -710191, -889597, -1397082, -2357491, -2933615, -2292648, -795494, 420570, 874238, 1016229, 1142115, 944420, 325100, -302457, -885894, -1904717, -3113044, -3207916, -1683291, -53634, -9163, -1080302, -1516974, -927929, -428015, -434165, -158314, 472594, 209040, -1434918, -2944632, -2712221, -1176590, -26654, -30624, -661057, -1263571, -1528060, -1157731, -106782, 926194, 1059109, 317092, -416897, -504652, -88442, 401470, 733380, 846544, 783408, 714188, 734123, 667766, 337403, -93279, -351176, -485445, -707132, -926847, -871162, -599536, -465901, -532586, -433804, 49254]
46285D9254N45878R4376n17963q34667o63205j16550M36082N58015J78729k00723
46275d70774l9448M67998M88299l47528j206462q98561N26087J598137J202477
46266A320225K2564m49146J8828K98386j70920n54189j59351L35033L8415o58090
46256D1755q12982n02745m60631n94821j90636N78950O89211q7610p94890p83387
46246b917786m47793j76955K80126R50897J226000Q76475N16028M80137K28197
46237A015326m96215r40521n88860j33659k32554k65739M59674J126694N32609
46228D76755p45060r49924K33836J238725R22514j29618r15436j255493j223902
46219b347603n99424M09296R13334N56679J19263K34677M10600J10752j21870
$$ y = [49254, 595132, 689508, 171545, -663122, -1326327, -1442877, -1006795, -448780, -270051, -470774, -510222, -42224, 446075, 98547, -1107915, -2006476, -1480389, 117748, 1320225, 1342789, 893643, 912471, 1210857, 1039937, 485748, 326397, 661430, 699845, 41755, -771227, -1273972, -1734603, -2329424, -2520060, -1941110, -1251899, -1339509, -2134399, -2917786, -3365579, -3542534, -3262408, -2311511, -1085511, -209036, 306992, 787129, 1015326, 519111, -421410, -1010270, -1143929, -1376483, -1642222, -1182548, -55854, 476755, -268305, -1218229, -984393, 254332, 1176846, 1047228, 131792, -1123701, -2347603, -2947027, -2537731, -1624397, -1067718, -948455, -713778, -303178, -192426, -314296]
46210c14296L26847P81673K02301r82047j299169l81294N50600M80102j86688
46201h21971m63847K967Q31514J316855Q17281n57426j600145j203181M8816N21437
46191a107700r8301l89428L89316R85730K76607o70480k19962J090648J310899
46182A567329J68921n84018n4822M96451p7257r23031p12624J63648L33495l06466
46172G1626n20244K35016R61507N80921o24155j457508j197665j59854Q21863
46163a288493J118549O61716p4562l96422L8262P74834Q69918k3417r87704q03477
46153a10796L41517Q65221m8600j139725q25878M16574P72939j02181o19022J44267
46143c05684R76490M72928q34704j365067o42331M85074J150520J041021K16894
$$ y = [-314296, 12551, 794224, 996525, 14478, -1284691, -1665985, -1115385, -635283, -821971, -1285818, -1282851, -451337, 865518, 1682799, 1125373, -474772, -1677953, -1629137, -1107700, -1206001, -1595429, -1206113, -220383, 56224, -614256, -834218, 256430, 1567329, 1736250, 1152232, 1097410, 1593861, 1516604, 593573, -119051, 44597, 378092, 71626, -448618, -213602, 747905, 1328826, 704671, -752837, -1950502, -2110356, -1288493, -169944, 491772, 417210, 20788, 59050, 833884, 1703802, 1680385, 692681, -110796, 230721, 1095942, 1047342, -92383, -918261, -501687, 271252, 169071, -449951, -305684, 670806, 1143734, 309030, -1056037, -1698368, -1213294, -62774, 978247, 1195141]
46134A195141p27345q38541k5271M58327k96551j292269r33157N87972J564598
46125c07096J196465L44541r9761k05884j79925J18776M51533J78782n59169p27915
46115B10347J148N98710K86756k24839J0251N56898L39379n43993r40581m24668
46105a30592J42876K4929l24846r3141N71084P52360J56565l82180r4453N32464
46095A155066M33249l68791p18756j58262K80285k11813p52016j92617P80226
46086B46571N66636o90598j179131k70100N42646J39948n22858k19532N37832
46077h48586O26186K95462M92199R56166N80571o65365j594249j479318o85718
46068b322652K81287J191795J556542Q53108m76500j206087p77399J67356Q15286
$$ y = [1195141, 467796, -370745, -396016, 62311, -234240, -1526509, -2459666, -1871694, -307096, 889369, 1233910, 1134149, 928265, 748340, 867116, 1318649, 1497431, 938262, 210347, 211495, 810205, 1096961, 872122, 882373, 1439271, 1778650, 1234657, 294076, -130592, 12284, 37213, -287633, -380774, 190310, 942670, 1099235, 717055, 622602, 1155066, 1588315, 1219524, 500768, 342506, 622791, 410978, -341038, -533655, 246571, 813207, 122609, -1056522, -1326622, -783976, -644028, -1166886, -1386418, -848586, -222400, 73062, 565261, 1521427, 2101998, 1436633, -157616, -1636934, -2322652, -2041365, -849570, 706972, 1560080, 1083580, -122507, -899906, -732550, 82736]
46059H2736R56625O50474O113n13312m31704j09701l38818q62158m40845J056149
46049E5559J825037M40379j849439k462395p78489J183892J428428J92168q42391
46040h07251o60305L09772R98573P45767j94362q63652n45296L08481M76631m09122
46030f40764j128065l60386J388355K193982J138418m97560r36199j49848M02466
46021A410399j653m25344J16109R98326P83431o65182j823397j447262j01973
46012a156546P31193N19444m1329l00499l46450l68545j54972L75263P33287M64806
46002D55652j81625o25372o29965k06716O55007J565480J569780K83764j156273
45993A729732j305468l83925J07584k99280m72730K68078R49922N35441m60012
$$ y = [82736, 1039361, 1689835, 1695948, 1182636, 750932, 641231, 302413, -559745, -1000590, 55559, 1880596, 2320975, 471536, -1990859, -2769348, -1585456, -157028, 35140, -807251, -1467556, -1157784, -159211, 586556, 392194, -471458, -1016754, -708273, -231642, -640764, -1768829, -2129215, -740860, 1453122, 2591540, 2093980, 1157781, 1007933, 1410399, 1408746, 983402, 1099511, 2097837, 2881268, 2216086, 392689, -1054573, -1156546, -425353, 94091, 52762, -247737, -594187, -962732, -1117704, -742441, -9154, 455652, 274027, -351345, -981310, -1188026, -533019, 1032461, 2602241, 2886005, 1729732, 424264, 40339, 147923, -151357, -624087, -356009, 593913, 1129354, 669342]
45984F69342q88582n94533j60372J77078L83729J33942n40204q02746k25801L16927
45974a531220P7830j36043O16250J430359Q36977n24629o55141N38666J005095
45965A658144r1764j021252l52222P98901O40919o42393j454634j010358J30502
45956a344157J014367R55589l7482r30136o01293N13946Q69269K29722O5089Q92903
45946A627817J135175j69209j381730p32759P79428J002625m8616o79386m46761
45937A086584l20345m62905j44769L80201J28362n53234l34003O41836Q17124
45928A238851n9020n07646k2015J17654n57900o42751M70431J072542j16957j573605
45918e80416j237384L14915J030954O20739M19907O67632K38268r45078j362413
$$ y = [669342, -219240, -813773, -974145, -797067, -413338, -279396, -819600, -1622346, -1848147, -1531220, -1453390, -1589433, -973183, 457176, 1294153, 769524, 114383, 653049, 1658144, 1566380, 545128, 192906, 991807, 1632726, 990333, -464301, -1474659, -1344157, -329790, 625799, 588317, -341819, -943112, -429166, 440103, 669825, 734914, 1627817, 2762992, 2593783, 1212053, 479294, 1258722, 2261347, 2212731, 1533345, 1086584, 766239, 303334, 158565, 538766, 667128, 113894, -220109, 421727, 1238851, 1179831, 672185, 650170, 767824, 209924, -432827, 37604, 1110146, 993189, -580416, -1817800, -1502885, -471931, 148808, 568715, 1236347, 1474615, 529537, -832876]
45909h32876k73132J034809J128790L26477j13327K11558P03393Q31907N57213
45900C574812J341o44793j012095q44717l68357l3737M4748Q1213J18823n3920
45890H63318l91301m03834J92652Q93827R22205K60990l11597k99152p1442j21334
45880A534332k78985j60918J1866k66500q02075p55101J78094J168505J139724
45871A768942K4896j085739j063061J6035Q73629N05460n42729r21152l52211
45862g75930J81391K15463M44315J014714P37732p54981j546499l6388K095967
45853A575784J939091k23197j279445j05225R51462J58072r64831o47154O9916
45844A474473n14202j513890r55855P18936J297840L26042n01765l13030r6233
$$ y = [-832876, -1106008, -71199, 1057591, 1384068, 1270741, 1482299, 2185692, 3017599, 3574812, 3576153, 2931360, 1919265, 1074548, 706191, 672454, 717202, 798415, 917238, 863318, 472017, 68183, 260835, 1154662, 2076867, 2337857, 2026260, 1727108, 1655666, 1534332, 1255347, 1094429, 1106295, 839795, 37720, -717381, -539287, 629218, 1768942, 1793838, 708099, -354962, -338927, 534702, 1040162, 497433, -423719, -775930, -594539, -379076, 65239, 1079953, 1817685, 1062704, -483795, -520183, 1575784, 3514875, 3291678, 2012233, 1907008, 2858470, 3016542, 2051711, 1404557, 1474473, 960271, -553619, -1509474, -790538, 507302, 833344, 331579, 18549, -77684]
45835g7684n14037p29281m6593Q48262J012776M83493j69868n97902n65210N8947
45825b97097Q39200J029769N45724K9586j38809j75364j94497K4390M68587Q01135
45815B932624Q67472O37869j62240j503127k371317j752550k12241O89584N48242
45806c25684L72473O14581M76248l84157r69233n47686J46579K39030J30698N67782
45796C20631J208151J202988N46636j41966o30322r59363q42594r1638P48073
45787A360596R80520O24962Q2495n21677r89663p28670L27437J099906P13493
45778B949399o8972N7651Q26256P64381m31311j344826r79344j64350j69570q52343
45768E86971j046841l27642M53351L96324k39948m07320K57478P94759K07721
$$ y = [-77684, -591721, -1321002, -1367595, -519333, 493443, 976936, 807068, 209166, -356044, -297097, 542103, 1571872, 2117596, 2147182, 2008373, 1833009, 1638512, 1662902, 2131489, 2932624, 3800096, 4437965, 4275725, 2772598, 401281, -1351269, -1563510, -873926, -325684, 46789, 661370, 1137618, 753461, -215772, -763458, -616879, -377849, -247151, 320631, 1528782, 2731770, 3278406, 3136440, 2506118, 1546755, 704161, 612523, 1360596, 2341116, 2966078, 3048573, 2526896, 1537233, 808563, 1136000, 2235906, 2949399, 2880427, 2938078, 3764334, 4528715, 4097404, 2752578, 1773234, 1608884, 1439314, 586971, -459870, -787512, -334161, 62163, -177785, -585105, -327627, 467132, 674853]
45759F74853q95984q64915O12151J785041J215637j53646m76019K35760L85357
45750B518235m98119j084401n12091L08175L43392J6481J59791M70409K23950
45741A945822j77661K52612J227760J239847k21131j622676j309827K17715R46478
45732B498939P0622j040099r43073j15436J20562j21480L84752J561589J741585
45723D157961L27294r81546o90215K64329K44941m27418l93641J63352L8518m93259
45713B210316r0253R18556P42656o55583j156353l7140O58200m18185j532084
45704F40130p84406O73184O54933l74803k53200J118963J637546M59675p73041
45695B998981n39662O17547J317161J069139K30137o48057r46817l54356N16555
$$ y = [674853, -221131, -1086046, -473895, 1311146, 2526783, 2373137, 1897118, 2132878, 2518235, 2020116, 935715, 423624, 731799, 1075191, 1091672, 1251463, 1721872, 1945822, 1768161, 2020773, 3248533, 4488380, 4267249, 2644573, 1334746, 1552461, 2498939, 2569561, 1529462, 586389, 470953, 591515, 470035, 854787, 2416376, 4157961, 4485255, 3503709, 2813494, 3077823, 3322764, 2895346, 2501705, 2665057, 2703575, 2210316, 2120063, 3038619, 3781275, 3125692, 1969339, 1932199, 2590399, 2172214, 640130, -144276, 528908, 1183841, 809038, 555838, 1674801, 3312347, 3772022, 2998981, 2459319, 3076866, 4394027, 5463166, 5693303, 5045246, 4098429, 3744073, 4260628]
45686D260628O14692k20326j066868j137237n12098L50763J115531J502156J355324
45677F262565Q72532L57654j07155l97002k15467K52865K07333n15652q11463
45668E906210O8840J053524P30367l82338o28008J95643P92055O60556N43085
45659H939934N78098L410r68832r52260L01246J222938Q96168M68844J038212
45650A1527758J732795J270351J59661j68698M12432Q14226N61741L10228P50831
45641A7371325J858904L038876L496889K860671J824691J605964K408008L190070
45633C7655398L343175L592529M599397N703356N984106N762262O051908P125842
45625G9817973Q552415J0173261J2199778J4714779J7748516K1458222K5732823
$$ y = [4260628, 4875320, 4654994, 3588126, 2450889, 1938791, 2289554, 3405085, 4907241, 6262565, 7135097, 7492751, 7385596, 6988594, 6773127, 7025992, 7233325, 6717673, 5906210, 5975050, 7028574, 7758941, 7376603, 6748595, 6944238, 7736293, 8396849, 8939934, 9518032, 9521442, 8552610, 7600350, 7901596, 9124534, 10020702, 10489546, 11527758, 13260553, 14530904, 14690565, 14521867, 14934299, 15748525, 16310266, 16620494, 17371325, 19230229, 22269105, 25765994, 28626665, 30451356, 32057320, 34465328, 37655398, 40998573, 44591102, 49190499, 54893855, 60877961, 66640223, 72692131, 79817973, 88370388, 98543649, 110743427, 125458206, 143206722, 164664944, 190397767]
45618A90397767L0166518L4876621M0523521M6622887N0178702M6724823L3066276
45611D72557115R858180j7226442l9302384m9643499m8643869m2535129l6755674
45604B48308298l1999216k6931208k1966269j8462125j6218762j4185691j2447575
45597A06097452j1392052j0051628p511118n020192m405189n139237n301756m733243
45589E2543037m722101n098912m425274k962879k645728l775472m368316l359665
45581B1184690k011585j424205j023055m33668n69104j650075k177235j243416
45573A0652347j33013k26226q50563o65630J36260M95825K97791J05675r0350
45564I722116n82980j051695j052044q52353q80777q80723m01662L70530Q96783
$$ y = [190397767, 220564285, 255440906, 295964427, 342587314, 392766016, 439490839, 472557115, 482415295, 465188853, 425886469, 376242970, 327599101, 285063972, 248308298, 216309082, 189377874, 167411605, 148949480, 132730718, 118545027, 106097452, 94705400, 84653772, 77142654, 72122462, 67717273, 62578036, 57276280, 52543037, 47820936, 42722024, 38296750, 35333871, 32688143, 28912671, 24544355, 21184690, 19173105, 17748900, 16725845, 16292177, 15723073, 14072998, 11895763, 10652347, 10519334, 10293108, 9442545, 8776915, 8913175, 9409000, 9706791, 9812466, 9722116, 9139136, 8087441, 7035397, 6183044, 5302267, 4421544, 4019882, 4390412, 5287195]
45555E287195R11146L87059m80099j022053o78516j8407j35873q54293q39640
45546B556519J97517R27691N47237q9220j79841j86175m60094l23457M20034P01331
45536D111542J08774r6868P32496J108114j10763j420832r68852L34822L88612
45527D187045n94289p72421m9054K0764o89898o98518J52882L14746n12108o69050
45517F90099M10879R17891l16419j627607r81656R05549J667892N77913q70011
45508A374530j193464m02272N98527J059724P68747J5435o66066r08760o48713
45499b312L1968Q34001J139822N89147k36064l63135K51044O36149J86029n80582
45489B486067q57466m94536J46664O72558P36376K13767m32668m87381P4244M65066
$$ y = [5287195, 6198341, 6585400, 6105301, 5083248, 4404732, 4386325, 4250452, 3396159, 2556519, 2754036, 3681727, 4228964, 4139744, 3959903, 3773728, 3313634, 2990177, 3410211, 4111542, 4220316, 4123448, 4855944, 5964058, 5853295, 4432463, 3463611, 3798433, 4187045, 3592756, 2820335, 2771281, 2792045, 2102147, 1403629, 1556511, 1871257, 1359149, 690099, 1100978, 2018869, 1702450, 74843, -906813, -1264, 1666628, 2244541, 1374530, 181066, -221206, 377321, 1437045, 2205792, 2221227, 1555161, 646401, -2312, 29656, 863657, 2003479, 2592626, 2356562, 1993427, 2244471, 2880620, 3066649, 2486067, 1628601, 1134065, 1280729, 1953287, 2689663, 2903430, 2470762, 1983381, 2057625, 2522691]
45479B522691J29854n51991q13171l55637M56724R03930M41333o39744j230763
45470H63226o63553K64690L07883l85168m99213L63567J059479P17485k4446k57178
45460A746772k19018n53258r39264n80356L17791O40146l1134p30440l40652R21274
45450B31861J638384Q20199q23179j558711o70546O53944Q97268J46157l53449
45441I81928j75945o5416l40896l05847L36978P40455L12648k08084K165M28433
45431A706419J40973n12567l88274N72555J142205N27998o71703j417240j374288
45422b73922q55243j97603M42139R29168J035433N42506m03256j073495p38812
45413e93085L46165J051607P76440J48935j12751k92320q55506j241517o27336
$$ y = [2522691, 2652545, 2100554, 1287383, 931746, 1388470, 2292400, 2733733, 2093989, 863226, 199673, 464363, 772246, 387078, -112135, 251432, 1310911, 2028396, 2003950, 1746772, 1527754, 974496, 35232, -545124, -227333, 412813, 381679, -348761, -689413, 231861, 1870245, 2690444, 1867265, 308554, -361992, 291952, 1189220, 1335377, 981928, 805983, 740567, 399671, 93824, 430802, 1171257, 1483905, 1275821, 1277986, 1706419, 1847392, 1334825, 946551, 1519106, 2661311, 3189309, 2517606, 1100366, -273922, -1129165, -1326768, -884629, 44539, 1079972, 1622478, 1219222, 145727, -593085, -246920, 804687, 1581127, 1730062, 1617311, 1324991, 469485, -772032, -1399368]
45404a399368M78269P11134r9889o41786j23686O38265O40683J09319k29365l95225
45394c11649p56417r95925m76511O15129J340184J165771M22446l10042o87470
45385E516n42962N0652O05661O00418J19543k60800k21965N7800L65022O60939
45375A439824P93552N14395o2968m49163l91499j41424j3584q6927m10536r60508
45365B31162j231884n47648Q23496J492973N33587j188731j946785j135945L36670
45356b633105J377579J613585J081644n0554j189484j470853o57826M98189J071499
45347c59326Q25633J53067m03474m14918J48181O55806L41642o21766j093975
45338g69130m18311O05542P62823L6561n19264l11640J56602K48168Q2887J30008
$$ y = [-1399368, -921099, -209965, -309854, -951640, -1075326, -437061, 203622, 312941, 83576, -311649, -1068066, -2063991, -2540502, -1925373, -585189, 580582, 1003028, 692986, 5516, -537446, -486794, 118867, 719285, 838828, 578028, 356063, 413863, 778885, 1439824, 2233376, 2747771, 2684803, 2235640, 1844141, 1702717, 1689133, 1602206, 1191670, 231162, -1000722, -1548370, -724874, 768099, 1301686, 112955, -1833830, -2969775, -2633105, -1255526, 358059, 1439703, 1389149, 199665, -1271188, -1929014, -1430825, -359326, 466307, 619374, 215900, -199018, -50837, 604969, 946611, 324845, -769130, -1187441, -581899, 180924, 217485, -301779, -613419, -456817, -208649, -125762, 4246]
45328D246L82389M28567J86597P9304L43991N29621P5219p17856q39284N1235
45318E24029Q98994M96240q19613j480702p31290M40126P17579R8687m26662l36401
45308f19013k1419M6474m1824P0323M18988O13368K79295m12646p87475m35017
45298h88946K05134M04285J59512P4408K64873J59796m04876p18663k73444M06998
45288f10923N67749K27869j87964n73524q19047m29863O60514J445524J018894
45279A299229l149l03884J74550K93485l31594p41710k92257K73223K8583o98957
45269c02481q38131m8164R45415J257119O53495l77074j060538r52052l00930
45260a023341K52999L39154P5686k36487l41651o8521M67890P63563M40255j65692
$$ y = [4246, 386635, 815202, 1001799, 1081103, 1425094, 1954715, 2029934, 1312078, 472794, 524029, 1423023, 1919263, 1099650, -381052, -1112342, -672216, 45363, 144050, -282612, -619013, -640432, -593958, -635782, -565459, -146471, 466897, 746192, 333546, -453929, -888946, -683812, -279527, -120015, -45607, 219266, 379062, -25814, -744477, -1017921, -610923, -43174, 184695, -3269, -576793, -1395840, -1825703, -1165189, 280335, 1299229, 1296080, 992196, 1166746, 1460231, 1128637, 386927, 94670, 367893, 396476, -302481, -1140612, -1188776, -243361, 1013758, 1667253, 1290179, 229641, -722411, -1023341, -770342, -431188, -355502, -591989, -933640, -1002161, -534271, 229292, 669547, 503855]
45250E03855l61661l6303K33363O6758k15157j43954K23731M23662J65150l63712
45240D95732o89507n41637j73139l1478r1502R7907N84880Q24124O25112N42170
45230A642662P46553L89191r22102j843648r69689P24050R30132n35663j333538
45221a172052j86633J135686O24914q46024r71034M47044J386555P32945l46855
45212H04546m57269R8399J78670l54513n43599K28381J349272J612053N60288
45203C476228r00974j390810n90705M27667N98039Q6425l37240n93464j079899
45194c04733j476191r30588M06557J173872O40722k12416j94968L55474L36956
45185b05315k38095l69416J86599N98440M46721K67774L15105K8131p05395r52294
$$ y = [503855, 142194, 105891, 339254, 406012, 190855, 46901, 270632, 694294, 859444, 495732, -193775, -735412, -908551, -940029, -1031531, -933624, -348744, 475380, 1100492, 1642662, 2389215, 2778406, 1856304, 12656, -957033, -232983, 697149, 161486, -1172052, -1358685, -222999, 401915, -444109, -1415143, -968099, 418456, 1151401, 804546, 347277, 445676, 624346, 269833, -273766, -45385, 1303887, 2915940, 3476228, 2575254, 1184444, 593739, 1021406, 1619445, 1705870, 1368630, 775166, -304733, -1780924, -2711512, -2304955, -1131083, -490361, -702777, -897745, -542271, -205315, -443410, -812826, -626227, -27787, 418934, 686708, 1001813, 1029944, 324549, -627745]
45175f27745k24392M97478K54042l24499j65506L61309J87912m26501l11119M53412
45165c25609N76278j84292n74025K319N55498L01219j68949j98440j27660k84853
45155d28514k40854J48607K32700j55744k41182J50157J01643n02772l46875R15996
45145c66838J498257K75359j060500n96791O81128O70540l16012m11036L80169
45136G54276L94090n39750q91266k61440J19926j79760k43136J23955J7135n88007
45126a293977o11544Q2325M54724L32262N82519J054714N95442n66078q01237
45117a70850P6948L61674n20048r78252j18064P77983O65093L18632L70965P0097
45107H54178p34121o65430O56437J399450M54997n61472n2746Q76441N19461m93391
$$ y = [-627745, -852137, -354659, -100617, -425116, -590622, -229313, -41401, -467902, -779021, -325609, 250669, 66377, -507648, -505329, 50169, 351388, 182439, -16001, -143661, -428514, -669368, -520761, -288061, -443805, -684987, -534830, -433187, -935959, -1282834, -366838, 1131419, 1406778, 346278, -250513, 430615, 1101155, 785143, 374107, 754276, 1148366, 608616, -282650, -544090, -424164, -603924, -847060, -723105, -705970, -1293977, -1905521, -1823196, -1368472, -1036210, -453691, 601023, 1196465, 630387, -170850, -93902, 267772, -252276, -1230528, -1348592, -570609, 94484, 413116, 784081, 854178, 120057, -545373, 111064, 1510514, 1965511, 1404039, 1351293, 2227734, 2747195, 2253804]
45097B253804n78747l6l4345n46754n30918j01833l6455k07069j32275j16089
45087c0717l44248l8119R95568J386019L85037n67947k86387m7308j133355j979844
45077a661301n65532J779938K049228J19184j407364j306822o92932k68624L91679
45068a562546R07964K81478q63731q09865L70916R22166M25699K00869O13104
45059D86054N80472k7508r5652L29475n4134j084626r76305N22514J410196O33007
45049A723493m65308p00043o21339o76490k36656N59549L79403q23381j244334
45040b105106k44169M56849j91481p87176j29639P58185Q41141R26195J554731
45031A079530J419923r6576j114466k79739N88550m91216j987345j236597J013371
$$ y = [2253804, 1675057, 1675021, 1640676, 1093922, 563004, 461171, 424716, 217647, 85372, -30717, -374965, -413084, 582484, 1968503, 2353540, 1785593, 1499206, 1451898, 318543, -1661301, -2226833, -446895, 1602333, 1721517, 314153, -992669, -1685601, -1954225, -1562546, -654582, -373104, -1236835, -2046700, -1675784, -753618, -327919, -127050, 486054, 1066526, 1039018, 943366, 1272841, 1218707, 134081, -842224, -319710, 1090486, 1723493, 1258185, 558142, -63197, -739687, -976343, -416794, -37391, -860772, -2105106, -2349275, -1892426, -2083907, -2871083, -3000722, -2242537, -1401396, -475201, 1079530, 2499453, 2402877, 1288411, 1008672, 1597222, 1106006, -881339, -2117936, -1104565]
45022a104565J748555M77077m32369J14547O00958o1516q84548p99392j44909
45013d86162M34444Q16988P13032k28193j288975j211815j44249M50890O9624
45004h74416k17196K45605O89438M55487Q4133J63517K98755k6908n22547o77388
44994c81520n01603k00448J58254L28122M0917k65990J86178J110504J155351
44985A629765j72536j576365j647221o37788J99489L41451K24110K61945M86853
44976h90297Q54699J160465Q70799k44934j438813j620838o81336M01671Q21905
44967g66679P31224O09278M46390m322n22069n42135M1643O48455P03255K44736
44957A589776k81859n45107m80412k02456M1544P3276O4106K73356M21389p3213
$$ y = [-1104565, 643990, 1121067, 688698, 803245, 1404203, 1342687, 458139, -341253, -486162, -51718, 765270, 1478302, 1250109, -38866, -1250681, -1394930, -944040, -874416, -1091612, -846007, -156569, 298918, 383051, 546568, 845323, 818415, 295868, -381520, -883123, -1083571, -925317, -597195, -556278, -822268, -636090, 474414, 1629765, 1457229, -119136, -1766357, -2404145, -2204656, -1863205, -1639095, -1377150, -890297, -35598, 1124867, 1995666, 1750732, 311919, -1308919, -1990255, -1588584, -766679, -35455, 573823, 1020213, 1015891, 493822, -48313, -6670, 641785, 1345040, 1589776, 1307917, 762810, 282398, 79942, 121486, 194762, 258868, 532224, 953613, 880400]
44947H80400r73265j168463l36880K64744l11727r29162j8607J604919J604189
44938F16148k29777j398081l92270J125112J016342k57173q39584l69727J35546
44929e93464L27053N94764O72978j4664q66176o30510N77524J258202O44421m27945
44919A542183r10468o71362j01748L67843K57241m76005r10414j37843J230837
44910A90264J641681P36670k62496m71370l90393o55776r31285o60566k3894M36853
44900c90312M62371q501q18863j247931o06820N19988O89180k91985q26230J81709
44890b337394J598138J644564L59693o81863n76780J14193N13678L78011k3042
44881I89198k50830r952M00881K73852m04710o33833J11567P83783K28493q64508
$$ y = [880400, -92865, -1261328, -1598208, -1333464, -1645191, -2574353, -2592960, -988041, 616148, 386371, -1011710, -1403980, -278868, 737474, 480301, -359283, -729010, -593464, -266411, 328353, 1001331, 986667, 120491, -510019, 67505, 1325707, 1970128, 1542183, 631715, -39647, -141395, 226448, 483689, 7684, -902730, -1040573, 190264, 1831945, 2568615, 2306119, 1834749, 1444356, 788580, -142705, -803271, -827165, -390312, 72059, 63558, -755305, -2003236, -2610056, -2090068, -1400888, -1692873, -2519103, -2337394, -739256, 905308, 1265001, 583138, 6358, 120551, 634229, 1012240, 989198, 738368, 728416, 1129297, 1403149, 998439, 364606, 476173, 1259956, 1488449, 623941]
44871F23941r02528M6958L39397m79619q24276L08600J554556J261339M1437l54310
44861A615495J46776R2698q36627j238388l52123O72570O06984j07217l92974
44852B07194k38503k22604j58107M65122J127369P30560o56864j686800j479424
44843a912057m87824M75832J042036R53171Q1275q30013n73298P59480J475849
44834I84451N38510q65414j030812j48474K76765j64753m47983j7676M33291L13150
44824a28945M447m0169l2428j58727n8136L99704N85311N8706n74310n25773p1994
44813e42314q4637n88556o97385p805P68078Q44078M09168J94963L75575M16156
44803A087321p3433p67558j020633n92853J49038O10250M46838j79962o87186
$$ y = [623941, -278587, -231629, 107768, -371851, -1196127, -887527, 667029, 1928368, 1969805, 1615495, 1762271, 1854969, 1018342, -220046, -572169, 100401, 707385, 600168, 207194, -31309, -253913, -412020, 53102, 1180471, 1911031, 1254167, -432633, -1912057, -2399881, -1924049, -882013, 71158, 152433, -677580, -1250878, -491398, 984451, 1522961, 657547, -373265, -521739, -244974, -409727, -857710, -875386, -442095, -128945, -124498, -164667, -197095, -355822, -413958, -14254, 571057, 629763, 55453, -470320, -542314, -626951, -1215507, -1912892, -1920697, -1152619, -308541, 100627, 295590, 671165, 1087321, 1013888, 246330, -774303, -1367156, -1218118, -607868, -161030, -340992, -1028178]
44794a028178n51325J13677O07871N04986K55113N20105J068981R83535N0646
44785B525411p85047p32069k41452j82297m86701m38370K4187K37278k1983k25691
44775c26734q8470K505j49007p6294M75491R10355O54370J15907K5213J97115
44765A740451j82000j144904j689376j124577J2538P27068P51065N46285M63580
44756A00130L73864L7594n09893r48471q83327j79073P35103J091596O13806o2987
44746C68342j93744L9863j07243o08762n42677L89621J089768N31445o43570r72173
44736f49130k41548L99064L01090Q4921L13126N73475M32440K76829M61494M96036
44726B447797l9504n36223l37215r422m18083j044623o86548L92109O62798j36278
$$ y = [-1028178, -1579503, -1465826, -857955, -352969, -97856, 422249, 1491230, 2474765, 2525411, 1740364, 1008295, 766843, 584546, 97845, -340525, -316338, -79060, -101043, -326734, -415204, -412699, -561706, -638000, -162509, 747846, 1402216, 1518123, 1543336, 1740451, 1558451, 413547, -1275829, -2400406, -2387868, -1660800, -909735, -363450, 100130, 473994, 511588, 1695, -946776, -1830103, -2009176, -1274073, -182477, 431329, 368342, 174598, 214461, 107218, -501544, -1044221, -654600, 435168, 966613, 323043, -649130, -890678, -491614, -190524, -105603, 207523, 780998, 1213438, 1490267, 1951761, 2447797, 2408293, 1872070, 1534855, 1525433, 1107350, 62727, -623821, -231712, 431086, 294808]
44716B94808m13639O24988J377680J96746j854597k275519o02037J094140J150778
44707d06652J86288l71339k67711j44839k34065k75212k12335j21888K09596Q51908
44697g86249J150655M42867p47294j130486l75250M83198O45561O21278J059433
44688A363713J325697L34476j492055k269250r53948J209126K080689J048874
44680B647322m64469p81779J89448J046193O49078n10705r74290k42507N36507
44671B094798J48011r73537j363166o01260J91680P8305m10199k29368O06096
44662d58640J101004O14378m87237j371408j457515o78781N22270J396737J395151
44653E75959O36494j78775l93801k1209K25739k75651j127400j181803j20551
$$ y = [294808, -118831, 506157, 1883837, 2080583, 225986, -2049533, -2651570, -1557430, -406652, -220364, -591703, -859414, -1004253, -1238318, -1513530, -1725865, -1847753, -1638157, -786249, 364406, 807273, 59979, -1070507, -1445757, -962559, -316998, 304280, 1363713, 2689410, 3023886, 1531831, -737419, -1691367, -482241, 1598448, 2647322, 2182853, 1401074, 1590522, 2636715, 3285793, 2775088, 1800798, 1558291, 2094798, 2242809, 1269272, -93894, -695154, -503474, -425169, -835368, -1064736, -458640, 642364, 1256742, 769505, -601903, -2059418, -2738199, -2215929, -819192, 575959, 1212453, 1033678, 639877, 618668, 844407, 568756, -558644, -1740447, -1860998]
44644a860998P72838K33821j001479j061086K85626J212176O00701l54926k32572
44635a405899L98737K54213l37337j67958N12431L78668n11378o71754K27292
44626a322985P09208k267o70734j78840O49949N90632K3582m4587J16378l15918
44616d45582q49932l38495Q57266J181536L55989k34246R0701L20047k24246n95904
44606A17134l0469M75042j33588q99775l38119Q27283N90867q99593j219614N06162
44596a004670J946601R97598j011420j380926l1578P38536q2766j021569p27337
44587a577531J50060L39871k32402p97472q93614m72475L43962J062121J102552
44578i74928O86964O28988R19319N72994o07016j303533n61957O77455R68906
$$ y = [-1860998, -1088160, -854339, -1855818, -2916904, -2631278, -1419102, -818401, -1173327, -1405899, -1007162, -752949, -1090286, -1258244, -745813, -367145, -878523, -1550277, -1322985, -613777, -616044, -1286778, -1465618, -815669, -225037, -201455, -246042, -129664, -445582, -1295514, -1634009, -776743, 404793, 760782, 526536, 617237, 937284, 713038, 117134, 86665, 561707, 428119, -471656, -809775, 17508, 608375, -291218, -1510832, -1004670, 941931, 1939529, 928109, -452817, -484395, 254141, 171375, -850194, -1577531, -1427471, -1087600, -1320002, -2117474, -3011088, -3483563, -3139601, -2077480, -974928, -287964, 341024, 1260343, 1833337, 1226321, -77212, -639169, 38286, 1007192]
44569A007192L67789j20439k93898o02983q18032l04439O26201R77217N67355
44560A405963P3479k72152p64204j106849o02513M39997Q58297M38463K01235
44551F71716N32630M71984m93879j297359q86720J54818O22100M14660J82457
44542C72407K7375k90649m66969j61206Q3988l48599q15081k38032R30593J073361
44532A67188j24396j068137o14046L37747M25718j62736l60968n6767J1448k65314
44522a710263k49905J98923M73644K64169p4682k73407l89398k50191L96791J074035
44512e40284R50077K22561j5709L97113L24000o39345j217503n05667M41225L85797
44502a97735l0398L34857Q37150J93879r06855o92385O13993J075051L36316M5087
$$ y = [1007192, 1374981, 1254542, 960644, 357661, -460371, -764810, -138609, 838608, 1405963, 1479442, 1207290, 443086, -663763, -1266276, -826279, 32018, 470481, 671716, 1204346, 1676330, 1182451, -114908, -1001628, -846810, -224710, 189950, 372407, 399782, 109133, -357836, -519042, -435054, -783653, -1598734, -1836766, -906173, 167188, 42792, -1025345, -1639391, -1301644, -875926, -1038662, -1399630, -1456397, -1444949, -1710263, -1960168, -1761245, -1287601, -1023432, -1098114, -1371521, -1760919, -2011110, -1614319, -540284, 409793, 632354, 616645, 1013758, 1337758, 698413, -519090, -1024757, -583532, -197735, -228133, 106724, 943874, 1137753, 230898, -461487, 152506, 1227557, 1563873, 1608960]
44492A608960O75902O55599n63503j247904m39964K67295l81374j028289k99374
44483g52652N14934k26161j356164p80741Q59731J285230M02262R4320O96472
44474G37231O33807m52024j017527m33446R072m84066r50883n21774L28329R79786
44464a171495J432337J424657N14025n63314m21998O43643P74589m59052j219965
44455I53427l78233P07021N18291l39994n35866j33277Q0269R8314J90073K2849
44445A182874m71243m38641M73624J093340L57796r92599j565031j240306p63197
44436b363383l26199J96043M34789J86817J11298N89892P38286j64737j117241
44427a714435p45421M59131Q40506R8289m71838j14902M50559L54136k98379q07645
$$ y = [1608960, 2284862, 2940461, 2376958, 1129054, 689090, 956385, 575011, -453278, -752652, -237718, -463879, -1820043, -2600784, -1741053, -455823, -53561, 40759, 737231, 1371038, 919014, -98513, -531959, -522887, -1006953, -1957836, -2479610, -2151281, -1171495, 260842, 1685499, 2199524, 1636210, 1214212, 1857855, 2632444, 2173392, 953427, 575194, 1282215, 1800506, 1460512, 924646, 791369, 871638, 969952, 1160025, 1182874, 711631, 272990, 746614, 1839954, 2197750, 1205151, -359880, -1600186, -2363383, -2689582, -2493539, -2058750, -1871933, -1760635, -1170743, -432457, -597194, -1714435, -2459856, -2000725, -1160219, -1061930, -1533768, -1648670, -1198111, -843975, -1142354, -1949999]
44417a949999o38101K11336J051556R98708J50571k67761M17608J208848Q60352
44408B043118k92604r73106p81352k25922M58691J234622J473051O25630n83446
44399B978682r42072n23169m01321p92792q40562k25460L46020M00076K49355
44390B48757J17861j91848n71919n66074k40329j71482m34766m92876j62312K07292
44380b257696N14140Q88112R31616J12422j007326j164093k74663L10187j19482
44371b066783n20551J98858J357955J382612o717j406524j448736l08345O60441
44362b157790N74847K5200J34618P92807O79749o11161j553176p45470R26028
44353a934348J539578Q60878J89069m4070n69686j248027q63625N93541J436092
$$ y = [-1949999, -2588100, -2376764, -1325208, -326500, -175929, -443690, -26082, 1182766, 2043118, 1750514, 777408, -3944, -229866, 228825, 1463447, 2936498, 3562128, 2978682, 2036610, 1513441, 1112120, 319328, -521234, -746694, -400674, -598, 248757, 366618, 174770, -397149, -963223, -1203552, -1375034, -1809800, -2302676, -2464988, -2257696, -1743556, -855444, 76172, 188594, -818732, -1982825, -2257488, -1947301, -2066783, -2587334, -2388476, -1030521, 352091, 345374, -1061150, -2509886, -2818231, -2157790, -1582943, -1557743, -1423125, -630318, 49431, -561730, -2114906, -2860376, -1934348, -394770, 466108, 655177, 611107, 41421, -1206606, -2070231, -1476690, -40598]
44344d0598Q43486P8639J78202K63613n18013j084576k26350J002878P56342n73255
44334F80368r32182J26624Q55974J43231r55951j057718l03133L72118O47192
44325d23477O74318L98726j56133n19622l98391j91285k62619k11366L88359R41922
44315B40432M91304o87575j155257k43332R57416J081007K59161l43620k57614
44306C41922N227J54060M56673P45115K90217q03337j194933j74781J003598P99845
44296A623606l35246p55175k28085r1957q04452j075242k559J401590J719797
44287A452277J044719L79307j5447n59172j187167j356826j005528n99675l09615
44278b157127J25638P25454J074984Q75596K86491k97329n52802m18513j82166
$$ y = [-40598, 802888, 881527, 1059729, 1323342, 805329, -279247, -505597, 497281, 1253623, 680368, -251814, -125190, 730784, 874015, -81936, -1139654, -1442787, -1070669, -423477, 250841, 649567, 493434, -26188, -424579, -615864, -878483, -1089849, -701490, 240432, 731736, 44161, -1111096, -1354428, -397012, 683995, 943156, 599536, 341922, 347149, 501209, 957882, 1702997, 1993214, 1189877, -5056, -179837, 823761, 1623606, 1288360, 533185, 305100, 213143, -591309, -1666551, -1669110, -267520, 1452277, 2496996, 2876303, 2860856, 2301684, 1114517, -242309, -1247837, -1847512, -2157127, -2031489, -1306035, -231051, 644545, 931036, 633707, 80905, -337608, -519774]
44269e19774j96588l69054k55712J89390M38199K24865K3345L00418P92706R63577
44259A591372P07360J89524m69292r21670o76855P482R2618o82004j082806j93442
44249a437713R48761Q40098j14563l39357K87563M17246k87348o48035k22173
44240e55521n1581n08821l36229J101963K315060J777422J40370j035795j494381
44231A352487j721496j393357j93235P69136L35561n64266k07243R68152R55834
44222C01573m08132j047489l3022R70502N01438n13748n58975J63445N30435K93652
44212A99679j43977o27699q58124k45928Q12122P97321o10310j456538k48398
44203b381852J540354J519833j07477j120049o39680J87214M70961M62687K81728
$$ y = [-519774, -716362, -1085416, -1341128, -1151738, -713539, -488674, -465329, -164911, 627795, 1591372, 2298732, 2488256, 2018964, 1097294, 420439, 427921, 520539, -161465, -1244271, -1437713, -488952, 351146, 236583, -102774, 184789, 602035, 314687, -333348, -555521, -607102, -1115923, -1452152, -350189, 1964871, 3742293, 3882663, 2846868, 1352487, -369009, -1762366, -1955601, -1186465, -850904, -1415170, -1622413, -654261, 301573, -106559, -1154048, -1187070, -216568, 284870, -228878, -787853, -624408, -93973, 199679, 55702, -571997, -1430121, -1676049, -863927, -66606, -676916, -2133454, -2381852, -841498, 678335, 570858, -549191, -1188871, -1001657, -530696, -68009, 213719]
44194B13719k86654o81263o4459R82974J005568j0777o22853l00815N4433R2043
44184C81916M56109R22790K88379j229143j660440l10804R49913N87097l74645
44175A1172m04425J03923P4253j90914L8130K52048k09283n49098J89351J192512
44165E07669J055342P2972m18153k68151l14248n77734m38264j22895l06008o45223
44155a454693l75686P6640k06684p42366k95774Q36184J108078K54753l31418
44146a130966R0164O68001O15884K23666j29093n36076q18392n29013N0620J70421
44136a324784j7484L16232J011634R66873M4568n89744l50531J9294m8185j36798
44126a08925L8272Q7493o9862k0929L2399n55438j298705q58637O30629J317125
$$ y = [213719, -72935, -754198, -818657, 164317, 1169885, 1159108, 536255, 235440, 289873, 381916, 838025, 1760815, 2049194, 820051, -840389, -1151193, -201280, 385817, 11172, -393253, -289330, -215077, -405991, -367861, -115813, -325096, -874194, -684843, 507669, 1563011, 1635983, 1217830, 949679, 635431, 57697, -380567, -503462, -809470, -1454693, -1830379, -1753739, -1960423, -2702789, -2998563, -2162379, -1054301, -799548, -1130966, -1040802, -372801, 243083, 466749, 337656, -198420, -1016812, -1545825, -1495205, -1324784, -1342268, -1026036, -14402, 952471, 997039, 407295, 56764, 76058, 27873, -108925, -70653, 16840, -53022, -73951, -41552, -596990, -1895695, -2754332, -2123703, -806578]
44116h06578M26287n26138k64641L37471J42288j88176L72325J123506P99025
44107A415369j94205n16794j75952k80127r20282j005041j52110P10386P87146
44098c31610L39881j1363m4846J47598L31597J47668n06938j115456j000856j23093
44088b167418Q63971J237398P61764r3729m50796K3019N11994Q9235p61794p27364
44078g13720J98009N65767j50294o48081r6431L26256m52940j232482l39228J423382
44068a119762J757771L51937p50470l21163M82242K45527o36760r07896l48573
44059a247147K31785L04087J16207R9011K94944L95707J86421j22246j70946n0243
44049C7580j81673m69111k54874M86546P41700k8983p99959m60790L33692J91033
$$ y = [-806578, -380291, -906429, -1171070, -833599, -691311, -879487, -507162, 616344, 1415369, 1221164, 704370, 528418, 248291, -671991, -1677032, -1829142, -1118756, -331610, 8271, -3092, -47938, 99660, 431257, 578925, 71987, -1043469, -2044325, -2167418, -1303447, -66049, 695715, 601986, 151190, 174209, 686203, 775438, 13644, -713720, -515711, 50056, -100238, -748319, -844750, -518494, -971434, -2203916, -2543144, -1119762, 638009, 989946, 239476, -81687, 400555, 646082, 9322, -898574, -1247147, -1015362, -711275, -595068, -496057, -201113, 194594, 381015, 258769, 87823, 37580, -144093, -613204, -868078, -381532, 360168, 331185, -468774, -929564, -595872, -404839]
44039d04839o19024n10849O98229J280129L47618o49945k65969N81464J73346
44030F30160j039352r82210P11403J882961R63248p21536r49437K01419P51876
44021A448532n0585p81101k75183O19443N95075p7514k89341j2869o7568m37226
44011F71663l02811L45230N37790o1636o37598o09574l77160l10268j21445K67889
44001e97920K96815j96554m47538O7101P49003Q12265L66203m6775k97274m43364
43991B61962l04570J34529M36392L18235M3791j11862j89471j33477J92780M27643
43981A075952Q0908l78451K3616R90745J042062j65900j132496q33725j67871
43972E34840j27766j31476N43107J116420O40258j97967j94260L90122M94244
$$ y = [-404839, -1023863, -1534712, -836483, 443646, 791264, 141319, -124650, 456814, 630160, -409192, -1391402, -679999, 1202962, 2166210, 1444674, 495237, 696656, 1448532, 1397947, 616846, 341663, 961106, 1556181, 1478667, 1189326, 1176457, 1108889, 671663, 368852, 714082, 1251872, 1190236, 552638, -56936, -434096, -744364, -865809, -597920, -301105, -497659, -945197, -878096, -129093, 683172, 1049375, 1002600, 705326, 261962, -42608, 91921, 528313, 846548, 890339, 778477, 589006, 455529, 648309, 1075952, 1156860, 778409, 802025, 1792770, 2834832, 2668932, 1536436, 702711, 534840, 407074, 275598, 818705, 1935125, 2575383, 2377416, 2183156, 2573278, 3067522]
43963C067522O9916k49233n02953r61206j063425k68483O79632P14290N7343l63390
43953A180013l71760k53577Q0729M74141J74952o79422o45738N54684R16403o42201
43943G88224j922158p82528J077227P98268q16554q75877L92310K33830j331090
43934b438348j318832P85421J874093N21610p76408k04409M99226k31655q47149
43925b136451J12658J082638M14506n22343N8086J102194Q67677J22842L20452
43916A422259N93834m12493j513508r45496J98676j86691j231968m99759J473389
43907a101757J757949q1424j278630l59802R45840R66256K99104j53586p02381
43898B91569j307162q54390P28222J640326P94408m87360o04900Q4548M48871
$$ y = [3067522, 3137438, 2888205, 2385252, 1424046, 360621, 92138, 771770, 1486060, 1543403, 1180013, 808253, 554676, 635405, 1109546, 1284498, 605076, -40662, 514022, 1430425, 788224, -1133934, -1916462, -839235, -40967, -857521, -1733398, -1341088, -1107258, -2438348, -3757180, -2971759, -1097666, -576056, -1352464, -1556873, -1057647, -1289302, -2136451, -2023793, -941155, -526649, -1048992, -990906, 111288, 978965, 1101807, 1422259, 2016093, 1603600, 90092, -855404, -656728, -843419, -2075387, -2575146, -1101757, 656192, 574768, -703862, -1063664, -117824, 848432, 1147536, 993950, 291569, -1015593, -1869983, -1141761, 498565, 1292973, 805613, 200713, 285261, 734132]
43889G34132N08970P21819N66091n45601j743539j622212k66262R03732J039605
43880B96735N54446R9335j64621k72716k00131j5758J56946L40871N68125O65409
43870B028641M63283P7540k55286m58045n44313m79288k86483r8070J5587O2647
43860E26213k4114k37392k47876J84000N43438J5893j168218j636314o57245O69240
43850b032375Q01317j49633p04236k10532L67040J04473m67655k88651N77090
43841b003162J088790P39987O9009k96375l15754j38374K23282N45651L92519
43832C05573j64372m36859j44224J13452p4043j27192M80393J086309P91777P454
43822A838268j90415J04920j47842r77851j187533l41318M81051L92053j58989
$$ y = [734132, 1243102, 1964921, 2531012, 1985411, 241872, -1380340, -1646602, -742870, 296735, 851181, 950516, 785895, 513179, 313048, 297290, 454236, 795107, 1363232, 2028641, 2491924, 2569464, 2314178, 1856133, 1311820, 832532, 546049, 447979, 463566, 526213, 502099, 264707, 16831, 200831, 744269, 760162, -408056, -2044370, -2701615, -2032375, -1231058, -1380691, -2084927, -2295459, -1928419, -1823946, -2291601, -2580252, -2003162, -914372, -174385, -105376, -401751, -717505, -855879, -632597, -86946, 305573, 141201, -295658, -439882, -326430, -400473, -527665, -47272, 1039037, 1830814, 1838268, 1647853, 1752773, 1604931, 627080, -560453, -901771, -420720, -28667, -187656]
43813a87656n00217o97234p36422p9870J085729J428084L81844o71669l78477
43804c55888M94159L99533m35507n20654L24522P01950p2227r82236r23227q4436
43794a454011O48848P71850L38386k49657m61540j69492J01576m5382j84830J55554
43784e48698M85280Q8214o10950n82993J17680M58108J65135M0560L99851N12635
43774E24822m4501o74875q58344q63696q56791l75567O37982J237539P13544k69297
43764h29184n43496Q6044Q92376J252549R97918J97019p63842j207639q38747
43755g57002j53769K18429K70533L34795M30330L53170J22715r1545k48589k95496
43745A83571l6525M98826Q38633N92886l1067n41270p25330o09767j81866M50343
$$ y = [-187656, -687873, -1385107, -2121529, -2201399, -1115670, 312414, 694258, 22589, -355888, 138271, 537804, 102297, -418357, -93835, 608115, 535888, -446348, -1369575, -1454011, -805163, -33313, 305073, 55416, -406124, -575616, -474040, -519422, -704252, -548698, -63418, 24796, -586154, -1169147, -1051467, -593359, -428224, -387664, 12187, 524822, 480321, -194554, -1052898, -1916594, -2773385, -3148952, -2510970, -1273431, -559887, -829184, -1372680, -1286636, -394260, 858289, 1856207, 2053226, 1289384, 81745, -757002, -910771, -692342, -421809, -87014, 343316, 696486, 819201, 727656, 479067, 183571, 147046, 645872, 1484505, 2077391, 2046324, 1505054, 779724, 169957, -11909, 438434]
43735D38434Q49892N99242k38706j208695j803353j590930m45981J012249J656514
43726g31334J053436J29793O1753P14246Q67884l1748j088604j183780m04165
43717f12519K36442J85822j01538J633M08900N32937J37021l66029m49966o1444
43707h8741L89069M57936N2462m62788n45456n7105M64205L92544j62120n25661
43697h5655m51479l52291l97772j34171N58617Q89496K77337n50316n02837K51814
43687d97257O46474M27645L39956O27307N81515j23689p47502o15367n3744K93683
43677H79021K96989M3206m67634q38511l73304P11570J079507R7860j000652q23722
43667c95670R0127K09227n08996o72490J08843N25276k49930j155730q77744K15516
$$ y = [438434, 1288326, 1887568, 1648862, 440167, -1363186, -2954116, -3400097, -2387848, -731334, 322102, 451895, 513648, 1227894, 2095778, 2064030, 975426, -208354, -612519, -376077, -190255, -291793, -290160, 118740, 651677, 788698, 422669, -27297, -88741, 300328, 758264, 810726, 347938, -197518, -254623, 209582, 602126, 440006, -85655, -537134, -889425, -1287197, -1421368, -862751, 26745, 304082, -246234, -749071, -497257, 149217, 576862, 916818, 1544125, 2125640, 2001951, 1254449, 639082, 585338, 879021, 1176010, 1219216, 751582, -86929, -460233, 251337, 1330844, 1428704, 428052, -395670, -305543, -96316, -605312, -1277802, -1168959, -643683, -893613, -2049343, -2927087, -2711571]
43657b711571Q26240O76291N58086Q16080R05037M50905j67864m68506m16601
43648D68097j87793L2953p4682o49255j088258n60050O65430J231597N28065l28944
43638C7160j08868O94350P03815j74710p37787m94546l10312p71659j163756o72133
43628b998446L60821J057673J148427Q68626L74912j18658k05579J25346L08228
43619I21350R6791o682K66194L24234k42686p91530o29151j47553l8228j01639
43609c48900J24105K58258k00174o62919k93639M19075L23292n06510r44026o15044
43599b446482j33637K17134O03404O91861J15506l57950K16786J092904Q02046
43590H01572k23363k29409O55432L94411j301297k059312o52405R40086P95956
$$ y = [-2711571, -1885331, -1209040, -650954, 165126, 1070163, 1521068, 1353204, 884698, 468097, 280304, 313257, 238575, -410680, -1498938, -2058988, -1393558, -161961, 366104, 37160, -71708, 622642, 1326457, 1151747, 413960, -80586, -390898, -1162557, -2326313, -2998446, -2637625, -1579952, -431525, 437101, 812013, 693355, 487776, 613122, 921350, 1018141, 1011459, 1277653, 1601887, 1359201, 567671, -61480, -209033, -247261, -348900, -224795, 33463, -166711, -829630, -1123269, -704194, -380902, -887412, -1831438, -2446482, -2580119, -2362985, -1759581, -1067720, -952214, -1310164, -1093378, -474, 801572, 578209, 348800, 1004232, 1398643, 97346, -1961966, -2614371, -1674285, -878329]
43581h78329p6835Q576N34513L23488P3N02917Q32481j40441j098170k88751J127973
43570H47495P60771r08464j306856j01954O01360K21478L48536J122588N80389
43561B165343j423413k130762k85557J529218R72585m50864k91879P70810O19120
43552A474601l90315l37204N82423M46938q08682j194681j02934P68767L68041
43543H06954k55808j79879j28207p17091j002906j01629J083726J127821J68355
43534H01336n26352m26084j7525L22889O13389O52594J45825n56746o83263j11342
43524B14721M38302M00771j5994l63796n38867n53689k26567M28129Q02626K96357
43514H81993o82459r11107J34824J402227J443730K64151p34480p09779m15311
$$ y = [-878329, -955164, -946588, -412075, -88587, -88514, 414403, 1246884, 1106443, 8273, -280478, 847495, 1608266, 699802, -607054, -709008, -107648, 113830, 462366, 1584954, 2165343, 741930, -1388832, -1674389, -145171, 827414, 376550, 84671, 855481, 1474601, 1084286, 747082, 1329505, 1776443, 967761, -226920, -329854, 438913, 806954, 551146, 371267, 243060, -474031, -1476937, -1578566, -494840, 632981, 801336, 274984, -151100, -168625, 154264, 767653, 1420247, 1566072, 1009326, 326063, 214721, 653023, 1053794, 1037800, 674004, 135137, -418552, -645119, -216990, 585636, 881993, 199534, -711573, -576749, 825478, 2269208, 2533359, 1798879, 1089100, 673789]
43505F73789p90761j335484q96930L39786R36164L66913j98796J67411O40221
43496i7687Q1228r20593q48892L30646J096742P40634K78110N45750Q38847L31465
43486B376250l74117l53405j04218o91867j678463j565403k33912P04463L33050
43477a587622l19753j12891N02268N79259L30957M46979N78940q2277j138698
43468h02838j306095l45831N83591O64101L80311M17256O08786N24161L17831
43459A041273L30983L48938p9908q14672j158789p09693J49753O59707M71155
43450B38747m170q9173K88636M72208L0393n03849l25802M47622Q99526N48946
43440B003084j81438p41756j014720r85945n61490J8637J99100j30001l96510
$$ y = [673789, -116972, -1452456, -2349386, -2009600, -1073436, -706523, -905319, -737908, -97687, -16459, -937052, -1785944, -1455298, -358556, 382078, 660188, 1205938, 2044785, 2376250, 2002133, 1648728, 1544510, 852643, -825820, -2391223, -2625135, -1920672, -1587622, -1907375, -2020266, -1517998, -938739, -607782, -160803, 418137, 335860, -802838, -2108933, -2454764, -1871173, -1207072, -826761, -409505, 199281, 723442, 1041273, 1372256, 1721194, 1641286, 826614, -332175, -1041868, -892115, -232408, 238747, 234577, 145404, 434040, 906248, 936641, 432792, 106990, 554612, 1454138, 2003084, 1821646, 1079890, 65170, -920775, -1482265, -1463628, -1264528, -1394529, -1791039]
43431a791039j55917L56820P45185R76204J066810P86265P8470o37106r12949
43422E12743o47207J00816J030874J219608j72033k301881k837444p02783K181928
43413a615379L036906J494295m65916j309877j198728o81035J61073R16193O90627
43404A028159n17294j378452r41971O9483M24568Q3421j07638J65371M62621M38776
43394b72956J30292l61755q12581p64548j38789L29356P356n34392k23068Q16222
43384a824863J266620N13894m44010m69569J52953L78673P5770P8805O69003R50671
43374A347947J62661r92163j067722J35587J043327K45869j490958k015354o11402
43365c242208R85521R71999o2225k00655Q46268J426995O19139m67249o81414
$$ y = [-1791039, -1946956, -1590136, -844951, 131253, 1198063, 1984328, 2062798, 1425692, 512743, -134464, -33648, 997226, 2216834, 2044801, -257080, -3094524, -3797307, -1615379, 1421527, 2915822, 2449906, 1140029, -58699, -739734, -578661, 337532, 1028159, 510865, -867587, -1809558, -1740075, -1315507, -1232086, -1339724, -1174353, -711732, -272956, -142664, -504419, -1317000, -2081548, -2220337, -1890981, -1883625, -2418017, -2641085, -1824863, -558243, -44349, -488359, -957928, -804975, -426302, -350532, -271727, 397276, 1347947, 1510608, 518445, -549277, -413690, 629637, 875506, -615452, -2630806, -3242208, -2256687, -1284688, -1346913, -1547568, -701300, 725695, 1344834, 877585, 196171]
43356A96171n63496r58470j220147l71596Q43787Q90075m7106l67432K58097M93212
43346h46905j51969m76833Q6120L23990m80931r97091q6359J001347N62765o46391
43336a712257n63158Q75613J766172J238506L24658j10638l08328l61028M4262
43327A193802L59090m38374j774611j741789n1449J217146O99319l18681j97094
43318a052641N97441P63280L70116J96858J10190k77169l96449K11191N97266
43309A120083j45623j027047n54401P28679R93679m8242r29020p67867j12576
43300g42335L67504M40034j68985j233080j405428J17802J770788J453896k18946
43291C81250q31681n4773J33536p36467p10866Q02567J473612m9906j474755m06440
$$ y = [196171, -367325, -1325795, -2545942, -2917538, -2073751, -1183676, -1230782, -1598214, -1340117, -846905, -998874, -1475707, -1389587, -1065597, -1546528, -2543619, -2629978, -1628631, -1065866, -1712257, -2275415, -1399802, 366370, 1604876, 1929534, 1818896, 1510568, 1149540, 1193802, 1552892, 1114518, -660093, -2401882, -2453331, -1236185, -536866, -855547, -1052641, -455200, 308080, 678196, 875054, 985244, 708075, 311626, 522817, 1120083, 974460, -52587, -606988, 121691, 1115370, 1067128, 138108, -629759, -742335, -374831, 65203, -103782, -1336862, -2742290, -2624488, -853700, 600196, 381250, -450431, -505204, -371668, -1108135, -1819001, -1016434, 457178, 407272, -1067483, -1473923]
43281a473923J654006J582683n74834j910917j015286N89793J186992P86362J35335
43272I60211l86801n36902j86158K20164J43292j37967J8518M83901O12882L26904
43262A518044j4092m41338j051275j255746m75249P42276J351712J188961P13428
43253B276721m5259j066959j500595p27310K41282M6802p62362n70559N13167
43244a595072P76962j40705o10896K03654J015737O74200j21818l94416m89882
43235f82236q98330r32874J9301J058970J012268K76750Q1804N28582O73440J85838
43225A323513k77494k41948j8869r0396m65758o79702k32661P38453J234472M45932
43215A735542r21898j270817k81078O13927L76939k04080k7716N11921L68898
$$ y = [-1473923, 180083, 1762766, 1187932, -722985, -1738271, -1148478, 38514, 824876, 960211, 573410, 36508, -149650, 70514, 213806, 75839, 94357, 578258, 1191140, 1518044, 1503952, 1062614, 11339, -1244407, -1719656, -977380, 374332, 1563293, 2276721, 2231462, 1164503, -336092, -1063402, -822120, -775318, -1537680, -2108239, -1595072, -818110, -958815, -1569711, -1366057, -350320, 323880, 202062, -192354, -682236, -1580566, -2513440, -2494139, -1435169, -422901, -146151, -64347, 464235, 1137675, 1323513, 1046019, 804071, 785202, 694806, 229048, -450654, -683315, 55138, 1289610, 1735542, 813644, -457173, -738251, -124324, 252615, 48535, 20819, 532740, 901638]
43206I01638l18216n05128P3793O33802N58249M621n56078p31876l65510J59055
43196a45650J18305n38599q75635k46187O78864Q54620L11424j08477m5094J17779
43186A21350J8484k66531l81650L0845Q31908J106106J66982j092543j046810
43177e11859K20965Q61658J61767l84000J28498K94589q71654j637827l61740
43168b099603J233870N87174j238629j083731J009527J807030K72466r08810q8245
43159e08951P37608k60460j537072j012426M42630Q32458L52841L49355N32605
43150g1412j55229j013735n33279P95749J087850J41832m06832M8819K99146l08179
43140a15270p32001j39449O90999P23592K09683j1025R9122l6697n00040p12195
$$ y = [901638, 583422, 78294, 152087, 785889, 1344138, 1348759, 792681, 60805, -304705, -145650, -27345, -565944, -1441579, -1687766, -1008902, -154282, 157142, 48665, 3571, 121350, 139834, -126697, -508347, -477502, 354406, 1460512, 1627494, 534951, -511859, -290894, 570764, 732531, 348531, 477029, 771618, -100036, -1737863, -2099603, -865733, -278559, -1517188, -2600919, -1591392, 215638, 488104, -420706, -508951, 228657, -31803, -1568875, -2581301, -2138671, -1306213, -953372, -604017, -71412, -226641, -1240376, -1773655, -977906, 109944, 251776, -155056, -106237, 192909, -115270, -847271, -986720, -295721, 427871, 637554, 626529, 725651, 688954, 188914, -523281]
43130e23281k95041L48252M52127j69164p61276m82983M51930R91791O55378L3881
43120G01614k92591m55087n19273m2497Q72823J089912Q907j221047j209505l08654
43110a375398J78397J03832K96490P25801N08915l15929o12562K8385O47366M34671
43100F19968k53207p10567p04412k41138N19324R45382N03715k49333k74207L26964
43090D82489M85575R189j70251K00431K39384k49099j92707O90845R42544l07675
43080B130725j565869j108303K95285O14180k94842p58608j64341K59439k54057
43071h46391p34142j68319Q88891J251768P21460l2820n35375o92150m17022J80909
43061c83191N34061K25254k98695k62503K39159K60848n86546j376850j003836
$$ y = [-523281, -818322, -470070, -17943, -187107, -948383, -1431366, -979436, 12355, 667733, 701614, 409023, -46064, -565337, -607834, 264989, 1354901, 1363808, 142761, -1066744, -1375398, -1197001, -1093169, -796679, -70878, 438037, 122108, -490454, -462069, 185297, 619968, 366761, -343806, -1048218, -1289356, -770032, 175350, 679065, 429732, 155525, 482489, 968064, 977253, 807002, 1007433, 1246817, 997718, 805011, 1495856, 2438400, 2130725, 564856, -543447, -248162, 366018, 71176, -687432, -851773, -592334, -846391, -1580533, -1748852, -859961, 391807, 1113267, 1080447, 545072, -147078, -564100, -383191, 150870, 376124, 77429, -185074, 54085, 314933, -271613, -1648463, -2652299]
43052b652299L15860J317589J319701Q45073N21674K02910l47965o52968k15141
43043F54434M57938M64393j16446m24973k34193q2451l7443M14437J040763Q09761
43033B946220k84374p20947L06976J397124R23580n02415j071286n51709k78283
43024B164886o74854o87425O1001L54802n56973j417405o96720J000019J622234
43015A169565M92793q19175o92019M38475Q31694j45807j217075r71223K48419
43006f64353Q81494K86923n17137m07281L70360P88288M83145p3706m56866o00631
42996I0236m39669L4234L86291N7583q02915j281102o56719P63211J813721J491562
42986A456433L4862j086928p72916J95991J44270r22332j120450L26270J550745
$$ y = [-2652299, -2336439, -1018850, 300851, 1145924, 1667598, 1870508, 1522543, 869575, 654434, 1112372, 1576765, 1460319, 1035346, 801153, 718702, 681259, 1095696, 2136459, 2946220, 2661846, 1940899, 2247875, 3644999, 4568579, 4066164, 2994878, 2443169, 2164886, 1490032, 802607, 863608, 1218410, 661437, -755968, -1452688, -452669, 1169565, 1662358, 843183, 151164, 589639, 1421333, 1275526, 58451, -912772, -664353, 217141, 504064, -13073, -420354, -49994, 738294, 1221439, 1147733, 690867, 90236, -349433, -315199, 71092, 128675, -674240, -1955342, -2612061, -1848850, -35129, 1456433, 1491295, 404367, -368549, -172558, -28288, -950620, -2071070, -1744800, -194055]
42977a94055Q22050o62163p36075J78430J3662j109379r59396P86411J670854
42968a89661M80704p33127j51205Q59164K99512j046266j133903p3865M49320
42959a239327J34458K3888K23453K0395k05073M67265J307121O79697j023756
42950C88121j592378m24795N96313K44395l29517M1828N91358L31617j00234J53762
42940i9530M00791k93787j154292q11651L61870P49270n4614q41331p36762j84596
42930b664632J22143J62497J89616K45710L34495N10892O52673N53467K47221
42921C54082r8727m63879p80068p06134o7208O92391R76150P75970N06453L18295
42911A507325N5868k81055n03463n38477m06021p7941L11556L80691j2581m60572
$$ y = [-194055, 627995, -34168, -770243, -591813, -578151, -1687530, -2646926, -1860515, -189661, 291043, -442084, -593289, 265875, 565387, -480879, -1614782, -1688647, -1239327, -1104869, -1080981, -857528, -837133, -1042206, -574941, 732180, 1411877, 388121, -1204257, -1629052, -1032739, -788344, -1117861, -1076033, -484675, -153058, -253292, -99530, 301261, 7474, -1146818, -1958469, -1596599, -847329, -901943, -1743274, -2480036, -2664632, -2542489, -2379992, -2190376, -1944666, -1610171, -1099279, -446606, 106861, 354082, 255355, -208524, -988592, -1694726, -1761934, -1069543, -93393, 682577, 1189030, 1507325, 1563193, 1282138, 778675, 240198, -165823, -243764, 67792, 448483, 435902, -24670]
42901b4670n04958j48129L72049Q66409J007002M89261k61548l08916L83018O47385
42891B516903j12770q78365o84133k29824m97231q02061J5259J225823J109943
42882A663544j78927q49278m49209k34145l90765M22405K002754J890068p03242
42873C173205k772789j580710J137822J696418j86294j525755r07487p3881m59032
42864a498503r90433l58375P09907Q22977J21058k38247J17900N99111O92901
42855b1704L59344j72514m48943j01721N03858N18585j47159n36133l3100O99174
42845F19687P34030J61786k84100l16986j37447J59406N22115N99316J06983o14616
42835A550174r04172n58946k9014M5879n80113j359151j228924J27914J410043
$$ y = [-24670, -529628, -677757, -305708, 560701, 1567703, 2056964, 1795416, 1486500, 1869518, 2516903, 2404133, 1525768, 841635, 611811, 114580, -687481, -672222, 553601, 1663544, 1484617, 635339, 186130, -48015, -438780, -16375, 1986379, 3876447, 3173205, 400416, -1180294, -42472, 1653946, 1467652, -58103, -965590, -1039471, -1498503, -2488936, -2847311, -2137404, -1314427, -1193369, -1431616, -1313716, -714605, -21704, 337640, 165126, -283817, -385538, 118320, 636905, 489746, -46387, -79487, 619687, 1353717, 1515503, 1231403, 914417, 776970, 936376, 1458491, 2057807, 2164790, 1550174, 646002, 87056, 58042, 103921, -476192, -1835343, -3064267, -2936353, -1526310]
42826a526310J013269o94385j591720o63380O99176R51421N06392M54332N54099
42817b97106J06926k75689K80613Q67788j4260j594036j517998M67110J866184
42808a10468J066953n44052j018577m30509J62756N83165R40263O65401l34943
42799I79989q19445n2402O82434Q1448q19593k89082J006581R05403o33691j273677
$$ y = [-1526310, -513041, -1207426, -2799146, -3462526, -2763350, -1811929, -1305537, -851205, -297106, -190180, -465869, -185256, 682532, 668272, -925764, -2443762, -1976652, -110468, 956485, 412433, -606144, -1036653, -873897, -290732, 649531, 1314932, 979989, 160544, 108142, 790576, 872024, 52431, -236651, 769930, 1675333, 1041642, -232035]
$$ [...]
##END NTUPLES=NMR SPECTRUM
##END=
