##TITLE=31Pdec_DPAA0812-3
 CDCl3, 24 sc
 10.12.2021
##JCAMPDX= 6.0         $$ Bruker NMR JCAMP-DX V2.0
##DATA TYPE= NMR SPECTRUM
##DATA CLASS= NTUPLES
##ORIGIN= UXNMR, Bruker Analytische Messtechnik GmbH
##OWNER= root
$$ XWIN-NMR		Version 3.5
$$ Fri Dec 10 11:20:25 2021 Russian Standard Time (UT+4h)  she@DPX200
##.OBSERVE FREQUENCY= 81.013821
##.OBSERVE NUCLEUS= ^31P
##.ACQUISITION MODE= SIMULTANEOUS
##.ACQUISITION SCHEME= undefined
##.AVERAGES= 24
##.DIGITISER RES= 16
##SPECTROMETER/DATA SYSTEM= spect
##.PULSE SEQUENCE= zgpg30
##.SOLVENT NAME= CDCl3
##.SHIFT REFERENCE= (INTERNAL, CDCl3, 0, 248.564)
##AUDIT TRAIL= $$ (NUMBER, WHEN, WHO, WHERE, WHAT)
$$ ##TITLE= Audit trail, XWIN-NMR		Version 3.5
$$ ##JCAMPDX= 5.01
$$ ##ORIGIN= Bruker BioSpin GmbH
$$ ##OWNER= she
$$ F:/spectra/data/she/nmr/P31/1/pdata/1/auditp.txt
$$ ##AUDIT TRAIL=  $$ (NUMBER, WHEN, WHO, WHERE, WHAT)
(   1,<2021-12-10 11:19:26.03 +0400>,<she>,<DPX200>,
      <created by zg, POWCHK disabled, PULCHK disabled
       configuration hash MD5:
       00 E9 B6 7A A2 85 ED C7 34 08 36 98 17 FE 4E 26
       data hash MD5: 32K
       7C 8A 52 E6 B2 2A 4D 53 63 14 60 EC 42 EC 00 B6>)
(   2,<2021-12-10 11:19:28.28 +0400>,<she>,<DPX200>,
      <Start of raw data processing
       efp BC_mod = 2 LB = 1 FT_mod = 6 PKNL = 1 PHC0 = -9119.028 PHC1 = -46.33002 SI = 64K 
       data hash MD5: 64K
       2D 99 38 63 41 FC 49 5F CD E4 61 BE 7F 34 F4 BD>)
(   3,<2021-12-10 11:19:55.14 +0400>,<she>,<DPX200>,
      <pk PHC0 = 94.26597 PHC1 = -217.8 
       data hash MD5: 64K
       0E 27 07 08 7F A4 FA AA A8 B6 77 6E 78 F7 29 B4>)
(   4,<2021-12-10 11:19:58.23 +0400>,<she>,<DPX200>,
      <abs ABSG = 5 
       data hash MD5: 64K
       CF AD B5 8E 41 24 98 56 83 3D B2 29 6B 27 37 FC>)
$$ ##END=
$$ 
$$ hash MD5
$$ C4 B6 5E 0D B7 01 28 E0 8C 12 41 ED AE 9C F5 05
##$RELAX= 
##$RELAX= 
##$RELAX= 
##$RELAX= 
##$RELAX= 
##$RELAX= 
##$RELAX= 
##$RELAX= 
$$ Bruker specific parameters
$$ --------------------------
##$DU= <F:/spectra>
##$EXPNO= 1
##$NAME= <P31>
##$PROCNO= 1
##$TYPE= <nmr>
##$USER= <she>
##$AMP= (0..31)
100 100 100 100 100 100 100 100 100 100 100 100 100 100 100 100 100 100 
100 100 100 100 100 100 100 100 100 100 100 100 100 100 
##$AQSEQ= 0
##$AQ_mod= 1
##$AUNM= <au_zg>
##$AUTOPOS= <>
##$BF1= 81.014009
##$BF2= 200.13
##$BF3= 200.13
##$BF4= 200.13
##$BF5= 200.13
##$BF6= 200.13
##$BF7= 200.13
##$BF8= 200.13
##$BYTORDA= 1
##$CFDGTYP= 0
##$CFRGTYP= 5
##$CHEMSTR= <none>
##$CNST= (0..31)
1 1 145 1 1 1 1 1 1 1 1 1 1 1 1 1 1 1 1 1 1 1 1 1 1 1 1 1 1 1 1 1 
##$CPDPRG= <waltz16>
##$CPDPRG1= <>
##$CPDPRG2= <waltz16>
##$CPDPRG3= <>
##$CPDPRG4= <mlev>
##$CPDPRG5= <mlev>
##$CPDPRG6= <mlev>
##$CPDPRG7= <mlev>
##$CPDPRG8= <mlev>
##$CPDPRGB= <>
##$CPDPRGT= <>
##$D= (0..31)
0 1 0 0 0 0 0 0 0 0 0 0.03 2e-05 3e-06 0 0 0 0 0 0 0 0 0 0 0 0 0 0 0 0 
0 0 
##$DATE= 1639120765
##$DBL= (0..7)
120 120 120 11 120 120 24 19 
##$DBP= (0..7)
150 150 150 150 150 150 150 150 
##$DBP07= 0
##$DBPNAM0= <>
##$DBPNAM1= <>
$$ [...]
##$SUBNAM3= <"">
##$SUBNAM4= <"">
##$SUBNAM5= <"">
##$SUBNAM6= <"">
##$SUBNAM7= <"">
##$SUBNAM8= <"">
##$SUBNAM9= <"">
##$SW= 501.771253377433
##$SWIBOX= (0..15)
0 1 3 0 0 0 0 0 0 0 0 0 0 0 0 0 
##$SW_h= 40650.406504065
##$TD= 32768
##$TD0= 1
##$TE= 0
##$TE2= 300
##$TE3= 300
##$TEG= 300
##$TL= (0..7)
0 120 53 12 22 120 120 120 
##$TP= (0..7)
150 150 150 150 150 150 150 150 
##$TP07= 0
##$TPNAME0= <>
##$TPNAME1= <>
##$TPNAME2= <>
##$TPNAME3= <>
##$TPNAME4= <>
##$TPNAME5= <>
##$TPNAME6= <>
##$TPNAME7= <>
##$TPOAL= (0..7)
0.5 0.5 0.5 0.5 0.5 0.5 0.5 0.5 
##$TPOFFS= (0..7)
0 0 0 0 0 0 0 0 
##$TUNHIN= 0
##$TUNHOUT= 0
##$TUNXOUT= 0
##$USERA1= <user>
##$USERA2= <user>
##$USERA3= <user>
##$USERA4= <user>
##$USERA5= <user>
##$V9= 5
##$VALIST= <valist>
##$VCLIST= <CCCCCCCCCCCCCCC>
##$VD= 0
##$VDLIST= <DDDDDDDDDDDDDDD>
##$VPLIST= <PPPPPPPPPPPPPPP>
##$VTLIST= <TTTTTTTTTTTTTTT>
##$WBST= 1024
##$WBSW= 4
##$XGAIN= (0..3)
0 0 0 0 
##$XL= 0
##$YL= 0
##$YMAX_a= 2379
##$YMIN_a= -3010
##$ZGOPTNS= <>
##$ZL1= 120
##$ZL2= 120
##$ZL3= 120
##$ZL4= 120
##$ABSF1= 248.5645
##$ABSF2= -253.2056
##$ABSG= 5
##$ABSL= 3
##$ALPHA= 0
##$AQORDER= 0
##$ASSFAC= 0
##$ASSFACI= 0
##$ASSFACX= 0
##$ASSWID= 0
##$AUNMP= <proc_1d>
##$AZFE= 0.1
##$AZFW= 0.5
##$BCFW= 0
##$BC_mod= 2
##$BYTORDP= 0
##$COROFFS= 0
##$CY= -3
##$DATMOD= 1
##$DC= 0
##$DFILT= <>
##$DTYPP= 0
##$F1P= 0
##$F2P= 0
##$FCOR= 1
##$FTSIZE= 65536
##$FT_mod= 6
##$GAMMA= 0
##$GB= 0
##$INTBC= 1
##$INTSCL= 5.30512e-09
##$ISEN= 30
##$LB= 1
##$LEV0= 0
##$LPBIN= 0
##$MAXI= 10000
##$MC2= 0
##$MEAN= 0
##$ME_mod= 0
##$MI= 50
##$NCOEF= 0
##$NC_proc= -8
##$NLEV= 6
##$NOISF1= 182.463
##$NOISF2= 159.3651
##$NSP= 0
##$NTH_PI= 0
##$NZP= 0
##$OFFSET= 248.5645
##$PC= 4
##$PHC0= -9024.763
##$PHC1= -264.13
##$PH_mod= 1
##$PKNL= yes
##$PPARMOD= 0
##$PSCAL= 0
##$PSIGN= 0
##$REVERSE= no
##$SF= 81.014009
##$SI= 65536
##$SIGF1= 159.3651
##$SIGF2= -187.1042
##$SINO= 113.3802
##$SIOLD= 16384
##$SREGLST= <1H.CDCl3>
##$SSB= 0
##$STSI= 65536
##$STSR= 0
##$SW_p= 40650.406504065
##$SYMM= 0
##$S_DEV= 0
##$TDeff= 32768
##$TDoff= 0
##$TI= <>
##$TILT= no
##$TM1= 0
##$TM2= 0
##$TOPLEV= 0
##$USERP1= <user>
##$USERP2= <user>
##$USERP3= <user>
##$USERP4= <user>
##$USERP5= <user>
##$WDW= 1
##$XDIM= 65536
##$YMAX_p= 495611278
##$YMIN_p= -20284998
$$ End of Bruker specific parameters
$$ ---------------------------------
##NTUPLES= NMR SPECTRUM
##VAR_NAME=  FREQUENCY,     SPECTRUM/REAL,   SPECTRUM/IMAG
##SYMBOL=    X,             R,               I
##VAR_TYPE=  INDEPENDENT,   DEPENDENT,       DEPENDENT
##VAR_FORM=  AFFN,          ASDF,            ASDF
##VAR_DIM=   65536,         65536,           65536
##UNITS=     HZ,            ARBITRARY UNITS, ARBITRARY UNITS
##FACTOR=    0.620285442955139, 1,           1
##FIRST=     20137.2065510759, 0,            0
##LAST=      -20513.1999529892, 0,           0
##MIN=       -20513.1999529892, -20284998,   0
##MAX=       20137.2065510759, 495611278,    0
$$ Real data points
##PAGE= N=1
##DATA TABLE= (X++(R..R)), XYDATA
$$ [...]
41692 5250379 5719594 6255421 5787123 3691375 848737 -549729 410571 1643891 605748
41683 605748 -2210122 -4359799 -5235296 -6237701 -7700619 -8491767 -8611136 -9357954 -10648231
41674 -10648231 -10774087 -9188877 -7190673 -5693574 -4609891 -4221318 -4547673 -3778641 -508633
41665 -508633 2744657 1913964 -2619877 -6279212 -6870377 -6649324 -7115293 -6632936 -5027006
41656 -5027006 -5674031 -10030323 -14066131 -13528934 -9583904 -6027323 -3919363 -2365671
41648 -2365671 -1783079 -2573785 -2778415 -849801 1051341 232593 -1722795 -1239501 1387185
41639 1387185 2453576 572145 -1913437 -3097795 -3480555 -3468391 -2235812 89338 1695727
41630 1695727 1405748 -182070 -2211514 -4276558 -5406549 -4528877 -2540115 -1941449 -3473765
41621 -3473765 -4623823 -2617012 1898599 5132755 4081820 -142943 -3231427 -2267243
41613 -2267243 1105722 3189388 3214471 3475219 4529980 3709316 -91387 -3536312 -3468412
41604 -3468412 -1577840 -1180672 -1895802 -1591424 -1507118 -4300671 -7849337 -6581391 224283
41595 224283 6405653 6868351 3471426 1070542 1523214 4047290 8004854 12047371 13012105
41586 13012105 9262418 3840906 1274745 2110031 3280258 3067134 2710941 3216660 3527927
41577 3527927 2744174 1920647 2352373 3557063 4368201 4980947 6194891 7029736 5160086
41568 5160086 511424 -3252165 -2596052 1311857 4020699 3696557 3126945 5030825 7935702
41559 7935702 8618772 6645142 4014078 1760335 -227333 -908506 1180402 4897291
41551 4897291 7001122 6048901 3515376 1078095 -595548 -427014 2430161 5892585
41543 5892585 6227033 3257325 1133519 2327505 4016921 2574911 -1275963 -4380660
41535 -4380660 -5588870 -5324225 -3099462 994625 4006279 3112212 -20227 -1401765
41527 -1401765 -586970 -712276 -2946788 -4811850 -4581052 -3685135 -3552529 -3334665 -2445917
41518 -2445917 -2535491 -4768231 -7166657 -6836887 -3605028 127513 1940033 655612 -3200641
41509 -3200641 -6639244 -5729696 -42394 5825929 7436794 5886257 5285556 6117496 4983076
41500 4983076 1074851 -1397914 695350 4197699 3815799 -317168 -2884327 -934460
41492 -934460 2180289 1521981 -3146010 -7523241 -7969571 -4857485 -1229092 454724 106981
41483 106981 -571654 -157151 882995 925009 -278740 -624037 1826135 5751790 7333801
41474 7333801 4546289 -133115 -2055902 698941 5254430 6967727 4362192 571240
41466 571240 -456481 1391267 2657783 1156856 -1184625 -1363368 249938 387923 -2654196
41457 -2654196 -6829155 -8691640 -6602534 -1647035 3200910 4802956 2308211 -1786283
41449 -1786283 -4233390 -4613556 -4811052 -5344566 -4797805 -3264617 -3267591 -5639750 -7168854
41440 -7168854 -4757261 -34503 2775485 2248904 481114 -452301 -50458 1748532 4385481
41431 4385481 5815053 4661130 2937460 3648232 5918061 6042284 3625404 2449366
41423 2449366 3801028 3392219 -1909562 -7857095 -7776775 -1757928 3890380 5691368 6522940
41414 6522940 9229052 11496958 9892542 5692688 3009320 2785783 2430003 913923
41406 913923 376780 1794490 2595342 868334 -623296 2080808 7804148 10957866 8823202
41397 8823202 4848774 3538367 4970953 6387540 6783992 7071305 7106267 5708742 3247236
41388 3247236 1409767 301392 -1694808 -4753133 -6694073 -6079445 -4254638 -3283121
41380 -3283121 -3319772 -2933804 -957223 2462558 5649806 6339564 4223255 2100637 2450143
41371 2450143 3397548 1020131 -4472332 -8500602 -8628967 -7210265 -6147140 -3577090
41363 -3577090 1526480 5812689 6502062 6230803 8367371 10525178 8065942 1978437
41355 1978437 -2380746 -3184584 -3110442 -3156309 -1541488 970017 676888 -2858565 -5544234
41346 -5544234 -5146146 -3932562 -3606998 -2952842 -2162775 -3730030 -6778759 -6654355 -3161791
41337 -3161791 -2559791 -7070801 -9353926 -3643507 3958178 4431090 109783 337018 5745726
41328 5745726 7524151 2206094 -3158527 -2854888 -363424 -439785 -1019123 1714704 5764899
41319 5764899 6353667 3007454 -912789 -3121917 -3294771 -1589164 590930 777539 -987433
41310 -987433 -1415511 853742 2611343 1341918 -441372 487845 2871158 3976300 4481284
41301 4481284 5808557 5573650 1048021 -4876055 -6740729 -4367755 -2297776 -2217102 -1544113
41292 -1544113 528437 1303448 -110950 -824340 963451 3393494 4710274 5552118 6009407
41283 6009407 4485778 1401759 223102 2549730 5508226 6202248 5470297 4881660 3376897
41274 3376897 -35124 -2960427 -2385253 968030 3863469 4654694 3812809 1985497 -115587
41265 -115587 -1370018 -1849328 -3102960 -5064046 -5068874 -2285142 -310513 -2061657 -4662511
41256 -4662511 -3582953 154904 1774762 555941 400471 2479207 2782210 -1323653
41248 -1323653 -6568536 -8243013 -5994774 -2947397 -1632574 -2758164 -5580970 -7478941
41240 -7478941 -5330843 601880 5958510 7170992 5153984 2545301 -110228 -2907326
41232 -2907326 -3867612 -1440861 1574982 606152 -4269059 -7971351 -7058514 -3633955 -1674934
41223 -1674934 -2303786 -4204766 -6254822 -7609480 -6936782 -4061763 -1548710 -2291433 -5642456
41214 -5642456 -7887593 -6731840 -3557601 -878488 583664 1359521 1498673 1048834 1254716
41205 1254716 3307374 6106869 7046316 5238632 2409652 256429 -1356432 -2787683
41197 -2787683 -3014148 -1273973 743726 202498 -3604721 -8527999 -11822044 -12093647 -9580396
41188 -9580396 -5895340 -3170567 -2087170 -1036965 1444162 3986521 4000155 1708629
41180 1708629 350323 1996876 5170413 7179290 6949849 4925480 2099062 -7794
41172 -7794 -229492 502452 72701 -1505217 -1895726 -339443 1051811 1193168 1845902
41163 1845902 3246781 1649987 -4762713 -10467466 -8466435 -276941 5531341 4715419
41155 4715419 1657496 1262506 2279769 1405282 -809192 -2066675 -2956807 -5285105 -7934235
41146 -7934235 -8356967 -6807305 -5487586 -4631022 -3100914 -2064004 -3977460 -7706182
41138 -7706182 -8499999 -4061098 2247519 5586115 4741305 1877928 -548495 -1097222 540599
41129 540599 2862001 3196164 771003 -1587137 -309849 4717312 9834336 11052645
41121 11052645 7092090 -125440 -6716859 -9123706 -6770791 -2718077 -677646 -1213080
41113 -1213080 -1851547 -1088341 -724675 -2905744 -5862235 -5143809 51696 4079298 962696
41104 962696 -7572310 -13440132 -12102577 -7675810 -6159675 -6945423 -5057376 40284
41096 40284 3072486 835576 -3243332 -4432236 -2932134 -2012117 -2555464 -2705104 -1482753
41087 -1482753 290842 2048118 3887763 5221600 5188817 4388139 4465638 5980232 7934143
41078 7934143 9055276 8424816 5703756 2199146 635740 1973092 3508286 2455058
41070 2455058 414443 1332514 5452524 8580622 7686502 4198191 1187221 330870 2377553
41061 2377553 7184260 11812762 11891625 6989956 1833705 108303 159728 -557464 -385697
41052 -385697 2936134 6400709 5076377 326150 -1089018 3317663 8346832 9017317
41044 9017317 6899465 5771376 5347695 3438808 1291650 1836378 3812698 2435838
41036 2435838 -3599357 -9565073 -10506109 -6969648 -3392337 -2612780 -3670779 -4073264 -2691626
41027 -2691626 -441052 1183813 1895341 2560315 3267869 2643613 312065 -1124228 1085633
41018 1085633 5382985 7138909 4936434 2568111 3177427 4440206 2542783 -1243813
41010 -1243813 -2045535 1106134 3398759 961026 -3798325 -5573031 -2889380 546722
41002 546722 241038 -4655889 -10474014 -11892232 -7022076 -304232 1606359 -1965219
40994 -1965219 -4011454 1406024 10850586 15344551 11333380 3884030 -894877 -2181690
40986 -2181690 -1813849 271280 4378318 7314270 4693264 -3052946 -10162320 -11818118
40978 -11818118 -8756633 -4843366 -2196238 -358425 1006821 917751 -1068294 -3279339
40970 -3279339 -3333506 -776680 2559743 4836234 5918580 6429692 6177075 4761416 3146624
40961 3146624 2797202 3012067 1092173 -3627045 -7526742 -6558882 -1694034 1752409 474660
40952 474660 -3222942 -5053148 -4057182 -2540526 -1948047 -1300042 138824 925419 -540367
40943 -540367 -3351971 -4948617 -4079227 -1671041 840313 2695474 3498782 3181249 2479952
40934 2479952 2182216 1724319 17139 -2054675 -1901933 1024094 3661318 3152681 719061
40925 719061 -269077 1062024 2609503 2695727 1601358 145366 -862739 1802 3362727
40916 3362727 6927850 7506239 5557199 4882045 6949409 8540644 6585754 2517319
40908 2517319 -398246 -1716276 -3120037 -4753190 -5129468 -3846577 -1862968 400129
40900 400129 2979152 4800514 4370666 1942201 -779396 -2889241 -4623794 -5861919
40892 -5861919 -6081077 -5508629 -4586812 -2759453 222012 2328383 1220744 -1731783 -2232731
40883 -2232731 1274368 5248497 5717164 3107387 663844 -73630 108589 759359 2224829
40874 2224829 3543242 2608935 -483625 -2323649 -298249 3337075 3868869 405489
40866 405489 -2963303 -3277725 -3172832 -6592560 -11990834 -13785632 -10339658 -6270013 -5588274
40857 -5588274 -6490769 -5421903 -2997816 -2439665 -4296475 -6338091 -7322685 -7470351 -6354173
40848 -6354173 -3840344 -2133776 -3024817 -3798633 -285741 6040718 8833061 5724758
40840 5724758 1615424 1103002 2227487 956662 -1953971 -2855679 -1509268 -929471 -1926671
40831 -1926671 -1968048 468473 3842077 6336182 7720454 7594343 4605737 -791365 -4707759
40822 -4707759 -3311834 2479752 7623632 8476707 6286832 4563732 4381434 3912877 1980034
40813 1980034 -225118 -1455987 -2178449 -2703884 -1740774 1020054 2808310 1362901 -675828
40804 -675828 1140497 5803145 6963357 1540719 -5549719 -7517630 -3818891 323020
40796 323020 648918 -2311292 -5122673 -5197185 -2959180 -1075633 -1161266 -1754153 -1117693
40787 -1117693 -962340 -3974911 -7937383 -7059353 -566921 4996349 4940687 3250528 5935581
40778 5935581 11367679 12786664 8314428 2797241 345773 157780 -42347 -836750 -2087107
40769 -2087107 -3536816 -3897954 -2335177 -841410 -1904527 -4038876 -3459730 -342080
40761 -342080 905938 -1357619 -3018485 -301284 4648787 6958475 5391670 2876794
40753 2876794 2101380 2775836 2677227 177514 -3883726 -6671766 -6492314 -4863765 -3965463
40744 -3965463 -3246212 -1378267 -438005 -3732126 -9240433 -10253253 -4476035 1988427
40736 1988427 2650722 -1228285 -4083804 -4292349 -4344045 -4683347 -2423280 3562933 9940759
40727 9940759 12415264 10115642 6046426 4141697 5448203 6560205 3208215 -3742023
40719 -3742023 -8231779 -6746350 -3308257 -3595807 -6554212 -6408157 -1882893 1742163
40711 1742163 421442 -3375094 -4975191 -3593951 -1758657 -1018231 -634729 603624
40703 603624 2883330 5028091 5149324 2808383 579716 1426748 4165249 4185237 -168278
40694 -168278 -4684419 -4780683 -1591858 115298 -1482744 -3813670 -4308846 -3184629 -1531979
40685 -1531979 835338 4487022 8572634 10782655 8941337 3140498 -3070951 -4855072
40677 -4855072 -1201988 2978292 2210575 -2476839 -4598598 -616312 5741219 8778238
40669 8778238 7511452 4816251 2308842 -617463 -3630721 -4761372 -3419061 -1766242
40661 -1766242 -2110235 -4237928 -5921383 -5100807 -1405669 3400790 6392909 6026070 3776875
40652 3776875 2192337 1649102 711173 -500189 279486 3828938 7380794 7770280 5282191
40643 5282191 2817293 2189537 2720578 2857586 1820742 -61129 -1693247 -2146539 -1773384
40634 -1773384 -1818442 -2535498 -2680466 -1462268 160801 911996 695463 -221332 -2078101
40625 -2078101 -4385906 -5195004 -3265527 1575 2350512 3405048 3992878 3780323 1637877
40616 1637877 -2086460 -5445636 -6859219 -6002290 -3368927 -193048 1992761 2908646
40608 2908646 3638605 4288997 3426039 1232043 585451 2560480 3693663 1321173 -1050789
40599 -1050789 1387178 6373142 6981165 1920369 -2704456 -2585034 -127234 1290823
40591 1290823 1902696 1978675 -310331 -3887779 -3263410 3231563 8544264 5969268 -617245
40582 -617245 -2055424 2972341 7102310 5966009 3842469 6117695 11450357 14131076
40574 14131076 10990163 3680340 -3739516 -7657051 -6825918 -3018910 642564 2418532
40566 2418532 2710338 2683799 3077331 3847401 4142713 3276026 2095044 1926762 1877772 -152589
40556 -152589 -2846050 -1640840 4021461 7651584 4012901 -2922615 -5509979 -3302880
40548 -3302880 -2286770 -4876916 -7530509 -8051927 -8165213 -7723933 -3396077 4319261 9030782
40539 9030782 6944120 2267014 476630 897085 26778 -2037291 -3157984 -3722240 -4877610
40530 -4877610 -4886223 -1943740 1432222 1306869 -2026997 -5290998 -7139952 -7666752 -5342496
40521 -5342496 250519 4250992 1141202 -6726893 -11052588 -8523060 -4149401 -2623502
40513 -2623502 -2380253 -787265 372306 -1253291 -3315900 -2144070 895169 919919 -3498475
40504 -3498475 -8518004 -9856570 -6674710 -1032409 3929545 5419231 3013858 -474743
40496 -474743 -1890458 -1493359 -2195147 -5176221 -8140485 -8237307 -5165001 -969339 1995782
40487 1995782 2646690 1881791 1846344 3311717 3957716 1024746 -4197940 -6868277 -4664347
40478 -4664347 -1148923 -1051795 -3836328 -4743581 -1593738 2567620 4130945 3289176 2143019
40469 2143019 846285 -1702984 -4525079 -4930602 -2377172 549617 1766063 2136327
40461 2136327 3017546 3286373 994167 -2858236 -4553181 -2020555 2622796 5570806
40453 5570806 5276730 3092771 752215 -1512559 -4110964 -6288922 -6299599 -3613327 -50239
40444 -50239 2171255 2952402 3647187 4315121 3644569 1969349 1934034 4595600 6919059
40435 6919059 5565404 1787339 -307931 414462 1275966 666729 167644 857106 979407
40426 979407 -747377 -2355490 -1642042 304122 1321694 1989969 4050508 6485019 6859735
40417 6859735 5899910 6711053 9121654 8825572 3672312 -2557719 -4916304 -3331031 -1388548
40408 -1388548 -945248 -804926 83418 786528 -84248 -2606936 -5385265 -6231750 -3635175
40399 -3635175 1237472 4682649 4018246 498052 -2517403 -3348329 -2373435 84649 3615802
40390 3615802 6119059 5542054 3456946 3605237 5956888 5754103 528191 -5231114 -5759143
40381 -5759143 -2102406 -475136 -3578954 -7835975 -9380691 -8511599 -6811470 -3779223
40373 -3779223 926304 4622873 4357274 1238367 -978326 -1027152 -1144648 -3111084 -5766892
40364 -5766892 -6777806 -4958949 -798385 3330669 3604743 -1899672 -9592908 -12706951
40356 -12706951 -8555040 -1340864 3511449 5374507 6847966 8594761 8841015 6988948
40348 6988948 4846488 4335717 5797024 8117771 9074572 6698196 2188769 -16578
40340 -16578 2359909 5474973 4101884 -888061 -3837600 -2487358 -193033 276708 117322
40331 117322 358702 -612832 -3053174 -4008675 -2538723 -2542788 -6572998 -10503403 -8798041
40322 -8798041 -2326007 3461869 5758743 5377661 2861403 -1317113 -4308877 -3852794
40314 -3852794 -2614432 -4437580 -7280564 -5672911 47521 3186849 395486 -3901550
40306 -3901550 -4617954 -2320409 -77933 1331994 2265119 2065927 756860 -271747 -1234560
40297 -1234560 -4169497 -8331137 -9298447 -5110533 423319 3079411 3162387 2495295 611229
40288 611229 -2619773 -4345566 -2610930 279941 1855787 3427412 6030848 6385645
40280 6385645 2072152 -2610543 -1981855 2140012 3104329 -568627 -4153885 -4789258 -4082503
40271 -4082503 -2745207 756851 5111570 5858836 2239127 -706800 990472 5616888
40263 5616888 9780972 12480847 13109634 10064933 4279686 213117 187745 1110117 -122240
40254 -122240 -1384545 783724 4948680 6848968 5976902 5625478 6876954 6698365 2841389
40245 2841389 -2377199 -4659354 -2524442 1643828 4577343 5209365 4797771 4571659 4161349
40236 4161349 2835929 1261563 614366 601496 253288 340232 2633876 6480074 8548851
40227 8548851 6910790 3371173 826446 157518 645150 1562334 2280559 2487754 3167853
40218 3167853 5492803 7951154 6982025 1899809 -3117747 -3885301 -1147042 1373335
40210 1373335 2045263 1960757 1814284 1034783 -238721 -749306 -102017 442617 -358822
40201 -358822 -2207852 -3747187 -4109412 -3842170 -4225882 -5357662 -5385083 -2796254 790675
40192 790675 1886710 -502697 -3604282 -4620194 -3836042 -2955436 -2251308 -1034403 395596
40183 395596 1104585 1155849 1377489 1794512 1386433 -617716 -3662458 -6006176 -6149881
40174 -6149881 -4612410 -3614776 -4022624 -3746193 -1009849 2139435 2597352 1524077 2768223
40165 2768223 5868317 5439383 -780313 -7712985 -9495740 -6595950 -3329728 -1585249
40157 -1585249 -602113 -281671 -732343 -340843 2018267 4339410 4433355 3831550 5002033
40148 5002033 6236349 3759151 -1767401 -5487422 -5393132 -4709319 -5966225 -6615141 -3075456
40139 -3075456 3230046 6786831 4535142 -369179 -2039948 1375694 5447660 4843070
40131 4843070 154800 -2719748 -65699 5442152 8974403 9209786 7968038 6618740
40123 6618740 5157041 3206513 184221 -3859120 -6536027 -4965932 -504300 2040055
40115 2040055 1644702 2873352 7623894 10578873 7625633 3533926 4761900 8961475
40107 8961475 9274896 5696247 3569777 3137900 166294 -3946433 -2992807 2199668 3075571
40098 3075571 -2846841 -7369742 -4895049 -966903 -2047864 -5270508 -5192674 -3451344
40090 -3451344 -3890759 -4030092 109579 5038905 4349998 -580209 -2735043 -526121 1259228
40081 1259228 647091 791035 2891226 3989825 2876795 1837568 1208277 -1710784 -6368363
40072 -6368363 -7370875 -2215265 3936835 4679548 369256 -3489060 -3559059 -1404581 -279822
40063 -279822 -1657617 -4443347 -6141911 -5015103 -1649884 1849067 3830424 3467122
40055 3467122 218765 -5118029 -9343419 -9156063 -4788454 236873 2857692 2570048
40047 2570048 559209 -1252391 -965012 1288971 2737535 1544005 -129464 589041
40039 589041 2263835 1246372 -2014360 -3365881 -1848368 -1324110 -3927062 -6457222
40031 -6457222 -5405555 -1638500 2186116 5115875 6320251 3854287 -1740403 -5926984
40023 -5926984 -5858035 -4619951 -5967503 -7757154 -5409835 213049 3789769 3424285 2191370
40014 2191370 1984277 1315121 99486 1191305 4991687 7221229 5058115 1699868
40006 1699868 1428086 3312807 3692785 2386401 1969675 2424347 1347962 -879115 -1033900
39997 -1033900 1003653 894923 -3465394 -7856895 -7452354 -3670072 -1574285 -2432022 -3173067
39988 -3173067 -2505510 -2928815 -5725030 -7954354 -6646178 -3216397 -1106172 -768643 276129
39979 276129 3118126 5599998 5004532 1275822 -2625066 -3121157 665412 5588340 7491908
39970 7491908 5944492 4290974 4360241 3793911 532588 -2918607 -3119829 -1477437 -2029942
39961 -2029942 -4555874 -4819430 -1656464 1442889 2849114 5291852 9342180 9936306
39953 9936306 3890823 -3357731 -4202491 550674 3652437 2691209 2724668 6865551 10696696
39944 10696696 9266512 5020147 4339431 8451353 11988543 10171759 4262760 -632395
39936 -632395 -1109914 2058343 5807136 7921638 8157406 6963278 4411255 1137582 -824582
39927 -824582 69074 2540315 3934710 3843647 4013644 4500835 2949611 -898798 -2923287
39918 -2923287 368786 6315645 8801590 5908920 1873892 1234221 3854718 6783919
39910 6783919 8592106 9783125 10167620 8406582 4618467 1574050 1715773 3616958
39902 3616958 3343406 -165658 -3082626 -1793601 1578632 1775708 -1888552 -4184259
39894 -4184259 -1580918 2356097 1945566 -2782106 -6774919 -7077567 -5491170 -4478966
39886 -4478966 -4136981 -3980126 -4615421 -6147379 -7046559 -6120993 -4273777 -3208038 -3439176
39877 -3439176 -4322406 -5041297 -5024252 -4283258 -3587890 -3428593 -3040532 -1673997 -247221
39868 -247221 117970 565217 2865267 5589680 5333968 2372979 1332345 4447017 7653399
39859 7653399 6215200 1550494 -916964 966829 4271682 5509650 3998556 1196234
39851 1196234 -720598 161545 3797706 7686378 9586135 9787401 9049197 6146925 464117
39842 464117 -4451811 -4040773 632803 3384227 924673 -3189282 -4087973 -1886356 -298244
39833 -298244 -1325128 -3749088 -5504132 -5455710 -3710287 -1774037 -1610139 -3199813 -3925639
39824 -3925639 -1722726 2063478 4459628 4683670 4379676 4499358 4138899 2971823 2837643
39815 2837643 5280048 8379536 8086403 3283195 -1953670 -2609274 1292022 4687247
39807 4687247 3719693 254952 -926699 1870943 5752310 7212306 5916133 4157708
39799 4157708 3629443 3557396 2194727 -90450 -339039 3066737 6804679 5652174 -375521
39790 -375521 -4995469 -3494343 1298263 3553699 2338601 1176370 1493745 1171493 -587131
39781 -587131 -1421327 122126 2193804 2621571 1492213 -394645 -3070122 -6197948 -8602952
39772 -8602952 -10022715 -11201785 -11579099 -9475312 -5505487 -2927469 -3070741 -3149428 -695668
39763 -695668 2173561 1581175 -2349868 -5197500 -3602672 707038 2688317 -562568
39755 -562568 -6306783 -8803206 -5858604 -1219626 785839 575804 534331 -353661 -4164823
39746 -4164823 -7947503 -6326874 -376569 2775241 682283 -999567 1356401 3011383
39738 3011383 -465389 -4660527 -3268958 1094379 875219 -4117146 -6254473 -1595843
39730 -1595843 4952286 7017073 4094751 136984 -1329089 530224 3719478 4953484
39722 4953484 3207154 1151723 1275227 2341826 2156216 1396354 1319495 333068 -2787765
39713 -2787765 -4753131 -2047469 2593043 3718325 1702883 1571842 4252482 5639236
39705 5639236 4197613 2738462 2239141 788018 -507614 2145371 7426976 8958177
39697 8958177 5516205 3384678 5081085 4012733 -4066890 -11748392 -9740257 -738493
39689 -738493 4638298 2586694 -1208166 -2069970 -1750620 -2852932 -4148891 -3428753 -1197544
39680 -1197544 130698 -1127848 -4264000 -5956209 -3055642 2912735 6333295 4604256
39672 4604256 1594332 1178965 1111008 -2183966 -6083843 -5028454 573692 4900874 5386504
39663 5386504 4754033 4567002 3104414 664273 870707 4477135 7016714 5331567 2110170
39654 2110170 1064168 1492756 974293 227290 1394609 3423530 2928564 -890671 -4905099
39645 -4905099 -5604351 -2424365 2176718 4903472 4406884 2715288 3316577 7281881 11960008
39636 11960008 13762245 11456943 6844166 3319615 3423491 6221103 7524661 4754679
39628 4754679 1108547 2053621 7602834 11480019 9045787 2824081 -1592728 -2163398
39620 -2163398 -583489 1563872 3778641 5249866 5422310 5287039 5793072 5605611 2725772
39611 2725772 -1981758 -5099235 -4722591 -2496648 -1116252 -1087459 -809515 575879 1336333
39602 1336333 -935617 -5347312 -7201870 -3378798 2698855 4431675 488418 -3526375
39594 -3526375 -2956141 45109 939019 -330456 -716379 -90288 -1372002 -5260710 -8899391
39585 -8899391 -10078863 -9426955 -7955018 -5554288 -2717310 -908001 -152676 1276538
39577 1276538 3709809 4996510 3853039 2048821 1624863 1791622 439075 -2574710
39569 -2574710 -5379454 -6472481 -5796971 -4243181 -3169453 -3532348 -4472040 -3740863 -592458
39560 -592458 2776322 3782891 2437644 630678 -427607 -732689 -639254 -1109164 -3666271
39551 -3666271 -8024070 -10523768 -7423611 129546 6479395 7317086 3703160 34400
39543 34400 -409948 2491308 6465414 8729641 8078991 5855228 4408842 4534713 5048173
39534 5048173 4544747 2529874 -692080 -3684702 -3869703 -55069 4851527 5985066
39526 5985066 2076492 -3256692 -6450716 -7688194 -8459430 -8321005 -6449154 -4220888
39518 -4220888 -3371405 -2964551 -968746 2189407 4337411 4861462 4470164 2611128 -1457279
39509 -1457279 -5386804 -5303016 -1231123 2424470 2802098 1860422 2498535 4430365 5637035
39500 5637035 5302704 3409768 -268087 -4737636 -7337881 -6736336 -4712191 -3286932
39492 -3286932 -2015750 52753 1826290 1817225 592744 -488762 -1147843 -872631 1782389
39483 1782389 6028290 7649596 4359332 -38752 -678980 1462436 2165173 1310213 2120802
39474 2120802 4404874 4712082 2903664 2216634 2465972 38771 -4094133 -3810615 1908613
39465 1908613 5490868 1868105 -3694408 -4421386 -2495843 -3681883 -6525643 -5336758
39457 -5336758 -931821 360974 -2616863 -4359040 -2066307 958196 2106051 2583111
39449 2583111 2417548 -620931 -4917847 -4559373 1834465 7688340 7413134 3532628 1318188
39440 1318188 1505277 2419811 4279048 6499178 5298200 -424403 -4622164 -1484925
39432 -1484925 5811846 9831842 9406708 8551078 7397846 2716717 -3085315 -2646650 4576437
39423 4576437 9418427 5738728 -853815 -2050299 1062481 1310192 -2827455 -5709877
39415 -5709877 -3575969 1013398 4186269 5312238 5289249 4140588 2231619 1317832 2485461
39406 2485461 4572331 5905125 6137810 5179248 2013286 -3348133 -7720775 -7224439 -2300205
39397 -2300205 2071556 2462972 1316702 2912933 6526874 7237606 3592833 195236
39389 195236 674298 2131878 450925 -2021173 201495 5907553 7335444 1626960
39381 1626960 -4025132 -2354602 3604241 5243092 573091 -4166675 -4307769 -2428974
39373 -2428974 -2901456 -5280642 -5861055 -3153370 1002516 4408790 6120360 5783627 3734697
39364 3734697 1851144 2254874 4422538 5206395 2903622 -60337 -305033 1598320 1987331
39355 1987331 -154445 -1488217 320261 2668732 2192509 406872 1370427 5143746
39347 5143746 7963892 8545320 9501803 11828937 12786074 11114920 9884452 11296463 12478286
39338 12478286 9925963 5041971 1469727 -497913 -2699689 -4306742 -2802215 1196437
39330 1196437 4317763 5246867 5407207 5243917 3711356 1439416 511238 599807 -1044195
39321 -1044195 -4955434 -8132415 -8311494 -6529231 -4473899 -2267746 27918 1609671
39313 1609671 2891304 5506657 9039526 10521388 8746855 6398609 6018079 6366700
39305 6366700 4986249 2229820 268311 -380730 -903132 -1702065 -1927166 -1012356 674454
39296 674454 2158134 2053090 -451960 -3965952 -5597851 -4252514 -1889276 -693706
39288 -693706 -667905 -943296 -1446374 -1853495 -826656 2030121 5098624 7054392 8272621
39279 8272621 8451053 5543099 -360397 -4613637 -3112379 1725164 3899596 1878949
39271 1878949 -293749 288937 1905212 2390529 2766112 4402616 5525280 3618057 -112489
39262 -112489 -1691837 258121 2533253 1757503 -728860 -353966 4239776 8315642 6443887
39253 6443887 -299167 -5297125 -4622879 -1129393 761102 765484 680191 8754 -2160971
39244 -2160971 -3165955 173048 5280658 6037357 1781624 -1215767 1105630 5056802
39236 5056802 5457970 2792120 528436 -567211 -962905 1223780 6675439 10154840
39228 10154840 5998333 -2290879 -4834819 1094325 6993913 5375239 -22083 -853179
39220 -853179 3786679 7848713 7892157 5769666 3093275 -446287 -2988126 -1091200 3781562
39211 3781562 5033865 103256 -5056744 -4421843 -533367 63793 -3362647 -6159798
39203 -6159798 -6426349 -6410528 -6338790 -3387160 1944625 4394628 1535906 -2018988 -1231138
39194 -1231138 2637582 5503180 6853400 8140468 7899830 4102238 -229487 237194
39186 237194 4827979 7041543 4116185 803106 1298587 2868483 1494181 -742540
39178 -742540 410492 2965696 975011 -5406943 -8989512 -6168665 -2216765 -2737754
39170 -2737754 -5263524 -4247046 -438229 760625 -1842131 -4265644 -4535140 -4617463 -4845742
39161 -4845742 -2705547 1276759 2552897 17368 -1392695 1130596 3463009 2366163
39153 2366163 1977913 6170655 9938563 6766350 698581 1252347 8055310 11091978
39145 11091978 6745175 2859920 4980067 7832781 5718251 2353739 3301924 5765557
39137 5765557 4083719 214252 207501 3606136 4722854 2484207 936159 875145 -1103477
39128 -1103477 -4914458 -5859837 -2741417 -451360 -2086042 -4270281 -3385951 -1448298
39120 -1448298 -1892875 -3253922 -1488773 3361616 6959504 6699868 4737032 4297898 5085961
39111 5085961 4016004 126007 -3149578 -2218241 1186206 1812001 -1390405 -3221655
39103 -3221655 -148071 3619574 2115514 -3159968 -5381702 -2396474 1208159 2046055
39095 2046055 2154669 3845206 5473745 4831854 2774577 863748 -1258888 -3470503
39087 -3470503 -3173218 1070240 5922421 6512191 2417456 -2002815 -2763493 24820 3194922
39078 3194922 3864181 1748440 -1134672 -2788674 -2727742 -866313 3402883 9148190 12436365
39069 12436365 10069175 4258585 291480 -296702 -627003 -2457916 -3520735 -1995324
39061 -1995324 538253 2531760 4971244 7965170 8374748 3998114 -2526513 -6963691
39053 -6963691 -8290765 -7529957 -4476138 798475 5154534 5087553 1401841 -2046695 -3508618
39044 -3508618 -4181226 -4619865 -3640641 -900957 2124468 4086985 4764849 4254166 2964307
39035 2964307 1987964 1627823 292764 -2943431 -5544303 -4163289 164680 2623008
39027 2623008 939366 -1801075 -1844696 190736 735581 -1798300 -5271961 -6440203 -4273537
39018 -4273537 -938079 300992 -1244737 -2377386 249007 5262138 7662753 5376426
39010 5376426 2007178 1187970 813207 -3500044 -10424004 -12997584 -7720441 401217
39002 401217 4258290 2924367 368618 -1399974 -3329498 -4724705 -2974467 1364626
38994 1364626 3885932 2487439 247250 128463 743678 27786 -754957 -156509 -232794
38985 -232794 -2986430 -6078623 -6538418 -6006067 -7267290 -8138233 -4850111 204522 897983
38976 897983 -2949400 -5159711 -2893000 122020 1312608 3211301 7125651 9261805
38968 9261805 6693807 1972801 -1589706 -4336159 -6704774 -6446060 -3348546 -1820555
38960 -1820555 -4179529 -5804077 -1997192 4290742 7092351 6379706 6325007 7000023 4303102
38951 4303102 -2439378 -8384384 -9229169 -5520890 -704251 2212797 2307435 1406006 2377582
38942 2377582 5117079 6108887 3761085 1226163 1347206 2256377 1522086 1153004 3955692
38933 3955692 7865288 8819424 6857915 4555528 1967782 -1633022 -3652081 -1847748
38925 -1847748 103713 -2627276 -7291672 -6765114 -701989 4050340 4431945 4888976 8559891
38916 8559891 11961101 11307763 8239604 6098835 5189152 4474172 3867353 2521925 -1206278
38907 -1206278 -5995820 -7557612 -4268039 846763 5101126 8872736 11824102 11277190
38899 11277190 6940114 2911028 1948164 1456292 -1738926 -5928200 -7113635 -4560453
38891 -4560453 -814239 1895096 2883925 2300171 1060428 283152 -1260 -126734 823125
38882 823125 3320753 4879124 3068883 523346 2131731 7219597 10026577 8610503
38874 8610503 7110071 7633083 6634484 2335840 -686419 1504778 6007650 8188846
38866 8188846 8142020 7756596 6121477 2547174 -179866 -292797 -653847 -3296905 -4894646
38857 -4894646 -2755141 -605817 -2403972 -4805726 -2620367 2030283 3390713 1781328
38849 1781328 1796953 3208381 1951783 -1256322 -1785604 -39919 -992683 -4445247 -4452893
38840 -4452893 -4015 2303829 -844086 -3845843 -1534535 2771027 3576804 1818292
38832 1818292 1428204 1632190 -1098733 -5760815 -7266019 -3672508 1236558 2724360
38824 2724360 -245646 -4926221 -7353352 -5440430 -1055434 1617130 821518 -903363
38816 -903363 -718134 443530 -242600 -2844920 -4392298 -3100945 -907215 -1052024 -3987258
38807 -3987258 -6528644 -5353143 -1001132 2588844 2893942 1733721 2129094 3692167
38799 3692167 3447222 552518 -2433064 -3118707 -1786289 104463 1856424 3354009
38791 3354009 4603129 5957858 7420857 7613659 5063729 620823 -3128446 -4994429
38783 -4994429 -5949813 -6590979 -5837595 -2904696 866916 2946537 1779658 -1901682 -5319368
38774 -5319368 -5935808 -4363495 -3754209 -5197628 -5781100 -3207489 148169 1037417 948740
38765 948740 3527544 7811964 9130298 6374964 3198104 1641544 -97623 -2557227
38757 -2557227 -3228384 -1923561 -2606226 -6779048 -9670528 -6849006 -1018354 1865284
38749 1865284 602141 -1071394 -423578 1801493 3706488 4067404 2579259 283483
38741 283483 -1177647 -1816402 -2966580 -3941630 -2210964 1537198 2424043 -1711878 -6171382
38732 -6171382 -5846450 -2417788 -708926 -950945 -141471 1036016 -1000418 -5454612 -6858662
38723 -6858662 -3233225 649919 170158 -3144096 -4965940 -4310722 -3524710 -4027430 -4600595
38714 -4600595 -3366950 -169489 2801315 2733943 -567978 -3615986 -3027801 -65859 740355
38705 740355 -2409856 -6337084 -7291898 -5346559 -3090863 -1753714 -481653 1323121
38697 1323121 2785003 2995031 2582728 2853083 3396759 1764704 -3361028 -9478532 -12610127
38688 -12610127 -12011651 -10186489 -8333202 -5213492 -1404893 -432551 -3134775 -4904411
38680 -4904411 -2262045 1441711 1590552 161050 1788392 4451176 1935608 -4820157
38672 -4820157 -7358999 -2623768 1885983 -179937 -4440269 -3673289 598053 1725337
38664 1725337 -655724 -906598 2313532 3847467 863640 -2915294 -3914896 -3951887 -5640170
38655 -5640170 -7083199 -5202417 -1430330 224349 -588578 -225461 3285071 7635877
38647 7635877 9852279 9664955 8118790 5196698 777563 -3426525 -5052527 -3792129
38639 -3792129 -1226981 1644998 4726076 6703946 5204711 305889 -4141803 -4602041
38631 -4602041 -1931216 538062 1659559 2647208 3453702 2314371 -671814 -2628898
38623 -2628898 -1889191 -288400 311529 1447970 5352476 10231532 11379424 7045676
38615 7045676 736920 -2960255 -2955929 -1172753 783169 2743914 4513671 5276701 4950474
38606 4950474 4666540 4811097 3631298 -476627 -5644608 -7650041 -4969573 -775068
38598 -775068 1198148 858918 306125 263309 446482 1781000 4932570 7513931 6448665
38589 6448665 3056492 2016708 4627834 6809753 5089315 1056802 -1911362 -3061201
38581 -3061201 -3169384 -2098955 -136648 787020 20047 74886 2786358 5823632 6049177
38572 6049177 4089520 2179412 -147751 -3934677 -6353507 -3681846 1935488 4068819
38564 4068819 808243 -2951304 -3053848 -1168217 -645225 -1677839 -2873628 -3832601 -3671344
38555 -3671344 -548019 4538847 6901556 4497461 2056070 4756428 10052592 10600681
38547 10600681 4524120 -1861066 -2153038 2863570 7166242 6225786 725293 -4741344
38539 -4741344 -5899149 -2720084 875563 2022145 2353693 4539686 6938767 5289747
38531 5289747 -466325 -5021780 -4580421 -1525783 -325701 -1687116 -3304390 -4087302
38523 -4087302 -4479704 -3872281 -999709 3197923 5697228 4706045 1142872 -2975892 -5720346
38514 -5720346 -5268330 -1458697 2309299 1565832 -3591420 -7761217 -6771309 -2686419 -134630
38505 -134630 146009 782766 2119077 1367361 -2048859 -4252479 -2093978 2156136 3878892
38496 3878892 2127094 -92128 -460693 526897 1730022 2926567 3820917 3760821 3167356
38487 3167356 3352963 4101814 3255211 -154583 -3955431 -5449177 -4734800 -3881611 -3811011
38478 -3811011 -3811098 -3560213 -3644766 -3975228 -3367968 -1193876 1733591 4313108 6125085 6840699
38468 6840699 5802711 2995482 -253008 -2236048 -2108539 141113 4082853 8474880
38460 8474880 11272390 11128172 8677877 5548736 2456331 -786617 -3832453 -5832922
38452 -5832922 -6950508 -8237389 -9469174 -8731905 -5339075 -1799442 -1147995 -3084721
38444 -3084721 -4638221 -4270097 -3214402 -2637555 -1791198 53929 1795263 2144695 1791258
38435 1791258 2363081 4107749 5995149 7292867 7582407 6036796 2486094 -1175135
38427 -1175135 -2364153 -517892 2860391 6253917 8408493 7233578 1367891 -6440041
38419 -6440041 -10208637 -6872064 -151725 3419995 1529327 -2296934 -3515435 -1497244
38411 -1497244 555603 -261334 -3164779 -4717422 -3089229 -190294 1254636 1382702
38403 1382702 1980491 2695866 1618477 -421027 57087 3483530 5412684 2969509 -191807
38394 -191807 939084 5097491 6869945 5063664 3652295 4154294 2583550 -3661036
38386 -3661036 -10261423 -11070709 -6138236 -725558 2258090 4574784 7349243 7760086
38378 7760086 3399543 -2589087 -4044918 807530 7000388 8498843 4398802 -1442828
38370 -1442828 -5111247 -5226870 -2322237 1663327 3611445 1770323 -1382293 -1299543 2878136
38361 2878136 7312525 9038505 9133737 8516713 4745715 -2940092 -8652781 -5825936 2899238
38352 2899238 7861892 5106682 1050322 2349455 6652688 7359655 3466796 -322340
38344 -322340 -1100522 -404704 -37693 319028 790874 94533 -2200920 -4561128 -5662091
38335 -5662091 -5894260 -5935560 -5558378 -4803568 -4806596 -6148214 -7357870 -6512631 -4105095
38326 -4105095 -3084014 -5477733 -9430681 -10444070 -6108410 721901 4383617 2287885
38318 2287885 -2412468 -4421868 -1751586 2999137 5879430 5034274 1464897 -2342860
38310 -2342860 -4351225 -4289729 -3418027 -2918238 -2656370 -1513396 1450126 5951185 9726960
38301 9726960 9119971 2315388 -7253732 -12683274 -10552383 -4905272 -2376868 -4327049
38293 -4327049 -6280824 -4856227 -2243313 -2539846 -5761978 -7698562 -5257917 -229220
38285 -229220 2811758 1572769 -1684710 -2853642 -310626 3881033 6569557 6379118
38277 6379118 4127931 1626873 444235 769153 974493 -652093 -3308407 -4213180 -2441799
38268 -2441799 -474781 -619243 -1704983 -1366016 -51806 16875 -877152 150950 4038081
38259 4038081 7746376 7871522 4631292 1245119 245037 969412 380735 -3248734 -7112477
38250 -7112477 -5956835 1058526 7548234 6936945 1035030 -2165466 1208751 6962853
38242 6962853 9433016 7547116 3168079 -1954546 -5359970 -4338635 -259002 1362931
38234 1362931 -1496241 -3466320 202087 5346323 4398870 -2068277 -5910541 -3115646
38226 -3115646 1518338 2554666 881397 -24494 -4696 -855558 -2185354 -2226729 -1210233
38217 -1210233 -1154586 -3034483 -5786366 -7403120 -6358093 -3337051 -1845180 -4790274
38209 -4790274 -9805140 -10826425 -5670029 900062 3482749 2319711 704541 -762586
38201 -762586 -3452350 -6234917 -6164115 -3181087 -359653 718411 1627652 3699105 5829773
38192 5829773 6551820 6080125 5395767 4885290 4545797 4388548 4377535 4743227 5816157
38183 5816157 6575401 4641848 -519940 -5714841 -7589404 -6794935 -6024860 -5579718 -4425813
38174 -4425813 -4068367 -6552837 -9327272 -7762489 -3215789 -2317533 -6334880 -7793000
38166 -7793000 -1578383 6372165 7028770 741782 -4505431 -4710023 -3251493 -3818453 -6183784
38157 -6183784 -9247903 -12725593 -14679748 -12172185 -6174869 -2021010 -2936631 -6049163
38149 -6049163 -6754447 -4668330 -3204159 -4752797 -8071586 -9953595 -8664142 -5746464
38141 -5746464 -3988396 -3466192 -1429619 2778887 5424282 3615755 98871 -1072243
38133 -1072243 -1096106 -3350665 -5687618 -2802681 3726968 5427582 -870718 -7899379
38125 -7899379 -8693100 -6113428 -6598767 -9648628 -9839656 -6076413 -2471708 -1406945 -1071974
38116 -1071974 594716 3664835 7340726 9886056 8465318 2464992 -4094972 -6700218
38108 -6700218 -5605388 -3907982 -2437994 -479998 530625 -1056754 -2909105 -1717403
38100 -1717403 563286 -754925 -4642364 -4813745 377200 4801629 3533934 -727665
38092 -727665 -3245036 -4090664 -5473898 -6417914 -4724681 -1480163 794585 2557546 5659639
38083 5659639 8697187 8145592 3856870 -144842 -756791 1051150 2732258 3509679 4212196
38074 4212196 5225083 5823415 5257463 3846553 2601515 1720254 280665 -1687344 -1814214
38065 -1814214 1923543 7464027 10093799 7996994 3897660 592165 -2155298 -4860077
38057 -4860077 -5688643 -3401428 -749070 -1546941 -5180557 -6998300 -4162717 1151139
38049 1151139 4612901 4082047 905490 -1679693 -1082479 2648792 6822778 8382925
38041 8382925 6364739 2307315 -1261890 -2842517 -3123113 -3908630 -5246268 -4680558 -1028269
38032 -1028269 2425058 1636001 -1797782 -2018774 2570969 6518004 5023088 318525
38024 318525 -2610121 -2919923 -2617108 -1497536 1677974 4634059 3298383 -2048583 -6401687
38015 -6401687 -6138929 -2411764 1515708 3376070 2511131 242876 -524250 1371178 3116479
38006 3116479 1874946 -203838 1209576 5513618 7391635 4324977 -605448 -4123934
37998 -4123934 -6407148 -8064803 -8050575 -6606584 -6124702 -6700812 -4798183 890874 6085492
37989 6085492 6756746 4841403 4273867 4490766 2593583 -293835 -180021 3019648 4789463
37980 4789463 2400050 -2109579 -5900629 -8476132 -9810565 -8817662 -5509498 -2331303
37972 -2331303 -1617380 -3151840 -5200228 -6480354 -6452862 -5258846 -3971808 -3391798 -2428642
37963 -2428642 251482 2896889 2048543 -1792091 -3410403 -48144 4061916 3903245
37955 3903245 1588678 2953912 7573173 8428439 2640199 -3612026 -4311219 -2569405
37947 -2569405 -4840792 -9526102 -8652894 -703543 5578838 3061426 -3820120 -5657211
37939 -5657211 -913437 3444096 2572895 -783932 -2041580 -954240 195946 1014014
37931 1014014 2458909 3706108 2574870 -1213030 -5219153 -6865842 -5633630 -2723825
37923 -2723825 382502 2768498 4174955 4707362 4444925 3324634 1388013 -913622
37915 -913622 -2602294 -2581544 -869175 510936 -838778 -4312710 -5881435 -2628174 3249914
37906 3249914 6888748 6471918 4219497 2192911 77271 -2458220 -4200053 -4525359
37898 -4525359 -4731445 -5677527 -6051018 -4609193 -2472963 -1524685 -1936559 -2844660 -4078629
37889 -4078629 -5553084 -6156928 -4955152 -2624261 -414209 1254535 2128732 1681484 735354
37880 735354 1728267 5496500 9389110 10523065 9247145 7301903 4605465 780134
37872 780134 -1934036 -1018684 1914907 2733129 570203 -1380018 -872978 862635 1876997
37863 1876997 1713488 517912 -1211663 -1774523 -4783 2216424 2305430 1383891 2321984
37854 2321984 3720897 1212387 -4380513 -6313756 -1953853 2437539 1099960 -2477143
37846 -2477143 -1895708 1386733 759796 -4333632 -7342079 -4627318 60041 2195611
37838 2195611 1932586 1288955 807931 1089164 3369752 6304108 6025033 1925481 -1153783
37829 -1153783 645759 4712526 6078569 4360810 3057797 3875263 5413181 6304321
37821 6304321 6213982 4460897 908531 -2156576 -2119048 127086 1347763 861759 1030562
37812 1030562 2486146 2428002 -781399 -4303817 -4447366 -1665865 503977 367619 -423964
37803 -423964 118796 1904551 3631124 4643315 5326260 6261054 7341685 7635384 6284401
37794 6284401 3604653 844191 -1151020 -2257052 -2095841 -109978 2942381 5174193
37786 5174193 6158549 7541309 9610845 9319670 4364556 -2249074 -5216308 -3986122
37778 -3986122 -2924308 -4045858 -3938775 100774 4769071 4920313 440631 -4581823
37770 -4581823 -7668711 -9177457 -9128425 -7133153 -5159338 -6100309 -9052517 -9913336 -7572422
37761 -7572422 -5606845 -6421347 -7720980 -7048971 -5978708 -6600825 -7150611 -5166783 -2589411
37752 -2589411 -3158982 -6060161 -6741221 -3667458 52416 1918627 2756169 3556144 3692507
37743 3692507 3535188 4991342 7634406 7783828 3694106 -1369425 -3638633 -3588881 -3569123
37734 -3569123 -3558490 -2565519 -1769589 -2418153 -2527367 81618 2939385 1963814 -1356139
37725 -1356139 -1168484 3905598 8612554 9259685 8534929 9352503 9348701 6098036 3304975
37716 3304975 5620135 10048013 9477527 3821031 376615 2244283 3648040 -309740
37708 -309740 -5788667 -6792990 -4353761 -3156002 -2823644 307403 4616588 4081550 -1899847
37699 -1899847 -6712851 -6482465 -5338213 -7533651 -10222250 -8855228 -5180150 -4012844
37691 -4012844 -4926296 -3368210 1134363 3829288 2005803 -1669327 -3900134 -4389882
37683 -4389882 -3599555 -1074090 2332244 4225617 4522901 6170431 9998400 12194593
37675 12194593 9541942 4314539 940831 117663 -492611 -1554699 -1690232 -836305 -417696
37666 -417696 -325569 1142134 3970462 5725686 4872826 2686472 1096739 466217 442509
37657 442509 1395509 3519690 5280935 4406353 870806 -2056250 -965919 3389238 6346604
37648 6346604 4863295 1327722 -65969 762431 857332 425310 3015454 8303806 10011272
37639 10011272 4499044 -2811824 -4268781 -88251 3660300 4770462 6261415 8861925
37631 8861925 8888165 4825064 261902 -1790231 -2605894 -3509115 -2685281 752322 3691125
37622 3691125 3566049 2452382 2847412 2679263 -898811 -5290856 -5357664 -1313502 1690202
37613 1690202 1874161 3376515 9024808 15236614 16980704 14629984 12581169 12984863
37605 12984863 14266154 15046843 15991500 17118929 16341578 12751478 9528232 10633720
37597 10633720 14798789 15814433 10226150 2396848 -650060 1906628 4281912 2478401
37589 2478401 -546018 292010 5131065 9702267 11304205 11114396 10918706 10507320 9136697
37580 9136697 7437768 6484909 6127048 5520980 4649894 4071195 3437385 1562306 -1755596
37571 -1755596 -5033520 -6823017 -7191938 -6594091 -4326555 95895 4563311 5882269
37563 5882269 4169692 3182436 5018989 7083786 6373091 4251632 3912018 5116693 5397590
37554 5397590 5267806 7587954 11641822 12519181 7873144 1535157 -1475951 -527105 1780502
37545 1780502 3435906 3709277 2526471 1185237 1695194 3856651 5063504 4136849 2747398
37536 2747398 1919628 439173 -1657607 -1843074 204965 600424 -2715208 -5632333 -3723728
37527 -3723728 724385 2210110 -53924 -2685812 -4319716 -5669102 -5143215 -757146
37519 -757146 4065308 3106678 -3365986 -7875371 -5886121 -1213149 870459 642841 842219
37510 842219 1074593 -458116 -2492404 -2170706 339130 1971885 888774 -1829926 -4022105
37501 -4022105 -4197411 -2054519 1294132 4033384 5434739 6308707 7279023 7796997 7437206
37492 7437206 6827251 6491228 5918464 4554412 2805317 1506688 1093515 1384171 1485008
37483 1485008 433677 -1011316 -342357 3060216 5547886 3397592 -1336952 -2730452
37475 -2730452 1138298 5833096 6794693 4358116 1287681 -1230461 -3090277 -3413234
37467 -3413234 -1433253 2228145 6258045 9044168 8307775 3200282 -2741390 -4220838
37459 -4220838 -1051938 987422 -2123794 -7331277 -8982786 -5740458 -907311 1629607
37451 1629607 56822 -4136560 -6231495 -2682279 3386602 5003313 1026419 -2013838
37443 -2013838 -85098 2189543 -321567 -4536023 -4388796 -493194 1828763 1005843
37435 1005843 -646479 -2498565 -4696794 -4095596 1678360 7750321 7147279 1524421
37427 1524421 -1013797 1558069 3231485 1196872 -11093 1880828 1930875 -2899115
37419 -2899115 -7214950 -5490630 -984607 -205800 -2926034 -3857802 -1050444 3168175
37411 3168175 7094144 9947296 9316500 3972535 -1837999 -2206636 2642804 7029005
37403 7029005 8091545 8560312 10489213 10884129 6067084 -2319808 -8368513 -8187434 -3530721
37394 -3530721 752627 1882571 997780 35402 -1289842 -3378295 -3290846 2313112 10478000
37385 10478000 13207194 7796199 1376948 1477995 6045526 7709143 4785732 2068869
37377 2068869 2454323 4179334 5996885 8719406 10823841 8739612 3535301 1595947
37369 1595947 5524224 9368912 7013184 1265125 -411355 3415789 7135049 6654425
37361 6654425 3650701 921887 -1516906 -3759438 -3440035 846549 5792745 6712868
37353 6712868 3947399 2420173 4347923 5913344 3166386 -1754799 -3775641 -2502613
37345 -2502613 -2236773 -4619731 -6253762 -5143457 -4563014 -7259926 -10005097 -8483571
37337 -8483571 -4508204 -3008279 -3918296 -3014560 234991 2107437 1955239 3294385 6257304
37328 6257304 5982522 1401099 -1179326 2223001 5993070 3262255 -3292376 -5982924
37320 -5982924 -4073135 -3347425 -5154770 -4023847 2752252 10036676 11834352 8384723
37312 8384723 3928747 1452003 1750514 4073990 5677494 4035559 1150301 2017246
37304 2017246 7047595 10291010 7923511 4111258 4368650 6939481 6275406 2602981
37296 2602981 1493975 4236195 5174089 591454 -5184372 -6123861 -3150644 -1946453
37288 -1946453 -4069801 -5188280 -2245312 2136777 4237756 4650281 5975487 7448550
37280 7448550 6002881 2009696 -438315 255347 885702 -890182 -2822023 -2905669 -3607307
37271 -3607307 -6598069 -7132525 -490360 8084496 8201706 -404087 -5924344 -771041
37263 -771041 8049963 9901746 5094058 1617595 2262373 3091113 2154361 1591250 1712434
37254 1712434 461143 -787955 2078269 7990273 10070179 5450321 -122246 -809591
37246 -809591 1323081 1018595 -1614338 -2328856 -139177 1529024 424225 -1798453 -2638673
37237 -2638673 -1685967 -93512 872866 422259 -1218158 -2617976 -2348522 -366807 2086738
37228 2086738 3384949 2281950 -831019 -3080887 -1381180 3522518 7127875 6498140
37220 6498140 3536034 1426849 172093 -1738902 -3154421 -1453845 2594638 4846128
37212 4846128 3388091 1155636 1620616 4318066 6524236 7507886 8614207 9998780
37204 9998780 10101867 8815651 8667933 11222950 13952340 13012945 8462909 4117439 2149671
37195 2149671 830859 -1250729 -1960843 698682 4102474 3927435 474781 -1701089
37187 -1701089 -162839 3123425 5985377 8552950 10644123 10514598 7937591 5238109
37179 5238109 3450950 733193 -3290054 -5117023 -2367537 1793987 2890677 1518634
37171 1518634 1575649 3759404 5040686 3883405 2009639 1055712 987203 1915360 4090518
37162 4090518 5755687 4374005 795073 -850732 1530993 5518544 8085397 9191692
37154 9191692 9962989 10004282 8805264 7852813 8771274 10477068 10594265 9113521 8375916
37145 8375916 9538876 11164895 11639929 11068997 10051129 8417318 6557100 6457850 9255791
37136 9255791 12507749 12533773 9582743 7704895 8439093 8044446 3746763 -366548 1573407
37127 1573407 7668002 9574031 4150726 -1931952 -1923457 1725179 2264320 -854964 -2234862
37118 -2234862 121851 1781230 -712065 -4153739 -3074495 2832241 8425237 9244352
37110 9244352 5816173 1998986 725702 2217044 5496887 9848168 14023740 15716268
37102 15716268 13988319 11501739 11738960 14173055 15082152 13249861 11274074 10469151
37094 10469151 8739047 5464930 4125279 6850455 10281994 10873111 10811818 13736141
37086 13736141 17333494 16050429 9856276 4572078 3726960 5316023 6861629 8566252
37078 8566252 10342337 10139397 6988874 2807755 235963 931121 5510112 12047880
37070 12047880 15480698 12584255 7108835 5597833 8486112 10274037 8316995 5590178
37062 5590178 4100571 2071838 -309400 1145963 7407903 12540159 11595818 7830018
37054 7830018 7592730 11625917 15863168 17858130 17993731 16734960 14926255 14862206 17186536
37045 17186536 18590093 16303219 12923669 12793953 15294191 16074683 13912038 12012010
37037 12012010 12796396 15341641 18264105 21752290 25984595 29984092 32717783 33823881
37029 33823881 33434935 32825971 34650244 40691785 49669620 58553032 65330003 69487145
37021 69487145 71444820 73392034 79195345 91214602 108035772 126884693 146919248
37014 146919248 168779093 193209264 222318697 259529920 304859081 352137187 394515608
37007 394515608 430972677 463160198 487385915 495611278 485436376 464180847 440574496
37000 440574496 415671977 384759248 346167843 305079062 268686801 239515480 214379378
36993 214379378 189375329 164638659 143200492 126123591 111249163 97077680 84934068
36986 84934068 75722609 67302373 57539850 47803673 40777254 36708755 34500785 34315782
36978 34315782 35719501 35277605 30222656 23347344 19954021 20574936 21025933 19329771
36970 19329771 17871541 18179690 18221183 16346049 14003253 12752387 11840295 10493161 9680882
36961 9680882 9822174 9358914 7386422 5391097 4775315 4901099 5095678 6197719 8337062
36952 8337062 9549834 8782683 8157691 9623487 11002686 8580011 3143185 298884
36944 298884 3857343 10983842 15429128 14530365 11242687 9332378 8702375 7022115 4389824
36935 4389824 3261031 3751246 2655110 -1195901 -3921688 -1839994 2825817 5035852
36927 5035852 3877681 2492747 2375212 2143248 1539737 2178736 3927663 4646808 4230076
36918 4230076 5022334 7397564 8906431 8961486 10219586 13543378 15648669 14229232 11775743
36909 11775743 11291892 11327851 8781004 4338504 1399166 838641 237057 -2170623 -5503662
36900 -5503662 -8002807 -8637514 -7079158 -3847279 -456452 1874897 3429465 4825399
36892 4825399 5219725 3211533 -507176 -2958433 -2182340 51043 192575 -2168611 -3008919
36883 -3008919 687752 5452730 4883720 -1042566 -4801925 -1759894 2970979 2440829
36875 2440829 -1553658 -2018144 1928468 4750855 4356363 4242766 5334883 3838531 -716339
36866 -716339 -3072298 -1057139 511628 -1302720 -1963796 2124473 6350194 5490231 2855802
36857 2855802 4409479 8142789 7405539 2098136 -1436140 -400435 1876984 2930088
36849 2930088 4126568 6410147 8670557 10627903 12541873 12365696 8057080 2241590
36841 2241590 -396708 215119 570489 294166 1788460 3728485 1876609 -2841311 -4053619
36832 -4053619 296356 4326149 3076580 -782210 -2341810 -1398358 -351673 434686
36824 434686 1328451 1072174 -624064 -1190380 812938 2750029 2120048 745445 1362752
36815 1362752 2840684 2590056 1461678 2208906 4531351 5451457 3830665 1261055 -952112
36806 -952112 -2760782 -3710443 -3029254 -1457427 -856051 -1684262 -2250912 -717651 2734462
36797 2734462 5512205 4495844 -455296 -4996943 -4410674 413240 3668748 2141364
36789 2141364 -942778 -1144451 1133479 2279544 773173 -1927761 -4136119 -5036290
36781 -5036290 -4306326 -2693450 -1670912 -1007350 1328759 5192404 6898808 4321590
36773 4321590 644234 -154717 913193 332592 -1746664 -2153662 -119187 2431654 5145272
36764 5145272 9091588 12550152 11850422 7331334 4094847 5205670 7777360 7773180 5695584
36755 5695584 5195131 8005104 12336701 15203705 14947943 12142696 8724971 5966844
36747 5966844 3776428 2562070 3952734 7585302 9203426 5613967 329504 -240883
36739 -240883 4056302 6849764 4895144 2510085 4068150 7241457 7543015 5544795
36731 5544795 4893021 5874341 5971689 5396225 7061807 11045259 13390222 11545508 7935333
36722 7935333 6682412 8639291 10824903 9778918 4931358 -726844 -3369883 -2210612
36714 -2210612 8016 900807 1285522 2799509 4507163 4495493 3875199 6060227 11806073
36705 11806073 17588386 19774882 18506615 16577814 16037192 16889386 18075604 18805472
36697 18805472 19420903 21326177 25600745 31625582 37574198 42104455 45179779 47927753
36689 47927753 52475339 61018051 73842213 89094961 105752072 125406685 148744010
36682 148744010 170996825 183815136 182223536 168188753 147906492 127879761 112754571
36675 112754571 103109047 94623848 82871336 69985540 63047416 64479161 68270419 68477894
36667 68477894 67274904 70099715 75976086 78624776 76245334 74136375 76438629 80312749
36659 80312749 80782500 77716772 74955868 74644572 75264064 74319012 70981897 66670731 64193827
36650 64193827 65391167 68621245 69847155 67383154 64081697 63139523 63073321 59241199
36642 59241199 50048144 39526515 33275986 32969336 35034555 33954420 27115769 17430714
36634 17430714 11027207 11437329 16274617 20337568 21113658 19792886 17770066 14756315
36626 14756315 10829768 7966689 7891604 9548995 10253370 8968385 7328228 7410874 9136905
36617 9136905 10071290 7882824 3199607 -440790 -359093 1877585 2249119 -440904 -2875324
36608 -2875324 -1655297 2300592 5424717 6434568 7454489 10295302 13533312 14192962
36600 14192962 11540720 8397776 8575004 12911450 17801693 18182811 12544979 4746668
36592 4746668 400807 1612711 5476972 7300964 4967222 564036 -1969135 -1116728
36584 -1116728 522130 -278632 -2679820 -2655704 1097771 4768653 4399461 783298 -2757802
36575 -2757802 -5070254 -6573170 -6017900 -1998374 3132675 5152607 3838135 2872245
36567 2872245 3535560 2948112 -206116 -2732843 -1887938 760780 3035205 5725277 9095904
36558 9095904 9617227 4790052 -1367965 -2652625 955595 3980606 3507622 1598676
36550 1598676 -60204 -2675022 -6400193 -8421072 -6989351 -4087369 -2262822 -1604059
36542 -1604059 -1467046 -2429655 -4587110 -6207726 -6033131 -5033846 -4237051 -2839233 -354929
36533 -354929 1304982 223418 -2373171 -3587790 -2582168 -817364 680081 2137215
36525 2137215 3314087 3002656 905119 -1125790 -686723 2276392 4638683 3096211
36517 3096211 -1545589 -4436467 -2647249 258903 -1355457 -6656054 -8350493 -2593724
36509 -2593724 5234657 7719205 5145186 3690712 5625809 6455772 2381693 -3781581
36501 -3781581 -6360223 -3856062 252001 2376430 2107317 961333 -9021 -524368 -197821
36492 -197821 1285745 3172363 3917493 2930972 1261280 4543 -1001243 -1995482 -1994077
36483 -1994077 -318535 1483464 1436643 353964 692976 2322539 2439794 238517 -1577047
36474 -1577047 -1224274 -572188 -1373262 -1690061 1037113 5431516 7761265 6815925 4497242
36465 4497242 2562228 1295606 566502 -132806 -1917527 -4730825 -6448494 -5900435 -5282473
36456 -5282473 -6821170 -8516088 -6725806 -2209262 227575 -1815246 -5723307 -8110889
36448 -8110889 -8300900 -6815909 -3796354 -514315 244352 -2637957 -6624723 -8296900
36440 -8296900 -7061525 -5119985 -4738629 -6211441 -7606896 -6227574 -1339603 4441855
36432 4441855 7508071 6788719 3852335 286593 -3163486 -5506743 -5993516 -5657791 -6169833
36423 -6169833 -7200396 -7137793 -6186523 -6081558 -6691576 -5845851 -2994647 -138197 1554204
36414 1554204 3103749 4816736 5067018 3308876 1479058 862256 216008 -1348706 -2300286
36405 -2300286 -1494861 -606746 -1437831 -2746377 -2072363 751657 3884541 5887369 6167824
36396 6167824 4551170 2094258 810161 1030617 749467 -861388 -1373662 1392997 5693806
36387 5693806 8042858 7551048 5857636 4239211 3063153 2682603 2602551 1198170 -1558767
36378 -1558767 -2951771 -1699373 -1141217 -4700042 -9869889 -11049715 -7577142 -4359323
36370 -4359323 -4423091 -5522624 -5247737 -4944867 -6159284 -6790868 -4019767 1107929 5049649
36361 5049649 6385310 6354471 5759653 4262611 2659118 2995009 5358736 6602856 4016023
36352 4016023 -699377 -3015019 -1111795 1905812 2022327 -955835 -4035533 -5284881
36344 -5284881 -5426461 -5529437 -5333545 -4358245 -2867215 -1044963 1250789 3390919 4302831
36335 4302831 4367116 5005159 5863770 4951196 2484600 1487804 2842004 3184017 559103
36326 559103 -1214236 2012816 7479717 8805226 5136123 1609299 1111833 1340384 847600
36317 847600 2121558 6235621 9469243 8625180 5775070 4196413 3159996 815473
36309 815473 -950953 393270 2204678 -369680 -6273091 -9140988 -6659165 -3690104
36301 -3690104 -4077282 -4738157 -1714521 2203900 1348383 -3460948 -5328981 -1274964 3393729
36292 3393729 2565941 -2770163 -6849314 -6636893 -3868638 -1116181 956196 2569765
36284 2569765 3465455 3071567 1015183 -2237430 -4488858 -2879439 2376466 6438803
36276 6438803 4492194 -2365368 -8146387 -8794409 -5823391 -3195755 -2894167 -3968426
36268 -3968426 -4038313 -1497110 2109768 2391627 -2818415 -9297084 -10596001 -6247855 -1982881
36259 -1982881 -1350079 -1649975 266105 2916932 3874369 4398086 6396573 7766276 5182869
36250 5182869 -174487 -3715599 -3359132 -1158976 158136 -352326 -1811845 -1731701 2089863
36241 2089863 7707704 9512094 5404169 627355 667199 3242819 2301634 -2367315 -5413482
36232 -5413482 -4519442 -2445228 -755217 2118079 5761857 6833061 4818573 3230492
36224 3230492 3274717 1878709 -1697045 -3047879 158820 3401471 2106569 -1125562
36216 -1125562 -1113592 1424418 1543442 -1599357 -3479247 -1001973 3677616 6515680 5746110
36207 5746110 2478051 -502237 -513655 2483352 5273503 4815985 1731001 -1002573 -1801685
36198 -1801685 -1255753 -207809 969214 1776952 1887920 1604179 1142233 488945 499021
36189 499021 2120264 3711663 2122481 -1843217 -2677757 2011973 6589503 4952545
36181 4952545 5495 -610782 3354927 4311072 -754840 -4818836 -1121060 6858155
36173 6858155 10324076 6209048 -1294073 -7391230 -10169725 -9303694 -6065296 -3964087
36165 -3964087 -5304903 -7437897 -6077403 -1865335 397499 -1099557 -3337605 -4366360
36157 -4366360 -6067987 -9174689 -10417555 -7881695 -4993487 -4939504 -4650575 261800 6923571
36148 6923571 7921903 2200966 -2986151 -2135623 2116236 4728221 5135022 5137006 4296253
36139 4296253 1666404 -838374 -1033708 -386109 -1343059 -2369772 114884 5569240 9069341
36130 9069341 7361244 2179675 -2460266 -3694701 -896735 3884207 6656539 5101526
36122 5101526 1272200 -1296347 -2068897 -2506469 -2184469 168062 2618892 1601911 -2235461
36113 -2235461 -4164830 -2208477 333226 429308 -652927 -618045 206712 505855 134816
36104 134816 -1085806 -3552820 -5340692 -3308378 1208693 2169582 -2469216 -6054694
36096 -6054694 -1929231 6351245 9165775 3671937 -3325092 -5400983 -3853122 -3243094
36088 -3243094 -4140178 -3700756 -1185686 707152 -24055 -1671595 -1066447 2229427 5414443
36079 5414443 6046235 4600713 2756502 910056 -840276 -901501 1625265 3824201 1778458
36070 1778458 -3335034 -5951842 -3904895 -1344520 -2040347 -4057692 -4112016 -3234472 -3861897
36061 -3861897 -4373673 -1686840 2402536 2866338 -874201 -3944999 -3412264 -2081413 -3162785
36052 -3162785 -5047644 -4303366 -1492599 -645479 -3347331 -5997588 -4090720 1793440
36044 1793440 5838942 3439733 -3236818 -7657982 -6452673 -2346584 605321 1801836
36036 1801836 2640341 3091349 2406811 1413291 1272223 1324980 1018326 2512788 7630965
36027 7630965 12870137 11911632 4189173 -2817938 -2080778 4703957 9799814 8711164
36019 8711164 3976602 311467 -923516 -1141076 -568274 2288382 7043834 9932598
36011 9932598 7970142 3359261 1119491 2512266 3633819 1325942 -2258815 -2869398
36003 -2869398 -41559 2557757 1905031 -1177214 -3459472 -2718045 333841 2949337
35995 2949337 3157603 1501619 -329803 -1600355 -2025961 -570450 2808673 5306631
35987 5306631 4465828 2459743 3022024 4485757 1404156 -5840562 -9292129 -4386529
35979 -4386529 2961291 4728217 1618917 169884 2491981 4818893 4410821 2466172
35971 2466172 890978 376303 983725 1463016 -525246 -4631411 -6712518 -4706022 -2346094
35962 -2346094 -3096586 -4384178 -3153371 -2871993 -7714370 -13047843 -10556067 -1546550
35954 -1546550 3911459 1423801 -2905007 -3453063 -2276372 -2529254 -2530249 -457322 1258303
35945 1258303 371381 -1273517 -1689447 -1991539 -2775849 -1999099 606038 1712824 -100804
35936 -100804 -1738518 -1219341 -804510 -1481986 -10102 4476035 6431706 1695825 -5078083
35927 -5078083 -6252017 -1189353 4471425 6499489 4461305 -506581 -5633488 -6927818
35919 -6927818 -4003932 -1761478 -3313212 -4824774 -2001938 2323704 3000623 1435143
35911 1435143 2730059 6344653 7032820 4048616 2159087 3444083 4817288 4415225
35903 4415225 4189869 4908078 4403781 2565226 2725886 5763724 7344939 3701581 -3232753
35894 -3232753 -8608299 -9725752 -6854783 -2096576 1000391 -286280 -4129596 -5187971
35886 -5187971 -981163 4923886 7340002 4897156 933 -4290566 -6012370 -4923454
35878 -4923454 -2799082 -1844134 -2265786 -2725488 -2919502 -3612146 -4422311 -4216169 -3542873
35869 -3542873 -3706659 -3533867 -625448 3890477 5914607 4639270 3927396 5593993 5660227
35860 5660227 393167 -7372403 -11605926 -10434212 -6706767 -3155323 -574413 415693
35852 415693 -629461 -2482548 -3466562 -3959290 -5423645 -7344396 -7530485 -5529537 -3690579
35843 -3690579 -4378219 -7354406 -10047894 -9663879 -5514858 -132259 2640011 1546886
35835 1546886 -932892 -1963728 -1258869 364833 2891223 5356915 4645452 -372422
35827 -372422 -5005758 -3478842 2677835 5548686 1241805 -4938296 -6047663 -2625518
35819 -2625518 -849408 -3804095 -8325245 -9809791 -7025843 -2069555 2049682 3365566
35811 3365566 2183740 738953 670893 1183248 744794 -325958 -680533 -407195 -380184
35802 -380184 202013 2802040 6172261 7108698 5078553 2920987 2031873 411565 -2716506
35793 -2716506 -4071476 -1221575 2626390 2672147 -531708 -2277548 -738591 1333082
35785 1333082 1514625 254000 -1642572 -4117698 -5713162 -3941104 918449 5260705
35777 5260705 6431366 5004226 2358840 -826614 -3030450 -2522581 -819014 -1849576
35769 -1849576 -6021418 -8768378 -7034717 -3494403 -1829477 -1521944 -452963 760783
35761 760783 660561 226443 503936 -345674 -3692025 -6692305 -6107511 -3531873 -2463374
35752 -2463374 -2521102 -1383677 -159745 -1278520 -2926120 -1742277 289946 -1620141
35744 -1620141 -6337446 -7870880 -5272403 -3608934 -3934516 -940873 6362581 10303328
35736 10303328 6198830 934658 3017637 9779357 12240250 8749947 5608306 6192110
35728 6192110 7410554 6645374 5208984 4109224 2166862 -468346 -1693035 -1420722
35720 -1420722 -2049159 -4169204 -5707521 -5896070 -6088310 -6092386 -3937030 -65033 2566602
35711 2566602 3447041 4891946 6348679 3830571 -2569437 -6204978 -2813824 2877242
35703 2877242 4215203 2063017 1427768 2094807 -131693 -4234995 -3871192 2257373 6737516
35694 6737516 3411757 -3979469 -7229007 -4496707 -1314723 -2262431 -5780873 -7548385
35686 -7548385 -6011900 -3176383 -1276036 -303243 843041 1767539 794759 -1788882 -2715865
35677 -2715865 101093 3816427 3811029 -155448 -4105875 -5824915 -6923618 -8503084 -8934275
35668 -8934275 -7492064 -6252904 -6181250 -5080122 -2117126 -605265 -2810701 -5512223
35660 -5512223 -4882798 -2646518 -2710219 -4632573 -5834440 -7476434 -11479484 -13765986 -8522691
35651 -8522691 1107748 5126715 942033 -2890473 -198329 3795164 1938013 -3579709
35643 -3579709 -5935259 -4254171 -2511958 -1753244 -322559 914365 175423 -570874 1146323
35634 1146323 2416759 -1034635 -6561264 -7532271 -3850406 -2048562 -4505020 -6064160
35626 -6064160 -3027586 1466535 3504554 3501084 2367569 -1303327 -6527490 -8018288 -3613253
35617 -3613253 888194 -788588 -6638766 -10002312 -8980719 -7139810 -6913997 -7352746
35609 -7352746 -7292840 -6387235 -3881143 -295585 848771 -2711036 -6955537 -5669633 546570
35600 546570 4357243 1701207 -3072208 -4059066 -1573017 -53680 -1317725 -3475942
35592 -3475942 -4804616 -5131453 -3994687 -678615 3503744 5459781 3772950 229845
35584 229845 -2859826 -5125427 -6733206 -6349016 -2922655 1153539 1509642 -2799205 -7535219
35575 -7535219 -8190687 -4874033 -812119 2117462 4010972 4532839 3047874 931851
35567 931851 759970 2597249 3483666 1348057 -2613928 -6109352 -8205733 -8799552 -7641917
35558 -7641917 -5040489 -2115164 385293 2299191 3119523 2728033 2816985 4863379 6649291
35549 6649291 4281728 -1542805 -5136583 -3319460 444933 1629538 607472 141204
35541 141204 510104 790171 1891141 4230456 5032614 2335465 -635200 193744 3099386
35532 3099386 3460885 1573013 1623631 3787914 3887806 1263348 351968 2822591 4408645
35523 4408645 2254362 -259402 404234 1925510 522595 -2448376 -3042371 -1376411
35515 -1376411 -1141818 -3798056 -7088466 -8537277 -7347415 -3682181 1068100 3992315
35507 3992315 3271138 706764 -354542 987029 2919825 3625058 2582295 377634
35499 377634 -1196943 -350264 1857204 1943005 -857888 -2626133 -702622 1441465 -580816
35490 -580816 -4528810 -4609655 -834099 692532 -2892390 -7354896 -8299714 -6724947 -5385484
35481 -5385484 -4309505 -2978062 -3063535 -5442820 -7383889 -6173755 -3242275 -1402192
35473 -1402192 -170687 2528126 5639093 5862399 2612748 -1306572 -3749451 -5009171
35465 -5009171 -5675904 -5437871 -4215849 -2411723 -188110 1675681 1148409 -2244612 -4914045
35456 -4914045 -2953243 1841266 3530726 225583 -3215633 -2245407 1310613 2846503
35448 2846503 1698607 916861 2026454 3489797 3896980 3682688 3298676 1935237 -1036062
35439 -1036062 -4567023 -6662331 -6230798 -4066495 -2170211 -1838665 -2359670 -2258284 -1820263
35430 -1820263 -3027300 -6441782 -9697476 -10244427 -8316061 -5796969 -3356083 -518463
35422 -518463 2195019 3251585 2192581 179287 -1661893 -3267485 -4952813 -6628964
35414 -6628964 -7712462 -7282601 -4787699 -1163671 1532297 2290748 1962847 1323249 73439
35405 73439 -1053623 437310 4950328 8186980 5839939 -138669 -3663935 -2561058
35397 -2561058 -652912 -1527852 -4127710 -5645126 -5294529 -3646904 -1263983 395500
35389 395500 -412348 -2573695 -2530021 401382 2342102 823055 -853128 1528164 6542453
35380 6542453 9152718 7376943 3256063 -1199913 -5028360 -6350628 -3672305 872997
35372 872997 3209644 2493749 1488192 1773241 1937184 898815 -300598 -845832 -1349671
35363 -1349671 -1795898 -964219 1150521 2804444 3177235 3079763 2337356 -530511 -4700571
35354 -4700571 -6053814 -2011243 4419994 7378861 4022113 -3128345 -8433314 -7506485
35346 -7506485 -1285675 4034288 3418356 -716222 -1745446 1667181 3883545 1328134
35338 1328134 -2105143 -1847007 9278 -1093331 -4318669 -5407638 -4193506 -4219584 -5896876
35329 -5896876 -5937916 -3758650 -2921401 -5032125 -7036100 -6443312 -5167712 -5806869 -7278721
35320 -7278721 -6828138 -4426495 -2862559 -4261104 -7635491 -9373490 -6339939 306460
35312 306460 5153026 4255370 -228230 -3469112 -4275377 -4263782 -2591091 2798333 9047688
35303 9047688 10052419 5524647 1967794 2468226 2330955 -1716836 -5187791 -4081305
35295 -4081305 -2774210 -6323171 -10260516 -7010194 903945 3769848 -491309 -4109544
35287 -4109544 -2460929 327105 911352 2599400 7431740 10311002 6790925 832193
35279 832193 -1215260 118359 148957 -1450479 -1009368 2349161 5807277 7520834 7596655
35270 7596655 5726009 2247309 212763 1814549 3909615 1943913 -2532707 -3638682
35262 -3638682 -412698 1350278 -2197688 -7512072 -9148853 -6533589 -2655196 506522
35254 506522 2323279 2009763 -144893 -1780114 -1235329 151632 593737 866576 2291515
35245 2291515 3485107 2316298 76757 151387 2561288 3335104 364152 -3145365 -3097195
35236 -3097195 -308692 739395 -1820979 -4749800 -3810458 1474715 7894777 11937293
35228 11937293 12143970 9292745 5611036 3186144 1951726 -130267 -3673416 -5752083
35220 -5752083 -3411180 1394343 3546286 1867775 932305 4054382 7881005 7120637
35212 7120637 2258368 -1348810 -884609 1412856 2902533 3788838 4935773 5676871 5112338
35203 5112338 3288168 196046 -4155124 -7933824 -8245112 -4825801 -835443 989622
35195 989622 746562 -768993 -3570867 -6326436 -5879526 -1531703 2675844 2909107 781984
35186 781984 415447 1858845 1320937 -2482306 -6018095 -5754385 -2450527 545735 1371507
35177 1371507 909185 1184111 3310447 6401918 8328208 7958682 6129236 3844169 838903
35168 838903 -2775939 -5048121 -4599893 -3288753 -3791637 -5525416 -6072810 -5785612 -6997730
35159 -6997730 -8899888 -8013558 -4750251 -4252861 -8103434 -10198345 -5154997 3174262
35151 3174262 7023861 5757765 5213904 7323093 7657180 4415119 2825992 7051548
35143 7051548 13073044 14433425 11441714 9396732 9825935 9115019 5403308 1539635
35135 1539635 88179 -268380 -1404052 -2221507 -944268 1376138 2263361 1440430 837592
35126 837592 1731841 3630580 5382415 5864952 4144719 496797 -3008196 -4192640 -2886514
35117 -2886514 -563157 1495891 2680912 2542970 1248079 64166 34045 569686 628834
35108 628834 649093 1700078 3257698 3777165 3278328 3283129 4058290 4043400 2469188 451929
35098 451929 -1216441 -3174814 -5180532 -4802385 -474612 5323727 8102698 6395104
35090 6395104 3259682 2616664 5005686 7271418 6232624 2564581 488831 2841933
35082 2841933 7195798 8691678 6474841 4727736 6629043 10153003 11651541 11025454
35074 11025454 10600094 10676435 9430011 6373750 2860449 -428427 -3546817 -5193255
35066 -5193255 -3945187 -1847366 -3087865 -7817376 -10719539 -7910388 -2395516 199754
35058 199754 -826386 -1456393 388411 2168379 1119848 -1764201 -3529122 -3041848 -1380874
35049 -1380874 433181 2479893 4847950 6523432 5885867 2538140 -1289359 -1948478
35041 -1948478 1852988 6704855 7484562 3228263 -1395421 -1503304 2283869 5026836
35033 5026836 3596628 -324937 -3322681 -4167097 -3656067 -2268203 135056 2903541
35025 2903541 4767708 5453152 5489327 4198739 -68042 -6540518 -10788368 -9131353 -3366143
35016 -3366143 1406981 3310750 5103086 8646727 11418982 10484500 6983697 3637870
35008 3637870 45084 -5611694 -11460390 -13136466 -10138197 -6547513 -4669568 -2595582
35000 -2595582 347908 817720 -2732312 -6029068 -5079354 -2466615 -2481678 -3381221 -884218
34991 -884218 2933740 1786718 -4253963 -8047119 -6317764 -3776243 -4014032 -3867351 -910694
34982 -910694 396483 -4107271 -10266779 -11336962 -8037289 -6372385 -8081116 -9729713
34974 -9729713 -9524238 -8658064 -6917015 -3147847 228438 -935040 -5855870 -9202235
34966 -9202235 -8356964 -5456957 -2450103 414405 1256405 -2044803 -6355370 -5586547 -23041
34957 -23041 3131953 771824 -1347857 1624564 5751763 5353842 2407533 2527695 5310555
34948 5310555 5386470 1236310 -3064662 -4250041 -3079049 -1450972 -492173 -1364244 -4292477
34939 -4292477 -6793674 -5998687 -2630288 52925 810477 1095139 1666867 1591653 653345
34930 653345 40877 287403 648391 725892 915575 1196784 1024659 355076 -387113 -901073
34920 -901073 -624043 1176409 3689835 4261077 1418168 -2883004 -5499522 -5448764 -3818799
34911 -3818799 -1901379 -757968 -948583 -1412246 -500739 1023104 851642 -99663 1973232
34902 1973232 6643971 7666086 2324119 -2875899 -1489815 2592092 1524819 -3367650
34894 -3367650 -3841408 1280314 4050934 481491 -3468527 -2233229 878208 252438
34886 252438 -3054871 -4213153 -2167601 761817 3675028 6732556 8163435 5962807
34878 5962807 1488198 -1844872 -2594143 -1819474 -925376 -968392 -2604168 -4794096 -4992803
34869 -4992803 -2277527 1164944 2915461 2826710 1540494 -1040624 -4171491 -5604456
34861 -5604456 -4536942 -3158319 -3356566 -3881124 -2614772 296483 3235202 4909803
34853 4909803 3943752 -534610 -5983100 -7271069 -3159539 916151 -185080 -4122876
34845 -4122876 -4709597 -780871 2895248 2707338 45207 -2059781 -2678849 -2613744 -2662791
34836 -2662791 -3021437 -3117014 -2000038 264618 2366283 3707974 5093068 6408300 5826074
34827 5826074 3060178 959795 1396201 1963854 -136432 -3122942 -3231292 -622231 1253817
34818 1253817 1057016 410863 251259 253791 1142691 3509983 4979109 2829914 -1074792
34809 -1074792 -2579164 -1953617 -2967649 -5233538 -3783077 2277035 7138709 7193692 6525471
34800 6525471 9415415 12793572 11615882 7696237 6930382 9998136 11857867 9570575
34792 9570575 5334362 2017280 346735 552292 2526539 4105899 3016834 644914
34784 644914 215813 1601730 2274950 3023629 7024947 12349604 11879615 3774802 -3797478
34775 -3797478 -3134600 2328683 3662621 -283395 -2023923 2870242 9674912 11561449
34767 11561449 7927900 3349491 1335478 1488507 1264623 -998777 -4120630 -5042564
34759 -5042564 -2787795 -543243 -1699335 -4841854 -5761472 -3834642 -2606802 -3891271
34751 -3891271 -5400235 -5166092 -4242475 -3526460 -1906414 458761 933579 -1149423 -2671287
34742 -2671287 -2018573 -2154585 -5046276 -7091393 -4473127 359563 2394440 1303311
34734 1303311 -103430 -1879348 -5567161 -8978394 -8695399 -6467196 -6702595 -8531405
34726 -8531405 -7176383 -2812672 -675929 -1832258 -1510072 1829767 3474555 1056088
34718 1056088 -1363132 -1238414 -2264489 -6794420 -10486029 -9721706 -7905206 -8538340 -8351947
34709 -8351947 -4233460 -1065606 -4350779 -9778033 -9333680 -4264140 -2048714 -2845841
34701 -2845841 69832 6692952 8508658 2549716 -3284341 -2997356 -1123755 -3085619
34693 -3085619 -5368772 -2643794 1727909 690382 -4864779 -7566796 -4749930 -845632
34685 -845632 655636 892724 955708 -352837 -2571659 -2372286 1545643 6001938 7816439
34676 7816439 7826996 8503954 9971720 10359107 8358240 3931379 -1830731 -6244291 -6402680
34667 -6402680 -2786889 203487 -653503 -3282146 -3623348 -1702740 -1237267 -3638701 -5988832
34658 -5988832 -5823234 -4554052 -4135111 -3200507 212334 3749233 2660345 -3079881 -7290643
34649 -7290643 -5059376 874516 3791472 1613876 -1178221 -231126 3028091 4018117
34641 4018117 1439150 -1525822 -2248559 -2126585 -3476043 -5048195 -3698115 24128
34633 24128 1622469 -867179 -3654701 -2969348 -969856 -1974391 -4937573 -4808177 -827939
34624 -827939 2090858 1319803 368811 2233455 3884114 1489607 -2626474 -3268059 -361936
34615 -361936 1513339 616369 -37932 1519230 3175204 2864185 1937987 2360094 3218274
34606 3218274 2255261 -730289 -3814331 -5236466 -4475012 -2013126 752304 2057448
34598 2057448 1305219 -246389 -931605 -464887 116813 -125808 -1111720 -2021302 -2201251
34589 -2201251 -1774279 -1323404 -1057385 -660884 58886 1048296 2580942 4889925 6813184
34580 6813184 6094980 2089894 -2700565 -4939341 -3840505 -1449431 -110524 -435956
34572 -435956 -1335159 -1473447 -958047 -1355749 -3132237 -3819897 -975455 3247179 3653404
34563 3653404 -987453 -5782303 -6165223 -3207249 -345442 1621079 3140392 2885499
34555 2885499 218226 -1951768 -1142098 190839 -1161993 -2792817 -273816 4446292
34547 4446292 4884841 29088 -4242254 -4544333 -4060205 -5415184 -6136144 -4331166 -2951308
34538 -2951308 -4361366 -5578027 -3239657 764357 2831761 3010856 2587810 189326
34530 189326 -4767451 -8136020 -6057498 -1295529 968778 1233443 3495215 7062180
34522 7062180 7606559 5459618 5241158 6827160 4708233 -1525043 -4040894 1625460
34514 1625460 8640648 8363591 2548369 -629300 979774 2473681 1430674 730887
34506 730887 1673504 1427163 -914038 -2003893 -701548 -1215077 -5966598 -10165761 -8499096
34497 -8499096 -3617927 -2102380 -4133940 -3674895 1375065 5669999 4701450 1088397
34489 1088397 -349009 472134 546008 -697440 -1537388 -1813857 -2775594 -4012142 -4066921
34480 -4066921 -3672879 -4922570 -7051341 -6476324 -2172143 1844157 1355950 -2463226 -4467207
34471 -4467207 -1958052 2157714 3013546 -507155 -4656910 -5321404 -2594849 47021
34463 47021 496904 145073 904030 2103934 1877184 360189 -443322 415992 1753616
34454 1753616 2132492 1480659 558156 -215092 -931604 -1590581 -1710720 -847789 365992
34445 365992 444495 -807621 -1287716 493910 2249353 417386 -4170898 -6422570 -3698193
34436 -3698193 884469 3318241 3505802 3165971 2392752 1072910 571546 830923 -1137258
34427 -1137258 -6213125 -9675902 -7183291 -1672895 628856 -1027663 -2469742 -2145179
34419 -2145179 -2055010 -2028660 466515 4444392 5465293 2717943 400774 564248 115007
34410 115007 -2918929 -5376046 -4204073 -1540170 -1379389 -4106267 -6772401 -6450596 -1997961
34401 -1997961 4751089 8856933 6853470 2066926 1218688 5086804 7584158 5320907
34393 5320907 2242051 2352898 3717089 3208933 1839582 1174565 -648472 -4688082 -7406687
34384 -7406687 -6031687 -3678462 -3992491 -4604480 -1687292 2464463 2868804 248245 -691843
34375 -691843 552155 757655 382531 3000406 7243405 6907627 934756 -3489198 -940338
34366 -940338 4682191 6511892 4272719 2764711 3501989 3115071 -144567 -2751423 -684171
34357 -684171 4535496 7380355 5569345 2945679 3639754 5852312 4806237 615867
34349 615867 -1471450 740220 2931387 1225408 -1951225 -2462788 -1088682 -1175178 -2510965
34340 -2510965 -2314438 -477836 828235 1547840 3272405 5194680 4808974 2266985 204733
34331 204733 -397366 -617418 -469016 899463 2399376 2152181 994549 1066555 1452404
34322 1452404 -589813 -4241657 -5394340 -2783094 279500 1172340 1208801 2411600 4180305
34313 4180305 4512682 2511798 -761791 -2415473 194311 5219168 6243819 137733
34305 137733 -7205512 -7945427 -3217662 -706471 -2416587 -2503585 2027144 6466510 6775416
34296 6775416 5370463 4787133 2442951 -3271320 -7575364 -5929576 -1538624 -51670
34288 -51670 -430090 2240220 7287738 8777603 4559888 -1175113 -4572020 -5955280 -6338411
34279 -6338411 -5056802 -2355329 -317837 501923 2121574 5123350 6541111 3813001
34271 3813001 -1395479 -5475821 -7317973 -8206655 -8399531 -6456673 -2150029 2096622
34263 2096622 3744151 2900533 1367423 -88574 -1670939 -2153165 735907 6283444
34255 6283444 9536212 6650242 286645 -3190398 -1525962 1262986 749300 -2740786
34247 -2740786 -5840226 -6620550 -5705629 -4289030 -2646745 -430165 2050074 2983014 544390
34238 544390 -3971054 -6219719 -3990617 -603618 -253478 -1651739 -413099 3258782
34230 3258782 4441000 1329217 -2158244 -2933649 -2537108 -2219061 224998 5150433 7631222
34221 7631222 4171715 -937265 -1241031 2682640 5062805 3888642 2220180 1578360
34213 1578360 -707 -2931955 -4507156 -3783627 -3640003 -6116673 -9303339 -10787724
34205 -10787724 -10981804 -10738889 -8512226 -3014667 2834962 3902733 -1157927 -8180240
34197 -8180240 -12402309 -13443545 -14124833 -15396482 -14763492 -10519023 -5376423 -3339773
34189 -3339773 -3838207 -2348047 2595392 6612060 5756760 2464570 1879941 4215712 4738805
34180 4738805 820102 -4736667 -7843536 -7461666 -4880896 -1417336 1678525 3012115
34172 3012115 2445877 1580698 1580805 1493197 -127681 -2875232 -5144861 -6468577 -7538630
34163 -7538630 -8003693 -6135809 -1605063 2919695 4645194 4262276 4443894 5088524 3268171
34154 3268171 -1060901 -2998776 604117 5306218 4440281 -1216617 -4349569 -1489047
34146 -1489047 3018748 4507770 3876357 3481151 2308735 -930607 -3944529 -4409750 -4209902
34137 -4209902 -5715939 -6668354 -3768376 706644 1326910 -2417192 -5749739 -6134647 -6052178
34128 -6052178 -7586320 -8926935 -7823754 -4943837 -2241628 -761483 -1117178 -3520911
34120 -3520911 -6483055 -7960167 -8244529 -8993552 -9283361 -6285636 -703706 2501809 759949
34111 759949 -2332156 -2527737 -1169548 -2497452 -6697406 -9380962 -7534735 -3010570
34103 -3010570 210655 176243 -2097565 -4435761 -5582150 -5918374 -6299029 -6285097 -4339170
34094 -4339170 -275902 3341316 3399100 -150562 -3653295 -3312949 591962 3675806 2373612
34085 2373612 -1615987 -3464466 -1806770 -609038 -3129839 -6852568 -7313531 -4818414
34077 -4818414 -3381413 -4054939 -3904538 -1900661 -1205781 -3874633 -7100426 -7300609 -5193137
34068 -5193137 -4017579 -4515823 -4458236 -2390545 373095 1566211 725148 -66482 1525543
34059 1525543 4498069 4491211 -596401 -6294132 -6498067 -2245680 -668777 -4112544 -5888124
34050 -5888124 -313867 7771872 8923352 1930623 -4947973 -4933465 163804 4349291
34042 4349291 4718601 2762942 1274083 1760518 3612121 4826688 4127906 2245238 541307
34033 541307 -517948 -459224 1760679 5285104 6242479 2303577 -2941321 -3860881 -227355
34024 -227355 3412884 5470450 9220224 15673307 19726368 16678857 8968921 2747882
34016 2747882 297565 -414382 -612980 507985 2419790 2655855 337264 -2420484 -3427013
34007 -3427013 -2658011 -933337 1615677 4638979 6506405 5453670 1502997 -3130774
33999 -3130774 -5382374 -3629834 411153 2598257 540482 -3427790 -4964808 -3060154
33991 -3060154 -600379 331516 928852 2441701 3382182 2250959 908223 2056161 4364624
33982 4364624 3606315 -1066182 -5184468 -4637809 -799717 1969053 2198129 2184607 3589235
33973 3589235 4705575 2977182 -1209827 -4641454 -5099145 -4152082 -5378626 -9811254
33965 -9811254 -14066256 -13860665 -8873049 -2891563 630403 1598715 1789246 2341462 3556146
33956 3556146 5263657 6082961 4143040 250243 -1526199 1214141 5344108 6288500
33948 6288500 4598618 4541159 6694529 6745704 2693145 -1522650 -2146276 -1327058 -3065745
33939 -3065745 -6455347 -7331720 -4954318 -2617961 -2261999 -2551275 -2232815 -1572885 -236588
33930 -236588 2422981 4406582 2505842 -1995574 -3195860 1561216 7363313 8212262
33922 8212262 4638848 1353124 112612 -725464 -1492563 -999969 -287576 -1660053 -3903775
33913 -3903775 -3388445 -691883 -868770 -5174793 -7853667 -4719731 -226125 -876752 -5064023
33904 -5064023 -5830243 -2105954 -141412 -3113801 -6128349 -4447712 -1103950 -1801127
33896 -1801127 -6002907 -8334052 -6914541 -4985313 -4567801 -3559477 -478270 1961117
33888 1961117 584497 -3291534 -5309515 -3504549 -266409 794936 -1465830 -5083361
33880 -5083361 -7048459 -5931586 -2861907 65636 2036519 3405821 3746079 1852001
33872 1852001 -1654359 -3640133 -2024453 1252296 2776747 2303664 2508501 4403225
33864 4403225 5707946 4530783 2258403 1246797 1409963 1045673 -83921 -635838 -158295
33855 -158295 407200 704692 1438763 2367397 1692498 -1365083 -4580538 -4673541 -824705
33846 -824705 4540133 7992186 7556690 3788270 -555624 -2433622 -1222330 685435
33838 685435 764849 -637386 -1264219 -475994 -233067 -2228570 -5332673 -6720054 -5038037
33829 -5038037 -1939309 -582082 -2534246 -5922142 -7121910 -4802377 -1460121 46665
33821 46665 286659 1551798 3277012 2366321 -1482662 -4169458 -2618475 1011338 2870455
33812 2870455 2674228 2407758 1907263 -252140 -2470597 -1228867 3119315 5872839 4699965
33803 4699965 3017010 4349288 6587026 5226280 366643 -3201011 -2380020 772851
33795 772851 2139939 -145046 -4665761 -8086261 -7378489 -2546137 2550765 3797901
33787 3797901 1597963 281842 2268429 4819019 3791518 -1013637 -5886354 -7579542
33779 -7579542 -6007021 -3109047 -635935 876886 2041364 3745295 5799462 6692362
33771 6692362 5352554 2730623 690192 -306105 -1206507 -2259179 -2400547 -1091163 679779
33762 679779 1985528 3308669 5213181 6731515 6587278 5376734 4692416 4215358 1908402
33753 1908402 -2097938 -4105982 -1472866 2835501 3429549 102509 -1357513 2444173
33745 2444173 6700138 4523794 -3111949 -8305123 -7024768 -3897633 -4262461 -6138937
33737 -6138937 -4116584 1905673 6930273 8465339 8803372 9734358 9949928 8830943 8240976
33728 8240976 8517136 6731974 1678682 -2886301 -3216557 -933191 45384 -669340 -1169687
33719 -1169687 -2061096 -5128164 -8341352 -7558111 -3479587 -1779629 -4844766 -7977507
33711 -7977507 -6297072 -1682107 392003 -1637514 -4557360 -5594586 -5105899 -4343096
33703 -4343096 -3399842 -2041088 -694488 342455 1614489 3430311 4575542 3322434
33695 3322434 112150 -1904076 -391754 2692264 3309388 1122459 157275 2476086
33687 2476086 4562401 2757002 -785706 -1648659 -342061 -916900 -3736350 -5248715
33679 -5248715 -4560106 -4148387 -3550757 881583 7921406 10108117 4414728 -1670743 84465
33670 84465 7381392 11447614 8790705 3130971 -1617306 -4243536 -3876299 -653366 1976722
33661 1976722 753184 -2231344 -2566406 -679662 -681157 -2767384 -2681994 866224 3995149
33652 3995149 4115706 3372977 3783051 3572677 681222 -3817783 -7924458 -11138958 -12932727
33643 -12932727 -11961101 -8588802 -5381616 -3602642 -1962133 97668 1103849 775565
33635 775565 1151975 3033262 4631535 5137206 5907556 6521233 3938896 -1926426 -6020090
33626 -6020090 -4854518 -1764301 -1718581 -4009394 -4190542 -861457 3556159 6907046 8353443
33617 8353443 7115524 3975606 2459785 4727269 7776923 7589787 5394002 5314831 7082222
33608 7082222 6353365 2161032 -1286689 -1236616 77984 376923 1341342 4710495 7715681
33599 7715681 6270665 1369641 -1146376 2461780 9182053 12506396 9584200 4055383
33591 4055383 1343373 2147090 2507085 230510 -1828728 -612198 1999295 2116485 -184115
33582 -184115 -1790426 -2091451 -2971918 -3812487 -1756789 2271300 3250649 -23379 -1726428
33573 -1726428 2760237 9521048 11499255 8233143 5112873 4704681 4393549 2467499
33565 2467499 1037278 1383383 1010191 -1990699 -5084748 -5115308 -3664947 -4828646 -8635920
33556 -8635920 -10527041 -7752726 -2985704 -289598 -248999 -1077986 -2235166 -3927314 -4289039
33547 -4289039 -791037 5148886 8353363 6237913 2309531 1241960 2823243 3727191
33539 3727191 3469956 4493753 6581271 5632912 -285617 -7103471 -9611860 -7850460
33531 -7850460 -5620625 -4279700 -1814278 2116955 4172667 1976080 -2016190 -3711752
33523 -3711752 -2877231 -2825551 -5193596 -7620269 -7073335 -3469320 925703 4171331 5611153
33514 5611153 5360629 4205596 3353297 3155078 2678683 1538207 1159404 2632060 4138171
33505 4138171 2803433 -930060 -3158142 -1462085 2004446 3429083 1611513 -1915251
33497 -1915251 -5328704 -7255495 -6272213 -2015867 3198070 5632573 3680283 -510993
33489 -510993 -3240849 -2754792 -517560 841897 746847 1174607 3282818 4720087 2537242
33480 2537242 -1620967 -2479283 1708260 6307195 6822809 5112770 5566885 7550552 6556422
33471 6556422 2173582 -360479 2157302 6093044 6443983 3994141 3768260 7884426
33463 7884426 12958816 14332295 10727938 4597375 -532537 -2516532 -1358847 1556319
33455 1556319 4663303 6734632 6968578 5504415 3731951 3158424 3813936 4392784 3854697
33446 3854697 2227011 172171 -1422514 -1967162 -2268847 -4238168 -8059638 -10765251
33438 -10765251 -9834716 -7237681 -6857911 -8383941 -7608429 -3322678 336830 209146 -1275470
33429 -1275470 -720305 477543 -1077443 -4636059 -6325468 -5013770 -2936446 -1210877
33421 -1210877 929634 2527887 1136715 -2314596 -3170056 403028 4063010 3169927
33413 3169927 -735283 -2481171 -521218 1729520 1213149 -1163487 -2700559 -2526787
33405 -2526787 -2042709 -2717910 -4228052 -4777905 -3391353 -1673660 -2194309 -4747310 -5787986
33396 -5787986 -2825036 2031735 4774170 4714693 4577650 5715813 6055911 3695091 249630
33387 249630 -1108266 177621 1362869 -514957 -5695312 -11331041 -13547870 -10713007
33379 -10713007 -5326510 -1790414 -1662549 -2297171 -1019397 1074815 1305580 -80972
33371 -80972 -368595 1175016 2354284 1916600 1273073 1129651 -610015 -5261404 -9903651
33362 -9903651 -10483469 -7262723 -4323723 -4139488 -5270133 -5257659 -3261997 107870 2905328
33353 2905328 1808994 -4672587 -12169554 -13280413 -6399289 1493939 3432642 747816
33345 747816 -761387 -69876 -1139034 -5023881 -7607967 -6292156 -3954264 -3992703 -5429754
33336 -5429754 -5721771 -5131427 -5126510 -5125365 -4284768 -4250972 -6239614 -7124902 -2916991 4600992
33326 4600992 9270636 8738948 6814087 6807153 7012031 4850096 1652664 323991 850010
33317 850010 1161569 797346 1039088 2495490 4618290 6617006 7413557 6255310 4747894
33308 4747894 5956477 9510047 10416847 5836236 341745 200115 4414059 6648148
33300 6648148 5107649 4502504 7428903 9788430 7433064 2586114 101901 794656
33292 794656 2137458 2948219 3648657 3782799 2956331 2940048 5366787 8316479 8635561
33283 8635561 6962319 6833104 8969865 10209859 8692997 6447325 5338449 3677642
33275 3677642 -706354 -6161833 -8756775 -7221068 -3981147 -1523753 211573 2498986
33267 2498986 5566959 8527672 10540661 11025778 9258513 5005910 -197651 -3382089
33259 -3382089 -2541408 1503643 5940753 8197129 7150487 3367050 -678228 -1731083
33251 -1731083 845230 3293624 1535550 -2988724 -4566575 -1149594 2408551 1336942
33243 1336942 -1932717 -1359567 3815029 8132266 7522356 3645739 -52582 -2651471
33235 -2651471 -4320890 -3908004 -792264 2691039 3357963 850013 -2690192 -5585758
33227 -5585758 -7308148 -7296900 -5673699 -4692153 -6651050 -9981768 -10167813 -5724558 -730958
33218 -730958 577027 -423860 623813 3913467 4928083 1583943 -1968553 -1046828
33210 -1046828 2779715 3841524 -117545 -5899976 -9623346 -9952967 -6553057 542894
33202 542894 8307468 10991790 6112253 -1659901 -5439475 -3860667 -1287372 -1205085 -2467130
33193 -2467130 -2349996 -633523 667700 207605 -1338797 -2373387 -2074675 -957365 71604
33184 71604 860251 1702072 2223671 1817890 1252396 2170920 4389096 5517203 4315927
33175 4315927 2485654 1622379 461381 -2625739 -6136729 -7169541 -5440725 -2807177
33167 -2807177 111375 3648392 6237209 5594797 2840629 1738584 3102880 3523561
33159 3523561 996860 -1577034 -688423 2639164 4573188 3613214 1527575 187097
33151 187097 -253686 -314966 -43869 835789 2227979 3074604 1726177 -2048811 -5624853
33142 -5624853 -5877800 -3284577 -1573865 -2475014 -3110913 -238230 4855799 7913978 7020915
33133 7020915 4138970 1889734 890003 383556 -79894 -156662 755526 2690337 4650494
33124 4650494 5345631 4580501 3268019 1942663 327653 -1340109 -2071154 -2020534 -2973768
33115 -2973768 -5441461 -6699320 -4014126 726644 2240324 -1522539 -6051026 -5419986
33107 -5419986 124672 4123086 2172658 -1956635 -1023015 5727932 11012531 9121216
33099 9121216 3326990 482257 1198423 436512 -3341086 -5598003 -3368511 44761
33091 44761 691382 -250872 164121 1274650 1049014 838514 3049991 5816043 5095586
33082 5095586 1557411 411163 3807429 7871993 8722276 7579993 7736695 9419210
33074 9419210 10338100 9517279 7999206 6598366 5103042 3523304 2542273 2471936 2668405
33065 2668405 2330997 1498797 919233 909835 789516 138339 361419 3411938 8269550
33056 8269550 10549978 7506249 2158976 -46642 1863480 3647979 2183590 -460904
33048 -460904 -602803 1846008 3892554 3826900 2827158 2537084 2820081 2239507 -198739
33039 -198739 -4023799 -7431200 -8403286 -6334285 -2802665 -339928 -55039 -599245 62570
33030 62570 1755515 1763005 -1674780 -6089535 -6848429 -2907314 1529004 2389235 744438
33021 744438 135492 622031 -857952 -4483659 -6014866 -2775616 2110718 3937570 2572008
33012 2572008 1527243 2325342 2928155 1419336 -1558288 -4306645 -5642363 -4481311
33004 -4481311 -226936 5242973 7869063 5452716 546271 -2119168 -671349 2434793
32996 2434793 3533398 1386321 -1980273 -3329093 -1452380 1100584 275121 -4701313
32988 -4701313 -9696107 -10077623 -5930798 -1326610 807752 970676 745454 926261 2262353
32979 2262353 5140238 7490454 5943870 848188 -2655428 -1073293 2426819 2726205
32971 2726205 451066 723298 5048022 8997133 8549717 4743204 763306 -2024172
32963 -2024172 -3334731 -2424148 244633 2022450 1261727 -7616 1196952 4505905
32955 4505905 6584012 5088594 735323 -3897478 -6493760 -6718276 -6549328 -7729968
32947 -7729968 -8502198 -5109926 2285642 7851688 6583538 476497 -4600464 -6450149
32939 -6450149 -7453881 -8923481 -8820416 -5964749 -2919737 -2450675 -3185101 -1385431 3569736
32930 3569736 7789709 7545926 3690676 -47546 -2207952 -4591120 -7854087 -9245107
32922 -9245107 -6821077 -3099991 -1052317 1078297 5950893 9924234 6711463 -1458980
32914 -1458980 -4448417 1068371 5532342 614245 -7864587 -9024196 -3454943 -933260
32906 -933260 -4507679 -7256437 -4756293 -924410 453887 1220410 2701438 1882169 -2019786
32897 -2019786 -3783329 -3298 4612532 4054297 -31388 -1605978 505651 1928643
32889 1928643 -249650 -4131849 -5993847 -3836732 996036 4033709 1593215 -3987032
32881 -3987032 -6071654 -2497403 1359319 940752 -726271 1174277 5016750 5856243
32873 5856243 3593452 2029150 2055059 1893069 2345602 5324066 8200271 6351875 1062186
32864 1062186 -1860273 -1492670 -2591195 -6037212 -6505388 -2465539 -645692 -5685539
32856 -5685539 -11992260 -12068123 -7731926 -5979687 -7381904 -6459828 -1980154 959481 -412312
32847 -412312 -2620518 -2449144 -1651095 -2477889 -3062034 -598587 3972725 7630889 9375910
32838 9375910 9798498 8465098 4877295 967514 -384201 929290 2409539 2680555
32830 2680555 2699512 3060391 2492936 90720 -2646020 -3356722 -1621904 763421 1855800
32821 1855800 1263315 177304 137862 1415312 2503013 1818093 -146583 -1454581 -1633463
32812 -1633463 -2309314 -4104328 -4735557 -2121491 1802404 2918254 423368 -1969663
32804 -1969663 -946696 2420761 4755489 4746840 3851703 3660793 4304585 5231579 6108882
32795 6108882 6510743 5410941 1676646 -4472384 -10369038 -12161183 -8501453 -2773232
32787 -2773232 -25825 -1440879 -3553877 -3385541 -2033549 -1811480 -2166646 -1009044 1306694
32778 1306694 2323003 1387511 375521 283532 -208808 -1864397 -2835856 -1007663 2912727
32769 2912727 5998723 6143468 3730231 953841 27296 1340278 2949187 2594069 479669
32760 479669 -792928 716300 4195065 7120353 7314058 4038125 -1410170 -5993029
32752 -5993029 -7512141 -7191982 -7767409 -8785831 -6705948 -869131 3910308 3362470 -238073
32743 -238073 -1542800 211962 1027683 -1201040 -4055620 -4888606 -3998499 -2690543 -1439946
32734 -1439946 -957072 -2015326 -3196191 -1905885 1263051 2585969 1033159 185502
32726 185502 2108069 3406232 858051 -2698190 -2700818 -361108 -546704 -3767175 -5819087
32717 -5819087 -4967746 -4039842 -4843056 -5563430 -4924344 -4327358 -4205721 -2483799 1287376
32708 1287376 4031753 3589819 1694785 420630 -933883 -3124337 -4562920 -4315140
32700 -4315140 -4278519 -5553989 -5905027 -4017223 -2937011 -5301684 -8095148 -6811223 -2682912
32691 -2682912 -797376 -2286013 -3307843 -1340309 2041333 4690972 6182765 6347190
32683 6347190 5048871 3655101 3665610 4015936 2695235 470587 -238939 535174 831388
32674 831388 473307 377974 -793542 -4700995 -8835944 -9174134 -7015818 -7522670 -11128476
32665 -11128476 -12413830 -8624847 -3302399 251285 3137573 6292119 7644034 6532917
32657 6532917 5376731 4336541 366359 -5535826 -7084374 -2802811 -37065 -3318911
32649 -3318911 -6169882 -2103305 3018688 -373802 -9182310 -11310365 -4138947 1863575
32641 1863575 -893056 -7431399 -9385628 -5765791 -715642 3211444 5445703 5496661
32633 5496661 4077658 3027320 2146316 -668711 -4942009 -7064687 -5524295 -2905253
32625 -2905253 -1513124 -967360 -1207802 -3377539 -6063982 -5248105 -379869 3532377 2501849
32616 2501849 -1243350 -3085893 -1780204 990948 3703815 5142652 4116165 1269856
32608 1269856 -1049324 -2197697 -3902390 -6475500 -7671295 -6661731 -5621132 -5802131
32600 -5802131 -5612795 -4097731 -2489716 -843673 2516898 6536916 7293776 4364132
32592 4364132 2018637 1753382 -100036 -4033606 -3901335 2823273 8291189 5094806
32584 5094806 -1909341 -3055421 1400219 3383695 631973 -1925920 -2843356 -5670458
32576 -5670458 -9489585 -8300450 -2061703 1091455 -2861509 -7690449 -7291032 -4539579
32568 -4539579 -4557737 -5781566 -4017969 -489888 588267 -885580 -2088710 -2956273 -4999508
32559 -4999508 -6338563 -3679651 1419623 3583157 1355129 -641101 1339827 4620380
32551 4620380 3851907 -1574368 -6474266 -6358347 -3168830 -2808956 -7191669 -11283681 -9734087
32542 -9734087 -4149214 -591619 -1339043 -3262807 -3772978 -3471485 -2335476 1478815 7020458
32533 7020458 9486234 6704242 2781305 2180800 3693384 3707387 2336880 2488969 5059777
32524 5059777 8369657 10484293 9656328 5157377 167138 286855 5916517 10056997
32516 10056997 7859296 4071051 5332314 9078885 7680449 1251727 -2274998 292151
32508 292151 3210446 1862211 -620960 82095 2675642 3925303 4118581 4727177 4529202
32499 4529202 2130443 -536594 -814641 827825 2328191 3015076 2617438 121451 -3619145
32490 -3619145 -5043333 -2860574 -1102598 -3501109 -7239619 -6608277 -1314014 3275444
32482 3275444 3485493 850002 -1507064 -2164963 -805152 2207589 4928208 5332958 4329978
32473 4329978 4766864 7067872 8515662 7377372 5019096 3206245 2087783 1831891
32465 1831891 3302752 5529030 5322109 1677802 -1714023 -936935 2919166 5648461
32457 5648461 5515252 3920647 1707463 -1504674 -4568977 -5249001 -4037385 -3831355 -4611971
32448 -4611971 -2523163 3224767 6479564 1609380 -7439543 -10791617 -5090358 2487407
32440 2487407 3685711 -1390277 -6069773 -5188388 688088 6721328 7627097 2084430
32432 2084430 -5113429 -7307161 -3551690 536346 604269 -1293756 -1440935 -287019 62836
32423 62836 598153 2863357 4316308 1699745 -2515986 -2774191 1100358 3739250 2575754
32414 2575754 612577 73046 -880881 -3213299 -4131936 -1905812 693135 542032 -1749692
32405 -1749692 -4189205 -6287852 -7435321 -6075656 -2783301 -473566 561202 3545466
32397 3545466 8693315 10754958 6660700 749544 -1990577 -3036117 -5370372 -6337306
32389 -6337306 -2523081 2032767 925258 -3336292 -2087851 5674086 11294685 9878721
32381 9878721 6890047 7747896 8852766 4772617 -1676445 -3678004 -1274786 -698164
32373 -698164 -3990242 -6116545 -3496792 213296 -228667 -3829398 -4951607 -1314404
32365 -1314404 3253176 4443304 2798804 1598421 1561103 655333 -1532914 -2680788 -1668424
32356 -1668424 -488316 -664354 -567276 1520263 4047989 4448618 2763809 472920 -2233235
32347 -2233235 -5096878 -5847241 -3225656 -255090 -487813 -2289314 -1206129 2842915
32339 2842915 5474987 4749255 3327123 3210888 3032803 1765933 783734 577363 -717096
32330 -717096 -3664151 -5789466 -5338389 -3777507 -2882198 -2168304 -783497 714955 1813035
32321 1813035 2707893 2662594 616124 -1953996 -2288488 -1100858 -1885743 -4571888 -4942669
32312 -4942669 -2184102 -1266820 -4489064 -6292884 -1482091 5987076 8401161 5222246
$$ [...]
##END NTUPLES=NMR SPECTRUM
##END=
