##TITLE=31Pdec_DPAA0812-2
 CDCl3, 24 sc
 9.12.2021
##JCAMPDX= 6.0         $$ Bruker NMR JCAMP-DX V2.0
##DATA TYPE= NMR SPECTRUM
##DATA CLASS= NTUPLES
##ORIGIN= UXNMR, Bruker Analytische Messtechnik GmbH
##OWNER= root
$$ XWIN-NMR		Version 3.5
$$ Thu Dec  9 11:40:08 2021 Russian Standard Time (UT+4h)  she@DPX200
##.OBSERVE FREQUENCY= 81.013821
##.OBSERVE NUCLEUS= ^31P
##.ACQUISITION MODE= SIMULTANEOUS
##.ACQUISITION SCHEME= undefined
##.AVERAGES= 24
##.DIGITISER RES= 16
##SPECTROMETER/DATA SYSTEM= spect
##.PULSE SEQUENCE= zgpg30
##.SOLVENT NAME= CDCl3
##.SHIFT REFERENCE= (INTERNAL, CDCl3, 0, 248.564)
##AUDIT TRAIL= $$ (NUMBER, WHEN, WHO, WHERE, WHAT)
$$ ##TITLE= Audit trail, XWIN-NMR		Version 3.5
$$ ##JCAMPDX= 5.01
$$ ##ORIGIN= Bruker BioSpin GmbH
$$ ##OWNER= she
$$ F:/spectra/data/she/nmr/P31/1/pdata/1/auditp.txt
$$ ##AUDIT TRAIL=  $$ (NUMBER, WHEN, WHO, WHERE, WHAT)
(   1,<2021-12-09 11:39:08.48 +0400>,<she>,<DPX200>,
      <created by zg, POWCHK disabled, PULCHK disabled
       configuration hash MD5:
       00 E9 B6 7A A2 85 ED C7 34 08 36 98 17 FE 4E 26
       data hash MD5: 32K
       B6 D0 75 B1 F3 C1 DE 7B B8 DE 2A 81 6B 51 9E B2>)
(   2,<2021-12-09 11:39:10.93 +0400>,<she>,<DPX200>,
      <Start of raw data processing
       efp BC_mod = 2 LB = 1 FT_mod = 6 PKNL = 1 PHC0 = -9003.046 PHC1 = -282.5305 SI = 64K 
       data hash MD5: 64K
       26 5D E3 BB B0 B7 2C BD CC 31 8F B4 2C 79 84 F1>)
(   3,<2021-12-09 11:39:36.32 +0400>,<she>,<DPX200>,
      <pk PHC0 = -14.33145 PHC1 = 0 
       data hash MD5: 64K
       28 40 64 F5 E4 E5 0F 4D 1C 8F DA C6 85 CB A0 EB>)
(   4,<2021-12-09 11:39:40.84 +0400>,<she>,<DPX200>,
      <abs ABSG = 5 
       data hash MD5: 64K
       AD D0 C1 85 52 8F 4B 0C 74 59 2B 74 6C FB C4 2A>)
$$ ##END=
$$ 
$$ hash MD5
$$ 04 8F 49 3E 23 B1 E1 9D 1C 24 E2 FC E0 98 93 92
##$RELAX= 
##$RELAX= 
##$RELAX= 
##$RELAX= 
##$RELAX= 
##$RELAX= 
##$RELAX= 
##$RELAX= 
$$ Bruker specific parameters
$$ --------------------------
##$DU= <F:/spectra>
##$EXPNO= 1
##$NAME= <P31>
##$PROCNO= 1
##$TYPE= <nmr>
##$USER= <she>
##$AMP= (0..31)
100 100 100 100 100 100 100 100 100 100 100 100 100 100 100 100 100 100 
100 100 100 100 100 100 100 100 100 100 100 100 100 100 
##$AQSEQ= 0
##$AQ_mod= 1
##$AUNM= <au_zg>
##$AUTOPOS= <>
##$BF1= 81.014009
##$BF2= 200.13
##$BF3= 200.13
##$BF4= 200.13
##$BF5= 200.13
##$BF6= 200.13
##$BF7= 200.13
##$BF8= 200.13
##$BYTORDA= 1
##$CFDGTYP= 0
##$CFRGTYP= 5
##$CHEMSTR= <none>
##$CNST= (0..31)
1 1 145 1 1 1 1 1 1 1 1 1 1 1 1 1 1 1 1 1 1 1 1 1 1 1 1 1 1 1 1 1 
##$CPDPRG= <waltz16>
##$CPDPRG1= <>
##$CPDPRG2= <waltz16>
##$CPDPRG3= <>
##$CPDPRG4= <mlev>
##$CPDPRG5= <mlev>
##$CPDPRG6= <mlev>
##$CPDPRG7= <mlev>
##$CPDPRG8= <mlev>
##$CPDPRGB= <>
##$CPDPRGT= <>
##$D= (0..31)
0 1 0 0 0 0 0 0 0 0 0 0.03 2e-05 3e-06 0 0 0 0 0 0 0 0 0 0 0 0 0 0 0 0 
0 0 
##$DATE= 1639035547
##$DBL= (0..7)
120 120 120 11 120 120 24 19 
##$DBP= (0..7)
150 150 150 150 150 150 150 150 
##$DBP07= 0
##$DBPNAM0= <>
##$DBPNAM1= <>
##$DBPNAM2= <>
$$ [...]
##$SUBNAM3= <"">
##$SUBNAM4= <"">
##$SUBNAM5= <"">
##$SUBNAM6= <"">
##$SUBNAM7= <"">
##$SUBNAM8= <"">
##$SUBNAM9= <"">
##$SW= 501.771253377433
##$SWIBOX= (0..15)
0 1 3 0 0 0 0 0 0 0 0 0 0 0 0 0 
##$SW_h= 40650.406504065
##$TD= 32768
##$TD0= 1
##$TE= 0
##$TE2= 300
##$TE3= 300
##$TEG= 300
##$TL= (0..7)
0 120 53 12 22 120 120 120 
##$TP= (0..7)
150 150 150 150 150 150 150 150 
##$TP07= 0
##$TPNAME0= <>
##$TPNAME1= <>
##$TPNAME2= <>
##$TPNAME3= <>
##$TPNAME4= <>
##$TPNAME5= <>
##$TPNAME6= <>
##$TPNAME7= <>
##$TPOAL= (0..7)
0.5 0.5 0.5 0.5 0.5 0.5 0.5 0.5 
##$TPOFFS= (0..7)
0 0 0 0 0 0 0 0 
##$TUNHIN= 0
##$TUNHOUT= 0
##$TUNXOUT= 0
##$USERA1= <user>
##$USERA2= <user>
##$USERA3= <user>
##$USERA4= <user>
##$USERA5= <user>
##$V9= 5
##$VALIST= <valist>
##$VCLIST= <CCCCCCCCCCCCCCC>
##$VD= 0
##$VDLIST= <DDDDDDDDDDDDDDD>
##$VPLIST= <PPPPPPPPPPPPPPP>
##$VTLIST= <TTTTTTTTTTTTTTT>
##$WBST= 1024
##$WBSW= 4
##$XGAIN= (0..3)
0 0 0 0 
##$XL= 0
##$YL= 0
##$YMAX_a= 5757
##$YMIN_a= -6303
##$ZGOPTNS= <>
##$ZL1= 120
##$ZL2= 120
##$ZL3= 120
##$ZL4= 120
##$ABSF1= 248.5645
##$ABSF2= -253.2056
##$ABSG= 5
##$ABSL= 3
##$ALPHA= 0
##$AQORDER= 0
##$ASSFAC= 0
##$ASSFACI= 0
##$ASSFACX= 0
##$ASSWID= 0
##$AUNMP= <proc_1d>
##$AZFE= 0.1
##$AZFW= 0.5
##$BCFW= 0
##$BC_mod= 2
##$BYTORDP= 0
##$COROFFS= 0
##$CY= -3
##$DATMOD= 1
##$DC= 0
##$DFILT= <>
##$DTYPP= 0
##$F1P= 0
##$F2P= 0
##$FCOR= 1
##$FTSIZE= 65536
##$FT_mod= 6
##$GAMMA= 0
##$GB= 0
##$INTBC= 1
##$INTSCL= 5.30512e-09
##$ISEN= 30
##$LB= 1
##$LEV0= 0
##$LPBIN= 0
##$MAXI= 10000
##$MC2= 0
##$MEAN= 0
##$ME_mod= 0
##$MI= 50
##$NCOEF= 0
##$NC_proc= -5
##$NLEV= 6
##$NOISF1= 182.463
##$NOISF2= 159.3651
##$NSP= 0
##$NTH_PI= 0
##$NZP= 0
##$OFFSET= 248.5645
##$PC= 4
##$PHC0= -9017.377
##$PHC1= -282.5305
##$PH_mod= 1
##$PKNL= yes
##$PPARMOD= 0
##$PSCAL= 0
##$PSIGN= 0
##$REVERSE= no
##$SF= 81.014009
##$SI= 65536
##$SIGF1= 159.3651
##$SIGF2= -187.1042
##$SINO= 113.3802
##$SIOLD= 16384
##$SREGLST= <1H.CDCl3>
##$SSB= 0
##$STSI= 65536
##$STSR= 0
##$SW_p= 40650.406504065
##$SYMM= 0
##$S_DEV= 0
##$TDeff= 32768
##$TDoff= 0
##$TI= <>
##$TILT= no
##$TM1= 0
##$TM2= 0
##$TOPLEV= 0
##$USERP1= <user>
##$USERP2= <user>
##$USERP3= <user>
##$USERP4= <user>
##$USERP5= <user>
##$WDW= 1
##$XDIM= 65536
##$YMAX_p= 326791011
##$YMIN_p= -18624953
$$ End of Bruker specific parameters
$$ ---------------------------------
##NTUPLES= NMR SPECTRUM
##VAR_NAME=  FREQUENCY,     SPECTRUM/REAL,   SPECTRUM/IMAG
##SYMBOL=    X,             R,               I
##VAR_TYPE=  INDEPENDENT,   DEPENDENT,       DEPENDENT
##VAR_FORM=  AFFN,          ASDF,            ASDF
##VAR_DIM=   65536,         65536,           65536
##UNITS=     HZ,            ARBITRARY UNITS, ARBITRARY UNITS
##FACTOR=    0.620285442955139, 1,           1
##FIRST=     20137.2065510759, 0,            0
##LAST=      -20513.1999529892, 0,           0
##MIN=       -20513.1999529892, -18624953,   0
##MAX=       20137.2065510759, 326791011,    0
$$ Real data points
##PAGE= N=1
##DATA TABLE= (X++(R..R)), XYDATA
$$ [...]
$$ plain form
39954 14135 206659 535429 738843 847490 919362 822156 540169 349959 414366 491941
39944 491941 310984 -18657 -197310 -102045 226465 683223 974753 709978 -88015 -810502
39934 -810502 -909936 -511505 -96129 173951 428019 586961 397074 -31581 -177680 228239
39924 228239 788389 898654 476076 40383 106802 617414 1012206 832653 192191 -397141
39914 -397141 -585588 -429093 -130128 195725 415401 324582 -80580 -453960 -450216 -111202
39904 -111202 274671 536251 629056 481332 151647 -3646 291889 745293 782151 331739
39894 331739 -83077 -101299 64599 117801 133708 255762 312042 96966 -227621 -376422
39884 -376422 -380396 -419415 -398985 -103033 349093 625731 706640 852594 1064938 1039676 732390
$$ packed form
39954A4135J92524L28770K03414J08647P1872r7206k81987j90210O4407P7575
39944D91941j80957l29641j78653R5265L28510M56758K91530k64775p97993p22487
39934h10502r9434L98431M15376K70080K54068J58942j89887m28655j46099M05919
39924B28239N60150J10265m22578m35693O6419N10612L94792j79553o40462n89332
39914c97141j88447J56495K98965L25853K19676r0819m05162l73380L744L39014
39904a11202L85873K61580R2805j47724l29685j55293K95535M53404L6858m50412
39894C31739m14816j8222J65898N3202J5907J22054N6280k15076l24587j48801
39884c76422l974l9019K0430K95952M52126K76638Q0909J45954K12344k5262l07286
$$ plain form
39873 732390 499867 510756 456125 102790 -255950 -238013 44166 207062 168174 100449
39863 100449 -15262 -359341 -850466 -1151025 -1115810 -907595 -653333 -329942 -44531 -55470
39853 -55470 -353746 -542392 -369078 -137933 -303584 -801421 -1101919 -912259 -528376 -387597
39843 -387597 -494706 -499005 -248540 -10004 -55398 -230649 -150343 249760 607647 626635
39833 626635 437582 343533 396976 413963 275131 23067 -237599 -350741 -120492 470783
39823 470783 1115571 1451418 1423947 1205074 868920 416203 33097 -22483 176271 241195
39813 241195 -34067 -437832 -654143 -571406 -246984 156225 348728 140325 -228437 -299931
39803 -299931 -39875 104144 -75006 -203939 15099 247793 58565 -348215 -452895 -263207
$$ packed form
39873G32390k32523J0889n4631l53335l58740J7937K82179J62896l8888o7725
39863A00449j15711l44079m91125l00559L5215K08215K54262L23391K85411j0939
39853e5470k98276j88646J73314K31145j65651m97837l00498J89660L83883J40779
39843c87597j07109m299K50465K38536m5394j75251Q0306M00103L57887J8988
39833F26635j89053r4049N3443J6987j38832k52064k60666j13142K30249N91275
39823D70783O44788L35847k7471k18873l36154m52717l83106n5580J98754O4924
39813B41195k75262m03765k16311Q2737L24422M03209J92503k08403l68762p1494
39803b99931K60056J44019j79150j28933K19038K32694j89228m06780j04680J89688
$$ plain form
39793 -263207 -230875 -406687 -320592 185009 596956 494200 213297 363050 959889 1449824
39783 1449824 1451298 1108714 739973 449915 166011 -146997 -418807 -553817 -544669 -514830
39773 -514830 -578805 -620813 -360806 219702 665327 506152 -129843 -631911 -635202 -355109
39763 -355109 -154899 -114678 -179846 -396573 -709867 -789949 -440159 -30195 -122844 -731761
39753 -731761 -1344018 -1650366 -1807359 -1922173 -1773778 -1260934 -706275 -417440 -275188 -65284
39743 -65284 83817 -47261 -326116 -466533 -492187 -615109 -778845 -710383 -363320 29017
39733 29017 284514 351065 142100 -375005 -979105 -1371255 -1468318 -1280184 -722304 71656
39723 71656 508404 159083 -521170 -703716 -336435 -112969 -305284 -414476 -166364 -51272
$$ packed form
39793b63207L2332j75812Q6095N05601M11947j02756k80903J49753N96839M89935
39783A449824J474l42584l68741k90058k83904l13008k71810j35010R148K9839
39773e14830o3975m2008K60007N80508M45625j59175o35995n02068l291K80093
39763c55109K00210M0221o5168k16727l13294q0082L49790M09964r2649o08917
39753g31761o12257l06348j56993j14814J48395N12844N54659K88835J42252K09904
39743f5284J49101j31078k78855j40417k5654j22922j63736O8462L47063L92337
39733B9017K55497O6551k08965n17105o04100l92150r7063J88134N57880P93960
39723G1656M36748l49321o80253j82546L67281K23466j92315j09192K48112J15092
$$ plain form
39713 -51272 -458941 -941662 -877570 -385781 -41256 -39289 -153126 -236860 -283227 -190314 99187
39702 99187 392472 526586 652892 922438 1135504 1057680 839266 747516 718636 561261
39692 561261 374584 365706 472066 556044 714283 956448 876243 203921 -553467 -676897
39682 -676897 -301597 -209753 -578372 -698995 -134360 548054 587673 71691 -298897 -188821
39672 -188821 79074 117065 -10487 34310 320343 459476 78347 -588029 -856729 -461444
39662 -461444 68256 138116 -147659 -346592 -458676 -755124 -1030497 -741804 89703 791625
39652 791625 983981 969109 981671 735017 118904 -245798 236914 1146753 1430869 709411
39642 709411 -284055 -611590 -117924 611124 1014995 1042981 915214 668710 211146 -237343
$$ packed form
39713e1272m07669m82721O4092M91789L44525J967j13837q3734m6367R2913K89501
39702I9187K93285J34114J26306K69546K13066p7824k18414r1750k8880j57375
39692E61261j86677q878J06360Q3978J58239K42165q0205o72322p57388j23430
39682f76897L75300R1844l68619j20623N64635O82414L9619n15982l70588J10076
39672a88821K67895L7991j27552M4797K86033J39133l81129o66376k68700L95285
39662d61444N29700O9860k85775j98933j12084k96448k75373K88693Q31507P01922
39652G91625J92356j4872J2562k46654o16113l64702M82712R09839K84116p21458
39642G09411r93466l27535M93666P29048M03871K7986j27767k46504m57564m48489
$$ plain form
39632 -237343 -201768 305085 520214 -96016 -921160 -867007 114771 977182 1061715 813140
39622 813140 778939 745448 365879 -77356 -200744 -249086 -558948 -733228 -190525 722940
39612 722940 1058947 649024 300329 489470 679186 278743 -379012 -530546 -52130 474864
39602 474864 593819 446580 438225 709199 1003858 961833 515808 -8129 -239646 -157190
39592 -157190 -3127 111844 277571 470552 465435 160286 -241811 -490118 -527478 -388042
39582 -388042 -97999 180908 160105 -199812 -507739 -389057 6902 197711 -573 -268680
39572 -268680 -198213 268409 800685 958404 583008 56416 38213 713753 1433377 1436953
39562 1436953 869845 633001 1140897 1719868 1538642 737233 169080 243821 555735 628241
$$ packed form
39632b37343L5575N06853K15129o16230q25144N4153R81778Q62411Q4533k48575
39622H13140l4201l3491l79569m43235j23388m8342l09862j74280N42703R13465
39612G22940L36007m09923l48695J89141J89716m00443o57755j51534M78416N26994
39602D74864J18955j47239q355K70974K94659m2025m46025n23937k31517Q2456
39592a57190J54063J14971J65727J92981n117l05149m02097k48307l7360J39436
39582c88042K90043K78907k0803l59917l07927J18682L95959J90809j98284k68107
39572b68680P0467M66622N32276J57719l75396n26592j8203O75540P19624L576
39562A436953n67108k36844N07896N78971j81226q01409n68153P4741L11914P2506
$$ plain form
39552 628241 497609 385826 219223 -196281 -735221 -1020458 -883599 -516327 -154596 184504
39542 184504 566037 876813 876670 535176 178245 153235 394623 521709 396810 326071
39532 326071 549245 795925 658146 234096 15224 185981 422957 414718 213716 3037
39522 3037 -137597 -142906 22151 163270 16134 -311784 -438226 -317756 -290771 -415587
39512 -415587 -332008 -3443 82570 -162251 -28488 861522 1710107 1651365 1122596 1103126
39502 1103126 1403306 967476 -213697 -838295 -241590 591170 528290 -178433 -575232
39493 -575232 -423326 -128447 155734 499972 639373 245369 -412766 -723264 -521554 -112381
39483 -112381 285441 572881 478693 -134051 -796530 -887222 -487294 -202047 -220386 -205075
$$ packed form
39552F28241j30632j11783j66603m15504n38940k85237J36859L67272L61731L39100
39542A84504L81533L10776j43l41494l56931k5010K41388J27086j24899p0739
39532C26071K23174K46680j37779m24050k18872J70757K36976q239k01002k10679
39522C037j40634n309J65057J41119j47136l27918j26442J20470K6985j24816
39512d15587Q3579L28565Q6013k44821J33763Q90010Q48585n8742n28769j9470
39502A103126L00180m35830j181173o24598N96705Q32760o2880p06723l96799
39493e75232J51906K94879K84181L44238J39401l94004o58135l10498K01710M09173
39483a12381L97822K87440r4188o12744o62479r0692L99928K85247j8339J5311
$$ plain form
39473 -205075 -72010 -119295 -275039 -9522 707176 1096628 679221 63114 47892 446760
39463 446760 501301 132721 -16307 296592 520650 206481 -313752 -443026 -114329 235912
39453 235912 229389 -168224 -721426 -1069695 -961806 -532743 -217527 -261971 -476019 -563731
39443 -563731 -457983 -195367 228193 632924 604690 36481 -528776 -532009 -190621 -173150
39433 -173150 -614416 -1012890 -1070017 -1022124 -1056680 -1013167 -852545 -832867 -952727 -797479
39423 -797479 -281112 27652 -244624 -635979 -581001 -287518 -263371 -398996 -245427 99717
39413 99717 150081 -106635 -243114 -166325 -125960 -54409 308299 658908 357150 -473333
39403 -473333 -900401 -475934 183179 381811 176152 -115624 -488102 -873774 -850399 -268523
$$ packed form
39473b05075J33065m7285j55744K65517P16698L89452m17407o16107j5222L98868
39463D46760N4541l68580j49028L12899K24058l14169n20233j29274L28697L50241
39453B35912o523l97613n53202l48269J07889M29063L15216m4444k14048q7712
39443e63731J05748K62616M23560M04731k8234n68209n65257l233L41388J7471
39433a73150m41266l98474n7127M7893l4556M3513J60622J9678j19860J55248
39423g97479N16367L08764k72276l91355N4978K93483K4147j35625J53569L45144
39413I9717N0364k56716j36479P6789M0365P1551L62708L50609l01758q30483
39403d73333m27068M24467O59113J98632k05659k91776l72478l85672K3375N81876
$$ plain form
39393 -268523 335953 448936 226368 -3976 -331729 -800792 -902930 -252268 608060 807915
39383 807915 322404 -140106 -235235 -275698 -517888 -821136 -1034227 -1152738 -1059368 -627440
39373 -627440 -125253 -18205 -289588 -415412 -116902 277704 342762 62958 -284981 -437051
39363 -437051 -230460 302418 817893 908830 570888 200669 94700 210811 448124 823437
39353 823437 1236176 1351327 934393 159026 -563042 -952626 -981497 -757915 -429539 -161442
39343 -161442 -116431 -391562 -902122 -1329542 -1325221 -859991 -284621 11412 -100063 -501067
39333 -501067 -900642 -882503 -251827 530865 679681 90867 -420442 -234021 211587 179563
39323 179563 -221575 -387821 -359084 -684221 -1261451 -1316964 -701501 -252222 -480990 -763195
$$ packed form
39393b68523O04476J12983k22568k30344l27753m69063j02138O50662Q60328J99855
39383H07915m85511m62510r5129m0463k42190l03248k13091j18511R3370M31928
39373f27440N02187J07048k71383j25824K98510L94606O5058k79804l47939j52070
39363d37051K06591N32878N15475R0937l37942l70219j05969J16111K37313L75313
39353H23437M12739J15151m16934p75367p22068l89584k8871K23582L28376K68097
39343a61442M5011k75131n10560m27420M321M65230N75370K96033j11475m01004
39333e01067l99575J8139O30676P82692J48816n88814n11309J86421M45608l2024
39323A79563m01138j66246K8737l25137n77230n5513O15463M49279k28768k82205
$$ plain form
39313 -763195 -405039 207379 277450 -84557 -62302 566145 1135981 1123530 788479 606936
39303 606936 570913 334336 -227494 -846457 -1133363 -924999 -457499 -190270 -313725 -478466
39293 -478466 -229429 325493 578610 212865 -384629 -663779 -586247 -501970 -573933 -683378
39283 -683378 -799373 -1016190 -1172268 -866497 -84841 538438 438057 -133258 -477738 -419268
39273 -419268 -402440 -654935 -826740 -651355 -434185 -510784 -628748 -361582 109338 166612
39263 166612 -357249 -945299 -1075558 -728454 -172066 337986 520892 153803 -542207 -901774
39253 -901774 -526067 169126 413294 -2113 -545210 -635320 -212902 421239 1014063 1403652
39243 1403652 1389210 902195 271944 -9237 121911 216892 -44268 -429402 -596369 -642309
$$ packed form
39313g63195L58156O12418P0071l62007K2255O28447N69836j2451l35051j81543
39303F06936l6023k36577n61830o18963k86906K08364M67500K67229j23455j64741
39293d78466K49037N54922K53117l65745n97494k79150P7532Q4277p1963j09445
39283f83378j15995k16817j56078L05771P81656O23279j00381n71315l44480N8470
39273d19268J6828k52495j71805J75385K17170p6599j17964K67166M70920N7274
39263A66612n23861n88050j30259L47104N56388N10052J82906l67089o96010l59567
39253i01774L75707O95193K44168m15407n43097r0110M22418O34141N92824L89589
39243A403652j4442m87015o30251k81181J31148R4981k61160l85134j66967m5940
$$ plain form
39233 -642309 -832497 -1033664 -929215 -660477 -647912 -774091 -418624 502244 1178014 944318
39223 944318 153176 -405207 -485906 -345612 -144811 81239 181648 135199 258352 690223
39213 690223 988832 768626 397561 426474 634279 392758 -220300 -492697 -200341 146312
39203 146312 205607 172124 163706 40276 -15958 431915 1159524 1250454 389561 -546421 -679634
39192 -679634 -255004 -23946 -109062 -148373 -109423 -233124 -430668 -395287 -171207 -59100
39182 -59100 -70876 22195 190630 165104 -91101 -329274 -401947 -366779 -262176 -87344 62270
39171 62270 110116 147658 235998 251801 205751 435970 1068584 1541916 1226518 393991 -41306
39160 -41306 239995 589932 409601 -27763 -89817 276650 509491 164692 -591804 -1170623
$$ packed form
39233f42309j90188k01167J04449K68738J2565j26179L55467R20868O75770k33696
39223I44318p91142n58383q0699J40294K00801K26050J00409m6449J23153M31871
39213F90223K98609k20206l71065K8913K07805k41521o13058k72397K92356L46653
39203A46312N9295l3483q418j23430n6234M47873P27609R0930q60893r35982j33213
39192f79634M24630K31058q5116l9311L8950j23701j97544L5381K24080J12107
39182e9100j1776R3071J68435k5526k56205k38173p2673L5168J04603J74832J49614
39171F2270M7846L7542Q8340J5803m6050K30219O32614M73332l15398q32527m35297
39160d1306K81301L49937j80331m37364o2054L66467K32841l44799p56496n78819
$$ plain form
39150 -1170623 -1127044 -618351 -278426 -464129 -719997 -356973 457178 729886 -7994 -931477
39140 -931477 -983075 -309377 31103 -362035 -716613 -308673 480076 768074 395146 -22749
39130 -22749 -57982 85807 104262 40538 12577 -102747 -408170 -657364 -519491 -67507
39120 -67507 273461 222715 -129006 -538817 -819865 -832792 -506392 57433 646764 1147657
39110 1147657 1553206 1763607 1590975 1062112 533506 327747 342619 204769 -199302 -525901
39100 -525901 -397346 92406 455583 378984 37414 -226095 -333291 -396847 -378872 -136111
39090 -136111 236280 449404 468312 590820 967335 1354446 1490130 1397731 1152729 706820
39080 706820 174611 -88787 -13796 -41714 -430046 -715497 -392184 197357 293942 -146866
$$ packed form
39150a170623M3579N08693L39925j85703k55868L63024Q14151K72708p37880r23483
39140i31477n1598O73698L40480l93138l54578M07940P88749K87998l72928m17895
39130b2749l5233J43789J8455o3724k7961j15324l05423k49194J37873M51984
39120f7507L40968n0746l51721m09811k81048j2927L26400N63825N89331N00893
39110A147657M05549K10401j72632n28863n28606k05759J4872j37850m04071l26599
39100e25901J28555M89752L63177p6599l41570k63509j07196o3556J7975K42761
39090a36111L72391K13124J8908J22508L76515L87111J35684r2399k45002m45909
39080G06820n32209k63398P4991k7918l88332k85451L23313N89541R6585m40808
$$ plain form
39070 -146866 -456549 -339872 -242413 -506710 -806546 -700047 -277891 43013 78018 5089
39060 5089 116903 519278 930699 888893 394216 107287 491612 1037191 955241 426496
39050 426496 347263 887377 1221515 855011 296788 75369 -42030 -359271 -565867 -356863
39040 -356863 -103325 -253121 -565169 -563787 -327974 -242759 -351802 -490372 -658170 -756587
39030 -756587 -435456 241154 519436 22876 -456888 -67045 702772 722592 -14596 -445618
39020 -445618 -125586 272263 228254 55955 36678 -129469 -566132 -752066 -355414 105359
39010 105359 -12272 -565397 -937283 -875539 -585471 -317724 -249980 -485118 -829014 -858428
39000 -858428 -510540 -287518 -565276 -1041691 -1229205 -1152931 -1129880 -1159447 -1043858 -901639
$$ packed form
39070a46866l09683J16677R7459k64297k99836J06499M22156L20904L5005p2929
39060E089J11814M02375M11421m1806m94677k86929L84325N45579q1950n28745
39050D26496p9233N40114L34138l66504n58223k21419j17399l17241k06596K09004
39040c56863K53538j49796l12048J382K35813Q5215j09043j38570j67798r8417
39030g56587L21131O76610K78282m96560m79764L89843P69817J9820p37188m31022
39020d45618L20032L97849m4009j72299j9277j66147m36663j85934L96652M60773
39010A05359j17631n53125l71886O1744K90068K67747O7744k35138l43896k9414
39000h58428L47888K23022k77758m76415j87514P6274K3051k9567J15589J42219
$$ plain form
38990 -901639 -999767 -1162502 -911787 -238406 289970 342435 284486 569014 1043580 1222070
38980 1222070 1008526 741108 604613 426784 139553 47062 358871 704168 506100 -190219
38970 -190219 -638847 -283176 542585 1015706 760964 151989 -226977 -171905 89587 236070
38960 236070 167403 64812 162284 431686 563462 331323 -119386 -460673 -558806 -507232
38950 -507232 -375389 -143208 129435 279775 237841 97030 -42701 -157961 -199879 -85520
38940 -85520 112332 115336 -249958 -738282 -857116 -412884 225679 519167 347287 49572
38930 49572 -98550 -190419 -344556 -344405 43611 547801 627838 251378 -4467 226597 585848
38919 585848 551737 168199 -147764 -286180 -503142 -874377 -1099221 -955222 -686534 -747966
$$ packed form
38990i01639r8128j62735K50715O73381N28376N2465n7949K84528M74566J78490
38980A222070k13544k67418j36495j77829k87231r2491L11809L45297j98068o96319
38970a90219m48628L55671Q25761M73121k54742o08975l78966N5072K61492J46483
38960B36070o8667j02591R7472K69402J31776k32139m50709l41287r8133N1574
38950e07232J31843K32181K72643J50340m1934j40811j39731j15260m1918J14359
38940h5520J97852L004l65294m88324j18834M44232O38563K93488j71880k97715
38930D9572j48122r1869j54137J51L88016N04190Q0037l76460k55845K31064L59251
38919E85848l4111l83538l15963j38416k16962l71235k24844J43999K68688o1432
$$ plain form
38909 -747966 -1213729 -1577525 -1259983 -341511 379868 247356 -478567 -994760 -987034 -855500
38899 -855500 -937982 -1064942 -1044302 -1031678 -1113515 -1018268 -623532 -300098 -320752 -366303 -126872
38888 -126872 38978 -308064 -776925 -576712 297615 1047597 1197598 1037786 917659 804554
38878 804554 684844 740917 883818 680784 43517 -495136 -502831 -225029 -113266 -145370
38868 -145370 9892 407170 763048 836398 604941 183465 -227024 -425343 -414657 -411264
38858 -411264 -531780 -623971 -536638 -384944 -370648 -465378 -464760 -302422 -151777 -211332 -474910
38847 -474910 -733259 -781925 -617620 -404063 -253473 -134589 -23798 -2698 -107973 -212991
38837 -212991 -174399 13629 283713 539803 567689 175664 -423787 -688954 -438654 -136920
$$ packed form
38909g47966m65763l63796L17542R18472P21379j32512p25923n16193P726J31534
38899h55500q2482j26960K0640J2624q1837R5247L94736L23434k0654m5551K39431
38888a26872J65850l47042m68861K00213Q74327P49982J50001j59812j20127j13105
38878H04554j19710N6073J42901k03034o37267n38653p695K77802J11763l2104
38868a45370J55262L97278L55878P3350k31457m21476m10489j98319J0686L393
38858d11264j20516r2191Q7333J51694J4296r4730O18J62338J50645n9555k63578
38847d74910k58349m8666J64305K13557J50590J18884J10791K1100j05275j05018
38837b12991L8592J88028K70084K56090K7886l92025n99451k65167K50300L01734
$$ plain form
38827 -136920 -197507 -385985 -329520 -224418 -438827 -709331 -466232 163517 439519 122184
38817 122184 -230333 -215533 -121099 -242284 -324632 -95271 159143 14646 -417285 -663025
38807 -663025 -537357 -290973 -229434 -407867 -617601 -577174 -250491 39319 16422 -109305
38797 -109305 51189 383922 358730 -151961 -618542 -554135 -43456 551167 967123 997188
38787 997188 569197 68102 75251 534470 676788 76038 -724657 -1015206 -864392 -795860
38777 -795860 -921590 -937715 -728573 -470359 -280139 -163837 -182169 -345971 -507511 -623741
38767 -623741 -888030 -1309470 -1462472 -1036169 -365248 465 8045 -53623 -156684 -439007
38757 -439007 -689880 -550641 -191573 -178676 -580237 -784781 -428186 -812 -168333 -810444
$$ packed form
38827a36920o0587j88478N6465J05102k14409k70504K43099O29749K76002l17335
38817A22184l52517J4800R4434j21185q2348K29361K54414j44497m31931k45740
38807f63025J25668K46384O1539j78433k09734M0427L26683K89810k2897j25727
38797a09305J60494L32733k5192n10691m66581O4407N10679N94623M15956L0065
38787I97188m27991n01095P149M59219J42318o00750q00695k90549J50814O8532
38777g95860j25730j6125K09142K58214J90220J16302j8332j63802j61540j16230
38767f23741k64289m21440j53002M26303O70921L65713P580o1668j03061k82323
38757d39007k50873J39239L59068J2897m01561k04544L56595M27374j67521o42111
$$ plain form
38747 -810444 -1152794 -748022 22380 458691 310345 -88959 -313668 -274970 -135869 17688
38737 17688 247690 557057 787122 763036 464916 67821 -142593 -7732 255815 238371
38727 238371 -60428 -95376 422357 900428 606274 -170316 -427338 102248 634969 632083
38717 632083 535156 804049 1052108 788752 372327 450254 891466 1043325 739421 320416
38707 320416 -85101 -546297 -800004 -537440 -131649 -265357 -803119 -841955 -56383 760681
38697 760681 806478 283286 -76200 12478 305862 550535 642470 501271 170765 -69685
38687 -69685 21613 323348 477059 286849 -91761 -286278 -29703 503591 731030 288454
38677 288454 -397051 -517588 62727 577731 386740 -168173 -290642 177589 657397 704116
$$ packed form
38747h10444l42350M04772P70402M36311j48346l99304k24709L8698J39101J53557
38737A7688K30002L09367K30065k4086k98120l97095k10414J34861K63547j7444
38727B38371k98799l4948N17733M78071k94154p76590k57022N29586N32721k886
38717F32083r6927K68893K48059k63356m16425P7927M41212J51859l03904m19005
38707C20416m05517m61196k53707K62564M05791j33708n37762l8836P85572Q17064
38697G60681M5797n23192l59486Q8678K93384K44673R1935j41199l30506k40450
38687f9685R1298L01735J53711j90210l78610j94517K56575N33294K27439m42576
38677B88454o85505j20537N80315N15004j90991n54913j22469M68231M79808M6719
$$ plain form
38667 704116 493112 371309 347750 257489 153429 220839 401209 402517 123841 -170438
38657 -170438 -222721 -140347 -179817 -290178 -155236 286664 642693 533375 66330 -347632
38647 -347632 -511170 -540670 -528877 -394157 -122812 86549 90869 70847 312972 757336
38637 757336 989460 756024 287855 -49139 -241561 -488327 -689744 -499235 40130 353639
38627 353639 90350 -337673 -324905 104149 452738 499707 411971 275653 49632 -88832
38617 -88832 91928 362914 232798 -281496 -635013 -606565 -593333 -871768 -1130779 -1013966
38607 -1013966 -635116 -271197 7294 137312 -42445 -425863 -629859 -600971 -707827 -963037
38597 -963037 -798661 -35912 582137 405524 -160481 -372096 -288692 -422660 -694482 -619307
$$ packed form
38667G04116k11004j21803k3559r0261j04060O7410J80370J308k78676k94279
38657a70438n2283Q2374l9470j10361J34942M41900L56029j09318m67045m13962
38647c47632j63538k9500J1793J34720K71345K09361M320k0022K42125M44364
38637G57336K32124k33436m68169l36994j92422k46766k01417J90509N39365L13509
38627C53639k63289m28023J2768M29054L48589M6969q7736j36318k26021j38464
38617h8832J80760K70986j30116n14294l53517K8448J3232k78435k59011J16813
38607a013966L78850L63919K78491J30018j79757l83418k03996K8888j06856k55210
38597i63037J64376P62749O18049j76613n66005k11615Q3404j33968k71822P5175
$$ plain form
38587 -619307 -252632 -59903 -18468 251607 549527 244387 -542285 -833883 -176323 657979
38577 657979 741047 151780 -353359 -347609 17685 417635 600610 449944 110812 -90977
38567 -90977 -41608 31363 -42756 -96342 66039 293504 277966 12041 -174270 -47312 201498
38556 201498 155041 -302636 -762658 -728980 -226717 247729 375834 304450 224011 63045
38546 63045 -202062 -346663 -311306 -430832 -878713 -1243881 -1092857 -625421 -311912 -211829
38536 -211829 -163486 -294082 -710888 -988621 -693035 -209122 -268643 -765221 -860042 -272891
38526 -272891 351070 478663 310559 167545 311 -192206 -119827 258690 498553 330621
38516 330621 91333 149826 322669 205553 -239151 -721048 -989983 -969462 -769170 -661545
$$ packed form
38587f19307L66675J92729M1435K70075K97920l05140p86672k91598O57560Q34302
38577F57979Q3068n89267n05139N750L65294L99950J82975j50666l39132k01789
38567i0977M9369P2971p4119n3586J62381K27465j5538k65925j86311J26958K48810
38556B01498m6457m57677m60022L3678N02263M74446J28105p1384q0439j60966
38546F3045k65107j44601L5357j19526m47881l65168J51024M67436L13509J00083
38536b11829M8343j30596m16806k77733K95586M83913n9521m96578r4821N87151
38526b72891O23961J27593j68104j43014j67234j92517P2379L78517K39863j67932
38516C30621k39288N8493J72843j17116m44704m81897k68935K0521K00292J07625
$$ plain form
38506 -661545 -763036 -735632 -196758 589818 931468 634217 147750 -245222 -680126 -1009490
38496 -1009490 -681895 268007 854724 373137 -552379 -796698 -211930 381713 417876 136135
38486 136135 456 138894 421241 685902 775680 590146 207299 -136716 -227342 -50880
38476 -50880 154554 113129 -102984 -77408 323975 583117 212713 -425971 -593885 -311731
38466 -311731 -270473 -621864 -733601 -336779 -22101 -216727 -507678 -489143 -491457 -828034
38456 -828034 -1028771 -596177 34404 111642 -274980 -473892 -376647 -394031 -527101 -321133
38446 -321133 264320 683183 599777 283010 113710 169531 358825 549656 513124 89821
38436 89821 -541826 -996266 -1017059 -520242 426456 1372692 1580622 826091 -140905 -420707
$$ packed form
38506f61545j01491K7404N38874P86576L41650k97251m86467l92972m34904l29364
38496a009490L27595R49902N86717m81587r25516k44319N84768N93643L6163k81741
38486A36135j35679J38438K82347K64661Q9778j85534l82847l44015r0626J76462
38476e0880K05434m1425k16113K5576M01383K59142l70404o38684j67914K82154
38466c11731M1258l51391j11737L96822L14678j94626k90951J8535k314l36577
38456h28034k00737M32594O30581P7238l86622j98912R7245j7384j33070K05968
38446c21133N85453M18863q3406l16767j69300N5821J89294J90831l6532m23303
38436H9821o31647m54440k0793M96817R46698R46236K07930p54531r66996k79802
$$ plain form
38426 -420707 -11385 472341 818506 1249384 1606663 1348097 483342 -202147 -144838 284146
38416 284146 354240 -102127 -601138 -605644 -43141 620978 790131 360079 -149092 -260178
38406 -260178 -112197 -56008 16978 398656 820933 687342 51139 -333402 -95579 247713
38396 247713 125816 -314714 -607232 -650281 -600335 -456411 -177525 34661 -36220 -259678
38386 -259678 -337706 -228305 -133207 -170516 -282262 -369662 -329516 -62965 362801 654972
38376 654972 578665 231466 -108995 -316091 -429097 -435351 -264633 -1561 92633 -150950
38366 -150950 -618345 -1045863 -1258905 -1216943 -922632 -449208 -58926 -91726 -578557 -1074120
38356 -1074120 -1085660 -651295 -296622 -405495 -830854 -1156498 -1133911 -816116 -483540 -487630
$$ packed form
38426d20707M09322M83726L46165M30878L57279k58566q64755o85489N7309M28984
38416B84146P0094m56367m99011m506N62503O64119J69153m30052n09171j11086
38406b60178J47981N6189P2986L81678M22277j33591o36203l84541K37823L43292
38396B47713j21897m40530k92518m3049M9946J43924K78886K12186p0881k23458
38386b59678p8028J09401R5098l7309j11746q7400M0146K66551M25766K92171
38376F54972p6307l47199l40461k07096j13006o254J70718K63072R4194k43583
38366a50950m67395m27518k13042M1962K94311M73424L90282l2800m86831m95563
38356a074120j1540M34365L54673j08873m25359l25644K2587L17795L32576m090
$$ plain form
38346 -487630 -910219 -1310768 -1117065 -378102 215526 228698 14589 87103 351919 368250
38336 368250 93788 -91371 40286 353264 601897 578083 172110 -386987 -557872 -135498
38326 -135498 333255 217046 -313000 -565225 -337290 -65507 -30059 -27253 101081 187310
38316 187310 147980 188767 409330 602217 606644 495791 285974 -150482 -735345 -1134753
38306 -1134753 -1228833 -1257884 -1319214 -1109333 -429886 370048 756292 612452 258383 43550
38296 43550 92522 281078 328434 75807 -255310 -286278 10690 310828 472612 687962
38286 687962 972239 938383 362164 -370338 -729274 -720011 -743769 -939763 -1039430 -850407
38276 -850407 -567984 -492457 -585443 -454186 168220 970143 1266271 781088 50138 -201367
$$ packed form
38346d87630m22589m00549J93703P38963N93628J3172k14109P2514K64816J6331
38336C68250k74462j85159J31657L12978K48633k3814m05973n59097j70885M22374
38326a35498M68753j16209n30046k52225K27935K71783L5448K806J28334Q6229
38316A87310l9330M0787K20563J92887M427j10853k09817m36456n84863l99408
38306a134753r4080k9051o1330K09881O79447P99934L86244j43840l54069k14833
38296D3550M8972J88556M7356k52627l31117l0968K96968L00138J61784K15350
38286F87962K84277l3856n76219p32502l58936R263k3758j95994r9667J89023
38276h50407K82423P5527r2986J31257O22406Q01923K96128m85183p30950k51505
$$ plain form
38266 -201367 72922 319624 201448 -101071 -352465 -519959 -508135 -160041 309485 373270
38256 373270 -79404 -510248 -469793 -132363 159211 399302 627064 609279 265423 594
38246 594 114533 227962 -164449 -863542 -1254930 -1182708 -938172 -592082 -23818 488562
38236 488562 454032 20678 -50025 526661 1081705 891563 78066 -695069 -1024277 -948324
38226 -948324 -673200 -462035 -547542 -826759 -832886 -306293 369204 583974 221078 -316143
38216 -316143 -665609 -776932 -679112 -327884 217467 693164 850024 687633 408439 211811
38206 211811 168535 223786 272945 265882 256868 325698 443287 446099 172478 -349009 -827330
38195 -827330 -874594 -356433 388494 786197 579059 85409 -177084 -61987 146669 215413
$$ packed form
38266b01367K74289K46702j18176l02519k51394j67494J1824L48094M69526O3785
38256C73270m52674m30844M0455L37430K91574K40091K27762j7785l43856k64829
38246E94J13939J13429l92411o99093l91388P2222K44536L46090N68264N12380
38236D88562l4530m33354p0703N76686N55044j90142q13497p73135l29208P5953
38226i48324K75124K11165q5507k79217o127N26593O75497K14770l62896n37221
38216c16143l49466j11323R7820L51228N45351M75697J56860j62391k79194j96628
38206B11811m3276N5251M9159p063r014O8830J17589K812k73621n21487m78321
38195h27330m7264N18161P44927L97703k07138m93650k62493J15097K08656O8744
$$ plain form
38185 215413 296731 657558 1183234 1358178 816769 -173297 -883719 -801191 -95618 591543
38175 591543 776108 506130 158469 -6988 -14005 7641 -19429 -164798 -495234 -883043
38165 -883043 -954013 -489565 137335 232373 -377922 -1030189 -1000388 -418788 -58800 -257170
38155 -257170 -461359 -22700 894986 1524013 1442063 949768 527564 290939 126275 58425
38145 58425 183964 362879 290454 -85498 -440091 -445309 -108839 336150 708033 917240
38135 917240 891891 668305 473494 499164 615172 512936 133915 -265291 -506480 -691802
38125 -691802 -898954 -931070 -603547 -125841 71777 -152810 -540968 -808348 -905422 -879618
38115 -879618 -716358 -437586 -187331 -59374 51721 249485 351986 44147 -634049 -1171389
$$ packed form
38185B15413Q1318L60827N25676J74944n41409r90066p10422Q2528P05573O87161
38175E91543J84565k69978l47661j65457p017K1646k7070j45369l30436l87809
38165h83043p0970M64448O26900R5038o10295o52267K9801N81600L59988j98370
38155b57170k04189M38659R17686O29027q1950m92295m22204k36625j64664o7850
38145E8425J25539J78915p2425l75952l54593n218L36470M44989L71883K09207
38135I17240k5349k23586j94811K5670J16008j02236l79021l99206k41189j85322
38125f91802k07152l2116L27523M77706J97618k24587l88158k67380r7074K5804
38115h79618J63260K78772K50255J27957J11095J97764J02501l07839o78196n37340
$$ plain form
38105 -1171389 -1128646 -664466 -301589 -248739 -240241 -54838 160488 244743 366194 704861
38095 704861 1023859 934641 473431 47902 -121706 -147588 -121146 -18882 47714 -92882
38085 -92882 -311047 -296928 -71528 62716 94731 291348 559073 469475 80831 3879
38075 3879 357334 452194 -29262 -381150 -65438 281702 -41322 -430662 83434 1039921
38065 1039921 1090543 151120 -443473 -48747 446471 266616 -104246 -59434 34189 -282039
38055 -282039 -547598 -198459 352700 406196 149153 193065 438542 375092 117050 137384
38045 137384 256319 -69531 -610178 -567294 97071 559887 466236 352284 520602 507013
38035 507013 85048 -133652 291820 790643 658456 170974 33854 167323 -81975 -720684
$$ packed form
38105a171389M2743M64180L62877N2850Q498J85403K15326Q4255J21451L38667
38095G04861L18998q9218m61210m25529j69608k5882K6442J02264O6596j40596
38085i2882k18165J4119K25400J34244L2015J96617K67725q9598l88644p6952
38075C879L53455R4860m81456l51888L15712L47140l23024l89340N14096R56487
38065A039921N0622r39423n94593L94726M95218j79855l70862M4812R3623l16228
38055b82039k65559L49139N51159N3496k57043M3912K45477o3450k58042K0334
38045A37384J18935l25850n40647M2884O64365M62816r3651j13952J68318j3589
38035E07013m21965k18700M25472M98823j32187m87482j37120J33469k49298o38709
$$ plain form
38025 -720684 -982090 -490945 181817 377438 211102 230004 564623 803491 587756 46224
38015 46224 -371847 -367627 -76585 89112 -104756 -442721 -505708 -156013 324645 571078
38005 571078 494807 285250 148635 109216 54426 -44593 -10250 330689 803250 953044
37995 953044 609402 200442 250383 679723 939050 803488 627850 711533 836773 709275
37985 709275 501818 551514 737863 639988 243352 6348 155636 361516 293606 112233
37975 112233 133152 304762 359549 286048 270093 250761 -72077 -719880 -1232546 -1147199 -523719
37964 -523719 133424 382663 191210 -139538 -306050 -291122 -338646 -583646 -749764 -412889
37954 -412889 356680 858269 544482 -174168 -306992 444498 1211454 1072447 296387 -76295
$$ packed form
38025g20684k61406M91145O72762J95621j66336J8902L34619K38868k15735n41532
38015D6224m18071M220K91042J65697j93868l37965o2987L49695M80658K46433
38005E71078p6271k09557j36615l9419n4790r9019L4343L40939M72561J49794
37995I53044l43642m08960M9941M29340K59327j35562j75638Q3683J25240j27498
37985G09275k07457M9696J86349r7875l96636k37004J49288K05880o7910j81373
37975A12233K0919J71610N4787p3501j5955j9332l22838o47803n12666Q5347O23480
37964e23719O57143K49239j91453l30748j66512J4928m7524k45000j66118L36875
37954d12889P69569N01589l13787p18650j32824P51490P66956j39007p76060l72682
$$ plain form
37944 -76295 263362 533112 151771 -361850 -265765 237344 423506 239561 219363 383533
37934 383533 160105 -497784 -810729 -320793 400809 615445 359477 68416 -164311 -419277
37924 -419277 -519582 -323800 -71744 51060 281623 716466 872067 437735 1091 266748
37914 266748 930372 1152319 831812 507576 259543 -243502 -723320 -480319 287533 515130
37904 515130 -63254 -399742 197884 933019 798351 111301 -134769 182723 392971 264943
37894 264943 200794 354077 417824 308063 343322 633689 851280 733736 373886 -78172
37884 -78172 -589311 -1020084 -1105097 -800344 -366639 -950 346328 681390 781880 508117
37874 508117 119615 40068 342710 650519 592780 240552 -18776 14245 137536 83374
$$ packed form
37944g6295L39657K69750l81341n13621R6085N03109J86162j83945k0198J64170
37934C83533k23428o57889l12945M89936P21602K14636k55968k91061k32727k54966
37924d19277j00305J95782K52056J22804K30563M34843J55601m34332m36644K65657
37914B66748O63624K21947l20507l24236k48033n03045m79818K43001P67852K27597
37904E15130n78384l36488N97626P35135j34668o87050k46070L17492K10248j28028
37894B64943o4149J53283O3747j09761L5259K90367K17591j17544l59850m52058
37884g8172n11139m30773q5013L04753M33705L65689L47278L35062J00490k73763
37874E08117l88502p9547L02642L07809n7739l52228k59328L3021J23291n4162
$$ plain form
37864 83374 -106711 -184323 -41142 221069 461001 559033 435508 216468 220312 514970
37854 514970 685941 405193 17764 65240 397089 404717 88765 121474 691091 1072950
37844 1072950 718972 76502 -177947 -122694 -204120 -342686 -121956 404469 750067 702964
37834 702964 451128 126313 -243639 -404025 -32768 715577 1229751 1079527 376457 -453106
37824 -453106 -975416 -919022 -372106 211836 464556 489239 561384 620941 433440 133913
37814 133913 144497 520164 804273 675376 393792 389101 634452 698576 360244 -56587
37804 -56587 -65316 351154 665623 434089 -165312 -599778 -650416 -536702 -458410 -372960 -248028
37793 -248028 -184120 -207682 -231361 -240936 -220452 29339 560378 871490 467691 -183227 -51033
$$ packed form
37864H3374j90085p7612J43181K62211K39932R8032j23525k19040L844K94658
37854E14970J70971k80748l87429M7476L31849P628l15952L2709N69617L81859
37844A072950l53978o42470k54449N5253q1426j38566K20730N26425L45598m7103
37834G02964k51836l24815l69952j60386L71257P48345N14174j50224p03070q29563
37824d53106n22310N6394N46916N83942K52720K4683P2145N9557j87501k99527
37814A33913J0584L75667K84109j28897k81584m691K45351O4124l38332m16831
37804e6587q729M16470L14469k31534n99401m34466n0638J13714P8292Q5450J24932
37793b48028O3908k3562k3679r575K0484K49791N31039L11112m03799o50918J32194
$$ plain form
37782 -51033 919450 1544400 1075417 281035 248304 868715 1286966 1237289 1066393 879829
37772 879829 556635 321418 472817 747374 688050 419071 337471 305275 -60817 -532402
37762 -532402 -547780 -175493 59706 174780 634776 1310725 1473443 905796 155755 -408927
37752 -408927 -933751 -1357035 -1276762 -774159 -509041 -695396 -784372 -477708 -242079 -416991
37742 -416991 -581046 -289826 215952 519690 645753 700616 479837 -63215 -473612 -421029
37732 -421029 -207998 -191578 -179915 93709 363354 271279 42975 133653 462540 536481
37722 536481 152792 -458364 -999017 -1234552 -1008076 -522373 -366111 -850848 -1538169 -1805742
37712 -1805742 -1631047 -1396004 -1185251 -807152 -346604 -127733 -139051 -2067 394124 641115
$$ packed form
37782e1033R70483O24950m68983p94382l2731O20411M18251m9677j70896j86564
37772H79829l23194k35217J51399K74557n9324k68979q1600l2196l66092m71585
37762e32402j5378L72287K35199J15074M59996O75949J62718n67647p50041n64682
37752d08927n24824m23284Q0273N02603K65118j86355q8976L06664K35629j74912
37742d16991j64055K91220N05778L03738J26063N4863k20779n43052m10397N2583
37732d21029K13031J6420J1663K73624K69645r2075k28304R0678L28887P3941
37722E36481l83689o11156n40653k35535K26476M85703J56262m84737o87321k67573
37712a805742J74695K35043K10753L78099M60548K18871j1318J36984L96191K46991
$$ plain form
37702 641115 374355 -181391 -442550 -150778 323129 403069 -3222 -376824 -267545 63414
37692 63414 -13688 -577434 -989148 -737616 -70553 387645 333733 -66015 -426084 -374409
37682 -374409 175852 829119 1056365 843207 656532 690267 604949 194489 -188145 -167463
37672 -167463 134469 432305 695057 883230 740772 308424 214169 874585 1698477 1687294
37662 1687294 685227 -489053 -1057706 -952904 -536271 -121771 154250 296725 366532
37653 366532 329573 94513 -219467 -307831 -122868 23468 -17308 2290 186331 201423
37643 201423 -95506 -229534 166370 642510 586806 220744 216012 580292 710460 421853
37633 421853 136991 76514 18876 -99683 -91053 -105040 -544870 -1208758 -1282011 -508315 317121
$$ packed form
37702F41115k66760n55746k61159K91772M73907P9940m06291l73602J09279L30959
37692F3414p7102n63746m11714K51532O67063M58198n3912l99748l60069N1675
37682c74409N50261O53267K27246k13158j86675L3735q5318m10460l82634K0682
37672a67463L01932K97836K62752J88173j42458m32348r4255O60416Q23892j1183
37662A687294j002067j174280n68653J04802M16633M14500K76021J42475O9807
37653C66532l6959k35060l13980q8364J84963J46336m0776J9598J84041J5092
37643B01423k96929j34028L95904M76140n5704l66062m732L64280J30168k88607
37633D21853k84862o0477n7638j18559Q630j3987m39830o63888p3253P73696Q25436
$$ plain form
37622 317121 428681 55452 -162311 -164546 -277020 -418216 -184023 402283 804473 686772
37612 686772 324546 218215 534174 986488 1143661 853153 419552 274769 437803 493953
37602 493953 195175 -182632 -273904 -159593 -174212 -361476 -481997 -479520 -555430 -746749
37592 -746749 -785639 -508721 -114290 168545 407629 706473 828516 471165 -131425 -311021
37582 -311021 167439 683262 494447 -318314 -973014 -930865 -366866 246183 613390 608776
37572 608776 208534 -328335 -498992 -65370 619866 1009530 952743 700056 470151 265170
37562 265170 55241 -92665 -107274 -7533 128579 247421 375298 573114 790479 858173
37552 858173 769699 837810 1282143 1748101 1649381 1019088 562761 730348 1193911 1442891
$$ packed form
37622C17121J11560l73229k17763k235j12474j41196K34193N86306M02190j17701
37612F86772l62226j06331L15959M52314J57173k90508m33601j44783J63034N6150
37602D93953k98778l77807r1272J14311j4619j87264j20521K477p5910j91319
37592g46749l8890K76918L94431K82835K39084K98844J22043l57351o02590j79596
37582c11021M78460N15823j88815q12761o54700M2149N63999O13049L67207m614
37572F08776m00242n36869j70657M33622O85236L89664n6787k52687k29905k04981
37562B65170k09929j47906j4609R9741J36112J18842J27877J97816K17365O7694
37552H58173q8474O8111M44333M65958r8720o30293m56327J67587M63563K48980
$$ plain form
37542 1442891 1405338 1189406 729514 127144 -121003 214519 569875 324981 -219898 -251654
37532 -251654 375495 1052157 1391825 1579331 1741518 1696403 1483281 1499962 1868163 2193206
37522 2193206 2207649 2173427 2363707 2577678 2504265 2251074 2209363 2622402 3486935 4613359
37512 4613359 5587954 5961493 5707301 5269671 5000743 4830065 4644005 4602572 4773351 4796268
37502 4796268 4345790 3721827 3512097 3722242 3687145 2947578 1878407 1247024 1333126 1703593
37492 1703593 1800282 1528134 1167657 878088 560633 232749 209692 664796 1218114 1307083
37482 1307083 887473 427799 242295 204197 156028 192950 371080 476436 320536 30423
37472 30423 -160255 -202608 -140866 30448 197977 57840 -487341 -1025870 -1063379 -663022
$$ packed form
37542A442891l7553k15932m59892o02370k48147L35522L55356k44894n44879l1756
37532b51654O27149O76662L39668J87506J62187m5115k13122J6681L68201L25043
37522B193206J4443l4222J90280K13971p3413k53191m1711M13039Q64533J126424
37512D613359R74595L73539k54192m37630k68928j70678j86060m1433J70779K2917
37502D796268m50478o23963k09730K10145l5097p39567j069171o31383Q6102L70467
37492A703593R6689k72148l60477k89569l17455l27884k3057M55104N53318Q8969
37482A307083m19610m59674j85504l8098m8169L6922J78130J05356j55900k90113
37472C0423j90678m2353O1742J71314J67529j40137n45181n38529l7509M00357
$$ plain form
37462 -663022 -318494 -211777 17377 630609 1262573 1342907 887512 500694 557970 742374
37452 742374 604135 288402 303018 673342 824321 420005 -125830 -231073 129145 588411
37442 588411 936902 1107598 927389 395469 4940 222764 755407 906542 608630 468171
37432 468171 756667 1051921 1065548 1130466 1495300 1721922 1289144 405787 -261453 -407419
37422 -407419 -230506 5880 162280 153019 28876 -4057 121949 228459 259574 426247
37412 426247 730740 762361 355573 37725 297646 761486 731605 285788 104563 324159
37402 324159 370571 24109 -142430 294028 861232 840504 250748 -258259 -251867 112755
37392 112755 393906 261124 -296658 -931710 -1194848 -981767 -622516 -447606 -438175 -393228
$$ packed form
37462f63022L44528J06717K29154O13232O31964Q0334m55395l86818N7276J84404
37452G42374j38239l15733J4616L70324J50979m04316n45835j05243L60218M59266
37442E88411L48491J70696j80209n31920l90529K17824N32643J51135k97912j40459
37432D68171K88496K95254J3627O4918L64834K26622m32778q83357o67240j45966
37422d07419J76913K36386J56400r261j24143l2933J26006J06510L1115J66673
37412D26247L04493L1621m06788l17848K59921M63840k9881m45817j81225K19596
37402C24159M6412l46462j66539M36458N67204k0728n89756n09007O392L64622
37392A12755K81151j32782n57782o35052k63138K13081L59251J74910R431M4947
$$ plain form
37382 -393228 -220826 71212 454583 790386 861593 652354 392034 183302 -142640 -594520
37372 -594520 -749449 -254973 591813 1121632 1029229 522400 -108020 -676124 -951376 -757811
37362 -757811 -251191 250986 701860 1204142 1506622 1185521 469317 277956 1049614 1991361
37352 1991361 2018051 1145651 385399 391787 798749 934296 667727 356576 331731 668830
37342 668830 1220888 1672502 1736640 1453409 1148073 999595 848511 543954 240175 150869
37332 150869 207969 210064 170109 248651 420943 482562 370376 230472 153222 90062 91198
37321 91198 357135 881511 1242163 1010442 317021 -227699 -217991 132002 344984 279332
37311 279332 194238 310978 545416 713813 804762 921831 1068796 1126331 1000871 710876
$$ packed form
37382c93228J72402K92038L83371L35803P1207k09239k60320k08732l25942m51880
37372e94520j54929M94476Q46786N29819r2403n06829o30420n68104k75252J93565
37362g57811N06620N02177M50874N02282L02480l21101p16204j91361P71658R41747
37352A991361K6690q72400p60252O388M06962J35547k66569l11151k4845L37099
37342F68830N52058M51614O4138k83231l05336j48478j51084l04557l03779q9306
37332A50869N7100K095l9955P8542J72292O1619j12186j39904p7250o3160J136
37321I1198K65937N24376L60652k31721o93421n44720R708L49993K12982o5652
37311B79332q5094J16740K34438J68397R0949J17069J46965N7535j25460k89995
$$ plain form
37301 710876 359908 75766 -75561 -150436 -233698 -277744 -152843 140724 480649 834424
37291 834424 1199925 1318654 856480 36668 -369745 -19699 476825 459643 194280 305914
37281 305914 636505 539744 120210 165240 765966 1026189 466596 -211611 -250361 100614
37271 100614 237597 199459 316371 454680 353462 247326 424371 567873 265603 -199486
37261 -199486 -316487 -242966 -421751 -627925 -314890 301122 473250 153299 7769 195999
37251 195999 152870 -250162 -348068 171864 689768 678214 501554 665562 972808 1004240
37241 1004240 848964 761312 597595 190429 -154805 -135869 -40252 -247775 -489252 -257918
37231 -257918 286491 498910 203031 -167319 -313140 -340152 -280834 34626 498568 664604
$$ packed form
37301G10876l50968k84142j51327p4875q3262m4046J24901K93567L39925L53775
37291H34424L65501J18729m62174q19812m06413L50046M96524j7182k65363J11634
37281C05914L30591r6761m19534M5030O00726K60223n59593o78207l8750L50975
37271A00614J36983l8138J16912J38309j01218j06136J77045J43502l02270m65089
37261a99486j17001P3521j78785k06174L13035O16012J72128l19951j45530J88230
37251A95999m3129m03032r7906N19932N17904j1554j76660J64008L07246L1432
37241A004240j55276q7652j63717m07166l45234J8936R5617k07523k41477K31334
37231b57918N44409K12419k95879l70350j45821k7012N9318L15460M63942J66036
$$ plain form
37221 664604 395231 130724 238280 452646 298310 -177354 -460181 -256419 204449 551328
37211 551328 673572 665790 609640 572469 666163 899785 1049021 886544 513207 237378
37201 237378 139726 38892 -75111 68872 538815 957834 1014193 907020 956536 1050664
37191 1050664 881144 507152 240837 142961 89146 169831 493771 714819 374986 -273652
37181 -273652 -420500 193464 885690 967198 578937 337077 537934 966626 1191976 871155
37171 871155 45566 -742298 -910490 -483450 15606 288344 471874 656277 702770 598011
37161 598011 494872 365823 142789 166424 791948 1511175 1334330 276011 -448017 -116813
37151 -116813 501224 434946 -56387 -124038 277264 539876 482441 392225 308563 106789
$$ packed form
37221F64604k69373k64507J07556K14366j54336m75664k82827K03762M60868L46879
37211E51328J22244p782n6150l7171R3694K33622J49236j62477l73337k75829
37201B37378r7652j00834j14003J43983M69943M19019N6359j07173M9516R4128
37191A050664j69520l73992k66315r7876n3815Q0685L23940K21048l39833o48638
37181b73652j46848O13964O92226Q1508l88261k41860K00857M28692K25350l20821
37171H71155q25589p87864j68192M27040M99056K72738J83530J84403M6493j04759
37161E98011j03139j29049k23034K3635O25524P19227j76845j058319p24028L31204
37151a16813O18037o6278m91333o7651M01302K62612n7435r0216q3662k01774
$$ plain form
37141 106789 69125 551438 1207390 1319365 868259 571056 821323 1216926 1232620 848826
37131 848826 404013 208867 365087 673401 752314 498566 294440 491629 905577 1140079
37121 1140079 1150931 1100601 927610 534987 206425 348231 917122 1471119 1655782 1376701
37111 1376701 769617 292355 462779 1142762 1523555 1226387 863467 981853 1112927
37102 1112927 641172 -1194 2556 456932 520605 166944 116765 463275 566840 340491
37092 340491 443165 1002215 1280281 948960 663341 938984 1365997 1419794 1270509 1304805
37082 1304805 1510244 1760520 2102742 2400858 2301729 1886605 1748166 2115711 2523796 2621328
37072 2621328 2631128 2721764 2678785 2576834 3007706 4139314 5217429 5511136 5148273 4563049
$$ packed form
37141A06789l7664M82313O55952J11975m51106k97203K50267L95603J5694l83794
37131H48826m44813j95146J56220L08314P8913k53748k04126J97189M13948K34502
37121A140079J0852n0330j72991l92623l28562J41806N68891N53997J84663k79081
37111A376701o07084m77262J70424O79983L80793k97168l62920J18386J31074
37102A112927m71755o42366L750M54376O3673l53661n0179L46510J03565k26349
37092C40491J02674N59050K78066l31321k85619K75643M27013N3797j49285L4296
37082A304805K05439K50276L42222K98116r9129m15124j38439L67545M08085R7532
37072B621328R800R0636m2979j01951M30872J131608J078115K93707l62863n85224
$$ plain form
37062 4563049 3799609 2917534 2428101 2645488 3081889 3098355 2751883 2489595 2450543 2566899
37052 2566899 2885888 3279646 3298865 2815091 2337397 2223070 2133083 1805290 1741445 2418911
37042 2418911 3345757 3682256 3414725 3163602 3150078 3083021 2821845 2491466 2163185 1984438
37032 1984438 2318959 3177941 3853594 3740980 3208536 3055724 3462864 4087599 4773788
37023 4773788 5442254 5675646 5224247 4641196 4646189 5122068 5475574 5673879 6117647 6774144
37013 6774144 7285244 7713247 8359655 9064512 9502397 9950729 10943502 12381370 13784656
37004 13784656 15180222 16959973 19180019 21773535 25034643 29124473 33728441 39049255
36996 39049255 46202872 55506387 65600344 75894061 88575004 106215598 129222268
$$ packed form
37062D563049p63440q82075m89433K17387M36401J6466l46472k62288l9052J16356
37052B566899L18989L93758J9219m83774m77694j14327q9987l27793o3845O77466
37042B418911R26846L36499k67531k51123j3524o7057k61176l30379l28281j78747
37032A984438L34521Q58982O75653j12614n32444j52812M07140O24735O86189
37023D773788O68466K33392m51399n83051M993M75879L53506J98305M43768O56497
37013F774144N11100M28003O46408P04857M37885M48332R92773J437868J403286
37004A3784656J395566J779751K220046K593516L261108M089830M603968N320814
36996C9049255P153617R303515J0093957J0293717J2680943J7640594K3006670
$$ plain form
36989 129222268 158680227 199051653 251232290 301852327 326791011 311301728 264517119
36982 264517119 210299267 166065648 134158178 110184555 91932315 78774808 68470330
36975 68470330 58652077 49319946 41476737 34931802 29161731 24703754 21932894 19713046
36967 19713046 16868373 13989245 12325646 11741566 11134356 10174021 9312109 8594379 7679333
36958 7679333 6684843 6002166 5568026 5136460 4872318 4896436 4721455 3978245 3233925 3200413
36948 3200413 3558345 3491185 3000496 2710681 2682797 2465859 2138642 2240417 2703898 2858022
36938 2858022 2546310 2300983 2298931 2082940 1540862 1271937 1631227 2171267 2421348 2547022
36928 2547022 2808446 2966089 2726662 2324042 2152815 2136557 1905508 1391647 887863 666552
$$ packed form
36989A29222268K9457959M0371426N2180637N0620037K4938684j5489283m6784609
36982B64517119n4217852m4233619l1907470k3973623j8252240j3157507j0304478
36975F8470330r818253r332131p843209o544935n770071m457977k770860k219848
36967A9713046k844673k879128j663599n84080o07210r60335q61912p17730r15046
36958G679333r94490o82677m34140m31566k64142K4118j74981p43210p44320l3512
36948C200413L57932o7160m90689k89815k7884k16938l27217J01775M63481J54124
36938B858022l11712k45327k052k15991n42078k68925L59290N40040K50081J25674
36928B547022K61424J57643k39427m02620j71227j6258k31049n13861n03784k21311
$$ plain form
36918 666552 794766 1167979 1525474 1598222 1396809 1177978 1042920 841240 589159 640002
36908 640002 1200044 1948042 2418202 2577890 2761312 3149052 3545692 3629721 3291815 2764139
36898 2764139 2440391 2457413 2475563 2074974 1363019 915902 1061625 1498320 1713534 1516551
36888 1516551 1064415 636542 485835 641554 781082 601704 360926 613619 1285319
36879 1285319 1537656 875714 -83417 -397278 -1119 368355 206091 -305789 -731769
36870 -731769 -815152 -562163 -277652 -402467 -940664 -1215704 -660343 283537 601222 8821
36860 8821 -750444 -972021 -751633 -489498 -231560 101776 282755 85580 -211520 -133200
36850 -133200 269421 453172 174255 -145393 10938 603278 1159365 1359748 1249953 961821
$$ packed form
36918F66552J28214L73213L57495P2748k01413k18831j35058k01680k52081N0843
36908F40002N60042P47998M70160J59688J83422L87740L96640Q4029l37906n27676
36898B764139l23748J7022J8150m00589p11955m47117J45723M36695K15214j96983
36888A516551m52136m27873j50707J55719J39528j79378k40778K52693O71700
36879A285319K52337o61942r59131l13861L96159L69474j62264n11880m25980
36870g31769q3383K52989K84511j24815n38197k75040N55361R43880L17685n92401
36860H821p59265k21577K20388K62135K57938L33336J80979j97175k97100P8320
36850a33200M02621J83751k78917l19648J56331N92340N56087K00383j09795k88132
$$ plain form
36840 961821 522641 14130 -327939 -376612 -349957 -552591 -926302 -1100884 -906184 -571220
36830 -571220 -327391 -86407 295870 657123 707619 468479 269367 342270 639213 1031599
36820 1031599 1445818 1743850 1683677 1153623 375683 -236956 -429394 -276356 -20037 196386
36810 196386 373174 484379 447701 347630 472565 896666 1204760 994562 544628 501240
36800 501240 884301 975644 395305 -289899 -412202 -139449 -31748 -72635 184502 728257
36790 728257 1066040 1060798 1126563 1476464 1748336 1581441 1106428 640286 282160 48682
36780 48682 76661 412519 815204 1002237 955797 840297 759862 716249 681475 625164 560060
36769 560060 556775 587504 438030 13495 -334732 -123513 585514 1156263 1134526 748685
$$ packed form
36840I61821m39180n08511l42069m8673K6655k02634l73711j74582J94700L34964
36830e71220K43829K40984L82277L61253N0496k39140j99112P2903K96943L92386
36820A031599M14219K98032o0173n30054p77940o12639j92438J53038K56319K16423
36810A96386J76788J11205l6678j00071J24935M24101L08094k10198m49934m3388
36800E01240L83061R1343n80339o85204j22303K72753J07701m0887K57137N43755
36790G28257L37783n242O5765L49901K71872j66895m75013m66142l58126k33478
36780D8682K7979L35858M02685J87033m6440j15500q0435m3613l4774n6311o5104
36769E60060l285L0729j49474m24535l48227K11219P09027N70749k1737l85841
$$ plain form
36759 748685 516464 599392 728426 620261 312448 124427 303437 680887 819724 621422
36749 621422 529392 844065 1136425 852324 295455 319769 1036455 1552001 1195286 342381
36739 342381 -291080 -558949 -662710 -569557 -192861 231353 472726 707951 1103147 1303669
36729 1303669 913033 267099 111059 567765 999200 934026 624381 552227 799073 1101244
36719 1101244 1245454 1209920 1074693 952888 962825 1198010 1694262 2353755 2911875 3147730
36709 3147730 3170643 3306067 3679298 4198335 4955880 6172304 7598011 8584089 9114651
36700 9114651 10150858 12433201 15659254 19646501 25416042 33460067 41096951 43561143
36692 43561143 38746765 29719355 21503081 16302178 12986686 10249758 8303528 7458224
$$ packed form
36759G48685k32221Q2928J29034j08165l07813j88021J79010L77450J38837j98302
36749F21422r2030L14673K92360k84101n56869K4314P16686N15546l56715q52905
36739C42381o33461k67869j03761R3153L76696M24214K41373K35225L95196K00522
36729A303669l90636o45934j56040M56706M31435o5174l09645p2154K46846L02171
36719A101244J44210l5534j35227j21805R937K35185M96252O59493N58120K35855
36709C147730K2913J35424L73231N19037P57545J216424J425707R86078N30562
36700I114651J036207K282343L226053L987247N769541Q044025P636884K464192
36692D3561143m814378r027410q216274n200903l315492k736928j946230q45304
$$ plain form
36684 7458224 6896901 5762779 4405413 3636394 3428611 3213576 2961106 3036543 3257263
36675 3257263 3031360 2411756 2147561 2524312 2917100 2786204 2427124 2301344 2211866 1726420
36665 1726420 1019249 648442 694896 726828 553094 453469 609352 784287 714494 474559
36655 474559 315963 380289 642240 928229 989701 790056 676011 969403 1424006 1445246
36645 1445246 879819 228879 -2805 160334 372231 391007 197821 -23368 47594 531455
36635 531455 1052263 1124866 859164 832845 1181989 1349597 961393 423400 279571 415176
36625 415176 362783 93267 9829 309475 777642 1162025 1430504 1677223 1976540 2291689
36615 2291689 2440536 2289442 2024381 1986307 2198497 2408700 2654022 3268129 4131539 4531890
$$ packed form
36684G458224n61323j134122j357366p69019k07783k15035k52470P5437K20720
36675C257263k25903o19604k64195L76751L92788j30896l59080j25780q9478m85446
36665A726420p07171l70807M6454L1932j73734r9625J55883J74935o9793k39935
36655D74559j58596O4326K61951K85989O1472j99645j14045K93392M54603K1240
36645A445246n65427o50940k31684J63139K11897J8776j93186k21189P0962M83861
36635E31455N20808P2603k65702k6319L49144J67608l88204n37993j43829J35605
36625D15176n2393k69516q3438K99646M68167L84383K68479K46719K99317L15149
36615B291689J48847j51094k65061l8074K12190K10203K45322O14107Q63410M00351
$$ plain form
36605 4531890 4204022 3954204 4632732 5894310 6698346 6808585 7048432 8111060 9801823
36596 9801823 11566537 13212241 14922710 16981858 19714852 23509396 28781466 35883755
36588 35883755 44646158 53566983 59763839 60562105 55539080 46849718 37523934 29609302
36580 29609302 23672732 19367654 16120812 13539236 11486417 9872612 8494558 7187991
36572 7187991 5977054 4894431 3832773 2779122 1971345 1566781 1396823 1311815 1442351
36563 1442351 1775927 1865240 1431967 881385 659573 508433 58639 -258602 169327 875408
36553 875408 770175 -178986 -862718 -765909 -614608 -933519 -1138331 -702170 -181310 -227791
36543 -227791 -414015 -5200 723473 964668 750284 802291 1218699 1310530 759081 69892
$$ packed form
36605D531890l27868k49818O78528J261578Q04036J10239K39847J062628J690763
36596I801823J764714J645704J710469K059148K732994L794544N272070P102289
36588C5883755Q762403Q920825O196856P98266n023025q689362r325784p914632
36580B9609302n936570m305078l246842k581576k052819j613805j378054j306567
36572G187991j210937j082623j061658j053651q07777m04564j69958q5008J30536
36563A442351L33576Q9313m33273n50582k21812j51140m49794l17241M27929P06081
36553H75408j05233r49161o83732R6809J51301l18911k04812M36161N20860m6481
36543b27791j86224M08815P28673K41195k14384N2007M16408R1831n51449o89189
$$ plain form
36533 69892 -255657 -279134 -192192 29929 314444 369334 132669 -84202 -121197 -224636
36523 -224636 -532616 -703841 -401179 143068 421472 337643 225024 261595 254401 59917
36513 59917 -143741 -200647 -302578 -635942 -874913 -498455 349758 842304 585592 269261
36503 269261 678050 1413444 1359616 349221 -487734 -299590 330067 338686 -267846 -548945
36493 -548945 -41886 708871 1049259 1003190 951342 991138 946731 766164 584754 476303
36483 476303 390146 325624 355668 420270 296329 -70991 -362623 -268543 12072 23698 -173761
36472 -173761 9915 696371 1077226 500772 -388209 -366919 661599 1525499 1423942 867390
36462 867390 673739 799506 706351 319165 -20236 -214208 -419720 -581003 -481357 -195501
$$ packed form
36533F9892l25549k3477Q6942K22121K84515N4890k36665k16871l6995j03439
36523b24636l07980j71225L02662N44247K78404q3829j12619L6571p194j94484
36513E9917k03658n6906j01931l33364k38971L76458Q48213M92546k56712l16331
36503B69261M08789P35394n3828j010395q36955J88144O29657Q619o06532k81099
36493e48945N07059P50757L40388m6069n1848L9796m4407j80567j81410j08451
36483D76303q6157o4522L0044O4602j23941l67320k91632R4080K80615J1626j97459
36472a73761J83676O86456L80855n76454q88981K1290J028518Q63900j01557n56552
36462H67390j93651J25767r3155l87186l39401j93972k05512j61283R9646K85856
$$ plain form
36452 -195501 -74488 -284454 -631577 -805431 -617898 -118238 372449 503162 300569 125652
36442 125652 132069 87231 -134060 -278430 -154358 62711 207833 360166 435467 104307
36432 104307 -491345 -560044 222584 999119 860127 178420 -47394 243495 283827 -114978
36422 -114978 -393309 -417738 -643954 -947317 -487403 819259 1762646 1424609 431897 -100149
36412 -100149 -122140 -296838 -677074 -723902 -370381 -147238 -298512 -535574 -690873 -917962
36402 -917962 -1136739 -933825 -260434 288403 210651 -243702 -458892 -246477 43902 45678
36392 45678 -269448 -686435 -967479 -982927 -789326 -603286 -586744 -637776 -500546 -127717
36382 -127717 177624 100894 -257480 -464372 -294880 -7930 39465 -121189 -196678 -136289
$$ packed form
36452a95501J21013k09966l47123j73854J87533M99660M90687J30713k02593j74917
36442A25652O417m4838k21291j44370J24072K17069J45122J52333P5301l31160
36432A04307n95652o8699P82628P76535j38992o81707k25814K90889M0332l98805
36422a14978k78331k4429k26216l03363M59914J306662R43387l38037r92712n32046
36412a00149k1991j74698l80236m6828L53521K23143j51274k37062j55299k27089
36402i17962k18777K02914O73391N48837p7752m54353k15190K12415K90379J776
36392D5678l15126m16987k81044j5448J93601J86040J6542n1032J37230L72829
36382a27717L05341p6730l58374k06892J69492K86950M7395j60654p5489O0389
$$ plain form
36372 -136289 -194114 -472297 -729495 -774888 -758014 -848931 -886004 -657085 -355587 -354938 -570990
36361 -570990 -485640 81837 641940 733501 600063 748517 1058511 897325 133055 -550516
36351 -550516 -589958 -287108 -215090 -301337 -90604 325537 359012 -92545 -416537 -233318
36341 -233318 64326 42997 -92705 -18393 38819 -224596 -426714 22964 842060 1057556
36331 1057556 343960 -507003 -651714 -134555 503190 984882 1242267 1034625 195845
36322 195845 -884608 -1504351 -1389878 -895851 -472864 -222364 -24384 154514 231630 162669
36312 162669 -13400 -250821 -514376 -703166 -649788 -299673 119255 233274 -91770 -567449
36302 -567449 -755593 -481401 45649 421687 336231 -159320 -597702 -516261 -46693 172188
$$ packed form
36372a36289n7825k78183k57198m5393J6874r0917l7073K28919L01498O49k16052
36361e70990Q5350N67477N60103R1561j33438J48454L09994j61186p64270o83571
36351e50516l9442L02850P2018q6247K10733M16141L3475m51557l23992J83219
36341b33318K97644k1329j35702P4312N7212k63415k02118M49678Q19096K15496
36331A057556p13596q50963j44711N17159O37745M81692K57385k07642q38780
36322A95845j080453o19743J14473M94027M22987K50500J97980J78898P7116o8961
36312A62669j76069k37421k63555j88790N3378L50115M18928J14019l25044m75679
36302e67449j88144K74192N27050L76038q5456m95551m38382Q1441M69568K18881
$$ plain form
36292 172188 -143880 -470154 -217653 364906 536651 144216 -228035 -168557 97216 265150
36282 265150 400774 595408 670482 520303 331494 169498 -228195 -899627 -1325190 -1098002
36272 -1098002 -572763 -330834 -294285 15417 514399 553594 -72117 -737665 -808910 -356206
36262 -356206 185100 614275 897521 872174 466295 42182 86082 556309 874895 638409
36252 638409 72433 -344401 -493486 -644541 -970444 -1278595 -1282755 -976592 -616057 -416666
36242 -416666 -390386 -421657 -361703 -84821 371148 710591 620147 167965 -216186 -245786
36232 -245786 -70381 54160 150003 333334 442751 218396 -187012 -255707 217198 777977
36222 777977 831813 316201 -335461 -756062 -928725 -959187 -826506 -477884 -46967 190814
$$ packed form
36292A72188l16068l26274K52501N82559J71745l92435l72251N9478K65773J67934
36282B65150J35624J94634P5074j50179j88809j61996l97693o71432m25563K27188
36272a098002N25239K41929L6549L09702M98982L9195o25711o65548p1245M52704
36262c56206N41306M29175K83246k5347m05879m24113M3900M70227L18586k36486
36252F38409n65976m16834j49085j51055l25903l08151m160L06163L60535J99391
36242d16666K6280l1271N9954K76882M55969L39443r0444m52182l84151k9600
36232b45786J75405J24541R5843J83331J09417k24355m05408o8695M72905N60779
36222G77977N3836n15612o51662m20601j72663l0462J32681L48622M30917K37781
$$ plain form
36212 190814 127446 5769 164977 566868 728567 304983 -357121 -549547 -128435 257064
36202 257064 82249 -280854 -170485 229255 49773 -897143 -1647799 -1380414 -581407 -281233
36192 -281233 -531594 -473880 188579 689507 406696 -193520 -280778 213746 724506 922358
36182 922358 908770 788201 588026 483417 638082 897996 1020183 1061366 1136291 996842
36172 996842 389663 -315469 -494728 -231831 -222657 -648774 -893725 -617659 -354415 -590434
36162 -590434 -913925 -705012 -186694 -79304 -498741 -901245 -981638 -953302 -954552 -809903
36152 -809903 -493333 -300136 -378381 -498688 -455704 -339798 -250949 -90306 158702 231840
36142 231840 -97561 -685636 -1174614 -1335210 -1168048 -868239 -764671 -1034420 -1369026 -1224613
$$ packed form
36212A90814o3368j21677J59208M01891J61699m23584o62104j92426M21112L85499
36202B57064j74815l63103J10369L99740j79482r46916p50656K67385P99007L00174
36192b81233k50361N7714O62459N00928k82811o00216q7258M94524N10760J97852
36182I22358j3588j20569k00175j04609J54665K59914J22187M1183P4925j39449
36172I96842o07179p05132j79259K62897R174m26117k44951K76066K63244k36019
36162e90434l23491K08913N18318J07390m19437m02504q0393K8336j250J44649
36152h09903L16570J93197p8245j20307M2984J15906Q8849J60643K49008P3138
36142B31840l29401n88075m88978j60596J67162K99809J03568k69749l34606J44413
$$ plain form
36132 -1224613 -567178 -37309 -118177 -467231 -446752 -55689 142197 -116131 -506315 -681666
36122 -681666 -631687 -404867 27310 442812 377490 -224534 -742049 -627681 -132877 113746
36112 113746 -11086 -139234 -112642 -104205 -96553 153156 527390 512050 -4892 -407177 -183305
36101 -183305 318040 399963 5577 -269146 -12630 565399 990545 1002211 705502 472900
36091 472900 614533 966971 996616 536776 139332 325590 769300 752945 261916 3669
36081 3669 371269 1035467 1666482 2403747 3326957 4012111 4020949 3484874 2857845 2359131
36071 2359131 1944392 1573876 1238334 918110 697247 686205 724656 508739 138535 71561
36061 71561 309849 197026 -559741 -1212785 -940880 -96897 248193 -191977 -629325 -404042
$$ packed form
36132a224613O57435N29869q0868l49054K0479L91063J97886k58328l90184j75351
36122f81666M9979K26820M32177M15502o5322o02024n17515J14368M94804K46623
36112A13746j24832j28148K6592Q437P652K49709L74234j5340n16942m02285K23872
36101a83305N01345Q1923l94386k74723K56516N78029M25146J1666k96709k32602
36091D72900J41633L52438K9645m59840l97444J86258M43710j6355m91029k58247
36081C669L67600O64198O31015P37265R23210O85154Q838n36075o27029m98714
36071B359131m14739l70516l35542l20224k20863j1042L8451k15917l70204o6974
36061G1561K38288j12823p56767o53044K71905Q43983L45090m40170m37348K25283
$$ plain form
36051 -404042 219238 607355 555925 315344 212282 410983 747196 736291 91168 -722438
36041 -722438 -846808 -59382 925255 1302463 981232 427681 85683 142183 535353 950847
36031 950847 1020089 689754 228135 -167275 -486818 -612099 -311792 315439 770882 719101
36021 719101 292061 -284768 -913318 -1292541 -959274 -55935 496387 146671 -442191 -367631
36011 -367631 132041 148170 -321893 -346874 337521 810746 448233 -69768 101561 620979
36001 620979 629425 220176 212821 681880 764984 64662 -666749 -610268 21069 412173 201697
35990 201697 -329054 -766985 -839934 -444812 179700 481092 154841 -445447 -733730 -548138
35980 -548138 -116762 362368 722064 664148 113400 -403718 -281842 301343 584661 287592
$$ packed form
36051d04042O23280L88117n1430k40581j03062J98701L36213j0905o45123q13606
36041g22438j24370P87426R84637L77208l21231n53551l41998N6500L93170M15494
36031I50847O9242l30335m61619l95410l19543j25281L00307O27231M55443n1781
36021G19101m27040n76829o28550l79223L33267R03339N52322l49716n88862P4560
36011c67631M99672J6129m70063k4981O84395M73225l62513n18001J71329N19418
36001F20979Q446m09249p355M69059Q3104p00322p31411N6481O31337L91104k10476
35990B01697n30751m37931p2949L95122O24512L01392l26251o00288k88283J85592
35980e48138M31376M79130L59696n7916n50748n17118J21876N83185K83318k97069
$$ plain form
35970 287592 -107156 -223284 -315788 -672672 -1046055 -1047144 -697482 -245332 198735 521692
35960 521692 489745 139324 -64436 164922 515457 630182 650888 738054 526320 -262951
35950 -262951 -1046048 -1044672 -514883 -405521 -852139 -993070 -437971 82024 -55954 -378451
35940 -378451 -170924 394538 714292 786055 974122 1117007 749789 66286 -201257 87087
35930 87087 244883 -157075 -668181 -726612 -438181 -155738 205077 845534 1404297 1279048
35920 1279048 570560 80913 234662 530816 341326 -179235 -388046 -71519 413666
35911 413666 785987 1105125 1357629 1288446 856701 449057 346768 310528 30910 -309356
35901 -309356 -350191 -196785 -219393 -321453 -18141 659818 928764 237196 -907750 -1479905
$$ packed form
35970B87592l94748j16128r2504l56884l73383j089L49662M52150M44067L22957
35960E21692l1947l50421k03760K29358L50535J14725K0706Q7166k11734p89271
35950b62951p83097J376N29789J09362m46618j40931N55099N19995j37978l22497
35940c78451K07527N65462L19754P1763J88067J42885l67218o83503k67543K88344
35930H7087J57796m01958n11106n8431K88431K82443L60815O40457N58763j25249
35920A279048p08488m89647J53749K96154j89490n20561k08811L16527M85185
35911D13666L72321L19138K52504o9183m31745m07644j02289l6240k79618l40266
35901c09356m0835J53406k2608j02060L03312O77959K68946o91568j144946n72155
$$ plain form
35891 -1479905 -1088179 -265376 263052 288051 114121 80831 177785 112158 -251827 -630805
35881 -630805 -669476 -457416 -384425 -480814 -320414 250783 704340 486246 -201181 -660840
35871 -660840 -569793 -211772 42794 108734 75940 66533 203945 441945 454441 4054 -603756
35860 -603756 -794062 -482755 -171270 -163781 -112079 370804 974305 1003617 323776 -420925
35850 -420925 -600093 -301166 -76307 -191685 -382023 -324573 -117025 -127810 -460729 -784997
35840 -784997 -778800 -576827 -568745 -789723 -772409 -153549 740895 1181431 913574 496833
35830 496833 604542 1152567 1400259 906799 91012 -308407 -102507 262031 342495 106770
35820 106770 -274251 -685272 -973964 -873348 -276325 506141 962334 842308 312528 -271196
$$ packed form
35891a479905L91726Q22803N28428K4999j73930l3290R6954o5627l63985l78978
35881f30805l8671K12060P2991r6389J60400N71197M53557k18094o87427m59659
35871f60840R1047L58021K54566O5940l2794r407J37412K38000J2496m50387o07810
35860f03756j90306L11307L11485P489N1702M82883O03501K9312o79841p44701
35850d20925j79168K98927K24859j15378j90338N7450K07548j0785l32919l24268
35840g84997O197K01973Q082k20978J7314O18860Q94444M40536k67857m16741
35830D96833J07709N48025K47692m93460q15787l99419K05900L64538Q0464k35725
35820A06770l81021m11021k88692J00616N97023P82466M56193j20026n29780n83724
$$ plain form
35810 -271196 -619722 -614946 -338766 -28622 99025 28513 -75598 -59639 75193 195519
35800 195519 170614 -2534 -199557 -302290 -295661 -196532 28032 358786 618513 643761
35790 643761 522060 455669 418255 208224 -138069 -302083 -166218 -37038 -197111 -501070
35780 -501070 -654818 -667280 -743778 -900561 -978736 -928946 -809972 -594184 -239526 107358
35770 107358 224884 91927 -145540 -400415 -637216 -753956 -705405 -632388 -627405 -515616
35760 -515616 -157583 196264 229433 98310 184348 381244 181879 -459271 -924208 -809003
35750 -809003 -483285 -438287 -525127 -305906 137711 284060 -29364 -360090 -276641 126873
35740 126873 455382 511728 412576 332320 292953 214923 93513 46822 163779 367021 494649
$$ packed form
35810b71196l48526M776K76180L10144J27647p0512j04111J5959J34832J20326
35800A95519k4905j73148j97023j02733O629R9129K24564L30754K59727K5248
35790F43761j21701o6391l7414k10031l46293j64014J35865J29180j60073l03959
35780e01070j53748j2462p6498j56783p8175M9790J18974K15788L54658L46884
35770A07358J17526j32957k37467k54875k36801j16740M8551P3017M983J11789
35760e15616L58033L53847L3169j31123Q6038J96896j99365o41150m64937J15205
35750h09003L25718M4998q6840K19221M43617J46349l13424l30726Q3449M03514
35740A26873L28509N6346r9152q0256l9367p8030j21410m6691J16957K03242J27628
$$ plain form
35729 494649 459110 235497 -206858 -777812 -1144324 -999145 -474032 -42675 24548 -142773
35719 -142773 -380695 -691624 -945775 -778622 -97062 586364 684117 235729 -242346 -449102
35709 -449102 -470927 -378249 -105345 225209 275207 -43140 -373151 -373694 -138747 38488 107861
35698 107861 206672 294448 158273 -201979 -459370 -345173 26821 358223 549468 698581
35688 698581 804710 724016 443378 153877 -45623 -286611 -616140 -779944 -575322 -232684
35678 -232684 -116010 -169350 -46176 278069 474469 459457 513332 659525 480851 -123401
35668 -123401 -522815 -219885 262325 30126 -822304 -1242339 -678867 170358 360358 -92630
35658 -92630 -439322 -281034 82521 252631 198532 75368 -51001 -137130 -68770 158319
$$ packed form
35729D94649l5539k23613m42355n70954l66512J45179N25113M31357O7223j67321
35719a42773k37922l10929k54151J67153O81560O83426R7753m48388m78075k06756
35709d49102k1825R2678K72904L30554M9998l18347l30011n43K34947J77235O9373
35698A07861R8811Q7776j36175l60252k57391J14197L71994L31402J91245J49113
35688F98581J06129q0694k80638k89501j99500k40988l29529j63804K04622L42638
35678b32684J16674n3340J23174L24245J96400j5012N3875J46193j78674o04252
35668a23401l99414L02930M82210k32199q52430m20035N63472Q49225J90000m52988
35658i2630l46692J58288L63555J70110n4099j23164j26369q6129O8360K27089
$$ plain form
35648 158319 302445 142036 -162265 -185079 227333 701934 737404 260254 -344221 -685658
35638 -685658 -696682 -537591 -362610 -243922 -194554 -168861 -95069 40440 179679 272478
35628 272478 313722 314029 309551 373614 514627 592059 463299 190884 -38284 -166418 -263840
35617 -263840 -309720 -198468 25107 165966 151617 98637 96920 157052 352647 710313 953500
35606 953500 727618 145991 -283453 -371662 -437337 -625316 -556667 31063 758994 1100613
35596 1100613 993924 591499 -123340 -968727 -1281267 -683110 176047 366400 -30343
35587 -30343 -128900 360111 752937 513807 4451 -151415 130616 533089 823103 898561
35577 898561 682969 249709 -145506 -300068 -182098 162514 575433 734198 461116 13291
$$ packed form
35648A58319J44126j60409l04301k2814M12412M74601L5470m77150o04475l41437
35638f85658j1024J59091J74981J18688M9368K5693P3792J35509J39239R2799
35628B72478M1244L07m478O4063J41013P7432j28760k72415k29168j28134r7422
35617b63840m5880J11252K23575J40859j4349n2980j717O0132J95595L57666K43187
35606I53500k25882n81627m29444q8209o5675j87979O8649N87730P27931L41619
35596A100613j06689m02425p14839q45387l12540N98157Q59157J90353l96743
35587c0343r8557M89011L92826k39130n09356j55866K82031M02473K90014P5458
35577H98561k15592m33260l95215j54562J17970L44612M12919J58765k73082m47825
$$ plain form
35567 13291 -270819 -468045 -784422 -964907 -594112 101116 427844 231211 52536 220604
35557 220604 487217 680910 969805 1271309 1173089 737372 616753 991707 1151402 602980
35547 602980 -124997 -335462 -141857 22060 240945 752323 1241486 1225834 787034 329585
35537 329585 8722 -67883 391555 1231198 1544868 813895 -137112 -210805 365140 502940
35527 502940 -18905 -411050 -315585 -241813 -467003 -561934 -281014 -31596 -121619 -279243
35517 -279243 -252170 -253006 -490773 -783007 -893174 -813478 -562962 -143423 239567 378005
35507 378005 465952 768116 974724 578451 -143892 -330316 207852 740140 760221 527649
35497 527649 284822 -144823 -656956 -686665 -184663 75513 -313111 -693473 -410376 184060
$$ packed form
35567A3291k84110j97226l16377j80485L70795O95228L26728j96633j78675J68068
35557B20604K66613J93693K88895L01504r8220m35717j20619L74954J59695n48422
35547F02980p27977k10465J93605J63917K18885N11378M89163j5652m38800m57449
35537C29585l20863p6605M59438Q39643L13670p30973r51007p3693N75945J37800
35527E02940n21845l92145R5465P3772k25190r4931K80920K49418r0023j57624
35517b79243K7073q36k37767k92234j10167P9696K50516M19539L82990J38438
35507C78005Q7947L02164K06608l96273p22343j86424N38168N32288K0081k32572
35497E27649k42827m29645n12133k9709N02002K60176l88624l80362K83097N94436
$$ plain form
35487 184060 417241 273097 20438 -422986 -995434 -1022532 -123300 922295 1091220 500204
35477 500204 32039 -34493 -129808 -416617 -600226 -549258 -331268 164468 878863 1133242
35467 1133242 399841 -700281 -1107528 -862804 -911171 -1448309 -1619237 -1024320 -378560
35458 -378560 -271184 -286473 78520 471460 328228 -174076 -469306 -452907 -394870 -357368
35448 -357368 -217507 -1921 205721 419845 503598 132401 -634639 -1139603 -917934 -362435
35438 -362435 -131772 -215363 -125979 207332 340429 60053 -288099 -289560 77164 529660
35428 529660 770590 658223 283209 -128709 -491027 -888991 -1217017 -1084263 -395441 247727
35418 247727 197600 -320193 -459262 74359 630619 555827 64545 -123519 287209 926642
$$ packed form
35487A84060K33181j44144k52659m43424n72448k7098Q99232J045595J68925n91016
35477E00204m68165o6532r5315k86809j83609N0968K17990M95736P14395K54379
35467A133242p33401j100122m07247K44724m8367n37138j70928N94917O45760
35458c78560J07376j5289L64993L92940j43232n02304k95230J6399N8037L7502
35448c57368J39861K15586K07642K14124Q3753l71197p67040n04964K21669N55499
35438c62435K30663q3591Q9384L33311J33097k80376l48152j461L66724M52496
35428E29660K40930j12367l75014m11918l62318l97964l28026J32754O88822O43168
35418B47727n0127n17793j39069N33621N56260p4792m91282j88064M10728O39433
$$ plain form
35408 926642 1273726 1112789 561511 -73085 -442691 -364285 35690 461467 755161 991368
35398 991368 1263121 1485214 1483225 1218829 839800 520973 327797 224934 122746 -99733
35388 -99733 -493780 -887960 -946969 -509470 187299 718595 838036 549206 -27904 -653632
35378 -653632 -964142 -787261 -445815 -431940 -746129 -885303 -560145 -61316 236250 350248
35368 350248 423058 345317 16514 -295019 -275254 -62421 -3732 -76776 -17391 101619 -35257
35357 -35257 -339942 -354575 -18899 190201 73159 40786 294538 286351 -446012 -1363880
35347 -1363880 -1536606 -917357 -320070 -239379 -400536 -503559 -681881 -989304 -1066735 -709939
35337 -709939 -310977 -310823 -538440 -510472 -156139 157003 174363 -15555 -196710 -184359 109354
$$ packed form
35408I26642L47084j60937n51278o34596l69606P8406L99975M25777K93694K36207
35398I91368K71753K22093j989k64396l79029l18827j93176j02863j02188k22479
35388i9733l94047l94180n9009M37499O96769N31296J19441k88830n77110o25728
35378f53632l10510J76881L41446J3875l14189j39174L25158M98829K97566J13998
35368C50248P2810p7741l28803l11533J9765K12833N8689p3044N9385J19010j36876
35357c5257l04685j4633L35676K09100j17042l2373K53752q187p32363r17868
35347a363880j72726O19249N97287Q0691j61157j03023j78322l07423p7431L56796
35337g09939L98962J54k27617K7968L54333L13142J7360j89918j81155J2351K93713
$$ plain form
35326 109354 490352 501089 -65200 -773978 -984763 -599325 -85708 147316 75049 -169711
35316 -169711 -491293 -789202 -994904 -1135143 -1153200 -821180 -132905 422675 420520 159261
35306 159261 220786 501850 360870 -278439 -739860 -675661 -553781 -745040 -891305 -664640
35296 -664640 -438943 -562521 -582449 11583 732115 678525 -76938 -587477 -437473 -186230
35286 -186230 -335074 -653356 -751817 -650820 -485063 -184332 253442 604096 774156 912340
35276 912340 975592 651395 -27397 -459307 -231300 271083 395406 67402 -273621 -324422
35266 -324422 -108035 270098 637886 683394 297824 -96627 5387 449416 579699 187645
35256 187645 -184324 -79853 194966 108574 -229825 -279321 -8628 -14611 -568964 -1102708
$$ packed form
35326A09354L80998J0737n66289p08778k10785L85438N13617K33024p2267k44760
35316a69711l21582k97909k05702j40239j8057L32020O88275N55580k155k61259
35306A59261O1525K81064j40980o39309m61421O4199J21880j91259j46265K26665
35296f64640K25697j23578j9928N94032P20532n3590p55463n10539J50004K51243
35286a86230j48844l18282r8461J00997J65757L00731M37774L50654J70060J38184
35276I12340O3252l24197o78792m31910K28007N02383J24323l28004l41023n0801
35266c24422K16387L78133L67788M5508l85570l94451J02014M44029J30283l92054
35256A87645l71969J04471K74819q6392l38399m9496K70693n983n54353n33744
$$ plain form
35246 -1102708 -990309 -433195 -96398 -157159 -270999 -310560 -492240 -782901 -857799 -773374
35236 -773374 -992679 -1495771 -1588214 -1012102 -533494 -807731 -1291401 -1080667 -348352 -17309
35226 -17309 -294059 -506865 -291930 35913 321948 803258 1322726 1251694 534521 -18505
35216 -18505 111762 448094 406066 167470 137514 184749 42282 -71405 108758 261622
35206 261622 -43970 -547904 -610594 -117593 477659 818827 842990 516770 -88635 -592901
35196 -592901 -658512 -437133 -266241 -120487 178760 426574 270387 -123627 -193172 245311
35186 245311 816036 1157788 1226679 1045235 617168 138132 -115981 -164619 -237194 -309867
35176 -309867 -111513 368632 750950 735074 415506 68098 -142094 -221498 -314282 -564604
$$ packed form
35246a102708J12399N57114L36797o0761j13840l9561j81680k90661p4898Q4425
35236g73374k19305n03092r2443N76112M78608k74237m83670K10734P32315L31043
35226a7309k76750k12806K14935L27843K86035M81310N19468p1032p17173n53026
35216a8505J30267L36332m2028k38596k9956M7235j42467j13687J80163J52864
35206B61622l05592n03934o2690M93001N95252L41168K4163l26220o05405n04266
35196e92901o5611K21379J70892J45754K99247K47814j56187l94014o9545M38483
35186B45311N70725L41752O8891j81444m28067m79036k54113m8638p2575p2673
35176c09867J98354M80145L82318j5876l19568l47408k10192p9404r2784k50322
$$ plain form
35166 -564604 -853931 -851335 -543645 -425434 -794158 -1170080 -945956 -354363 -125273 -334253
35156 -334253 -355466 38488 333968 204451 18171 110019 230022 120921 46799 265283
35146 265283 463284 241355 -204125 -378060 -180517 136733 429641 636547 559466 150893
35136 150893 -180405 -22486 437318 717922 794500 1031139 1450257 1617361 1296803 737474
35126 737474 214770 -256920 -617107 -618018 -245291 70164 -37965 -390745 -573589 -518595
35116 -518595 -462650 -472565 -380684 -171194 -72644 -163526 -177880 105767 484705 579239 346294
35105 346294 93276 24685 44443 31897 25197 20645 -119633 -352381 -318537 147439 575350
35094 575350 378421 -234914 -383034 296923 1045367 919446 27083 -630062 -432471 199396
$$ packed form
35166e64604k89327K596L07690J18211l68724l75922K24124N91593K29090k08980
35156c34253k1213L93954K95480j29517j86280R1848J20003j09101p4122K18484
35146B65283J98001k21929m45480j73935J97543L17250K92908K06906p7081m08573
35136A50893l31298J57919M59804K80604P6578K36639M19118J67104l20558n59329
35126G37474n22704m71690l60187r11L72727L15455j08129l52780j82844N4994
35116e18595N5945r915R1881K09490R8550r0882j4354K83647L78938R4534k32945
35105C46294k53018o8591J9758j2546o700m552j40278k32748L3844M65976M27911
35094E75350j96929o13335j48120O79957P48444j25921q92363o57145J97591O31867
$$ plain form
35084 199396 492690 265316 -60285 -131221 -6991 125427 256130 438616 568795 480809
35074 480809 202213 -49124 -100434 69240 397381 731721 803801 460997 -53143 -313447
35064 -313447 -255614 -197250 -236385 -40056 530378 998861 884928 424389 208742 336415
35054 336415 438112 367138 280499 132711 -269815 -706909 -704103 -351577 -281474 -642508
35044 -642508 -822728 -520900 -346888 -812135 -1369558 -1182489 -398553 130969 123622 48300
35034 48300 155144 138547 -147291 -352914 -238479 -55154 -66410 -139433 -76078 22765 -6478
35023 -6478 -80696 -47912 45308 68533 9349 -91038 -234558 -393378 -515298 -658670 -909581
35012 -909581 -1139046 -1118777 -908793 -790990 -769859 -565110 -211357 -143075 -429602 -488765
$$ packed form
35084A99396K93294k27374l25601p0936J24230J32418J30703J82486J30179q7986
35074D80809k78596k51337n1310J69674L28141L34340P2080l42804n14140k60304
35064c13447N7833N8364l9135J96329N70434M68483j13933m60539k15647J27673
35054C36415J01697p0974q6639j47788m02526m37094K806L52526P0103l61034
35044f42508j80220L01828J74012m65247n57423J87069P83936N29522p347p5322
35034D8300J06844j6597k85838k05623J14435J83325j1256p3023O3355R8843k9243
35023f478p4218L2784R3220K3225n9184j00387j43520j58820j21920j43372k50911
35012i09581k29465K0269K09984J17803K1131K04749L53753O8282k86527n9163
$$ plain form
35002 -488765 -9271 354858 -145483 -1140984 -1555289 -1082263 -481818 -374856 -498080 -370529
34992 -370529 -44839 147011 99581 -152172 -603455 -1045598 -1069574 -641733 -281896 -315082
34982 -315082 -376438 -94770 192145 8665 -352071 -247714 193106 191792 -455133 -1081173
34972 -1081173 -1213463 -1148720 -1191796 -1067325 -547680 -55475 -74903 -401601 -540604 -495642
34962 -495642 -574370 -690511 -514659 -182284 -190365 -573340 -788976 -556461 -264734 -304204
34952 -304204 -454233 -306323 9024 -25217 -509901 -903608 -734736 -235445 19989 -56480
34942 -56480 -31270 211539 139698 -528921 -1068415 -604460 477672 867480 144408 -675178
34932 -675178 -723843 -450114 -592269 -896189 -775240 -537107 -822968 -1282053 -1039699 -265903
$$ packed form
35002d88765M79494L64129n00341r95501m14305M73026O00445J06962j23224J27551
34992c70529L25690J91850m7430k51753m51283m42143k3976M27841L59837l3186
34982c15082o1356K81668K86915j83480l60736J04357M40820j314o46925o26040
34972a081173j32290O4743m3076J24471N19645M92205j9428l26698j39003M4962
34962d95642p8728j16141J75852L32375q081l82975k15636K32515K91727l9470
34952c04204j50029J47910L15347l4241m84684l93707J68872M99291K55434p6469
34942e6480K5210K42809p1841o68619n39494M63955J082132L89808p23072q19586
34932f75178m8665K73729j42155l03920J20949K38133k85861m59085K42354P73796
$$ plain form
34922 -265903 8428 -361535 -392934 272882 679114 141527 -632722 -740598 -420781 -354926
34912 -354926 -444074 -219003 148211 204359 128266 338759 541775 132159 -670310 -1036667
34902 -1036667 -788904 -539003 -581350 -557301 -341460 -364514 -748383 -893682 -366214 386270
34892 386270 647276 317679 -215445 -699339 -1059279 -1111551 -703940 -34971 508517 764100
34882 764100 802935 649950 289916 -89394 -153846 182013 573267 579694 159904 -236071
34872 -236071 -118258 492628 1033810 979746 393076 -188063 -350542 -172126 -22216 -133709
34862 -133709 -389726 -453905 -113256 456534 807867 662021 181110 -243676 -381118 -280779
34852 -280779 -136459 -129676 -298200 -473800 -469184 -369997 -439756 -673766 -744218 -539042 -413334
$$ packed form
34922b65903K74331l69963l1399O65816M06232n37587p74249j07876L19817O5855
34912c54926q9148K25071L67214N6148p6093K10493K03016m09616q02469l66357
34902a036667K47763K49901m2347K4049K15841k3054l83869j45299N27468P52484
34892C86270K61006l29597n33124m83894l59940n2272M07611O68969N43488K55583
34882G64100L8835j52985l60034l79310o4452L35859L91254O427m19790l95975
34872b36071J17813O10886N41182n4064n86670n81139j62479J78416J49910j11493
34862a33709k56017o4179L40649N69790L51333j45846m80911m24786j37442J00339
34852b80779J44320O783j68524j75600M616R9187o9759k34010p0452K05176J25708
$$ plain form
34841 -413334 -642338 -955532 -970429 -794279 -764251 -838300 -740486 -531002 -501203 -618635
34831 -618635 -606929 -470768 -373714 -115428 565973 1206977 978164 -204 -577587 -192769
34821 -192769 268194 -154544 -996598 -1096517 -349268 228515 28357 -464184 -602941 -422026
34811 -422026 -273193 -213430 -119064 -37907 -93825 -257881 -437091 -597085 -637695 -384845
34801 -384845 93288 388918 230032 -116673 -202971 -33872 -293 -207590 -269960 80259
34791 80259 523584 581177 279677 25254 -47395 -145624 -242058 36483 716885 1154785
34781 1154785 808363 424 -553557 -702519 -795954 -876498 -632377 -133153 117089 9676
34771 9676 5876 221773 85601 -621950 -1088428 -545847 478673 826493 322130 -167919
$$ packed form
34841d13334k29004l13194j4897J76150L0028p4049R7814K09484K9799j17432
34831f18635J1706J36161R7054K58286O81401O41004k28813r78368n77383L84818
34821a92769M60963m22738q42054r9919P47249N77783k00158m92541j38757J80915
34811d22026J48833N9763R4366Q1157n5918j64056j79210j59994m0610K52850
34801c84845M78133K95630j58886l46705q6298J69099L3579k07297o2370L50219
34791H0259M43325N7593l01500k54423p2649r8229r6434K78541O80402M37900
34781A154785l46422q07939n53981j48962r3435q0544K44121M99224K50242j07413
34771I676l800K15897j36172p07551m66478N42581J024520L47820n04363m90049
$$ plain form
34761 -167919 -169265 -127678 -358431 -405004 97999 640765 536232 -48930 -386526 -243278
34751 -243278 -40654 -76352 -167007 -123594 -103234 -300311 -595868 -717862 -588199 -379120
34741 -379120 -330943 -567954 -969267 -1192595 -984227 -511905 -223788 -322078 -567646 -686424
34731 -686424 -729202 -850709 -954037 -831576 -522147 -226761 32201 316250 394535 -77877
34721 -77877 -904397 -1335493 -970461 -281826 81221 128421 219976 271424 -87312 -704997
34711 -704997 -971565 -746785 -553941 -668319 -694349 -396688 -293692 -847206 -1548985 -1528641
34701 -1528641 -818422 -293052 -421834 -761774 -769061 -496458 -267003 -147567 -41629 27625
34691 27625 -6330 -117242 -293210 -551093 -735359 -604400 -267379 -201444 -612199 -1096735
$$ packed form
34761a67919j346M1587k30753m6573N03003N42766j04533n85162l37596J43248
34751b43278K02624l5698r0655M3413K0360j97077k95557j21994J29663K09079
34741c79120M8177k37011m01313k23328K08368M72322K88117r8290k45568j18778
34731f86424m2778j21507j03328J22461L09429K95386K58962K84049P8285m72412
34721g7877q26520m31096L65032O88635L63047M7200R1555N1448l58736o17685
34711g04997k66568K24780J92844j14378k6030K97661J02996n53514p01779K0344
34701a528641P10219N25370j28782l39940p287K72603K29455J19436J05938O9254
34691B7625l3955j10912j75968k57883j84266J30959L37021O5935m10755m84536
$$ plain form
34681 -1096735 -1219609 -1111800 -1132563 -1202502 -948827 -392391 4645 2282 -135423 -121719
34671 -121719 -30187 -24663 -25278 110860 286387 301130 184096 156189 294839 419734 329428
34660 329428 29459 -306607 -528906 -624782 -662943 -657603 -536454 -277530 -12963 108659
34650 108659 128651 202194 316062 261168 -57166 -465964 -784564 -1048341 -1307261 -1382679
34640 -1382679 -1087124 -592530 -283599 -250070 -216060 -30787 73935 -125215 -454407 -593586
34630 -593586 -546330 -566442 -691948 -671797 -402722 -151029 -180450 -354937 -328038 -38048
34620 -38048 210619 167887 -59657 -215543 -248476 -295673 -382548 -353687 -156357 -4293 -108418
34609 -108418 -364748 -509691 -521371 -613455 -813046 -839774 -544718 -189832 -33209 127824
$$ packed form
34681a096735j22874J07809k0763o9939K53675N56436L97036k363j37705J3704
34671a21719R1532N524o15J36138J75527J4743j17034k7907J38650J24895r0306
34660C29428k99969l36066k22299r5876l8161N340J21149K58924K64567J21622
34650A08659J9992P3543J13868n4894l18334m08798l18600k63777k58920p5418
34640a382679K95555M94594L08931L3529L4010J85273J04722j99150l29192j39179
34630e93586M7256k0112j25506K0151K69075K51693k9421j74487K6899K89990
34620c8048K48667m2732k27544j55886l2933m7197q6875K8861J97330J52064j04125
34609a08418k56330j44943j1680r2084j99591k6728K95056L54886J56623J61033
$$ plain form
34599 127824 603495 1115741 970973 57960 -798367 -815188 -263570 -65384 -540255 -1049697
34589 -1049697 -925921 -293732 245059 401975 358869 328024 305657 234233 129002 -9121
34579 -9121 -211997 -419512 -495402 -425675 -356804 -370175 -360199 -224133 -36477 83835 156670
34568 156670 236789 229020 20001 -228304 -143553 414840 1123322 1498600 1339497 798436
34558 798436 142897 -407120 -671435 -538951 -87587 404021 648991 564368 296420 84737
34548 84737 119521 448596 913813 1190585 1027742 523798 64631 -116896 -210909 -486037
34538 -486037 -774363 -615245 30603 549852 383973 -274801 -776944 -821072 -631633 -462013
34528 -462013 -331057 -251321 -316930 -462693 -464575 -289014 -135638 -44674 169511 453030
$$ packed form
34599A27824M75671N12246j44768r13013q56327j6821N51618J98186m74871n09442
34589a049697J23776O32189N38791J56916m3106l0845k2367p1424j05231j38123
34579i121k02876k07515p5890O9727O8871j3371R976J36066J87656J20312P2835
34568A56670Q0119p769k09019k48305Q4751N58393P08482L75278j59103n41061
34558G98436o55539n50017k64315J32484M51364M91608K44970q4623k67948k11683
34548H4737L4784L29075M65217K76772j62843n03944m59167j81527r4013k75128
34538d86037k88326J59118O45848N19249j65879o58774n02143m4128J89439J69620
34528d62013J30956P9736o5609j45763j882J75561J53376R0964K14185K83519
$$ plain form
34518 453030 412548 -48802 -412443 -260528 36782 -146830 -722338 -1028517 -829003 -536322
34508 -536322 -404343 -144070 413460 824180 613879 3303 -391777 -393130 -365878 -556396
34498 -556396 -733152 -596909 -269794 -159351 -408130 -656740 -439386 228934 781671 692522
34488 692522 66563 -468797 -416637 168901 858648 1252810 1192209 760126 182056 -348387
34478 -348387 -777581 -1079690 -1119680 -804066 -333517 -80802 -175312 -387304 -442633 -254354
34468 -254354 160517 728085 1215665 1351691 1158096 924500 767964 521461 191911 161730
34458 161730 659260 1322986 1620539 1476518 1162923 806183 405203 144371 198565 300100
34448 300100 -2063 -618273 -917685 -561064 79159 479590 561429 530490 476330 392150
$$ packed form
34518D53030m0482m61350l63641J51915K97310j83612n75508l06179J99514K92681
34508e36322J31979K60273N57530M10720k10301o10576l95080j353K7252j90518
34498e56396j76756J36243L27115J10443k48779k48610K17354O68320N52737q9149
34488F92522o25959n35360N2160N85538O89747L94162o0601m32083n78070n30443
34478c48387m29194l02109l9990L15614M70549K52715r4510k11992n5329J88279
34468b54354M14871N67568M87580J36026j93595k33596j56536k46503l29550l0181
34458A61730M97530O63726K97553j44021l13595l56740m00980k60832N4194J01535
34448C00100l02163o16210k99412L56621O40223M00431Q1839l0939n4160q4180
$$ plain form
34438 392150 330339 286257 137840 -89816 -134783 96355 278274 101121 -268334 -473777
34428 -473777 -504519 -568326 -612718 -438356 -201556 -282605 -614013 -670330 -301276 -73285
34418 -73285 -456787 -1067514 -1145502 -561031 85044 262416 30062 -225575 -242983 -26695
34408 -26695 237691 365099 393504 559163 904542 1074276 769512 253680 34496 134607
34398 134607 129941 -95247 -162125 95401 273175 45422 -290916 -323799 -201432 -311021
34388 -311021 -548918 -455213 53854 613963 1016590 1351401 1520218 1175461 342015 -369964
34378 -369964 -471502 -179525 -667 -16810 63016 326669 528979 511103 424338 454197
34368 454197 537998 484668 268014 69327 34926 92707 90613 74519 266254 687596 976331
$$ packed form
34438C92150o1811m4082j48417k27656m4967K31138J81919j77153l69455k05443
34428d73777l0742o3807m4392J74362K36800q1049l31408n6317L69054K27991
34418g3285l83502o10727p7988N84471O46075J77372k32354k55637j7408K16288
34408b6695K64386J27408K8405J65659L45379J69734l04764n15832k19184J00111
34398A34607m666k25188o6878K57526J77774k27753l36338l2883J22367j09589
34388c11021k37897R3705N09067N60109M02627L34811J68817l44757q33446p11979
34378c69964j01538K91977J78858j6143P9826K63653K02310j7876q6765K9859
34368D54197Q3801n3330k16654j98687l4401N7781k094j6094J91735M21342K88735
$$ plain form
34357 976331 786106 287582 13463 196629 519228 591297 423630 266958 184124 17914
34347 17914 -287831 -541639 -509577 -174127 231406 418970 302608 85073 50998 252598
34337 252598 439970 321248 -133420 -640426 -833983 -588260 -140127 162741 241698 290852
34327 290852 390494 365161 162633 82666 335446 607450 459567 1655 -275455 -243111
34317 -243111 -202289 -231905 -50139 356511 545113 305599 20221 16820 49666 -168541
34307 -168541 -356093 -106539 359142 448066 57840 -322680 -316693 -29776 255061 362866
34297 362866 213004 -122700 -326761 -113167 370123 676073 601853 353004 183907 141300
34287 141300 178555 279360 424036 597706 813267 986438 904438 533970 224019 309791
$$ packed form
34357I76331j90225m98524k74119J83166L22599P2069j67667j56672q2834j66210
34347A7914l05745k53808L2062L35450M05533J87564j16362k17535l4075K01600
34337B52598J87372j18722m54668n07006j93557K45723M48133L02868P8957M9154
34327B90852R9642k5333k02528p9967K52780K72004j47883m57912k77110L2344
34317b43111M0822k9616J81766M06650J88602k39514k85378l401L2846k18207
34307a68541j87552K49554M65681Q8924l90226l80520N987K86917K84837J07805
34297C62866j49862l35704k04061K13594M83290L05950p4220k48849j69097m2607
34287A41300L7255J00805J44676J73670K15561J73171q2000l70468l09951Q5772
$$ plain form
34277 309791 616795 687198 424029 141068 4828 -157682 -432467 -597610 -481405 -234850
34267 -234850 -92419 -109131 -250472 -478980 -618468 -401983 156595 645717 695060 375238
34257 375238 18474 -188675 -278349 -325532 -379270 -473832 -569829 -562423 -442984 -352236 -380334
34246 -380334 -417921 -298843 116 370171 677598 809484 745376 635669 644215 651110 340541
34235 340541 -272737 -660482 -410681 124992 194128 -359102 -859237 -716383 -225043 -117100
34225 -117100 -528944 -873224 -751047 -504861 -599210 -841436 -697990 -205977 16125 -260704
34215 -260704 -463270 -80693 499836 492451 -191678 -861599 -1004856 -839595 -798752 -875277
34205 -875277 -758321 -405346 -152353 -237591 -435218 -319563 166540 605856 643551 419990
$$ packed form
34277C09791L07004P0403k63169k82961j36240j62510k74785j65143J16205K46555
34267b34850J42431j6712j41341k28508j39488K16485N58578M89122M9343l19822
34257C75238l56764k07149q9674m7183n3738r4562r5997P406J19439R0748k8098
34246c80334l7587J19078K98959L70055L07427J31886o4108j09707Q546O895l10569
34235C40541o13278l87745K49801N35673O9136n53230n00135J42854M91340J07943
34225a17100m11844l44280J22177K46186r4349k42226J43446M92013K22102k76829
34215b60704k02566L82577N80529p385o84129o69921j43257J65261M0843p6525
34205h75277J16956L52975K52993q5238j97627J15655M86103M39316L7695k23561
$$ plain form
34195 419990 259100 130768 -191834 -554647 -539132 -210955 -150756 -512882 -682984 -284182
34185 -284182 89417 -233594 -873186 -947662 -438450 -147037 -410101 -712538 -627814 -356829
34175 -356829 -180219 -73125 -46934 -230548 -438162 -305655 -31471 -267092 -1022763 -1450943
34165 -1450943 -1095343 -582603 -553033 -653181 -293500 228102 219892 -215712 -392060 -197927
34155 -197927 -149603 -352967 -291425 210547 567170 268843 -409263 -849090 -844382 -631296
34145 -631296 -462950 -413490 -412767 -287414 89974 579674 852089 777212 596958 625892 888041
34134 888041 1107004 980315 463325 -135267 -382381 -162787 152227 110192 -294137 -639227
34124 -639227 -588746 -234692 55798 6263 -355257 -750074 -904703 -778177 -507839 -187924
$$ packed form
34195D19990j60890j28332l22602l62813J5515L28177O0199l62126j70102L98802
34185b84182L73599l23011o39592p4476N09212K91413k63064l02437Q4724K70985
34175c56829J76610J07094K6191j83614k07614J32507K74184k35621p55671m28180
34165a450943L55600N12740K9570j00148L59681N21602q210m35604j76348J94133
34155a97927M8324k03364O1542N01972L56623k98327o78106m39827M708K13086
34145f31296J68346M9460P23J25353L77388M89700K72415p4877j80254K8934K62149
34134H88041K18963j26689n16990n98592k47114K19594L15014m2035m04329l45090
34124f39227N0481L54054K90490m9535l61520l94817j54629J26526K70338L19915
$$ plain form
34114 -187924 139445 320935 208248 -15289 30216 319915 340021 -142712 -607205 -450635
34104 -450635 173053 625921 647642 454757 181503 -201739 -491320 -374365 -11038 51940
34094 51940 -313458 -589233 -376466 65997 296995 306033 337239 419553 436782 463747 657672
34083 657672 884124 787014 303188 -109170 75319 789785 1320357 1063238 287875 -126033
34073 -126033 202584 672001 601534 232451 275524 696435 711733 60884 -484582 -222626
34063 -222626 491213 841066 662768 389080 212731 -50860 -386568 -480671 -270028 -120526
34053 -120526 -317542 -712686 -1001237 -1081728 -1031076 -950026 -928165 -971503 -910657 -585594 -156201
34042 -156201 24176 -85514 -121284 133873 396745 318462 30680 -63926 93589 174826
$$ packed form
34114a87924L27369J81490j12687k23537M5505K89699K0106m82733m64493J56570
34104d50635O23688M52868K1721j92885k73254l83242k89581J16955L63327O2978
34094E1940l65398k75775K12767M42463K30998R038L1206Q2314J7229K6965J93925
34083F57672K26452r7110m83826m12358J84489P14466N30572k57119p75363m13908
34073a26033L28617M69417p0467l69083M3073M20911J5298o50849n45466K61956
34063b22626P13839L49853j78298k73688j76349k63591l35708r4103K10643J49502
34053a20526j97016l95144k88551q0491N0652Q1050K1861m3338O0846L25063M29393
34042a56201J80377j09690l5770K55157K62872p8283k87782r4606J57515Q1237
$$ plain form
34032 174826 20012 -100716 117586 597637 985448 1020990 718562 316130 107902 182911
34022 182911 284849 101732 -279681 -460877 -344809 -320731 -623268 -855028 -533705 118088
34012 118088 400365 63794 -452125 -708247 -742874 -778936 -869247 -982105 -1102624 -1110499
$$ packed form
34032A74826j54814j20728K18302M80051L87811L5542l02428m02432k08228P5009
34022A82911J01938j83117l81413j81196J16068K4078l02537k31760L21323O51793
34012A18088K82277l36571n15919k56122l4627l6062r0311j12858j20519p875
$$ [...]
##END NTUPLES=NMR SPECTRUM
##END=
