##TITLE=31Pdec_DPAA0812-1
 CDCl3, 24 sc
 9.12.2021
##JCAMPDX= 6.0         $$ Bruker NMR JCAMP-DX V2.0
##DATA TYPE= NMR SPECTRUM
##DATA CLASS= NTUPLES
##ORIGIN= UXNMR, Bruker Analytische Messtechnik GmbH
##OWNER= root
$$ XWIN-NMR		Version 3.5
$$ Thu Dec  9 11:22:44 2021 Russian Standard Time (UT+4h)  she@DPX200
##.OBSERVE FREQUENCY= 81.013821
##.OBSERVE NUCLEUS= ^31P
##.ACQUISITION MODE= SIMULTANEOUS
##.ACQUISITION SCHEME= undefined
##.AVERAGES= 24
##.DIGITISER RES= 16
##SPECTROMETER/DATA SYSTEM= spect
##.PULSE SEQUENCE= zgpg30
##.SOLVENT NAME= CDCl3
##.SHIFT REFERENCE= (INTERNAL, CDCl3, 0, 248.564)
##AUDIT TRAIL= $$ (NUMBER, WHEN, WHO, WHERE, WHAT)
$$ ##TITLE= Audit trail, XWIN-NMR		Version 3.5
$$ ##JCAMPDX= 5.01
$$ ##ORIGIN= Bruker BioSpin GmbH
$$ ##OWNER= she
$$ F:/spectra/data/she/nmr/P31/1/pdata/1/auditp.txt
$$ ##AUDIT TRAIL=  $$ (NUMBER, WHEN, WHO, WHERE, WHAT)
(   1,<2021-12-09 11:21:33.90 +0400>,<she>,<DPX200>,
      <created by zg, POWCHK disabled, PULCHK disabled
       configuration hash MD5:
       00 E9 B6 7A A2 85 ED C7 34 08 36 98 17 FE 4E 26
       data hash MD5: 32K
       5A 6A 25 7B FE 3C 57 BC B1 7F 0D BD E1 10 61 35>)
(   2,<2021-12-09 11:21:40.15 +0400>,<she>,<DPX200>,
      <Start of raw data processing
       efp BC_mod = 2 LB = 1 FT_mod = 6 PKNL = 1 PHC0 = -9133.444 PHC1 = -128.3306 SI = 64K 
       data hash MD5: 64K
       15 A0 2F E0 18 F9 6A B6 D5 4D A2 F3 76 30 2E 0B>)
(   3,<2021-12-09 11:22:09.21 +0400>,<she>,<DPX200>,
      <pk PHC0 = 199.0371 PHC1 = -343.6 
       data hash MD5: 64K
       E3 24 3A 0A 2D 17 BD B9 AC DB BD 03 4E 27 12 E7>)
(   4,<2021-12-09 11:22:12.98 +0400>,<she>,<DPX200>,
      <abs ABSG = 5 
       data hash MD5: 64K
       74 32 0B 45 8F 44 5D 7B A6 E6 DE FE 3A 62 35 A7>)
$$ ##END=
$$ 
$$ hash MD5
$$ 2B 9A 6F C9 2D 6B 55 8B 5F 0C 15 36 05 5D 0E 68
##$RELAX= 
##$RELAX= 
##$RELAX= 
##$RELAX= 
##$RELAX= 
##$RELAX= 
##$RELAX= 
##$RELAX= 
$$ Bruker specific parameters
$$ --------------------------
##$DU= <F:/spectra>
##$EXPNO= 1
##$NAME= <P31>
##$PROCNO= 1
##$TYPE= <nmr>
##$USER= <she>
##$AMP= (0..31)
100 100 100 100 100 100 100 100 100 100 100 100 100 100 100 100 100 100 
100 100 100 100 100 100 100 100 100 100 100 100 100 100 
##$AQSEQ= 0
##$AQ_mod= 1
##$AUNM= <au_zg>
##$AUTOPOS= <>
##$BF1= 81.014009
##$BF2= 200.13
##$BF3= 200.13
##$BF4= 200.13
##$BF5= 200.13
##$BF6= 200.13
##$BF7= 200.13
##$BF8= 200.13
##$BYTORDA= 1
##$CFDGTYP= 0
##$CFRGTYP= 5
##$CHEMSTR= <none>
##$CNST= (0..31)
1 1 145 1 1 1 1 1 1 1 1 1 1 1 1 1 1 1 1 1 1 1 1 1 1 1 1 1 1 1 1 1 
##$CPDPRG= <waltz16>
##$CPDPRG1= <>
##$CPDPRG2= <waltz16>
##$CPDPRG3= <>
##$CPDPRG4= <mlev>
##$CPDPRG5= <mlev>
##$CPDPRG6= <mlev>
##$CPDPRG7= <mlev>
##$CPDPRG8= <mlev>
##$CPDPRGB= <>
##$CPDPRGT= <>
##$D= (0..31)
0 1 0 0 0 0 0 0 0 0 0 0.03 2e-05 3e-06 0 0 0 0 0 0 0 0 0 0 0 0 0 0 0 0 
0 0 
##$DATE= 1639034493
##$DBL= (0..7)
120 120 120 11 120 120 24 19 
##$DBP= (0..7)
150 150 150 150 150 150 150 150 
##$DBP07= 0
##$DBPNAM0= <>
##$DBPNAM1= <>
##$DBPNAM2= <>
$$ [...]
##$SUBNAM3= <"">
##$SUBNAM4= <"">
##$SUBNAM5= <"">
##$SUBNAM6= <"">
##$SUBNAM7= <"">
##$SUBNAM8= <"">
##$SUBNAM9= <"">
##$SW= 501.771253377433
##$SWIBOX= (0..15)
0 1 3 0 0 0 0 0 0 0 0 0 0 0 0 0 
##$SW_h= 40650.406504065
##$TD= 32768
##$TD0= 1
##$TE= 0
##$TE2= 300
##$TE3= 300
##$TEG= 300
##$TL= (0..7)
0 120 53 12 22 120 120 120 
##$TP= (0..7)
150 150 150 150 150 150 150 150 
##$TP07= 0
##$TPNAME0= <>
##$TPNAME1= <>
##$TPNAME2= <>
##$TPNAME3= <>
##$TPNAME4= <>
##$TPNAME5= <>
##$TPNAME6= <>
##$TPNAME7= <>
##$TPOAL= (0..7)
0.5 0.5 0.5 0.5 0.5 0.5 0.5 0.5 
##$TPOFFS= (0..7)
0 0 0 0 0 0 0 0 
##$TUNHIN= 0
##$TUNHOUT= 0
##$TUNXOUT= 0
##$USERA1= <user>
##$USERA2= <user>
##$USERA3= <user>
##$USERA4= <user>
##$USERA5= <user>
##$V9= 5
##$VALIST= <valist>
##$VCLIST= <CCCCCCCCCCCCCCC>
##$VD= 0
##$VDLIST= <DDDDDDDDDDDDDDD>
##$VPLIST= <PPPPPPPPPPPPPPP>
##$VTLIST= <TTTTTTTTTTTTTTT>
##$WBST= 1024
##$WBSW= 4
##$XGAIN= (0..3)
0 0 0 0 
##$XL= 0
##$YL= 0
##$YMAX_a= 9510
##$YMIN_a= -9900
##$ZGOPTNS= <>
##$ZL1= 120
##$ZL2= 120
##$ZL3= 120
##$ZL4= 120
##$ABSF1= 248.5645
##$ABSF2= -253.2056
##$ABSG= 5
##$ABSL= 3
##$ALPHA= 0
##$AQORDER= 0
##$ASSFAC= 0
##$ASSFACI= 0
##$ASSFACX= 0
##$ASSWID= 0
##$AUNMP= <proc_1d>
##$AZFE= 0.1
##$AZFW= 0.5
##$BCFW= 0
##$BC_mod= 2
##$BYTORDP= 0
##$COROFFS= 0
##$CY= -3
##$DATMOD= 1
##$DC= 0
##$DFILT= <>
##$DTYPP= 0
##$F1P= 0
##$F2P= 0
##$FCOR= 1
##$FTSIZE= 65536
##$FT_mod= 6
##$GAMMA= 0
##$GB= 0
##$INTBC= 1
##$INTSCL= 5.30512e-09
##$ISEN= 30
##$LB= 1
##$LEV0= 0
##$LPBIN= 0
##$MAXI= 10000
##$MC2= 0
##$MEAN= 0
##$ME_mod= 0
##$MI= 50
##$NCOEF= 0
##$NC_proc= -5
##$NLEV= 6
##$NOISF1= 182.463
##$NOISF2= 159.3651
##$NSP= 0
##$NTH_PI= 0
##$NZP= 0
##$OFFSET= 248.5645
##$PC= 4
##$PHC0= -8934.407
##$PHC1= -471.9306
##$PH_mod= 1
##$PKNL= yes
##$PPARMOD= 0
##$PSCAL= 0
##$PSIGN= 0
##$REVERSE= no
##$SF= 81.014009
##$SI= 65536
##$SIGF1= 159.3651
##$SIGF2= -187.1042
##$SINO= 113.3802
##$SIOLD= 16384
##$SREGLST= <1H.CDCl3>
##$SSB= 0
##$STSI= 65536
##$STSR= 0
##$SW_p= 40650.406504065
##$SYMM= 0
##$S_DEV= 0
##$TDeff= 32768
##$TDoff= 0
##$TI= <>
##$TILT= no
##$TM1= 0
##$TM2= 0
##$TOPLEV= 0
##$USERP1= <user>
##$USERP2= <user>
##$USERP3= <user>
##$USERP4= <user>
##$USERP5= <user>
##$WDW= 1
##$XDIM= 65536
##$YMAX_p= 604686200
##$YMIN_p= -2667547
$$ End of Bruker specific parameters
$$ ---------------------------------
##NTUPLES= NMR SPECTRUM
##VAR_NAME=  FREQUENCY,     SPECTRUM/REAL,   SPECTRUM/IMAG
##SYMBOL=    X,             R,               I
##VAR_TYPE=  INDEPENDENT,   DEPENDENT,       DEPENDENT
##VAR_FORM=  AFFN,          ASDF,            ASDF
##VAR_DIM=   65536,         65536,           65536
##UNITS=     HZ,            ARBITRARY UNITS, ARBITRARY UNITS
##FACTOR=    0.620285442955139, 1,           1
##FIRST=     20137.2065510759, 0,            0
##LAST=      -20513.1999529892, 0,           0
##MIN=       -20513.1999529892, -2667547,    0
##MAX=       20137.2065510759, 604686200,    0
$$ Real data points
##PAGE= N=1
##DATA TABLE= (X++(R..R)), XYDATA
$$ [...]
39900e26443J02828k1023m7539j25102j04901K89317P24652N14229k79614p55361
$$ -526443 -423615 -444638 -492177 -617279 -722180 -432863 291789 806018 526404 -228957
39890b28957m03021K42522M56267K31858j2047j24237k05602k59493k37197j87900
$$ -228957 -631978 -389456 66811 298669 286622 162385 -43217 -302710 -539907 -727807
39880g27807j01304J27343L66400K51993j94614l67885Q9028O32158N45342K7961
$$ -727807 -829111 -701768 -335368 -83375 -277989 -645874 -556846 75312 620654 648615
39870F48615j26999J94707K68235k49056p26080n57767q3769M9222q0778K3396
$$ 648615 521616 716323 984558 735502 9422 -548345 -632114 -582892 -663670 -640274
39860f40274L01481K86909P4646K33398O79821N80273k86459r54205o37920Q2844
$$ -640274 -338793 -51884 22762 256160 935981 1516254 1229795 275590 -362330 -279486
39850b79486K19184j11138q9545K93262K64797k79694m96049J4179N33815L85778
$$ -279486 -60302 -171440 -260985 32277 297074 17380 -478669 -464490 69325 455103
39840D55103p7173j94158m1687j09896l84646m05440k1737M21338N57189L37907
$$ 455103 377930 183772 142085 32189 -352457 -757897 -779634 -358296 198893 536800
39830E36800N543j06562Q0553J93123j36006o14848n97961r2446J92844l3932
$$ 536800 542343 435781 516334 709457 573451 -41397 -639358 -731804 -538960 -572892
39820e72892k35337n3170R9978o7404r7067K91893M75676k2576n07970j71924
$$ -572892 -808229 -861399 -761421 -828825 -925892 -633999 -158323 -180899 -688869 -860793
39810h60793M57207L16308l90901n08276J69872O45857L82786n0074j65393j90112
$$ -860793 -403586 -87278 -478179 -986455 -816583 -170726 212060 161986 -3407 -193519
39800a93519k23379R3705O55452O93248O517n50928l55532R6447J62493N7503
$$ -193519 -416898 -323193 332259 1025507 1032024 481096 125564 222011 384504 442007
39790D42007J93694K85187q6871n95463o44635k97657k9203O9629J89038K58905
$$ 442007 635701 920888 834017 238554 -406081 -703738 -732941 -663312 -474274 -215369
39780b15369J34624M541L9897j2748l17196m25076O6645O91069O82368J11859
$$ -215369 -80745 -76204 -36307 -49055 -366251 -791327 -724682 -33613 648755 760614
39770G60614k89528k41338q4966P603J91350L49664J35424l14071m44579j95198
$$ 760614 471086 229748 144782 152385 343735 693399 828823 514752 70173 -125025
39760a25025j17809l93899m66384J3231N38869N20238J67210N6067J90826R3949
$$ -125025 -242834 -636733 -1103117 -1089886 -551017 -30779 136431 192498 383324 477273
39750D77273l49037o90971n62837r9158L23300M66798L11294J9456j15074Q4214
$$ 477273 128236 -562735 -1125572 -1224730 -901430 -434632 -123338 -103882 -218956 -134742
39740a34742M03111M21288O1521k69636k42295p1224j49749l90667l45603L4954
$$ -134742 268369 689657 751178 481542 239247 168023 18274 -372393 -717996 -683042
39730f83042K45189J2530k23794k014L75234K94370j52090k64081J69778N53591
$$ -683042 -437853 -425323 -649117 -651131 -275897 18473 -133617 -397698 -227920 325671
39720C25671M29445J06877K6263N0097j51815m32601m18005j59072p526K024J28103
$$ 325671 755116 861993 888256 938353 786538 353937 -64068 -223140 -230666 -228642 -100539
39709a00539L38733K53481k46161p33309p18764j97827L82353N59197K42311j95185
$$ -100539 238194 491675 245514 -487795 -1206559 -1404386 -1022033 -462836 -220525 -415710
39699d15710k37063K17185O67894N64021k2089m82281m16383o0370Q2151j51214
$$ -415710 -652773 -435588 232306 796327 774238 291957 -124426 -184796 -102645 -253859
39689b53859m58907m72826j54920K24566M32308M81515M69408L67803J38033p1419
$$ -253859 -712766 -1185592 -1340512 -1115946 -683638 -202123 267285 635088 773121 701702
39679G01702r1639l0554j14823k71433k14746L1445J02621j05850k21521J0633
$$ 701702 610063 579509 464686 193253 -21493 9952 112573 6723 -214798 -204165
39669b04165K91027K14921j22883k83193o7208K93723M06119N2173n51727p87045
$$ -204165 86862 301783 178900 -104293 -171501 122222 528341 580514 28787 -758258
39659g58258k40726O43168R35568M00126j79608j08919K91357K77737k31317o79807
$$ -758258 -998984 -355816 579752 979878 800270 691351 982708 1260445 1029128 349321
39649C49321o93806l71008N9969M07325M58328J50292k47361l82193j83835J41139
$$ 349321 -344485 -715493 -655524 -248199 210129 360421 113060 -269133 -452968 -311829
39639c11829L03249P4389m44060o79304j91567N39854N89759l0390k97452K26201
$$ -311829 -8580 65809 -378251 -1057555 -1249122 -709268 -119509 -149899 -447351 -221150
39629b21150O93753M02392j02326j37372j00257n33139q61439l41066M35322L84976
$$ -221150 472603 874995 772669 635297 535040 1901 -859538 -1200604 -765282 -380306
39619c80306k28961k88397K27254L54821N519M0200M77524L41519m46657p15298
$$ -380306 -609267 -897664 -670410 -315589 -310070 -269870 207654 549173 102516 -612782
39609f12782o0610L99857l2211m77819j42436K77571n1058n28616j63566O94130
$$ -612782 -673392 -273535 -305746 -783565 -926001 -648430 -699488 -1228104 -1391670 -697540
39599f97540R27604L78693j47255k12203q7802l2756m7764j55070l13793k98707
$$ -697540 230064 608757 461502 249299 161497 128741 80977 -74093 -387886 -686593
39589f86593r7183m3419k02693j70504J56490L09073J54194K27936O37444O07771
$$ -686593 -783776 -827195 -1029888 -1200392 -1043902 -734829 -580635 -352699 284745 892516
39579H92516j58980p06311l37509J23409k50324p81819l40867N81599O07608k00230
$$ 892516 733536 27225 -310284 -186875 -437199 -1219018 -1559885 -978286 -370678 -570908
39569e70908m84366J13033N22892K11366o4558K00960M31408J71629j40290j41221
$$ -570908 -1055274 -942241 -419349 -207983 -272541 -71581 359827 531456 391166 249945
39559B49945j69323l92701l50824Q9498L06735K2326j30213K44752N18265J26441
$$ 249945 80622 -312079 -662903 -573405 -266670 -244344 -374557 -129805 388460 514901
39549E14901m05164l52579J4318J3586k61694k54220j628K9347j25692m1866K17599
$$ 514901 109737 -242842 -228524 -214938 -476632 -730852 -732480 -703133 -828825 -870691 -653092
39538f53092J63742k25833m20526j84776J26445J97594J14748N387j58604k70744
$$ -653092 -489350 -715183 -1135709 -1320485 -1194040 -996446 -881698 -876311 -1034915 -1305659
39528a305659r3896K75229M02206J87055Q6440L53247M87918n4208q80443j017540
$$ -1305659 -1399555 -1124326 -722120 -535065 -448625 -95378 392540 338332 -542111 -1559651
39518a559651k44522N50260N65464R3225q6500J24020J93440n0216k08591r7836
$$ -1559651 -1804173 -1253913 -688449 -595224 -681724 -557704 -364264 -414480 -623071 -720907
39508g20907l6534j69220j57635J58424L97102K96682J56693J89666M6162m53802
$$ -720907 -757441 -926661 -1084296 -925872 -528770 -232088 -75395 114271 160433 -293369
39498b93369p18804k42251M41735M87315K5826j64517M3284J34293M2113J69841
$$ -293369 -1012173 -1254424 -812689 -325374 -299548 -464065 -420781 -286488 -244375 -74534
39488g4534L90801J26723m88510o09821o3556L24490J01889j51433K2051J61967
$$ -74534 316267 442990 -45520 -655341 -718897 -394407 -292518 -443951 -421900 -259933
39478b59933j46793m30264j76906K21646J61348j46289j17020K00997L01648N8631
$$ -259933 -406726 -836990 -1013896 -792250 -630902 -777191 -894211 -693214 -391566 -332935
39468c32935k34374l65257k59850J05727M46266L00862j77666j98385M14461P18465
$$ -332935 -567309 -932566 -1192416 -1086689 -640423 -339561 -517227 -715612 -301151 417314
39458D17314J01954n85809l26020L78773L33160l48974m78623J85577O03705K42902
$$ 417314 519268 -66541 -392561 -13788 319372 -29602 -508225 -322648 281057 523959
39448E23959j78514q7381M1779k65354n68580l23009J89288L97763K90047J39039
$$ 523959 345445 258064 299843 34489 -534091 -857100 -667812 -270049 19998 159037
39438A59037m6505k47450j58554K48490M05714j7112m58765k96309J40564J38604
$$ 159037 112532 -134918 -293472 -44982 360732 343620 -115145 -411454 -270890 -132286
39428a32286j94992j65267K76306M48561J10701j54060O0590L52245K31734j29270
$$ -132286 -327278 -492545 -216239 232322 343023 188963 249553 601798 833532 704262
39418G04262l02809k88368l13423k83111N6538N59032P33144L39771l64856r33481
$$ 704262 401453 113085 -200338 -483449 -426911 132121 865265 1205036 840180 -93301
39408i3301j031749n60486K02873O60723M48657p6772k42050O0154K89830J08590
$$ -93301 -1125050 -1685536 -1482663 -821940 -373283 -450055 -692105 -631951 -342121 -233531
39398b33531j67167j61192j8392l4508q6025R2994L12011J49356l00089m38177
$$ -233531 -400698 -561890 -580282 -614790 -700815 -607821 -295810 -146454 -446543 -884720
39388h84720r545N05103N21403O7586l29887k88011P0078L14323J98144n0207
$$ -884720 -894265 -389162 132241 199827 -130060 -418071 -347993 -33670 164474 114267
39378A14267k9977K10527J55807l61418p15742l26704L75856M86078m2808l77655
$$ 114267 84290 294817 450624 89206 -626536 -953240 -577384 -91306 -134114 -511769
39368e11769j30182J47732J3314j67963j0420J49238r7257m10695k17228L48825
$$ -511769 -641951 -494219 -480905 -648868 -659288 -510050 -607307 -1018002 -1235230 -886405
39358h86405O68671N41037K76034R8971o062l3319n016r4823k92714k26468K32310
$$ -886405 -217734 323303 599337 698308 692246 658927 653911 559088 266374 39906 272216
39347B72216N36303K05758l34642l42146R6078K70970K6869j09603O8540J59739
$$ 272216 808519 1014277 679635 337489 433567 704537 731406 621803 690343 850082
39337H50082n1812k97978m51904o83372q27392m13063L99105P24720K18097l28586
$$ 850082 798270 500292 48388 -634984 -1462376 -1875439 -1476334 -751614 -533517 -862103
39327h62103j76311K68373K24077j75727j80379L20329O63850M54046J5765k55227
$$ -862103 -1038414 -770041 -545964 -721691 -902070 -581741 82109 536155 551920 296693
39317B96693m06061o03775p16178m70376J39393P42006Q57714L38451l80520o22249
$$ 296693 -109368 -713143 -1429321 -1899697 -1760304 -1018298 -160584 177867 -202653 -824902
39307h24902k14625K80792K84671p3000k44644q5029N8729J1148J8080K04106
$$ -824902 -1039527 -758735 -474064 -547064 -791708 -876737 -818008 -806860 -788780 -584674
39297e84674K44746r8604m39451k19845M05748O45447J58488l97400k75213K47838
$$ -584674 -339928 -438532 -877983 -1097828 -692080 -46633 111855 -285545 -560758 -312920
39287c12920K66131l40439o39312n8295O49256M65500l71880p46598l28071Q6078
$$ -312920 -46789 -387228 -1026540 -1084835 -435579 29921 -341959 -1088557 -1416628 -1330550
39277a330550m6711k45889J0583L83147L61954K07936M27574P36487M28590l72931
$$ -1330550 -1377261 -1623150 -1612567 -1229420 -867466 -659530 -231956 504531 933121 560190
39267E60190p13232j75494N05167N08440L187k94609j98601j11414k06594j69503
$$ 560190 -153042 -328536 176631 685071 688258 393649 195048 83634 -122960 -292463
39257b92463J54101L63128P0856m34419n10008m1425M08770L84864P6357j02084
$$ -292463 -138362 224766 295622 -138797 -648805 -690230 -281460 103404 179761 77677
39247G7677j02960j17357j48798j02063q1841j73811j13343L14611O86402L92351
$$ 77677 -25283 -142640 -291438 -393501 -475342 -649153 -762496 -447885 238517 630868
39237F30868l34698n77257q0902L32252O1318l33901j03956M31506M29566q9190
$$ 630868 296170 -281087 -361989 -29737 31581 -302320 -406276 25230 454796 365606
39227C65606l39888r8074K7110k71581m80402j90252J95998J37037k13116l47927
$$ 365606 25718 -72356 -45246 -316827 -797229 -987481 -791483 -654446 -867562 -1215489
39217a215489j91084k1222J12872L66998O16769N06853J6976m13031m24814j39433
$$ -1215489 -1406573 -1427795 -1314923 -947925 -331156 175697 192673 -220358 -645172 -784605
39207g84605P4970K9565j61094k21082N2189N38704P90783M84416j28471m84591
$$ -784605 -709635 -680070 -841164 -1062246 -1010057 -471353 319430 803846 675375 190784
39197A90784m46873m11030n46219m02202L27275J038808Q66514l3200n66625j92350
$$ 190784 -256089 -667119 -1213338 -1615540 -1288265 -249457 617057 583857 17232 -175118
39187a75118L80394L18373j64328l31521j23788p7652k90730k75179J41511M95821
$$ -175118 205276 523649 359321 27800 -95988 -173640 -464370 -739549 -598038 -102217
39177a02217M38494J90519J5511j98200n09282n81876j94624K76558L18008l6620
$$ -102217 336277 526796 542307 344107 -165175 -747051 -941675 -665117 -347109 -383729
39167c83729l63195m48608l45981n3688M11485P53725O62662K96929J00822J51595
$$ -383729 -746924 -1195532 -1541513 -1595201 -1183716 -429991 232671 529600 630422 782017
39157G82017R1564k44002n30416m32730o8279J97553J89479k3116l07294m83740
$$ 782017 873581 629579 99163 -333567 -401846 -204293 -14814 -37930 -345224 -828964
39147h28964l15711K35324P69097P41680J09779n21273n68474j48146J53461Q8043
$$ -828964 -1144675 -909351 -140254 601426 711205 189932 -378542 -526688 -373227 -285184
39137b85184k4761R3525K59796K37487J77108K73527K91610p0115n37304n49066
$$ -285184 -309945 -216420 43376 280863 457971 731498 1023108 952993 415689 -133377
39127a33377j17825J82460R7452m6704n2606j66080m53070m96245p6014L85117
$$ -133377 -251202 -68742 28710 -17994 -70600 -236680 -689750 -1185995 -1262009 -876892
39117h76892M64547L43023L37331L02107Q190k87856k19780M8650J15752J9164
$$ -876892 -412345 -69322 268009 570116 578306 290450 70670 119320 235072 254236
39107B54236O9254K23371J90450J834o7574k7182j03737k60922k91213k68700
$$ 254236 323490 546861 737311 739145 671571 644389 540652 279730 -11483 -280183
39097b80183l88840m71659j88658K83770M18902J35615j22526j11312j6357P7222
$$ -280183 -669023 -1140682 -1329340 -1045570 -626668 -491053 -613579 -724891 -741248 -664026
39087f64026L35497O62578O23083J15918l55844l52178m9799J09026n601k03653
$$ -664026 -328529 334049 957132 1073050 717206 365028 315229 424255 418654 215001
39077B15001k83113j70848M3970J40032K4327p3780N3107J55197j38599o01292
$$ 215001 -68112 -238960 -194990 -54958 -30631 -104411 -51304 103893 -34706 -635998
39067f35998n69567P3459O18706M78238l7109k17349Q1556L36583J04237m07541
$$ -635998 -1205565 -1132106 -513400 -35162 -72271 -289620 -208064 128519 232756 -174785
39057a74785n69766q4404N78631O81945J66021k69967j89237j2376k07818m43434
$$ -174785 -744551 -828955 -250324 431621 597642 327675 138438 126062 -81756 -525190
39047e25190j93160K74152L30030O3702J5145J14023q5507l27680j0473M71356
$$ -525190 -718350 -444198 -114168 -50466 -35321 78702 -6805 -334485 -344958 126398
39037A26398J15802q24467q89090K40580R99987L43899n90418l66526M80003N01496
$$ 126398 242200 -582267 -1471357 -1230777 -230790 113109 -477309 -843835 -363832 137664
39027A37664k58734n33049J0093M41574K48997n6683p5515p2856k12090k03034
$$ 137664 -121070 -654119 -644026 -202452 46545 -10138 -85653 -158509 -370599 -573633
39017e73633N8802K60892K31570J02008r9851l88871m40696K0205N31683L69054
$$ -573633 -514831 -253939 -22369 79639 -20212 -409083 -849779 -829574 -297891 71163
39007G1163l13048o13704k09364K53171K21052o3479j49395k1101R7147R7085
$$ 71163 -241885 -855589 -1064953 -811782 -590730 -654209 -803604 -824705 -727558 -630473
38997f30473j7702j19812L3169L87848M19290q0754l86770J74159R39395O98916
$$ -630473 -648175 -767987 -734818 -346970 72320 -8434 -395204 -221045 718350 1417266
38987A417266l80671q91581l42931J90531l4826k84480J65579O48965K61795n54631
$$ 1417266 1036595 145014 -197917 -7386 -42212 -326692 -161113 487852 749647 195016
38977A95016p43081k84558K1416k7973K9204K41902J76407j64595l03507j61830
$$ 195016 -548065 -832623 -811207 -839180 -809976 -568074 -391667 -556262 -859769 -1021599
38967a021599j22510k04229j1397M00389M38663k5843l33221m7076L62572K90223
$$ -1021599 -1144109 -1348338 -1359735 -959346 -520683 -546526 -879747 -926823 -564251 -274028
38957b74028p2229j02722K78637N49291L78526J7221j44574p0380K785o4747j91744
$$ -274028 -346257 -448979 -170342 378949 757475 774696 630122 559742 562527 497780 306036
38946C06036k51275k18730j27403L895J20616R8623j14842l68179m36567k53883
$$ 306036 54761 -163969 -291372 -287477 -166861 -68238 -183080 -551259 -987826 -1241709
38936a241709Q8010M68635O99921N15689q4647n82082m43580J25327L96032J40994
$$ -1241709 -1153699 -685064 14857 530546 445899 -136183 -579763 -454436 -58404 82590
38926H2590j03420K6475J42209j50378m92739l42936J09379K67382J00883Q0345
$$ 82590 -20830 5645 147854 -2524 -495263 -838199 -728820 -461438 -360555 -280210
38916b80210K67850K30297r5796j94386J47323L96786R2101m10408m72633j07991
$$ -280210 -12360 217937 122141 -72245 75078 471864 563965 153557 -319076 -427067
38906d27067J31662J6456j24153j3126J67093J18279j22426k70151j64829J19426
$$ -427067 -295405 -278949 -403102 -416228 -249135 -130856 -253282 -523433 -688262 -568836
38896e68836M28687O13636N30863J81851j41797r8131K19937K94903j11452n20489
$$ -568836 -140149 473487 1004350 1186201 1044404 946273 1166210 1461113 1349661 829172
38886H29172l72502Q1159O7671n11132q14067k79965M83783N72392J03498o9463
$$ 829172 456670 537829 605500 94368 -719699 -999664 -515881 56511 160009 90546
38876I0546K38091K82210l27013q85831o01065K21208N98192J94928l83360n29560
$$ 90546 328637 610847 283834 -601997 -1203062 -981854 -383662 -188734 -572094 -1101654
38866a101654k79967N5713L71831O13182N49417R1343l75705l64135P0421L79304
$$ -1101654 -1381621 -1325908 -954077 -340895 208522 299865 -75840 -439975 -369554 9750
38856I750K15664j99368m28270k76906J30901M82028M45808M346l56280j48099
$$ 9750 225414 26046 -402224 -679130 -548229 -66201 379607 383953 27673 -120426
38846a20426L55149L40997l42376p80637k52314O13797O44572k15199q65325o09251
$$ -120426 234723 575720 233344 -547293 -799607 -185810 458762 243563 -621762 -1231013
38836a231013P1432M38148M26564L42667K57423J21440L9797N4711o323j86779
$$ -1231013 -1159581 -721433 -294869 47798 305221 426661 466458 521169 514846 328067
38826C28067k60459j62472j41289k42083j35368K26091L30583p1356m07361j16532
$$ 328067 67608 -94864 -236153 -478236 -613604 -387513 -56930 -128286 -535647 -652179
38816f52179M24116M75968P3422j53033l0962N0337m3152l9197R4456P6544o8986
$$ -652179 -228063 247905 321327 168294 137332 187669 144517 105320 199776 276320 207334
38805B07334o258K16944J48811k47810m31779j59616J20552M2628j17545j9795
$$ 207334 201076 418020 566831 319021 -112758 -272374 -151822 -109194 -226739 -246534
38795b46534J56129J34648P5159K01981K99435Q1979k40760k76595q7750j3828
$$ -246534 -90405 44243 119402 321383 620818 702797 462037 185442 97692 83864
38785H3864n5716L5178J79903M5709l11771m20459j15189J82458R9947j61003
$$ 83864 28148 63326 243229 288938 -22833 -443292 -558481 -376023 -276076 -437079
38775d37079j87082N8497K96346L65715K95959Q4029k63940n04887l21871J80215
$$ -437079 -624161 -565664 -269318 96397 392356 476385 212445 -292442 -614313 -434098
38765d34098M37686J12886l83849l74899J56334N04975K17847k59873k31081K25372
$$ -434098 3588 116474 -267375 -642274 -485940 19035 236882 -22991 -254072 -28700
38755b8700L65300j07452n63658l27634L57079O52174K37612l45668m80380j94740
$$ -28700 336600 229148 -334510 -662144 -305065 347109 584721 239053 -241327 -436067
38745d36067P5575J38725J56067K36129K45431O3387k00030l34410k44609J6351
$$ -436067 -360492 -221767 -65700 170429 415860 479247 279217 -55193 -299802 -283451
38735b83451K90538L44302L8459m21492n84856k67884J87462L53564K52264J94921
$$ -283451 7087 351389 389848 -31644 -616500 -884384 -696922 -343358 -91094 103827
38725A03827K32168J19727j94864m15865l07010L3147L77161N73644M83744L6129
$$ 103827 335995 455722 260858 -155007 -462017 -428870 -51709 521935 1005679 1041808
38715A041808n23569p40070m73498o0971J76530K78046L32012K03006j32524l11885
$$ 1041808 518239 -221831 -695329 -756300 -579770 -301724 30288 233294 100770 -211115
38705b11115n2106L28852K87964j60664m62776l06545J462L1629j97256l11615
$$ -211115 -263221 65631 353595 192931 -269845 -576390 -574928 -543299 -740555 -1052170
38695a052170j01737K19696K91921O5884j28969l5935J78411K24895J66541K35857
$$ -1052170 -1153907 -934211 -642290 -576406 -705375 -741310 -562899 -338004 -171463 64394
38685F4394L03833L8112m15176n02643j43574R3692o2854j35826K24389N71178
$$ 64394 368227 406339 -8837 -511480 -655054 -561362 -624216 -760042 -535653 35525
38675C5525M04699j711j34086p7888j61054k40938o8843Q5324n8819j18672K57080
$$ 35525 440224 438513 304427 226539 65485 -175453 -244296 -158972 -217791 -336463 -79383
38664g9383N01017j8602o64590l17680P09226R56201Q5847n93543k43223K89590
$$ -79383 421634 403032 -261558 -579238 129988 1086189 1172036 578493 335270 624860
38654F24860N4046m66394l57266J50896K05044j99182l43462l8347K17236J91893
$$ 624860 678906 212512 -144754 6142 211186 12004 -331458 -369805 -152569 39324
38644C9324K15730M80011O56760L70423k72488p30958n48884Q2457L60660j91309
$$ 39324 255054 735065 1391825 1762248 1489760 758802 209918 292375 653035 461726
38634D61726r16210p38976K80330Q87112L75614m45753n20838K769K80993J12681
$$ 461726 -454484 -1193460 -913130 -26018 349596 -96157 -616995 -614226 -333233 -220552
38624b20552l2492P0935K21583K83948K43565l892l95262n12310j48456K69436
$$ -220552 -253044 -182109 39474 323422 566987 563095 167833 -344477 -492933 -223497
38614b23497L17430K17789K92917K64701j92963o47061m85121K6615J38289j68121
$$ -223497 93933 311722 604639 869340 676377 29316 -455805 -429190 -290901 -459022
38604d59022k55501K9188K03781Q5351j439M8096J9665N582K66072M64735P053
$$ -459022 -714523 -685335 -481554 -396203 -397642 -349546 -329881 -324299 -58227 406508 413561
38593D13561p58408p32303K48412R59857N21144l74328o06334j82429J42351J52029
$$ 413561 -344847 -1077150 -828738 131119 652263 277935 -328399 -510828 -368477 -216448
38583b16448J84440K59281P2470k93851l96034j33129J50497K36697K05012P9178
$$ -216448 -32008 227273 299743 5892 -390142 -523271 -372774 -136077 68935 148113
38573A48113j85943l58674q9029M74168O84984K32856l78943m56859J5743M29064
$$ 148113 -37830 -396504 -485533 -11365 673619 906475 527532 70673 86416 515480
38563E15480L50803j6411k09882j04689J8303q7357l00878k94083N2989M66992
$$ 515480 866283 849872 639990 535301 553604 466247 165369 -128714 -75725 391267
38553C91267N24220R3459m61382o05215k28624J95623K02995o0252j07746J24944
$$ 391267 915487 1008946 547564 -57651 -286275 -90652 112343 52091 -55655 69289
38543F9289K28031N3701k5029J89848K84966j09341o42372p08881k98418J07974
$$ 69289 297320 351021 325992 515840 800806 691465 49093 -659788 -958206 -850232
38533h50232K47723J96759J4948k03812j47403K75384N18962P2183o31481p23354
$$ -850232 -602509 -405750 -390802 -594614 -742017 -466633 52329 124512 -506969 -1230323
38523a230323k13477O4509j53753j86533L30111P56329N11150K476j18959M4930
$$ -1230323 -1443800 -1379291 -1533044 -1719577 -1389466 -633137 -121987 -119511 -238470 -193540
38513a93540P0777N7113K67635L83969m4319o79043p56353k39181J78646J72760
$$ -193540 -122763 -65650 201985 585954 541635 -137408 -893761 -1132942 -954296 -781536
38503g81536J16720K58970L39320K08545J22456J50507l6285m27411l90819L31854
$$ -781536 -664816 -405846 -66526 142019 264475 414982 378697 -48714 -439533 -107679
38493a07679R20937M98628n14623q97117l39629K25414J21610j46865Q5723M67364
$$ -107679 813258 1311886 797263 -99854 -439483 -214069 -92459 -239324 -153601 313763
38483C13763K32388m49237o27063j8646N36034L05455l24178m98318q3943L15042
$$ 313763 546151 96914 -530149 -548795 -12761 292694 -31484 -529802 -613745 -298703
38473b98703K89899N4397k1981J05600K25815J60879r4139l65342m05929j42913
$$ -298703 -8804 45593 23612 129212 355027 515906 421767 56425 -349504 -492417
38463d92417J79197K35380Q446j85724r0030J79366K74936M0806k78025l14885
$$ -492417 -313220 -77840 -69394 -255118 -345148 -165782 109154 149960 -128065 -442950
38453d42950m9488J51041L3439j90596j78690N0543K40697L25393L53792J67580
$$ -442950 -492438 -341397 -307958 -498554 -677244 -626701 -386004 -60611 293181 460761
38443D60761l32786p15529m53872J72357L44551k4541j31217L42452O30801J90252
$$ 460761 127975 -587554 -1041426 -869069 -524518 -549059 -680276 -337824 292977 483229
38433D83229l16573j35256K71876L8666n67808n68215R5263N05983K55897j11238
$$ 483229 166656 31400 303276 341942 -225866 -794081 -698818 -192835 63062 -48176
38423d8176j88438k04202k50009L1361O56259J001607O84616J11035j96645k67597
$$ -48176 -236614 -440816 -690825 -659464 -3205 998402 1683018 1794053 1597408 1329811
38413A329811l66580n00045n43625m82086l08769j5852K23653K19492J04682R6643
$$ 1329811 963231 463186 -80439 -562525 -871294 -887146 -663493 -444001 -339319 -242676
38403b42676J3550m12062q27201n78688K19906O84945L85672j23462j96195J35344
$$ -242676 -229126 -641188 -1468389 -2047077 -1827171 -1142226 -756554 -880016 -1076211 -940867
38393i40867N04952O98549N66112N0163m73069m58947R692K75746R3925q9677
$$ -940867 -435915 262634 828746 878909 405840 -53107 -43415 232331 326256 236579
38383B36579J8598J65031J81448K45727K88097n0278n93897o30164p8695K29488
$$ 236579 255177 420208 601656 847383 1135480 1085202 491305 -138859 -217554 11934
38373A1934j18892m26296q8358L94838L24332m3124l5318L31243N38472L99550
$$ 11934 -106958 -533254 -621612 -226774 97558 54434 19116 350359 888831 1288381
38363A288381P8815k87110m85418k41550K28951K78597j55174l24913P5421L05159
$$ 1288381 1367196 1080086 594668 353118 582069 860666 705492 380579 456000 761159
38353G61159j61724o81569n26357n5140Q1924P9385L38036M77061O4110l69904
$$ 761159 599435 -82134 -608491 -663631 -581707 -502322 -164286 312775 376885 6981
38343F981j79009J79799l8299m47225k21131L18189K10077l96741m37024K81458
$$ 6981 -172028 7771 -30528 -477753 -698884 -380695 -170618 -567359 -1004383 -722925
38333g22925Q25208O38191R8610l77647o66027m85454K33452O92047J36127p65095
$$ -722925 102283 740474 839084 461437 -204590 -690044 -456592 235455 371582 -393513
38323c93513p55268m070K10649k62514k38639N86935R77432K48477n93668n64178
$$ -393513 -1148781 -1152851 -942202 -1204716 -1443355 -856420 121012 369489 -224179 -788357
38313g88357j32138p3417j38036J73236N30797M44131J84299J68589J52862j69134
$$ -788357 -920495 -993912 -1131948 -958712 -427915 16216 200515 369104 521966 352832
38303C52832m42070k76074K1385J7832j34140j53467j65824k23928J7699N69967
$$ 352832 -89238 -365312 -343927 -326095 -460235 -613702 -779526 -1003454 -985755 -415788
38293d15788P74425L18024j51729p1303J48050j2796k17669j6741J92939j05210
$$ -415788 358637 676661 524932 453629 601679 588883 371214 354473 547412 442202
38283D42202n00072l31549J26760J87980j5751J05814L84900J74867l73691m54878
$$ 442202 -57870 -389419 -262659 -74679 -90430 15384 400284 575151 201460 -253418
38273b53418J7431K50056j06499m43940k39733J97427L31590J25072j24340j98230
$$ -253418 -235987 14069 -92430 -536370 -776103 -578676 -247086 -122014 -246354 -444584
38263d44584l693M02056O97938N53477P1159l24490m24926l54444k33973j00860
$$ -444584 -448277 -46221 651717 1205194 1276353 951863 526937 172493 -61480 -162340
38253a62340q5762k64300l74438p6845N13427R02448Q06288L71323j13501m17776
$$ -162340 -248102 -512402 -886840 -963685 -450258 452190 1258478 1629801 1516300 1098524
38243A098524l93369j32233k047k04991m26333k56771J80052L94465K04393j33609
$$ 1098524 705155 572922 570875 365884 -60449 -317220 -137168 257297 461690 328081
38233C28081l63181m26933l12455n2243J86564K89507L38483L24398k968o27705
$$ 328081 -35100 -462033 -774488 -826731 -640167 -350660 -12177 312221 309253 -318452
38223c18452r33789m21237M62669Q13566M67062P6294N0643J12731J2003j2014
$$ -318452 -1252241 -1673478 -1210809 -397243 69819 146113 196756 309487 321490 309476
38213C09476K22289L74086P5348m45553o29975l08873J47015L05637P5005l20116
$$ 309476 531765 905851 981199 535646 -94329 -403202 -256187 49450 124455 -195661
38203a95661n68239m65403k9078M78438O81134L87701j59117m50774k73520K4178
$$ -195661 -763900 -1229303 -1258381 -779943 -98809 288892 129775 -320999 -594519 -570341
38193e70341K8000j49333j14964J16290J79368N1757R2291L25948L44164Q2622
$$ -570341 -542341 -691674 -806638 -690348 -510980 -459223 -366932 -40984 303180 385802
38183C85802p708J69978R3594l64325m86182J09336O30535K85657l89536l73431
$$ 385802 378094 548072 641666 277341 -208841 -99505 531030 816687 427151 53720
38173E3720J95972L43021r6789l43678j05514L6955j77812k03313K64664O60126
$$ 53720 249692 592713 495924 152246 46732 83687 -94125 -297438 -32774 627352
38163F27352M35045j13904l70608k33943j7775Q1754O4417m1282j64282k08227
$$ 627352 1062397 948493 577885 343942 326167 407921 472338 431056 266774 58547
38153E8547j94510j98728j68510m7207L2351k0181p801K00504L23377J34362l4107
$$ 58547 -135963 -334691 -503201 -550408 -518057 -538238 -546039 -345535 -22158 112204 78097
38142G8097J53143L03226j19477p45188p33278j03133L29823K78352K12248K55218
$$ 78097 231240 534466 414989 -330199 -1063477 -1166610 -836787 -558435 -346187 -90969
38132i0969k611m17799k24039N69666Q80581K02061n46963m97543j05576j17814
$$ -90969 -93580 -511379 -735418 -165752 714829 916890 369927 -127616 -233192 -351006
38122c51006k34213J52612O34466L77858m00773o70587j15965N22008N86524K10410
$$ -351006 -585219 -432607 201859 579717 178944 -491643 -607608 -85600 500924 711334
38112G11334j33729j87628M633J51658m8292m35633m44411N4419M12443J50378
$$ 711334 577605 389977 394610 546268 497976 62343 -382068 -327649 84794 235172
38102B35172k67636k01707J22353Q5589k12617j61236K85355N65958M24276J16714
$$ 235172 -32464 -234171 -111818 -26229 -238846 -400082 -114727 451231 875507 992221
38092I92221j80414m57335m82880o2464M03353L44614p6508k29699p7493j33954
$$ 992221 811807 354472 -128408 -190872 212481 557095 480587 250888 173395 39441
38082C9441m04578l09483K11663M64941J53731j23626O9381K73605r593m26369
$$ 39441 -365137 -674620 -462957 1984 155715 32089 101470 375075 365482 -60887
38072f0887l66358P2148L53870L59818L42340K95153p232m44220n66164k17074
$$ -60887 -427245 -355097 -1227 358591 700931 996084 988852 544632 -21532 -238606
38062b38606K30192L24931m959m62102o66555m31416J04050N76436O75763L55933
$$ -238606 -8414 316517 311558 -150544 -817099 -1248515 -1144465 -568029 107734 463667
38052D63667j41561m11133j86681L02880M48026j3176n60168n36949n5387K23849
$$ 463667 322106 -89027 -275708 27172 475198 462022 -98146 -635095 -690482 -466633
38042d66633P9927j02213j23962k16829l50908n5928P03464J146666O94539j50858
$$ -466633 -386706 -488919 -612881 -829710 -1180618 -1236546 -533082 613584 1308123 1157265
38032A157265n13639l14406j23076j71885j96339r4733p3522j37112j3097L17226
$$ 1157265 643626 329220 206144 34259 -162080 -256813 -330335 -467447 -480544 -163318
38022a63318M80638K43330j70564m12066l75192j41206J79220M31325M40976J75048
$$ -163318 317320 560650 390086 -21980 -397172 -538378 -359158 72167 513143 688191
38012F88191k03832m58810m06441l6610L70992M10735L4877k88501j65683J39400
$$ 688191 484359 25549 -380892 -417502 -46510 364225 399102 110601 -55082 84318
38002H4318P4465l51403n40656j78040L12419L76081N4400j71859n7220J87189
$$ 84318 158783 -192620 -733276 -911316 -598897 -222816 -168416 -340275 -397495 -210306
37992b10306K75158J88984R0246M8933j3633j41374k23737j36247O4950K08102
$$ -210306 64852 253836 344082 393015 379382 238008 14271 -121976 -57026 151076
37982A51076K29715J87266Q8871p4191j45547M0797K80256J57947k65931l77679
$$ 151076 380791 568057 656928 582737 437190 477987 758243 916190 650259 272580
37972B72580Q6684N08768K28294m47194o73988k87581Q1140K7262j71972j94571
$$ 272580 359264 868032 1096326 649132 -24856 -312437 -231297 -204035 -376007 -570578
37962e70578j33685j25859m6026J83346L83041M12824L31554J63087j03151k28865
$$ -570578 -704263 -830122 -876148 -692802 -309761 103063 434617 597704 494553 265688
37952B65688N3015M49224L30463k84416o18367k83085J50403J19881r8642p5190
$$ 265688 318703 767927 1098390 813974 195607 -87478 62925 182806 84164 8974
37942H974m8964l39086n26240j09974M51470L47622j96201j94919M80151Q36113
$$ 8974 -39990 -379076 -905316 -1015290 -563820 -216198 -412399 -607318 -127167 708946
37932G08946L12470l77950l75922J41217M17083J78084k75365o22351p04218m55145
$$ 708946 1021416 643466 267544 408761 825844 1003928 728563 106212 -598006 -1053151
37922a053151l0610K25361K06497J82238L11707L59651J43244r1612n0355J52941
$$ -1053151 -1083761 -858400 -651903 -469665 -157958 201693 344937 253325 202970 355911
37912C55911K32757J67607R6069J7740j01388j40533l2721L2538j08022k86625
$$ 355911 588668 756275 852344 870084 768696 628163 595442 627980 519958 233333
37902B33333k47918l5153J10594R0220k0793j29581j50093l7500Q8115P1517L7551
$$ 233333 -14585 -49738 60856 151076 130283 702 -149391 -186891 -98776 -27259 10292
37891A0292K42337N33903M26815j11791m92241m02163k77997m54103m82834N1762
$$ 10292 252629 786532 1213347 1101556 609315 207152 -70845 -524948 -1007782 -956020
37881i56020O04677L93996l18557n82123j89287J74017J44885R8931K44769K19393
$$ -956020 -351343 42653 -275904 -858027 -1047314 -873297 -728412 -629481 -384712 -165319
37871a65319j32195l63614j75167J08773J74322K13829L92431M03975L0924l49601
$$ -165319 -297514 -661128 -836295 -727522 -553200 -339371 53060 457035 487959 138358
37861A38358l32040j52701k65799n62402n57388j68120J95525K40794R1608J5383
$$ 138358 -193682 -346383 -612182 -1174584 -1731972 -1900092 -1704567 -1463773 -1372165 -1356782
37851a356782J49457M50129O81171N41101K0946m61272m87885j13921K53534L30861
$$ -1356782 -1207325 -757196 -76025 465076 486022 24750 -463135 -577056 -323522 7339
37841G339J49195j02532k45768k04609o1888L3214N0394O2842P0191K3742j2521
$$ 7339 156534 54002 -191766 -396375 -458263 -425049 -374655 -311813 -241622 -217880 -230401
37830b30401K8866K0733j25431j44693J94357M91813J62320n07977n62473J54107
$$ -230401 -201535 -180802 -306233 -450926 -256569 235244 397564 -110413 -672886 -518779
37820e18779O13120J38098n60385n66509j63142j38841l41486l7803O53731Q49163
$$ -518779 94341 232439 -327946 -894455 -1057597 -1196438 -1537924 -1575727 -921996 -72833
37810g2833L19144k32062l38974k59554j97984R605K49136Q1165l80949m00954
$$ -72833 246311 14249 -324725 -584279 -782263 -772658 -523522 -442357 -823306 -1224260
37800a224260K14407O74892L67667k50191m04423l9541L82377N78946M77199M9911
$$ -1224260 -1009853 -334961 32706 -217485 -621908 -661449 -279072 299874 777073 826984
37790H26984m24292m23695N3598K94645j00441n39801l42148K04698L46052l974
$$ 826984 402692 -21003 32595 327240 226799 -313002 -655150 -450452 -104400 -108374
37780a08374l27514l72360k58107J7845M74564P44419M61125q9509l35663k66163
$$ -108374 -435888 -808248 -1066355 -1048510 -573946 170473 631598 542089 206426 -59737
37770e9737k62651k88224p426L97961L60012j05895l54392j27927J36765J48833
$$ -59737 -322388 -610612 -618038 -220077 139935 34040 -320352 -448279 -311514 -162681
37760a62681J41211K15238Q2218k57340l20842J8877K13986l7053k48159r535
$$ -162681 -21470 193768 275986 18646 -302196 -283319 -69333 -106386 -354545 -364080
37750c64080K79266J24047k14593k39865p0590p7097j15443J21704L55906J25166
$$ -364080 -84814 39233 -175360 -415225 -485815 -562912 -678355 -556651 -200745 -75579
37740g5579l31165m05837j49669j11244k62378j6984O08940P99610J94542m77579
$$ -75579 -406744 -812581 -962250 -1073494 -1335872 -1352856 -743916 55694 250236 -227343
37730b27343m51158N5942L69336L61590L61506M36616L54395Q5848j41524k33307
$$ -227343 -678501 -622559 -253223 108367 469873 906489 1260884 1346732 1205208 971901
37720I71901l03051l84379l58956j83813J1507Q7088N4721O4016K20045L74750
$$ 971901 668850 284471 -74485 -258298 -246791 -159703 -104982 -40966 179079 553829
37710E53829K16124k62770n49895k25026L21500K93896l45220p16127k58065M72075
$$ 553829 769953 507183 -42712 -267738 53762 347658 2438 -713689 -971754 -499679
37700d99679O51289L17428P1384M6707j15254m33931m63591o3429L12828K86564
$$ -499679 151610 469038 540422 587129 471875 37944 -425647 -489076 -176248 110316
37690A10316N1247k4435P6928J49768J52247J81640K01954N1485k82706n46768
$$ 110316 161563 137128 214056 363824 516071 697711 899665 951150 668444 121676
37680A21676m44515J8604M52556M43216K9172l18000k69637j8665O7663k5806
$$ 121676 -322839 -304235 148321 591537 620709 302709 33072 14407 82070 56264
37670E6264m4979N4427L5756k10872m57415m09263m7590L32798L79897N7349k16903
$$ 56264 11285 65712 101468 -109404 -566819 -976082 -1023672 -690874 -310977 -253628 -470531
37659d70531k4771L94031L26154l38306p05508p8013Q56576Q20933k34960j004462
$$ -470531 -495302 -101271 224883 -113423 -818931 -896944 -40368 780565 545605 -458857
37649d58857o22637K72240O20416L14683n4709k33739l87685m78399k53031K10652
$$ -458857 -1081494 -809254 -188838 125845 71136 -162603 -550288 -1028687 -1281718 -1071066
37639a071066M76710L16929l5534k28167j54867J6797M1295j30091k27501K191
$$ -1071066 -594356 -277427 -312961 -541128 -695995 -679198 -637903 -767994 -995495 -993304
37629i93304L29091K72633j07407j70974K71431M80929j10962q41573o46759L39641
$$ -993304 -664213 -391580 -498987 -669961 -398530 82399 -28563 -870136 -1516895 -1177254
37619a177254R21500N39497p8079j64386M2718m7701l67566m44411k43496j19193
$$ -1177254 -255754 283743 205664 41278 83996 36295 -331271 -775682 -1019178 -1138371
37609a138371j30514J2910L57517N44209L33206m7434k15023q7599J01425J30109
$$ -1138371 -1268885 -1255975 -898458 -354249 -21043 -68477 -283500 -371099 -269674 -139565
37599a39565J4171q0188q2774r6662j84264j90529M0200L29591L16913j3417k46501
$$ -139565 -125394 -205582 -288356 -385018 -569282 -759811 -719611 -390020 -73107 -86524 -333025
37588c33025j05855J76494K58089J82880J91325K50204J40922r1960j67412l3804
$$ -333025 -438880 -262386 -4297 178583 369908 620112 761034 669074 501662 467858
37578D67858N5620q540j4858J62133K87635J15635k12147l64699k76251j54802
$$ 467858 523478 514938 500080 662213 949848 1065483 853336 488637 212386 57584
37568E7584j23016j03050l8392P620R236K4178J7755j50020m42393n52971k99863
$$ 57584 -65432 -168482 -206874 -199254 -190018 -165840 -148085 -298105 -740498 -1293469 -1593332
37557a593332L8165O5757j14993J808N35897R10191O04396p6859m00328k01443
$$ -1593332 -1555167 -1489410 -1604403 -1602595 -1066698 -156507 447889 371030 -29298 -230741
37547b30741J6918m1822q3359R8129J51386j78411m09589Q525O65843O13426k08290
$$ -230741 -213823 -255645 -339004 -240875 -89489 -267900 -677489 -668964 -3121 610305 402015
37536D02015p76571m46618J64886K14175j18598j01784K77858L56195n3108l60973
$$ 402015 -374556 -821174 -656288 -442113 -560711 -662495 -384637 -28442 -81550 -442523
37526d42523j43269L05072N35738M83623K34082j80836m93581k75112L46732N84955
$$ -442523 -585792 -280720 255018 738641 972723 791887 298306 23194 369926 954881
37516I54881O5421n10830l57917K01283K83369j29955k25971K31793M82848J1130
$$ 954881 1020302 509472 151555 352838 636207 506252 280281 512074 994922 1006052
37506A006052o20467o49257j98201R4336Q5826J32791L28870L75762J69180k7004
$$ 1006052 385585 -263672 -461873 -367537 -281711 -148920 179950 555712 724892 697888
37496F97888n9390r2238k02455j53460J88064M77613K56656l85082q06733n66569
$$ 697888 638498 546260 343805 190345 378409 856022 1112678 727596 -79137 -645706
37486f45706K5400L06841J20635l9235J80836M31190K25641k14989k47181J44261
$$ -645706 -620306 -313465 -192830 -232065 -51229 379961 605602 390613 143432 287693
37476B87693K56105j96813n43595j88546M15154M66843N7489q9119J27525R9132
$$ 287693 543798 346985 -196610 -385156 29998 496841 554330 465211 592736 691868
37466F91868l08051m26678N5342M59401J68373l65813l52452R5740K46766j3224
$$ 691868 383817 -42861 12481 471882 640255 274442 -78010 17730 264496 251272
37456B51272r2045K02389L22747m2271l93573k21138J92186K69469L7486l7127
$$ 251272 159227 361616 684363 642092 248519 27381 219567 489036 526522 489395
37446D89395J36493K17051J12702J32564L67288M50867J87485j4750K81425Q01366
$$ 489395 625888 842939 955641 1088205 1455493 1906360 2093845 2079095 2360520 3161886
37436C161886Q44800K44084l92851m94628k24885j32259l44869m76226k93479
$$ 3161886 4006686 4250770 3857919 3363291 3138406 3006147 2661278 2185052 1891573
37427A891573q9033j94528m12080k95137J07059K36189j26402m35585j49518L96696
$$ 1891573 1802540 1608012 1195932 900795 1007854 1244043 1117641 682056 532538 929234
37417I29234L98378k48681p63422n74179m8999J71974J11400K30114N38251N27743
$$ 929234 1327612 1078931 315509 -258670 -307669 -135695 -24295 205819 744070 1271813
37407A271813r35n59343o11409k44519N1950N8173j4247N0298J68248J60697O5291
$$ 1271813 1270878 711535 100126 -144393 -92443 -34270 -48517 1781 170029 330726 396017
37396C96017N3650R9452k4010l25352m27179p3338L81017L80075q352j83799N589
$$ 396017 449667 549119 525109 199757 -227422 -300760 80257 460332 451980 268181 273770
37385B73770j5926n38017q75377k92714P79884J196395O13091j61630l47693m3512
$$ 273770 257844 -280173 -1155550 -1448264 -668380 528015 1141106 979476 631783 588271
37375E88271K43614K89449J11280k48780n77982n30954j19625J75612O3649j30269
$$ 588271 831885 1121334 1232614 983834 405852 -125102 -244727 -69115 -5466 -135735
37365a35735l189K94018L51308J73485J18000K71587L12260L4396l00169k76648
$$ -135735 -138924 155094 506402 679887 797887 1069474 1381734 1416130 1115961 839313
37355H39313J42240N37685N04955J22055j85813k22125j62581j9278N50279J462813
$$ 839313 981553 1519238 2024193 2146248 1960435 1738310 1575729 1556451 2106730 3569543
37345C569543J726932N62609j215208j922560j174819k89670k55843m42572L4752
$$ 3569543 5296475 5859084 4643876 2721316 1546497 1256827 1000984 558412 593164
37336E93164P35962O92507K4969l85322l76836m90593p22471m82667J94682N13170
$$ 593164 1329126 2021633 2046602 1661280 1284444 793851 71380 -411287 -216605 296565
37326B96565J92730q5055J60202M52012K22904k40476k67628K00239N81792M25575
$$ 296565 489295 404240 564442 1016454 1239358 998882 731254 931493 1513285 1938860
37316A938860j20670n31312m63168j34960n2957k66662k38350K45016N22781M4001
$$ 1938860 1818190 1286878 823710 688750 635793 369131 130781 375797 898578 942579
37306I42579n62935l24272M68602O15927p7791n09053j13908L10247J46173M5362
$$ 942579 379644 55372 523974 1139901 1062110 553057 439149 749396 895569 940931
37296I40931O14797J097912N00497p01279j168656n93135J12547K66824N5615
$$ 940931 1555728 2653640 3154137 2452858 1284202 691067 803614 1070438 1126053
37287A126053j68710l18949l07196q6060O1285j10827k80380k9407L57272L01184
$$ 1126053 957343 638394 331198 245138 306423 195596 -84784 -114191 243081 544265
37277E44265m8910m6449L06298L62300J2889q6731L14229N61021J26336n95562
$$ 544265 495355 448906 755204 1117504 1130393 1043662 1357891 1918912 2045248 1449686
37267A449686r37244p97228m55487r2441J50451J18758k6719J07151M78409N46687
$$ 1449686 512442 -284786 -740273 -832714 -682263 -563505 -590224 -483073 -4664 542023
37257E42023J41369j98601r9581N1152j44453l30714J715N80355O82905J72327
$$ 542023 683392 484791 385210 436362 291909 -38805 -37090 543265 1226170 1398497
37247A398497l81669m92832k08353J38098K57347O7886k18577k85089j13685K2964
$$ 1398497 1016828 523996 315643 453741 711088 778974 560397 275308 161623 184587
37237A84587M0743J32731K87634K32492J1836Q125J58145j10428p98652j026056
$$ 184587 225330 358061 645695 878187 890023 898148 1056293 945865 147213 -878843
37227h78843l56180M00031M14431N3228J1065O9071k25392m07731J13368P38599
$$ -878843 -1235023 -834992 -420561 -367333 -356268 -287197 -512589 -920320 -806952 -68353
37217f8353N38872o0621M8582O83283O86301q311l46012j11066j12587l57080
$$ -68353 470519 409898 458480 1141763 1828064 1819753 1473741 1362675 1250088 893008
37207H93008L7974Q71830Q43733o1746l12692M69339R29431R34969K284992M871668
$$ 893008 930982 1802812 2646545 2584799 2272107 2741446 3670877 4605846 6890838 11762506
37197A1762506N096313Q19933m440878n611681k822540n15111p52344j338883
$$ 11762506 16858819 17678752 13237874 7626193 4803653 4288542 3536198 2197315
37189B197315n51916K43669k53374q85792m32466K12422p607l16959J76816O06619
$$ 2197315 1645399 1889068 1635694 749902 317436 529858 522251 205292 382108 988727
37179I88727O172p00410k51360O65135N76929k93430n92511j50184J00455N409
$$ 988727 994899 294489 43129 708264 1285193 991763 399252 249068 349523 354932
37169C54932K04101N47738K22634n90854p56850j9281N94424M41565P4300M3011
$$ 354932 559033 1106771 1329405 738551 -18299 -37580 556844 998409 1072709 1115720
37159A115720L6498k89990n66723l76101N527Q9113p0172q4012J09670K20351
$$ 1115720 1152218 862228 295505 -80596 -75069 14044 -56128 -140140 -30470 189881
37149A89881R6007p1927m0591J40964J85834j983j09221J36790M35770K72249
$$ 189881 285888 213961 173370 314334 500168 498185 388964 525754 961524 1233773
37139A233773k37566m48599k13558r2976l09827l03900K25727O40347L72573r7696
$$ 1233773 996207 547608 334050 241074 -68753 -372653 -146926 493421 865994 768298
37129G68298o1473K34605J13143k95131k97611J58704M52513L13517P0731l5186
$$ 768298 706825 941430 1054573 759442 461831 620535 1073048 1386565 1457296 1422110
37119A422110p5835n9155M1580J1795k74751m55321j90572J92657J99011j0199
$$ 1422110 1346275 1287120 1328700 1340495 1065744 610423 419851 612508 811519 801320
37109H01320R798J22649p5701l68671k34976J43409J14163l03419m31560q1661
$$ 801320 811118 933767 858066 489395 254419 397828 511991 208572 -222988 -304649
37099c04649K01789J18957O799J16380K35509J98976J57318K07959K70369L50432
$$ -304649 -102860 16097 22896 139276 374785 573761 731079 939038 1209407 1559839
37089A559839M57253L64586l6039l49788k24679l997j50687l39027M9650P88177
$$ 1559839 2017092 2381678 2345639 1995851 1771172 1767175 1616488 1277461 1327111 2115288
37079B115288J090240Q75677Q03861J130798J460789J572545J561269J217107
$$ 2115288 3205528 4081205 4885066 6015864 7476653 9049198 10610467 11827574
37071A1827574K38722r31994j455730j311075j230997j426147j365121q73605
$$ 11827574 12066296 11134302 9678572 8367497 7136500 5710353 4345232 3471627
37063C471627m34583k75006j15595O8418j1290j92776k9350K43452l4642o68497
$$ 3471627 3037044 2762038 2646443 2714861 2703571 2510795 2481445 2724897 2690255 2021758
37053B021758p24733n8568M45949L50494J77387J95174o5292o78303q88334l27954
$$ 2021758 1297025 1238457 1684406 2034900 2212287 2407461 2342169 1663866 775532 447578
37043D47578L38627M68892K37235J0235j70700j81193K02917O78860O79167L62889
$$ 447578 786205 1255097 1492332 1502567 1331867 1150674 1353591 2032451 2711618 3074507
37033C074507L54917N40943L39969J03655P33876J813904J803158M20811q53066
$$ 3074507 3429424 3970367 4310336 4413991 5147867 6961771 8764929 9185740 8332674
37024H332674j096377j036462j272867j209906n27835j705m947J49427N56259
$$ 8332674 7236297 6199835 4926968 3717062 3189227 3187522 3182575 3332002 3888261
37015C888261J89215j026229j478442l89761P40108N45019j12750N9841N99741
$$ 3888261 4077476 3051247 1572805 1183044 1923152 2468171 2355421 2415262 3015003
37006C015003N64316M25847Q85600J173992L96241o15197o22964q6764j63131
$$ 3015003 3579319 4005166 4890766 6064758 6460999 5845802 5222838 5136074 4972943
36997D972943o17576n08279k5679P9569L8519L87267O26846J57067l58070j18258
$$ 4972943 4355367 3847088 3821409 3900978 3939497 4326764 4953610 5110677 4752607 4634349
36987D634349K93925P4465j95900K69011Q04863N30213Q6663L70052P07324J78295
$$ 4634349 4928274 5002739 4806839 5075850 5880713 6410926 6497589 6867641 7574965 7753260
36977G753260m22138Q0132J051098J172959O82758N98829Q61702J043706J566231
$$ 7753260 7331122 7411254 8462352 9635311 10318069 10916898 11778600 12822306 14388537
36968A4388537K464130K600672J889269K179899L952409M791440L623366L351076
$$ 14388537 16852667 19453339 21342608 23522507 27474916 32266356 35889722 39240798
36960C9240798O120579R397246J0632902J2043812J5874892J9017095J8621076
$$ 39240798 45361377 54758623 65391525 77435337 93310229 112327324 130948400
36953A30948400J9103014K6007960L7002086M8322596O5109366R0346672J04709609
$$ 130948400 150051414 176059374 213061460 261384056 326493422 416840094 521549703
36946E21549703P7327710N808787o9344126j03550269r2513914o6217340m8299213
$$ 521549703 598877413 604686200 535342074 431791805 339277891 273060551 224761338
36939B24761338l8011899k7921564j9770481j7465356j7693557j5494947j1908399
$$ 224761338 186749439 158827875 139057394 121592038 103898481 88403534 76495135
36932G6495135j0107184r259734p174615m866165m198958m218413l336860k400667
$$ 76495135 66387951 57128217 49953602 45087437 40888479 36670066 33333206 30932539
36924C0932539k620379k963427k214472j333135j456842j730796j210465q07725
$$ 30932539 28312160 25348733 23134261 21801126 20344284 18613488 17403023 16595298
36916A6595298j362656j808418j167383m44436o91668j051519n43690l862l99099
$$ 16595298 15232642 13424224 12256841 11812405 11120737 10069218 9525528 9521666 9122567
36907I122567q92551m51149J49049k19355r38895q13411j25334J62137J31428
$$ 9122567 8230016 7778867 7927916 7708561 6769666 5956255 5830921 5993058 6124486
36898F124486K46986Q3947o98475j181254n58564L15999L01733j04745J78770
$$ 6124486 6371472 6455419 5756944 4575690 4017126 4333125 4634858 4530113 4708883
36889D708883P77108N82497k07317m86889j60062n1455k81377k26249J52342K77594
$$ 4708883 5485991 6068488 5861171 5374282 5214220 5162765 4881388 4655139 4807481 5085075
36879E085075O4900q8565j75107l96188m43563J4160M94942L61790q8126j84902
$$ 5085075 5149975 5061410 4886303 4490115 4046552 4060712 4555654 4917444 4829318 4644416
36869D644416l6390m1468J79992J090794J931697J541545K28239o16479o47439
$$ 4644416 4608026 4566558 4746550 5837344 7769041 9310586 9538825 8922346 8274907
36860H274907q22489j474848j682100r49999j24190J2599j13921J18618L54751
$$ 8274907 7452418 5977570 4295470 3345471 3221281 3233880 3119959 3238577 3593328
36851C593328J2441m95144l05942M50223P08374j5264r13548r57454j88229M57278
$$ 3593328 3605769 3110625 2804683 3254906 3963280 3948016 3034468 2077014 1888785 2346063
36841B346063L93377j2453j56847o5072j48046l69381k59311K26779M89158J69501
$$ 2346063 2739440 2726987 2570140 2505068 2357022 1987641 1728330 1955109 2444267 2613768
36831B613768k74746k57198Q9077J85118j56145n85168p28726n08217r0432K22461
$$ 2613768 2339022 2081824 2170901 2356019 2199874 1614706 885980 377763 287331 509792
36821E09792K02653k9878j35777m6951j9653j17801p6151J73031L26911K69027
$$ 509792 712445 682567 546790 499839 480186 362385 286234 459265 786176 1055203
36811A055203K70727L97587L08847m8099k02736j2546k5146m66878o39457m5362
$$ 1055203 1325930 1723517 2032364 1984265 1781529 1768983 1743837 1276959 637502 592140
36801E92140O12071M60562j24642j92752J64888P0554n06341o39583k4635N07506
$$ 592140 1204211 1664773 1540131 1347379 1512267 1582821 1076480 436897 412262 919768
36791I19768L27395j39762k67219q7117J13731L32283N41422M47367n365l71741
$$ 919768 1247163 1107401 840182 753065 866796 1199079 1740501 2187868 2182503 1810762
36781A810762l25812j04289j3003M4591J99099K38554K0560j25476J32872N45622
$$ 1810762 1484950 1380661 1367658 1412249 1611348 1849902 1870462 1744986 1877858 2423480
36771B423480O21089L62825K28967M35741O72854N31429k2480o28270q63755o28782
$$ 2423480 3044569 3407394 3636361 4072102 4744956 5276385 5253905 4625635 3761880 3133098
36761C133098k62538j89553m10990n15474k67338M2772J3484k80704l80525p3197
$$ 3133098 2870560 2681007 2270017 1754543 1487205 1529977 1543461 1262757 882232 809035
36751H09035L16885L55899O1052j47186l6239J15427n3544m10062m98837k42851
$$ 809035 1125920 1481819 1542871 1395685 1359446 1474873 1421329 1011267 512430 269579
36741B69579n8677j77228k95690j33181J12591J96742K67888M33938L39143k25936
$$ 269579 210902 33674 -262016 -395197 -282606 -85864 182024 615962 955105 729169
36731G29169o86680l98887K90909N36277L23939L39329N96469L59639l94721o60528
$$ 729169 42489 -356398 -65489 470788 794727 1134056 1730525 2090164 1695443 1034915
36721A034915l0143N07443J30113m83555l41651J99389J28195m60003n73454j0011
$$ 1034915 1004772 1512215 1642328 1158773 817122 1016511 1144706 684703 111249 101238
36711A01238M16488K94641J03017J49971Q4332k60345m51865k37837L5603J05336
$$ 101238 517726 812367 915384 1065355 1149687 889342 437477 199640 235243 340579
36701C40579J67678K77928J29998k18739j85799L34817N95809J76742k30523O5051
$$ 340579 508257 786185 916183 697444 511645 846462 1442271 1619013 1388490 1453541
36691A453541N45064K87247n07122p86388k28285L96749M36041J23627P511K21642
$$ 1453541 1998605 2285852 1778730 992342 764057 1160806 1596847 1720474 1727985 1949627
36681A949627N02826N39162K32190j30133q0992L96425P52916P16970P79068J320070
$$ 1949627 2452453 2991615 3223805 3093672 3012680 3409105 4162021 4878991 5658059 6978129
36671F978129J846018J880462K012927K901465L636108K564872k16331k647670
$$ 6978129 8824147 10704609 12717536 15619001 19255109 21819981 21603650 18955980
36663A8955980l298476k822943k369295j964456j300244q41323j006087j169160
$$ 18955980 15657504 12834561 10465266 8500810 7200566 6359243 5353156 4183996
36655D183996o52854k000j04907o35799o07042n5186J04728k94157m52077l9348
$$ 4183996 3531142 3529142 3424235 2788436 2181394 2126208 2230936 1936779 1484702 1445354
36645A445354L03926J26165j54683o8124J73653J34950j75716m00159k69886J59525
$$ 1445354 1749280 1875445 1720762 1652638 1826291 1961241 1785525 1385366 1115480 1275005
36635A275005M75344K28634m27656p29035l32325R7021p4678l68022k0003O02925
$$ 1275005 1750349 1978983 1551327 822292 489967 586988 512310 144288 124285 727210
36625G27210N57060k7221j44988L21472M11276k07421p00388n53376k76004j92440
$$ 727210 1284270 1257049 1112061 1433533 1844809 1637388 937000 383624 107620 -84820
36615h4820J36535P03126O17289l17603q75290k44508N80503M05336k43373j67240
$$ -84820 51715 754841 1372130 1054527 179237 -65271 515232 920568 677195 509955
36605E09955M23265M31359j27358k78483P2625P3711l62948l50263K91203O08391
$$ 509955 933220 1364579 1237221 958738 1031363 1105074 742126 391863 683066 1291457
36595A291457J63044k24806O6977M43492K23781k16663k37176n2286j92376m54269
$$ 1291457 1454501 1229695 1296672 1740164 1963945 1747282 1510106 1457820 1265444 811175
36585H11175k83077J94173L65863J47232K6803J89651K82981R5615j10496r1087
$$ 811175 528098 722271 1088134 1235366 1262169 1451820 1734801 1830416 1719920 1628833
36575A628833O46p0774k15303j45669K01768N32774N03045J25834k06425j86364
$$ 1628833 1629479 1558705 1343402 1197733 1399501 1932275 2435320 2561154 2354729 2168365
36565B168365L4341J43221K22057O11169J214687J455956J129627P85992R10650
$$ 2168365 2202706 2345927 2567984 3179153 4393840 5849796 6979423 7765415 8676065
36556H676065J211093J226291J199433J659842K477776L183026M000426N443135
$$ 8676065 9887158 11113449 12312882 13972724 16450500 19633526 23633952 29077087
36548B9077087O717039N779779J775868l381108o756021p255768n989600m354359
$$ 29077087 35794126 41573905 43349773 39968665 33212644 25956876 19967276 15612917
36540A5612917k891550j810326j344386j265013r74619m63150m03798r70066j382250
$$ 15612917 12721367 10911041 9566655 8301642 7327023 6863873 6460075 5490009 4107759
36531D107759j084757n66571m26232l99386n6784K43327J2807l31954j23943K93664
$$ 4107759 3023002 2456431 2030199 1630813 1574029 1817356 1830163 1498209 1374266 1667930
36521A667930R0222n37115n96285J1150L04621j03212m06383p5229K63104K5502
$$ 1667930 1758152 1221037 624752 635902 940523 837311 430928 355699 618803 644305
36511F44305l08795j64674N1944k34205o04094l18724L43302M75045j3774l47359
$$ 644305 335510 170836 222780 -11425 -615519 -934243 -590941 -115896 -129670 -477029
36501d77029j66156Q2444O8181M0190K04309L52924L32700K94131K69924M2304
$$ -477029 -643185 -560741 -492560 -452370 -248061 104863 437563 731694 1001618 1043922
36491A043922l43411m36633m6275L62211K63378k30359n82727n35578k89655r3497
$$ 1043922 700511 263878 217603 579814 843192 612833 30106 -505472 -795127 -888624
36481h88624N9349K79531M91606M41481N0615l35829k82979J16574K74524n9978
$$ -888624 -829275 -549744 -58138 383343 433958 98129 -184850 -68276 206248 146270
36471A46270l58305p9903M35678M27051q5481k66522K50323P42842M40999l46675
$$ 146270 -212035 -291938 143740 570791 485310 218788 469111 1211953 1652952 1306277
36461A306277o84208k85033K29258K63838o0094k43389p7249K02497K51207k0855
$$ 1306277 622069 337036 566294 830132 770038 526649 449400 651897 903104 882249
36451H82249l50813l80117q4721J42783J3599j79751N8986O01853P09209O0305
$$ 882249 531436 151319 66598 209381 222980 43229 102215 704068 1413277 1473582
36441A473582o77173p01578j63204J38953n1814k13918j0721J97184N1617j74283
$$ 1473582 796409 94831 -68373 70580 18766 -195152 -205873 -8689 42928 -131355
36431a31355m8237L34230N48785M20573M6080m41370p63546n21714K15026O87389
$$ -131355 -179592 154638 703423 1123996 1170076 728706 -34840 -556554 -341528 345861
36421C45861L39428l60897n58872j84082J55359J89654J52509R8075j35221l32090
$$ 345861 685289 324392 -234480 -418562 -263203 -73549 78960 177035 41814 -290276
36411b90276r3178L54259L57716q5232l11253j55553j76308m85499l94698L14461
$$ -290276 -383454 -29195 328521 243289 -67964 -223517 -399825 -885324 -1280022 -965561
36401i65561P62998K87925m58522n01718M4308L80719K93056J65122J14061o1487
$$ -965561 -202563 85362 -373160 -874878 -830570 -449851 -156795 8327 122388 60901
36391F0901k98164l34765j98111p5031P1408K72385K67290l3675j78171J55688
$$ 60901 -237263 -572028 -770139 -845170 -773762 -501377 -234087 -267762 -445933 -290245
36381b90245N08119L14459j46729k21184L9440R1576m3407J57290O60273P66261
$$ -290245 217874 532333 385604 164420 203860 295436 252029 409319 1069592 1835853
36371A835853J80596n38694p87777n87063k75522k8569J48009L00328M92639O43288
$$ 1835853 2016449 1477755 689978 102915 -172607 -201176 -53167 247161 739800 1383088
36361A383088M81490m8031n35193o17556m88943m74841m21104n5196L49256L30346
$$ 1383088 1864578 1816547 1281354 663798 174855 -299986 -721090 -776286 -427030 -96684
36351i6684L5478l0314J24420P7292j72795k19401k0921Q4318Q1598K36853L83711
$$ -96684 -61206 -91520 32900 110192 -62603 -282004 -302925 -218607 -137009 99844 483555
36340D83555P2882n10643o11420n3039M43439L22325j05598k72128o8487K63339
$$ 483555 556437 45794 -565626 -618665 -175226 147099 41501 -230627 -299114 -35775
36330c5775M38180K06625l56011o30947j45267N52477M72782l29226p36675k13357
$$ -35775 402405 609030 253019 -377928 -523195 29282 502064 172838 -563837 -777194
36320g77194M66331M77133N5639j42363n4364j0056p5008j15046j02099M191K67402
$$ -777194 -310863 166270 221909 79546 25182 15126 -59882 -174928 -277027 -272836 -5434
36309e434M51849K16694k00573j66002K78527L32851k33639n58082k7049O95405
$$ -5434 446415 663109 462536 296534 575061 907912 674273 116191 89142 784547
36299G84547O85440R5552l02168l17458k77231k42352j04061p8363l20188l91301
$$ 784547 1469987 1565539 1263371 945913 668682 426330 322269 243906 -76282 -467583
36289d67583R0905N90201L08304m93939p47683j32295M92785L77266j58594l75976
$$ -467583 -376678 213523 521827 27888 -719795 -852090 -359305 17961 -140633 -516609
36279e16609j57515L9342l9202j42727K6856L38709L96587J27814p2035L3772
$$ -516609 -674124 -634782 -673984 -816711 -789855 -451146 -54559 73255 1220 34992
36269C4992P4032l02722o31535k04546O48859Q09471Q2277l89204R3492O56766
$$ 34992 109024 -193698 -825233 -1029779 -380920 428551 510828 121624 215116 871882
36259H71882L28272l31630k19443L99528L44382m59757q49097l31992K21672J18764
$$ 871882 1200154 868524 649081 1048609 1392991 933234 84137 -247855 -26183 92581
36249I2581j37358O4522L30537K1146n51778n53136O8610M89234J99007l19738
$$ 92581 -44777 19745 350282 371428 -180350 -733486 -664876 -175642 23365 -296373
36239b96373k92729L14413P49576M13968l75187p53238l80798J74126K69982M7457
$$ -296373 -589102 -274689 474887 888855 513668 -239570 -620368 -446242 -176260 -128803
36229a28803P7909M13833N31538J84903k25151k85293j32694j19071k22585j37632
$$ -128803 -50894 362939 894477 1079380 854229 568936 436242 317171 94586 -43046
36219d3046J68103L15315K0542m40932m86165M5267O19500O39884J85582j76297
$$ -43046 125057 440372 460914 19982 -466183 -420916 198584 838468 1024050 847753
36209H47753k02608j67311k42215k10398K9756J86669Q6846n796Q6248R0279j56804
$$ 847753 645145 477834 235619 25221 54977 241646 328492 322696 408944 499223 342419
36198C42419k89619o3251R0710j91391l92342J06093P92490O12334l25013p42887
$$ 342419 52800 -10451 80259 -111132 -503474 -397381 395109 1007443 682430 -60457
36188f0457r2846O16445L69991l81502n31550K7219M19984J79099k21380k62613
$$ -60457 -153303 463142 833133 451631 -79919 -52700 367284 546383 325003 62390
36178F2390j30029k64022n70755n11980R2315P16933P50199K43532k33734l77841
$$ 62390 -67639 -331661 -902416 -1414396 -1322081 -605148 145051 388583 154849 -222992
36168b22992l92368m14433k05301L07964O46020M10876j8260R904M19009N32608
$$ -222992 -615360 -1029793 -1235094 -927130 -281110 129766 111506 121410 540419 1073027
36158A073027J28521k76789k66906n0678K6652j7886k9272j8708j1529N9436J20252
$$ 1073027 1201548 924759 657853 607175 633827 615941 586669 567961 556432 615868 736120
36147G36120l6196l35933l92400r4562J54470M1479j79325j24682J20739K04615
$$ 736120 699924 363991 -28409 -122971 31499 72978 -106347 -231029 -110290 94325
36137I4325O3294q4617j27940j09832k3425J22923J58717j5387j57898R972L05091
$$ 94325 157619 73002 -54938 -164770 -188195 -65272 93445 78058 -79840 -69868 235223
36126B35223K61195j85725n58673m74739r1117K19109L23099K54768j5120m06764
$$ 235223 496418 310693 -247980 -722719 -813836 -594727 -271628 -16860 -31980 -438744
36116d38744n33869j03633N33927O72202J62151l77336m26951k00110j04548k7729
$$ -438744 -972613 -1076246 -542319 129883 292034 -85302 -512253 -712363 -816911 -844640
36106h44640L10030O22259L88178j92140l41356J07083M30496J81735j30866K1323
$$ -844640 -534610 87649 475827 283687 -57669 49414 479910 661645 530779 552102
36096E52102K81331R8647k33627o2763M34360M40332k03098p20718n46117l2105
$$ 552102 833433 932080 698453 635690 1070050 1510382 1307284 586566 40449 8344
36086H344K01312N4513j81601k88063j86921R2539K99524J43407k26083k72512
$$ 8344 209656 264169 82568 -205495 -392416 -299877 -353 143054 -83029 -355541
36076c55541J71870N54177L09624l47924o98642m27920Q4632L49137L18614K59986
$$ -355541 -183671 370506 680130 332206 -366436 -794356 -709724 -360587 -41973 218013
36066B18013K91436K64485P9655r8303q5280R064k3917m9181K78539Q60909J079233
$$ 218013 509449 773934 853589 755286 670006 679070 655153 605972 884511 1745420 2824653
36055B824653O26938L252k14397k16416n40721j070894j120017m70640K92639
$$ 2824653 3451591 3454843 3240446 3024030 2483309 1412415 292398 -178242 114397
36046A14397N84637M29553J40342j23984k85524k42848o5411J1884n4949p0075
$$ 114397 699034 1128587 1268929 1144945 859421 616573 551162 563046 508097 438022
36036D38022j8107j60262n23325o67450k64861L54982N75161K73116o9913k3595
$$ 438022 419915 259653 -263672 -931122 -1195983 -841001 -265840 7276 -62637 -86232
36026h6232K58786K66182j79464o09734m46950J90422N38076J89906l08707k18812
$$ -86232 172554 438736 259272 -350462 -797412 -606990 -68914 120992 -187715 -406527
36016d06527L43385O17993K90012k02601m10655l54369k01962j0391Q2904q8106
$$ -406527 -63142 554851 844863 642262 231607 -122762 -324724 -335115 -252211 -340317
36006c40317l16446j67645K82897L78705j63342p18784n74184J09722O04525N98545
$$ -340317 -656763 -824408 -541511 -162806 -326148 -1044932 -1619116 -1509394 -904869 -306324
35996c06324L87000K34173N2609k30351l74477j11431M03137O19133J71783n96471
$$ -306324 80676 314849 367458 137107 -237370 -348801 54336 673469 845252 248781
35986B48781q73143k81137O00927Q75665L90111j65628k10475N3878N7401l47233
$$ 248781 -624362 -905499 -304572 571093 961204 795576 585101 638979 696380 349147
35976C49147p41903o80873k02869K20131K30461M366m1422J00710N8962j65006
$$ 349147 -392756 -1073629 -1276498 -1056367 -825906 -821540 -862962 -762252 -703290 -868296
35966h68296m2278N49735Q52349K92712m96506n24572Q8334M24222K66190K04727
$$ -868296 -910574 -360839 491510 784222 287716 -236856 -148522 275700 541890 746617
35956G46617L55779J62078l94031n59203j15199J91691m1260k15857P2715K50369
$$ 746617 1102396 1264474 870443 311240 196041 387732 346472 130615 203330 453699
35946D53699j31907n05513l14400k4084j83324l23653J57339P48371O20453Q3354
$$ 453699 321792 -183721 -498121 -522205 -705529 -1029182 -871843 -123472 496981 580335
35936E80335J2971K70453J7989o32244o61701J33598P47491N21000k6130k49569
$$ 580335 593306 863759 881748 249504 -412197 -278599 468892 989892 963762 714193
35926G14193k60890l31677k93364l9173P1530j83000m22081k49315J44778L49904
$$ 714193 453303 121626 -171738 -210911 -139381 -322381 -744462 -993777 -848999 -499095
35916d99095L11409K08911J13552M1882L0590l1762k91731n23626k93754L03558
$$ -499095 -187686 21225 134777 176659 207249 175487 -116244 -639870 -933624 -630066
35906f30066O01997L08341n2248K1187K62092J99492l1869m0929L9836j76169
$$ -630066 -28069 280272 228024 249211 511303 710795 678926 637997 677833 501664
35896E01664m93245l28912K47944M21064j83497q31008o39428K07865P46420N28224
$$ 501664 8419 -320493 -72549 348515 165018 -665990 -1305418 -1097553 -351133 177091
35886A77091O8584j8857K01991L00146J43010j00813l36723n11059l99406R6269
$$ 177091 245675 226818 428809 728955 871965 771152 434429 -76630 -476036 -379767
35876c79767N37261L68764k27193m55508j6264M78269M39315Q4192r7605j31147
$$ -379767 157494 526258 299065 -156443 -172707 305562 744877 829069 731464 600317
35866F00317k84432m25931k63258M3821J09230j9592j194J43608J02855q7598
$$ 600317 315885 -110046 -373304 -329483 -220253 -239845 -241039 -97431 5424 -82174
35856h2174q2398J02400N2225l25608n79404l63931J13769M33823L95197M3114
$$ -82174 -164572 -62172 -9947 -335555 -914959 -1278890 -1165121 -731298 -336101 -292987
35846b92987l77169m68432o8392M00998L85363r215j62791R2587K27250j06277
$$ -292987 -670156 -1138588 -1206980 -805982 -420619 -429834 -592625 -500038 -272788 -379065
35836c79065n07567m42084Q882L43969K95339J6663j67318k5738L64623N97812
$$ -379065 -886632 -1328716 -1319834 -975865 -680526 -663863 -831181 -856919 -492296 105516
35826A05516L71600o5847k29681j01608n7133j29982K8534L70522L54305j01789
$$ 105516 477116 411269 181588 79980 22847 -107135 -78601 291921 646226 544437
35816E44437k94684J79462O76467M54077j65582l23314M2026J84993k49093p57937
$$ 544437 249753 429215 1105682 1559759 1394177 1070863 1112889 1297882 1048789 290852
35806B90852p66734k92772K83827O43841O04791J77373k99254l83037l6396L02032
$$ 290852 -475882 -768654 -484827 159014 763805 941178 641924 258887 222491 524523
35796E24523K41380j40562m49656l95583l4308K91112K69767k8845k19735j14324
$$ 524523 765903 625341 175685 -219898 -254206 36906 306673 277828 58093 -56231
35786e6231J9723r9721k90507j93559J12426J92048p2655k93286j56203J47414
$$ -56231 -36508 -136229 -426736 -620295 -507869 -315821 -388476 -681762 -837965 -690551
35776f90551K49486J18295K0079Q5910J36017l0450k87477k60063J85890O47886
$$ -690551 -441065 -322770 -302691 -216781 -80764 -111214 -398691 -658754 -472864 175022
35766A75022N99587Q4022l04896k23702m060m8729j82922k5632K75740K38755
$$ 175022 774609 858631 553735 330033 325973 277244 94322 68690 344430 583185
35756E83185j34108l11266n6751K39239K06249r727j13593j03179q4019j4028
$$ 583185 449077 137811 81060 320299 526548 516821 403228 300049 216030 202002
35746B02002Q4383O52k72334l65648j03890J04955j03781l69158j40126L46666
$$ 202002 286385 287037 14703 -350945 -454835 -349880 -453661 -822819 -962945 -616279
35736f16279L60634j04889k32507L00962P15332L09065m20677n27097l2584K12673
$$ -616279 -255645 -360534 -593041 -292079 423253 732318 311641 -215456 -248040 -35367
35726c5367j01999l63064r2032L61119M63170K53756Q7887M8818J628p1572j35409
$$ -35367 -137366 -500430 -592462 -231343 231827 485583 573470 622288 623916 552344 416935
35715D16935k53042l80729k77653P8756K88265J00836j16482N5484L39052J59504
$$ 416935 163893 -216836 -494489 -415733 -127468 -26632 -143114 -87630 251422 410926
35705D10926l80953n96925k65815J00318J41837J37975L48535M90869K74287m6922
$$ 410926 29973 -566952 -832767 -732449 -590612 -452637 -104102 386767 661054 614132
35695F14132j23164j07643k85036m21055q9431M99691O16521J4104o82423p56697
$$ 614132 490968 383325 98289 -322766 -412197 87494 704015 718119 35696 -721001
35685g21001k29166K82747L14547j0640k10602j4310L11327K87237j08922l42968
$$ -721001 -950167 -667420 -352873 -363513 -574115 -588425 -277098 10139 -98783 -441751
35675d41751o7136L29208K76190r7529j71150J54313K75360j24693n13764l23647
$$ -441751 -508887 -179679 96511 -1018 -172168 -17855 257505 132812 -380952 -704599
35665g04599J42240J53872l45567o65809l56207K48108N68207M54017J40654j33905
$$ -704599 -562359 -408487 -754054 -1419863 -1776070 -1527962 -959755 -505738 -365084 -498989
35655d98989k36621j06131J40731K30496Q2314j5276J81842M32179L08617j27071
$$ -498989 -735610 -841741 -701010 -470514 -388200 -403476 -221634 210545 519162 392091
35645C92091l36941o8758K61612J57803k62676m50532j57836K93560M39902J60191
$$ 392091 55150 -13608 248004 405807 143131 -307401 -465237 -171677 268225 428416
35635D28416k63922m31499j84094K27575M06293K81515J33133O6970j80588o41809
$$ 428416 164494 -267005 -451099 -223524 182769 464284 597417 664387 483799 -158010
35625a58010p34696m4675P79230O79946k74421q55798l99986K90249K52579k19492
$$ -158010 -892706 -937381 -158151 521795 247374 -608424 -1008410 -718161 -465582 -685074
35615f85074k40997J78643K91935l6364j60208J76588M51571L24980J40288J68593
$$ -685074 -926071 -747428 -455493 -491857 -652065 -475477 -23906 301074 441362 609955
35605F09955J18782k08040m54249l41581j58319j41828O521M33350N86092O9023
$$ 609955 728737 520697 66448 -275133 -433452 -575280 -568759 -135409 450683 519706
35595E19706n00732l44330K07158K55515j72792k80478P016n0536m83724l17112
$$ 519706 18974 -325356 -118198 137317 -35475 -315953 -308937 -359473 -843197 -1160309
35585a160309P11578J357008O25469o26260q78429q0971N01408K12431l18002
$$ -1160309 -448731 908277 1533746 907486 29057 -51914 449494 661925 343923
35576C43923l52323L4882L51981L32454L8641k27876j30084K18299J93245m32530
$$ 343923 -8400 26482 378463 710917 749558 521682 391598 609897 803142 370612
35566C70612q85979m16909M16864M52865k67970n41700P6227O11565L10392k27294
$$ 370612 -515367 -932276 -515412 -62547 -330517 -872217 -795990 -184425 125967 -101327
35556a01327j95516J41437J40638o4754k1747O0099k42434n81927k96861M07112
$$ -101327 -296843 -155406 -14768 -79522 -101269 -41170 -283604 -865531 -1162392 -755280
35546g55280O72245K65440k12410l38037k76945j73889P9847L54456K67560j44595
$$ -755280 -83035 182405 -30005 -368042 -644987 -818876 -739029 -384573 -117013 -261608
35536b61608l38743n1402L38723M23788K75038J49610J09993J25868J95514K07056
$$ -261608 -600351 -651753 -313030 110758 385796 535406 645399 771267 966781 1173837
35526A173837K181l05082l92939k08582n8274j31539k49423j82991N0605K76322
$$ 1173837 1176018 870936 477997 269415 211141 79602 -169821 -352812 -302207 -25885
35516b5885L15880P2602k93435l75132j1722L74360L14536j6071j25327k2141
$$ -25885 289995 362597 69162 -305970 -317692 56668 371204 355133 229806 207665
35506B07665r4015l09823k68905m80O9073k4311J83212N63422L69692m55310r19589
$$ 207665 113650 -196173 -465078 -465558 -396485 -420796 -237584 325838 695530 240220 -679369
35495f79369m42644K33775K56305o8966m4287J31415j34083n63771l79857L16335
$$ -679369 -1122013 -888238 -631933 -700899 -745186 -613771 -747854 -1311625 -1691482 -1375147
35485a375147O20715K42426j47662p7085J32550J47367J70255L52924L44176j14776
$$ -1375147 -754432 -512006 -659668 -736753 -604203 -456836 -286581 66343 410519 295743
35475B95743o22280o04278q5758L86372M05387L4260l71448m79641k40184O8884
$$ 295743 -326537 -930815 -1016573 -630201 -224814 -190554 -562002 -1041643 -1281827 -1212943
35465a212943J72001J65567L31305N97602N41780M5497m05277l22193J27393L54672
$$ -1212943 -1040942 -875375 -544070 53532 595312 640809 235532 -86661 40732 395404
35455C95404J15585k38818k67757K5723K54314J36227j90286l62411k25446L2360
$$ 395404 510989 272171 4414 30137 284451 420678 230392 -132019 -357465 -325105
35445c25105J61758J19765K252j23137j90480q6630J95364M45386M48015K38636
$$ -325105 -163347 -43582 -41330 -164467 -354947 -441577 -246213 199173 647188 885824
35435H85824J0166j36892j95288j24890O3123J82609N7514k16785l89856l70113
$$ 885824 895990 759098 563810 438920 502043 684652 742166 525381 135525 -234588
35425b34588k35990m0448J56517J74366n3941k06519Q5968O08633O95269J39349
$$ -234588 -470578 -511026 -354509 -180143 -234084 -440603 -354635 253998 949267 1088616
35415A088616m26900l51699J37546K57487k30554o84373m56966K28293N70086
$$ 1088616 661716 310017 447563 705050 474496 -209877 -666843 -438550 131536
35406A31536K28325k78231l07308P6168K93594J11027j13972p6657K9346m9802
$$ 131536 359861 81630 -225678 -149510 144084 255111 141139 64482 93828 44026
35396D4026j15275J54369N66438N73930N1153m98405n92393l01142n917R7409
$$ 44026 -71249 83120 649558 1223488 1274641 776236 183843 -117299 -123216 -25807
35386b5807P5884L2389J95q639J8538P9142J44491J36323k9842k76171l23873
$$ -25807 50077 82466 82661 74022 92560 171702 316193 452516 422674 146503 -177370
35375a77370k1461L38599L04199j06960l70428j71074J58371J53366j04001j86105
$$ -177370 -198831 139768 443967 337007 -33421 -204495 -46124 107242 3241 -182864
35365a82864k8564J8710j61723k41344m1550J06650p5322k55975L0257N68749
$$ -182864 -211428 -192718 -354441 -595785 -637335 -530685 -606007 -861982 -831725 -262976
35355b62976O88147K51414j56338j31071L0774m7500k19027j89226l5692O5382
$$ -262976 425171 676585 520247 389176 419950 372450 153423 -35803 -71495 -6113
35345f113K11530M11774K94510k46666n56535j09185M85998K95698l76294l69215
$$ -6113 205417 617191 911701 665035 108500 -685 485313 781011 404717 35502
35335C5502L99729O47404k57923j194757r20923J53882P29709M58747N9936K8588
$$ 35502 435231 1082635 824712 -370045 -1290968 -1137086 -407377 51370 111306 139894
35325A39894J72853K36903J89420k3066l86119n84641l84915q1631o6591j88672
$$ 139894 312747 549650 739070 716004 329885 -254756 -639671 -721302 -787893 -976565
35315i76565q1001J44176J39730J5101J14514L06331K02584o6993m9588J62711
$$ -976565 -1057566 -913390 -773660 -758559 -644045 -337714 -135130 -202123 -251711 -89000
35305h9000N9849l00001k72167K67252O04149K68202k56474k84571J34044M26664
$$ -89000 -29151 -329152 -601319 -334067 270082 538284 281810 -2761 131283 557947
35295E57947K85279q4499k77525q1671K62212K18786l40052p42397l09424N75520
$$ 557947 843226 758727 481202 399531 661743 880529 540477 -201920 -511344 64176
35285F4176Q35776J60996n97524o45782j71346K26163L78940M21712L39363R6360
$$ 64176 899952 1060948 463424 -182358 -353704 -127541 251399 673111 1012474 1108834
35275A108834j37062k51209l80663n45689m70611o1864K90558K32686l4144r4157
$$ 1108834 971772 720563 339900 -205789 -676400 -738264 -447706 -215020 -249164 -343321
35265c43321Q1825K14714J89771J22162Q0865K3936n4593r8286p5835j9073j0899
$$ -343321 -261496 -46782 142989 265151 346016 369952 315359 217073 141238 122165 111266
35254A11266r6709j37545P7092M05090L34800k67547p31078m36296K06494L42993
$$ 111266 14557 -122988 -45896 359194 693994 426447 -304631 -740927 -534433 -191440
35244a91440J865n2835L04941L85662K766j45635K16568L45717k08113o74567
$$ -191440 -189575 -242410 62531 448193 450959 305324 521892 867609 659496 -15071
35234a5071k51087N79043Q11075L95384M3451J6345L240j04509j47200j86560
$$ -15071 -266158 312885 1123960 1519344 1562795 1579140 1582380 1477871 1330671 1144111
35224A144111l44682l75582n5062K66744J63945j14919r7805M4213j09540k82801
$$ 1144111 799429 423847 368785 635529 799474 684555 586750 630963 521423 238622
35214B38622Q6506O62096N05973l85382q94442m07004L19971L51283j59931m55148
$$ 238622 325128 987224 1493197 1107815 213373 -193631 126340 477623 317692 -137456
35204a37456l12681q1059M7981J90449L50447L41374J29061o5754p6138l2640
$$ -137456 -450137 -531196 -483215 -292766 57681 399055 528116 462362 386224 353584
35194C53584j92442n27708n97475m9832P28917Q45634M1867p71579n96108L03711
$$ 353584 161142 -366566 -964041 -1013873 -284956 560678 602545 -169034 -765142 -461431
35184d61431P45933K27650n07391o03157j50600J87148J29067l3662N4527M19961
$$ -461431 284502 512152 4761 -598396 -748996 -561848 -432781 -466443 -411916 8045
35174H045P40023N77500j72705r75657j067784l38855M56699N78959J59460r3509
$$ 8045 748068 1325568 1152863 177206 -890578 -1229433 -772734 -193775 -34315 -127824
35164a27824J22807L78868J89587l02826n42295l16498K946M9844n028K02732
$$ -127824 -5017 373851 563438 260612 -281683 -598181 -595235 -545391 -550419 -347687
35154c47687N49031N35879Q8584k64674j88611k5590j52147k96141M46N32746
$$ -347687 201344 737223 825807 561133 372522 346932 194785 -101356 -100910 431836
35144D31836O38210J55715l67728m69714l05756k52989l41278k98654J1506L83966
$$ 431836 1070046 1225761 858033 388319 82563 -170426 -511704 -810358 -798852 -414886
35134d14886M91322K58192m0151j22480n0312l6064k4334J62913L30241R2211
$$ -414886 76436 334628 294477 171997 121685 85621 61287 224200 554441 646652
35124F46652l90503m90908j11630J13596p6842q9989L71696N45270j76271j005265
$$ 646652 256149 -234759 -346389 -232793 -309635 -399624 -27928 517342 341071 -664194
35114f64194p99223J77579O82351L50853o5965j37393j77403k32449R9236O32776
$$ -664194 -1463417 -1285838 -603487 -252634 -318599 -455992 -633395 -865844 -766608 -133832
35104a33832N65881j62761n67578j13748M81766M65961J22161R469o721k33631
$$ -133832 432049 269288 -298290 -412038 69728 535689 657850 667319 660598 426967
35094D26967l77558q1678L01760K37379j10703k27177j22934j67802l15860j94431
$$ 426967 49409 -32269 269491 506870 396167 168990 46056 -121746 -437606 -632037
35084f32037J67077L26509J31081p8838j6777J83674K33739O6335j41738k04285
$$ -632037 -464960 -138451 -7370 -86208 -102985 80689 314428 380763 239025 34740
35074C4740j16066K935J30481L41544M98667K54705l51398o63826k62507K91519
$$ 34740 -81326 -78391 52090 393634 892301 1147006 795608 131782 -130725 160794
35064A60794K18998k68078l53474L980R9978j55316o1817N04191P28187K52866
$$ 160794 379792 111714 -241760 -237780 -137802 -293118 -354935 149256 877443 1130309
35054A130309j91689q0534O5134k28800m96784k94450p6621k67203l71996M9626
$$ 1130309 938620 858086 923220 694420 197636 -96814 -173435 -440638 -812634 -763008
35044g63008M05046R2653l09565j8251N18936L97924j41775k02124J71761K28356
$$ -763008 -357962 -265309 -574874 -593125 -74189 323735 181960 -20164 151597 379953
35034C79953k3060J9507J76661k47140r15765o92441M43036J155822P53020P4634
$$ 379953 356893 376400 553061 305921 -609844 -1302285 -859249 296573 1049593 1124227
35024A124227n8765k0199l68558p57558o19500j37477J78742K83727L75326L98416
$$ 1124227 1065462 1045263 676705 -80853 -700353 -837830 -659088 -375361 -35 398381
35014C98381K57450P7932r3676l80136o17979l85433K54722O56981N16066K43736
$$ 398381 655831 733763 640087 259951 -358028 -743461 -488739 168242 684308 928044
35004I28044J42933o1476m80718o10743j66413K90191J67277k53280l41323p0100
$$ 928044 1070977 1009501 528783 -81960 -248373 41818 209095 -44185 -385508 -455608
34994d55608J76610L24595M83584M40198m1610o09608o47281j41587K90456K31395
$$ -455608 -278998 45597 529181 969379 927769 318161 -329120 -470707 -180251 51144
34984E1144r5383k42730q9144J04220N1528j82593k21530R4644L79255K14735
$$ 51144 -44239 -286969 -376113 -271893 -220365 -402958 -624488 -529844 -150589 64146
34974F4146j64715k05526N2894N1524k94197m32612j50670J03675J30665L29656
$$ 64146 -100569 -306095 -253201 -201677 -495874 -928486 -1079156 -975481 -844816 -515160
34964e15160P31989O17839k57247r18586m97622M07657O37803J62139j55587m0464
$$ -515160 216829 834668 577421 -341165 -838787 -431130 206673 368812 213225 172761
34954A72761M4456j8608J19547L67597K02739l23330n15200j32752K70026K89805
$$ 172761 217217 198609 318156 685753 888492 565162 49962 -82790 187236 477041
34944D77041J72938J46513P639l12585m44965j90229J29713K36317K74010L36798
$$ 477041 649979 796492 804131 491546 46581 -143648 -13935 222382 496392 833190
34934H33190J84444k07468l63997l4119K72317R64n48685o17643p6019M47649
$$ 833190 1017634 810166 446169 412050 684367 685331 136646 -480997 -557016 -109367
34924a09367M71438J88952J0218k5012j65518m86404p28249n85138n6396N23695
$$ -109367 362071 551023 561241 536229 370711 -115693 -843942 -1429080 -1485476 -961781
34914i61781P90323O56853L32122R0403L7482L4617j49122n08264o64715k83675
$$ -961781 -171458 485395 817517 907920 945402 980019 830897 322633 -342082 -625757
34904f25757L68498O14844K26036k94220m68566m19511l56972n2176N79795Q63210
$$ -625757 -257259 357585 583621 289401 -179165 -598676 -955648 -1007824 -428029 435181
34894D35181J88241q06564q59637J17043Q59088N55600j51702l70682k14120k09113
$$ 435181 623422 -183142 -1042779 -925736 -66648 488952 337250 -33432 -247552 -456665
34884d56665k40158O8453M27744K42889l46082n97939k63799J61942K85545K60057
$$ -456665 -696823 -628370 -200626 42263 -303819 -901758 -1165557 -1003615 -718070 -458013
34874d58013K88251K46124Q097k51846k86075n6325K88003M93810L01175k37359
$$ -458013 -169762 76362 84459 -167387 -453462 -509787 -221784 272026 573201 335842
34864C35842n84582k66491M04505O25757K14227j24159J06152L85404n329p71531
$$ 335842 -248740 -515231 -110726 515031 729258 605099 711251 1096655 1091326 319795
34854C19795r42551l10278K60531J58334q4129K57533Q26196O71126k13829p57578
$$ 319795 -622756 -933034 -672503 -514169 -598298 -340765 485431 1156557 942728 185150
34844A85150l71266K17825J52774k55104j51321M11246N57872p511n81829n72393
$$ 185150 -186116 31709 184483 -70621 -221942 189304 747176 739665 157836 -414557
34834d14557k46582q1238k2141J91468M53753M89440K96875L4989k46440m72964
$$ -414557 -661139 -742377 -764518 -573050 -119297 370143 667018 702007 455567 -17397
34824a7397m57961k34018j32456k41019j70794K83709O66478M95656J0297k27803
$$ -17397 -475358 -709376 -841832 -1082851 -1253645 -969936 -303458 192198 202495 -25308
34814b5308j55894q3432m2165J07435J44956k39218p40296o91084k7159O07944
$$ -25308 -181202 -264634 -306799 -199364 -54408 -293626 -1033922 -1725006 -1752165 -1144221
34804a144221P46273N13434J69154j51943k19092J06941L87520K1839p00173p46296
$$ -1144221 -397948 115486 284640 132697 -86395 20546 408066 429905 -270268 -1016564
34794a016564J44331Q85828N06748m81394q50540l08697L60860N35714L70271
$$ -1016564 -872233 13595 520343 38949 -811591 -1120288 -759428 -223714 146557
34785A46557K19646J14425k3278r0379K6926K10716K30999M5219j33773j14390
$$ 146557 366203 480628 457350 366971 393897 604613 835612 880831 747058 632668
34775F32668l0275j92985n46838n56333L8375O32880M78456j81511m26034q5854
$$ 632668 602393 409408 -137430 -693763 -655388 -22508 455948 274437 -151597 -237451
34765b37451L4967m14425o62767j15394N70210N11291M201n4359L34853L97242
$$ -237451 -202484 -616909 -1279676 -1395070 -824860 -313569 -309368 -363727 -28874 368368
34755C68368l8698l20132j07244J82216J75000J7025r6011j89752j71336J68340
$$ 368368 329670 9538 -97706 84510 259510 276535 180524 -9228 -180564 -12224
34745a2224O63318Q21479M82381l8604m61521o86184n21688O8649N14484K02267
$$ -12224 651094 1472573 1954954 1916350 1454829 768645 246957 315606 830090 1032357
34735A032357m91706n80945J8053L01854k20533p32998m18583L26638O47586M73814
$$ 1032357 540651 -40294 -22241 279613 59080 -673918 -1092501 -765863 -118277 355537
34725C55537K81060J82183L046j52926j02454j7313q1702o7834J95621L38384
$$ 355537 636597 818780 821826 668900 566446 549133 467431 399597 595218 933602
34715I33602M3090k79705j04199K69088J47677m12495o83939l79212M6269J88118
$$ 933602 976692 696987 592788 861876 1009553 597058 -86881 -466093 -419824 -231706
34705b31706J33972O5535j7243r3077p1077J6024P9342J44219J91373Q1553o7590
$$ -231706 -97734 -32199 -49442 -142519 -213596 -197572 -118230 25989 217362 298915 231325
34694B31325J41380O11927N39121l69854j086350o17437L70986M92211j85301
$$ 231325 372705 984632 1523753 1153899 67549 -549888 -178902 313309 128008
34685A28008l55639K40581M02035l49779q24028j45612P53163O62007m7217k69439
$$ 128008 -227631 12950 414985 65206 -758822 -904434 -151271 510736 463519 194080
34675A94080M3100K04052J96282M11835M87901j89811j071509r54944P9004O24531
$$ 194080 237180 441232 637514 1049349 1537250 1347439 275930 -679014 -600010 24521
34665B4521R5744m11819N6105Q02553O35473l07895q72660n58765M2489K95716
$$ 24521 120265 -291554 -235449 567104 1202577 894682 22022 -536743 -494254 -198538
34655a98538K05946N6003m547Q0212K44368J78109l09622p65647m78385M30172
$$ -198538 7408 63411 58864 139076 383444 561553 251931 -513716 -992101 -561929
34645e61929Q83383K30813p39998p88731Q8020P22588M72331j0693L3864L36777
$$ -561929 321454 552267 -187731 -976462 -888442 -165854 306477 295784 329648 666425
34635F66425K32192j79033k77446j840J31452m7140j94415j93826k91049m18995
$$ 666425 898617 719584 442138 440298 571750 524610 330195 136369 -154680 -573675
34625e73675j82229K99403L54308j07762k67768K80809O99285J58777p37398p65629
$$ -573675 -755904 -456501 -102193 -209955 -477723 -196914 502371 661148 -76250 -841879
34615h41879P9680O27762L05243j87284j47556J32937Q4423j61092j10604K01074
$$ -841879 -762199 -134437 170806 -16478 -164034 -31097 53326 -107766 -218370 -17296
34605a7296K78604m1497l70753l46915p4105J04309M8956q5582j04216Q368J28660
$$ -17296 261308 219811 -150942 -497857 -571962 -467653 -418697 -504279 -608495 -600127 -471467
34594d71467J73135J55806R2836l1777j69579j91789m3268J69879K99396K75651
$$ -471467 -298332 -142526 -49690 -81467 -251046 -442835 -486103 -316224 -16828 258823
34584B58823R1699j90808l83022k90964L4235L29280M39362M04651K25554j36523
$$ 258823 350522 159714 -223308 -514272 -480037 -150757 288605 693256 918810 782287
34574G82287m59505l72800M6639K18956j13450m42954k78778N7934j5392l30444
$$ 782287 322782 -50018 -3379 215577 102127 -340827 -619605 -561671 -577063 -907507
34564i07507k22072L29699N72167J21690m26079l48812J95269M21426k3483o16280
$$ -907507 -1129579 -799880 -227713 -106023 -532102 -880914 -685645 -264219 -287702 -903982
34554i03982n99432J01706P41339O00095j41008o30515m29810M6237K96495M05577
$$ -903982 -1503414 -1401708 -660369 -60274 -201282 -831797 -1261607 -1215370 -918875 -513298
34544e13298N88799N99474J87937k43790j63203J72849R0786l57334m58557l6430
$$ -513298 75501 674975 862912 619122 455919 628768 719554 362220 -96337 -132767
34534a32767K74352R8285j52611r3282L3854o4508j98684j36472k6163o437P8208
$$ -132767 141585 239870 87259 -6023 27831 -36677 -235361 -371833 -397996 -404433 -326225
34523c26225K16799N7828l83637m35664K62031J011307R19853J22826n22963o58975
$$ -326225 -109426 -51598 -435235 -870899 -608868 402439 1322292 1445118 922155 263180
34513B63180o27397o36545m70495o0174K83069L50928L00061K97101K70811J46403
$$ 263180 -364217 -1000762 -1471257 -1531431 -1248362 -897434 -597373 -300272 -29461 116942
34503A16942K5080p91O675l5805j14759j80478j91166r2188J23691L50087M62312
$$ 116942 142022 141231 147906 112101 -2658 -183136 -374302 -466490 -342799 7288 469600
34492D69600M34893K92133N2864j77182k08859j8562J34992Q835l08931n20874
$$ 469600 904493 1196626 1249490 1072308 863449 844887 979879 988714 679783 158909
34482A58909m56684j80438J07169J76569n3870l43688l25242J7036K91610K54958
$$ 158909 -297775 -478213 -371044 -194475 -248345 -592033 -917275 -900239 -608629 -353671
34472c53671J44105K51489M42229L80515M4126k72786l49566k10028j7271M1271
$$ -353671 -209566 41923 484152 864667 908793 636007 286441 76413 59142 100413
34462A00413r2610j98736J901L80324M63501J19106j92952r2299J74928J71235
$$ 100413 7803 -190933 -189032 191292 654793 773899 580947 488648 663576 834811
34452H34811j02232l59797m84641m61071j84622K64989M87695L08975J13926K04740
$$ 834811 732579 372782 -111859 -572930 -757552 -492563 -4868 304107 418033 622773
34442F22773K41647j30652n29048l98364K0228P7129j86088j83045J27463K11188
$$ 622773 864420 733768 204720 -193644 -173416 -96287 -282375 -465420 -337957 -126769
34432a26769j7217p5670J01385J2803l71574l80794J84596N53468J75869l79280
$$ -126769 -143986 -219656 -118271 -105468 -477042 -857836 -673240 -119772 56097 -323183
34422c23183l46191Q0953K21389K7364k4156J67893K61447J40454K1378l7639
$$ -323183 -669374 -588421 -367032 -339668 -363824 -195931 65516 205970 227348 189709
34412A89709j92708l84047l09660R7944M90892M94045J09344k91939l21628J0600
$$ 189709 -2999 -387046 -696706 -598762 -107870 386175 495519 203580 -118048 -107448
34402a07448K52172P3306j92859K1851N48504N39731k57067r28446o02879K87219
$$ -107448 144724 218030 25171 47022 595526 1135257 878190 -50256 -653135 -365916
34392c65916O20582J30775m01198l51037Q6915M67589O44052N72194J51601m32836
$$ -365916 254666 385441 -15757 -366794 -279879 187710 831762 1403956 1555557 1122721
34382A122721o40995k15198L72670M57385J6768l57186k80862l8198q4731l45929
$$ 1122721 481726 266528 639198 1096583 1113351 756165 475303 437105 352374 6445
34372F445l26086J23469N15105L79423j04791m40239m94926m25441j67373L71996
$$ 6445 -319641 -196172 318933 698356 593565 153326 -341600 -767041 -934414 -562418
34362e62418P31011K96655n95699q04765L1694Q54926O49466j89053o27231m68286
$$ -562418 168593 465248 -130451 -935216 -903522 -48596 600870 411817 -215414 -683700
34352f83700k06735N0809N10820Q56218N43889j50581l76718k4311J54487j51984
$$ -683700 -890435 -839626 -328806 527412 1071301 920720 544002 519691 674178 522194
34342E22194l50084m2478L07997K31009m95L7310J92487J05697j67268l42596
$$ 522194 172110 129632 437629 668638 668143 705453 897940 1003637 836369 493773
34332D93773l40288k03230L4510J65142n5983l95745l13310J48145L02532o1430
$$ 493773 153485 -49745 -15235 149907 93924 -301821 -615131 -466986 -164454 -225884
34322b25884k72152P5860L78138O4638l72247k08480K88274L84075J19911M8356
$$ -225884 -498036 -422176 -44038 20600 -351647 -560127 -271853 112222 232133 280489
34312B80489J29742o7189l44117j47011K86181J74055m18867n72149l2560L61911
$$ 280489 410231 343042 -1075 -148086 138095 312150 -106717 -678866 -711426 -349515
34302c49515P9152l25938k49661Q2108K64975L82053M81366K11711m02103n89874
$$ -349515 -270363 -596301 -845962 -763854 -498879 -116826 364540 576251 174148 -415726
34292d15726M6501P18675N26109k28985o03835l89943p1577J65748M48443N17344
$$ -415726 -369225 349450 875559 646574 42739 -347204 -418781 -253033 195410 712754
34282G12754j557p12246p52630m5048N59007M97538J24461m6702l3513o2728j31712
$$ 712754 711197 -1049 -753679 -798727 -239720 257818 382279 335577 302064 239336 107624
34271A07624j77595k45714k69466p6497K20469K41987q5210l62807k90161k9632
$$ 107624 -69971 -315685 -585151 -661648 -441179 -199192 -284402 -647209 -937370 -967002
34261i67002J45207J99620J86353R6566N508M0872J11071J4443j33708j9850K54987
$$ -967002 -821795 -622175 -435822 -339256 -333748 -292876 -181805 -167362 -301070 -320920 -65933
34250f5933K07278k24379m63230j51371L05292L96310K25868J58425J71286L8463
$$ -65933 141345 -83034 -546264 -697635 -392343 3967 229835 388260 559546 598009
34240E98009j58915j82119o9948j4158o952J9033p1794l55117n37877l19413J04962
$$ 598009 439094 256975 187027 172869 165917 184950 113156 -241961 -779838 -1099251 -994289
34229i94289K85669J28770p7351j10418J4400J75495J96926k7209k56661q9788
$$ -994289 -708620 -579850 -657201 -767619 -753219 -577724 -380798 -408007 -664668 -754456
34219g54456L30899K89404m14608r09686m29519M64694O84360K40826M5253K94691
$$ -754456 -423557 -134153 -548761 -1458447 -1887966 -1423272 -738912 -498086 -452833 -158142
34209a58142K46178l08723n52045k8797N32168L88258j09227k73332j88900k70442
$$ -158142 88036 -220687 -772732 -801529 -269361 118897 9670 -263662 -452562 -723004
34199g23004l41816m2928L08968J93478r8842J06982O10000N22490k57568p82275
$$ -723004 -1064820 -1107748 -798780 -605302 -704144 -597162 12838 535328 277760 -504515
34189e04515n00647j9101Q935j14251J28460M35295K15904k89180l04019K50513
$$ -504515 -1005162 -1024263 -1015328 -1129579 -1001119 -565824 -349920 -639100 -943119 -692606
34179f92606O54095N08981J90771N8700m5975k52500k88214m1195R1981j09376
$$ -692606 -38511 470470 661241 719941 673966 421466 133252 92057 184038 74662
34169G4662j94010J92951N26488J32261o29273p79708k05505J91649p1927l79761
$$ 74662 -119348 73603 600091 732352 103079 -676629 -882134 -690485 -762412 -1142173
34159a142173r9627M35524N40090J80802j82514l30865l34541k00904L7688J46809
$$ -1142173 -1241800 -806276 -266186 -85384 -267898 -598763 -933304 -1134208 -1096520 -949711
34149i49711J7965q5302L6976J65542J00668N1745J62965J15012k57967m42898
$$ -949711 -931746 -1017048 -980072 -814530 -713862 -662117 -499152 -384140 -642107 -1085005
34139a085005l3769M15605J90982k93931o0950P37979Q70478o6764r21005o33515
$$ -1085005 -1118774 -703169 -512187 -806118 -867068 -129089 741389 674625 -246380 -879895
34129h79895L06894O99868K62215k65677k49044K09821N91333N04912J5975l89622
$$ -879895 -573001 126867 389082 123405 -125639 84182 675515 1180427 1196402 806780
34119H06780l29488l6315l1840l19882l96780j04511J31193O8060J0776J47095
$$ 806780 477292 440977 409137 89255 -307525 -412036 -280843 -212783 -202007 -54912
34109e4912J60589j32956l58311k07762N3685J40969K45158M87393M55052r8721
$$ -54912 105677 -27279 -385590 -593352 -539667 -398698 -153540 333853 788905 690184
34099F90184n98429m05039J56581K86898n3710k01674N6501K05225n8813l22086
$$ 690184 91755 -313284 -156703 130195 76485 -125189 -68688 136537 77724 -244362
34089b44362j32765L17028M79378J52864l19166m53614j51030J90203J68688o4435
$$ -244362 -377127 -60099 419279 572143 252977 -200637 -351667 -161464 7224 -57211
34079e7211l6560K60975L03376q5780l54852q6624L07077K52578j07136k79772
$$ -57211 -93771 167204 470580 384800 29948 -56676 250401 502979 395843 116071
34069A16071k34145j96784l9032L90983O49384K35010m59056n83822j23058J19334
$$ 116071 -118074 -314858 -353890 37093 686477 921487 462431 -121391 -244449 -125115
34059a25115j73727m00313o8264N03468P44761M92842p5791o28385p19954k28994
$$ -125115 -298842 -699155 -767419 -263951 480810 973652 897861 269476 -450478 -679472
34049f79472K49925J06538k54049O3462Q82088J004911J02048o37544l47973J52059
$$ -679472 -429547 -323009 -577058 -513596 368492 1373403 1475451 837907 489934 641993
34039F41993k08190q94891o20513M92697J010221L59076m25728m13305p3685k41844
$$ 641993 433803 -461088 -1081601 -588904 421317 780393 354665 -58640 -132325 -374169
34029c74169o62163m58411L75154Q84195N46251l3561r9629J84550J60199j96435
$$ -374169 -1036332 -1494743 -1119589 -235394 310857 277296 177667 362217 522416 325981
34019C25981k63748J37806L75387J2807m31569k67586K81005M62558J94148P1608
$$ 325981 62233 200039 575426 588233 156664 -110922 170083 632641 826789 898397
34009H98397K54562K10999k41901m77490o9429M18625K36165m35737p90208n18084
$$ 898397 1152959 1363958 1122057 644567 575138 993763 1229928 794191 3983 -514101
33999e14101l1134K53482K86201J25129j70317l65399k12036J42783K70857O4699
$$ -514101 -545235 -291753 -5552 119577 -50740 -416139 -628175 -485392 -214535 -149836
33989a49836j03329N7031L23601K84043r8254m55211m85686k70779q0044K585
$$ -149836 -253165 -196134 127467 411510 313256 -141955 -627641 -898420 -978464 -975879
$$ [...]
##END NTUPLES=NMR SPECTRUM
##END=
