##TITLE=31Pdec_DPAA0612
 CDCl3, 24 sc
 7.12.2021
##JCAMPDX= 6.0         $$ Bruker NMR JCAMP-DX V2.0
##DATA TYPE= NMR SPECTRUM
##DATA CLASS= NTUPLES
##ORIGIN= UXNMR, Bruker Analytische Messtechnik GmbH
##OWNER= root
$$ XWIN-NMR		Version 3.5
$$ Tue Dec  7 10:52:45 2021 Russian Standard Time (UT+4h)  she@DPX200
##.OBSERVE FREQUENCY= 81.013821
##.OBSERVE NUCLEUS= ^31P
##.ACQUISITION MODE= SIMULTANEOUS
##.ACQUISITION SCHEME= undefined
##.AVERAGES= 24
##.DIGITISER RES= 16
##SPECTROMETER/DATA SYSTEM= spect
##.PULSE SEQUENCE= zgpg30
##.SOLVENT NAME= CDCl3
##.SHIFT REFERENCE= (INTERNAL, CDCl3, 0, 248.564)
##AUDIT TRAIL= $$ (NUMBER, WHEN, WHO, WHERE, WHAT)
$$ ##TITLE= Audit trail, XWIN-NMR		Version 3.5
$$ ##JCAMPDX= 5.01
$$ ##ORIGIN= Bruker BioSpin GmbH
$$ ##OWNER= she
$$ F:/spectra/data/she/nmr/P31/1/pdata/1/auditp.txt
$$ ##AUDIT TRAIL=  $$ (NUMBER, WHEN, WHO, WHERE, WHAT)
(   1,<2021-12-07 10:51:43.46 +0400>,<she>,<DPX200>,
      <created by zg, POWCHK disabled, PULCHK disabled
       configuration hash MD5:
       00 E9 B6 7A A2 85 ED C7 34 08 36 98 17 FE 4E 26
       data hash MD5: 32K
       52 28 29 20 B3 B7 65 41 61 56 68 76 87 12 4C 6D>)
(   2,<2021-12-07 10:51:51.37 +0400>,<she>,<DPX200>,
      <Start of raw data processing
       efp BC_mod = 2 LB = 1 FT_mod = 6 PKNL = 1 PHC0 = -9135.869 PHC1 = -12.53057 SI = 64K 
       data hash MD5: 64K
       DD 35 7D 67 63 CA 69 FB 51 6E FF 3F F9 05 63 E7>)
(   3,<2021-12-07 10:52:14.85 +0400>,<she>,<DPX200>,
      <pk PHC0 = -16.03686 PHC1 = 44.4 
       data hash MD5: 64K
       14 7F 4A 81 B4 10 5A 92 1E BE 5E B6 B3 AF 3F 32>)
(   4,<2021-12-07 10:52:19.21 +0400>,<she>,<DPX200>,
      <abs ABSG = 5 
       data hash MD5: 64K
       BE DF 53 E5 50 41 90 3D 7E 95 F5 63 08 2F E5 0F>)
$$ ##END=
$$ 
$$ hash MD5
$$ FD 8E 3B DA ED 80 3A 91 93 5E 62 3A F3 9A F5 C1
##$RELAX= 
##$RELAX= 
##$RELAX= 
##$RELAX= 
##$RELAX= 
##$RELAX= 
##$RELAX= 
##$RELAX= 
$$ Bruker specific parameters
$$ --------------------------
##$DU= <F:/spectra>
##$EXPNO= 1
##$NAME= <P31>
##$PROCNO= 1
##$TYPE= <nmr>
##$USER= <she>
##$AMP= (0..31)
100 100 100 100 100 100 100 100 100 100 100 100 100 100 100 100 100 100 
100 100 100 100 100 100 100 100 100 100 100 100 100 100 
##$AQSEQ= 0
##$AQ_mod= 1
##$AUNM= <au_zg>
##$AUTOPOS= <>
##$BF1= 81.014009
##$BF2= 200.13
##$BF3= 200.13
##$BF4= 200.13
##$BF5= 200.13
##$BF6= 200.13
##$BF7= 200.13
##$BF8= 200.13
##$BYTORDA= 1
##$CFDGTYP= 0
##$CFRGTYP= 5
##$CHEMSTR= <none>
##$CNST= (0..31)
1 1 145 1 1 1 1 1 1 1 1 1 1 1 1 1 1 1 1 1 1 1 1 1 1 1 1 1 1 1 1 1 
##$CPDPRG= <waltz16>
##$CPDPRG1= <>
##$CPDPRG2= <waltz16>
##$CPDPRG3= <>
##$CPDPRG4= <mlev>
##$CPDPRG5= <mlev>
##$CPDPRG6= <mlev>
##$CPDPRG7= <mlev>
##$CPDPRG8= <mlev>
##$CPDPRGB= <>
##$CPDPRGT= <>
##$D= (0..31)
0 1 0 0 0 0 0 0 0 0 0 0.03 2e-05 3e-06 0 0 0 0 0 0 0 0 0 0 0 0 0 0 0 0 
0 0 
##$DATE= 1638859902
##$DBL= (0..7)
120 120 120 11 120 120 24 19 
##$DBP= (0..7)
150 150 150 150 150 150 150 150 
##$DBP07= 0
##$DBPNAM0= <>
##$DBPNAM1= <>
##$DBPNAM2= <>
$$ [...]
##$SUBNAM3= <"">
##$SUBNAM4= <"">
##$SUBNAM5= <"">
##$SUBNAM6= <"">
##$SUBNAM7= <"">
##$SUBNAM8= <"">
##$SUBNAM9= <"">
##$SW= 501.771253377433
##$SWIBOX= (0..15)
0 1 3 0 0 0 0 0 0 0 0 0 0 0 0 0 
##$SW_h= 40650.406504065
##$TD= 32768
##$TD0= 1
##$TE= 0
##$TE2= 300
##$TE3= 300
##$TEG= 300
##$TL= (0..7)
0 120 53 12 22 120 120 120 
##$TP= (0..7)
150 150 150 150 150 150 150 150 
##$TP07= 0
##$TPNAME0= <>
##$TPNAME1= <>
##$TPNAME2= <>
##$TPNAME3= <>
##$TPNAME4= <>
##$TPNAME5= <>
##$TPNAME6= <>
##$TPNAME7= <>
##$TPOAL= (0..7)
0.5 0.5 0.5 0.5 0.5 0.5 0.5 0.5 
##$TPOFFS= (0..7)
0 0 0 0 0 0 0 0 
##$TUNHIN= 0
##$TUNHOUT= 0
##$TUNXOUT= 0
##$USERA1= <user>
##$USERA2= <user>
##$USERA3= <user>
##$USERA4= <user>
##$USERA5= <user>
##$V9= 5
##$VALIST= <valist>
##$VCLIST= <CCCCCCCCCCCCCCC>
##$VD= 0
##$VDLIST= <DDDDDDDDDDDDDDD>
##$VPLIST= <PPPPPPPPPPPPPPP>
##$VTLIST= <TTTTTTTTTTTTTTT>
##$WBST= 1024
##$WBSW= 4
##$XGAIN= (0..3)
0 0 0 0 
##$XL= 0
##$YL= 0
##$YMAX_a= 5480
##$YMIN_a= -6018
##$ZGOPTNS= <>
##$ZL1= 120
##$ZL2= 120
##$ZL3= 120
##$ZL4= 120
##$ABSF1= 248.5645
##$ABSF2= -253.2056
##$ABSG= 5
##$ABSL= 3
##$ALPHA= 0
##$AQORDER= 0
##$ASSFAC= 0
##$ASSFACI= 0
##$ASSFACX= 0
##$ASSWID= 0
##$AUNMP= <proc_1d>
##$AZFE= 0.1
##$AZFW= 0.5
##$BCFW= 0
##$BC_mod= 2
##$BYTORDP= 0
##$COROFFS= 0
##$CY= -3
##$DATMOD= 1
##$DC= 0
##$DFILT= <>
##$DTYPP= 0
##$F1P= 0
##$F2P= 0
##$FCOR= 1
##$FTSIZE= 65536
##$FT_mod= 6
##$GAMMA= 0
##$GB= 0
##$INTBC= 1
##$INTSCL= 5.30512e-09
##$ISEN= 30
##$LB= 1
##$LEV0= 0
##$LPBIN= 0
##$MAXI= 10000
##$MC2= 0
##$MEAN= 0
##$ME_mod= 0
##$MI= 50
##$NCOEF= 0
##$NC_proc= -5
##$NLEV= 6
##$NOISF1= 182.463
##$NOISF2= 159.3651
##$NSP= 0
##$NTH_PI= 0
##$NZP= 0
##$OFFSET= 248.5645
##$PC= 4
##$PHC0= -9151.906
##$PHC1= 31.86943
##$PH_mod= 1
##$PKNL= yes
##$PPARMOD= 0
##$PSCAL= 0
##$PSIGN= 0
##$REVERSE= no
##$SF= 81.014009
##$SI= 65536
##$SIGF1= 159.3651
##$SIGF2= -187.1042
##$SINO= 113.3802
##$SIOLD= 16384
##$SREGLST= <1H.CDCl3>
##$SSB= 0
##$STSI= 65536
##$STSR= 0
##$SW_p= 40650.406504065
##$SYMM= 0
##$S_DEV= 0
##$TDeff= 32768
##$TDoff= 0
##$TI= <>
##$TILT= no
##$TM1= 0
##$TM2= 0
##$TOPLEV= 0
##$USERP1= <user>
##$USERP2= <user>
##$USERP3= <user>
##$USERP4= <user>
##$USERP5= <user>
##$WDW= 1
##$XDIM= 65536
##$YMAX_p= 497167654
##$YMIN_p= -3439155
$$ End of Bruker specific parameters
$$ ---------------------------------
##NTUPLES= NMR SPECTRUM
##VAR_NAME=  FREQUENCY,     SPECTRUM/REAL,   SPECTRUM/IMAG
##SYMBOL=    X,             R,               I
##VAR_TYPE=  INDEPENDENT,   DEPENDENT,       DEPENDENT
##VAR_FORM=  AFFN,          ASDF,            ASDF
##VAR_DIM=   65536,         65536,           65536
##UNITS=     HZ,            ARBITRARY UNITS, ARBITRARY UNITS
##FACTOR=    0.620285442955139, 1,           1
##FIRST=     20137.2065510759, 0,            0
##LAST=      -20513.1999529892, 0,           0
##MIN=       -20513.1999529892, -3439155,    0
##MAX=       20137.2065510759, 497167654,    0
$$ Real data points
##PAGE= N=1
##DATA TABLE= (X++(R..R)), XYDATA
$$ [...]
39914a557036M48542N19400J40280j62665j30124R8983K78989K62780P0224j12297
39904a42924j09773K8442J22489J35050J63419K00755J34208k5476j26651j01162
39894B78377m2322p1129k38034m73854n35800j80263M48261Q15730O06565J22291
39884G29822j52933j27163K0402K12052L56336J83183l38722o94369m55368J6860
39874b49900P1733k43998l52350j30225J7888J1698K00843N30319M38784j46397
39864A48395m96035j66422K86637J89174k35099l26787k9131J82487J35117Q7333
39854b24331J38458O5452k41432n85521p15632m89319J06106P71282R02746K43468
39844b8723n59863n86072J33501N83741J47875n49287n68465M4237M58143K95158
$$ plain form
39914 -1557036 -1108494 -589094 -448814 -611479 -741603 -642620 -363631 -100851 -30627 -142924
39904 -142924 -252697 -224255 -101766 33284 196703 397458 531666 506190 379539 278377
39894 278377 236055 164926 -73108 -546962 -1082762 -1263025 -814764 966 607531 729822
39884 729822 576889 449726 470128 682180 1038516 1221699 882977 188608 -266760 -249900
39874 -249900 -178167 -422165 -774515 -904740 -886852 -875154 -674311 -143992 294792 148395
39864 148395 -347640 -514062 -227425 -38251 -273350 -600137 -629268 -446781 -311664 -224331
39854 -224331 -85873 -20421 -261853 -847374 -1563006 -2052325 -1946219 -1174937 -272191 -28723
39844 -28723 -588586 -1174658 -1041157 -457416 -309541 -858828 -1427293 -1383056 -924913 -629755
39834f29755N711K6681J93994J89597O7741K4857J3515p2947j10761Q723P3002
39823b09642j36365l95944l03415J16975M45617M25737J45388k22916m76137l15306
39813i26008K78273O92748L08040n13408p16616L582P25833O00397m788j75425
39803B72628K04781M29533P6945m71005o34299l25553P5431J88667l1748l28952
39793e43572m43634l53108j84577j0654J24141J31804P9841K63871P20331R01679
39783F86122L75283l52262m21362P2373K19285k22393m91515k04358L1580j31469
39773d38716n3072N87468Q30337r6517j196249r61885K90933Q21788M2051p65266
39763i39128m93320L52904P58638O31221M28351J82555k68818n79013k67315L75997
$$ plain form
39834 -629755 -624044 -597363 -403369 -213772 -146031 -121174 -107659 -180606 -291367 -282644 -209642
39823 -209642 -346007 -741951 -1045366 -928391 -482774 -57037 88351 -134565 -610702 -926008
39813 -926008 -647735 45013 353053 -160355 -876971 -873389 -147556 452841 448053 272628
39803 272628 477409 906942 983887 512882 -121417 -446970 -371539 -182872 -214620 -543572
39793 -543572 -987206 -1340314 -1524891 -1535545 -1411404 -1279600 -1199759 -935888 -215557 686122
39783 686122 1061405 709143 287781 360154 579439 357046 -134469 -338827 -307247 -438716
39773 -438716 -491788 95680 926017 829500 -366749 -1328634 -1037701 -215913 -173862 -939128
39763 -939128 -1432448 -1079544 -320906 310315 738666 921221 652403 73390 -193925 182072
39753A82072N06361p9367n74040k79308L55198L46046l34074n95411J74640J047191
39743G49308P79398l45180q89426l54225K23898r293n34392n32159j59959O538
39733a065492J3070J67059K78469J07089J3048L20901N66451K47278j99538j04700
39723C43635K49148J70684j62443q4767K52361J43223l30634m18774m4029J49332
39713B67736K8202O7140K19784p5791o56416o36587R9410N76979K45766k62022
39703a25799k77076p613R9570K5229j50145m07904l86936K74355J010920Q06238
39693H60839j65862n70334M4505N35818R3689m59161j90610L22068N6171o76810
39683a49687p65325m6882O13646O44356K22247k96160n97297l62340K94587O63886
$$ plain form
39753 182072 688433 609066 35026 -244282 110916 456962 122888 -472523 -297883 749308
39743 749308 1528706 1183526 294100 -60125 163773 154480 -379912 -912071 -1072030 -1065492
39733 -1065492 -1052422 -885363 -606894 -499805 -486757 -165856 400595 647873 448335 343635
39723 343635 592783 763467 601024 516257 768618 911841 581207 162433 118404 267736
39713 267736 295938 363078 582862 507071 -149345 -785932 -686522 -109543 136223 -125799
39703 -125799 -402875 -410488 -310918 -285689 -435834 -843738 -1230674 -956319 54601 860839
39693 860839 694977 124643 169148 704966 798655 339494 148884 470952 527123 -149687
39683 -149687 -915012 -961894 -348248 296108 518355 222195 -375102 -737442 -442855 221031
39673B21031L44031j08270o1591J81064J7459l30247k38431J65646K42400l0054
39663D03038j30274l2452j87543n03729l31832L83024Q23648M68602j87414m35230
39653B69838k83955j81716k36087j72567J21042L87962L57084J19372M0105K71897
39643F92975M68296K04601l46477n35775j61674J67114r6506o09971o56464k01955
39633a075836J29366K5568j29168R2225N67143Q39229O35314L7155o35880r88079
39623e02963p72340j27524M60529N65197K23882j19666j30987K6910k9560k90761
39613f97283l23785N0012M23555M05967J85718J20577J31224p873j23728L051
39603A67435O6487k56292n18361j13518N27666M04528m15393p71025k01966M00418
$$ plain form
39673 221031 565062 456792 395201 576265 593724 263477 25046 190692 433092 403038
39663 403038 272764 240312 52769 -450960 -782792 -399768 423880 892482 705068 269838
39653 269838 -14117 -195833 -431920 -604487 -483445 -95483 261601 380973 421078 692975
39643 692975 1161271 1365872 1019395 483620 321946 489060 392554 -217417 -873881 -1075836
39633 -1075836 -946470 -920902 -1050070 -957845 -390702 448527 1083841 1120996 485116 -502963
39623 -502963 -1275303 -1402827 -942298 -377101 -153219 -272885 -403872 -376962 -406522 -697283
39613 -697283 -1021068 -971056 -547501 -141534 44184 164761 295985 288112 164384 167435
39603 167435 233922 -22370 -540731 -654249 -126583 277945 -137448 -908473 -1110439 -710021
39593g10021L12282p67N0654J65451n5655k36064J9024K71283J9970l47685k46993
39582g58521O1447Q043k32347j32023J86981K51457J68320L48937N99022L89939
39572H91255j60871m34909k98296j51515j13036Q0301M17451N49874L58397K4394
39562A163045l47302o58892o12559j57400J46041j26424m58637j13424O13500
39553e52052P52753J39387l92471l01605N1550J99366J70818J20207L4897j2537
39543B10313J01954J93440K0022j33430J73949O07344L55078n15576r29271l58496
39533b74673L76884L70775j01890k49104m8763m9906k85950k63778P8118K10944
39523b37343o7372k35681J23751O00907N06012j20749n34219k88925K17669L55122
$$ plain form
39593 -710021 -397739 -398506 -347852 -182401 -238056 -474120 -455096 -183813 -163843 -511528 -758521
39582 -758521 -697074 -689031 -921378 -1053401 -866420 -614963 -446643 -97706 501316 891255
39572 891255 730384 295475 -2821 -154336 -267372 -187071 230380 780254 1138651 1163045
39562 1163045 815743 156851 -455708 -613108 -467067 -593491 -1052128 -1165552 -552052
39553 -552052 200701 340088 -52383 -353988 -302438 -103072 67746 187953 222850 210313
39543 210313 312267 505707 525729 392299 566248 1173592 1528670 1013094 83823 -274673
39533 -274673 102211 472986 371096 121992 73229 23323 -262627 -526405 -448287 -237343
39523 -237343 -304715 -540396 -416645 184262 690274 569525 35306 -253619 -35950 319172
39513C19172P5254j54348l1276K70335L88054J31816l72009p14207n33188j6740
39503f37137J80500j79954m68775r8866M88852M62264o4825k41515R6343K54501
39493b08612N811l8506L14664L41895l04898q36358n40315J28508L99799L18435
39483d19577K71930J65446j23936j94925J40504K66350k30389o70035l27834L28117
39473g94349M63785K68881L96539O29892L44942j86333k30542O6209N1539r6599
39463I13964K18076N73942M0326r82828j041675P8613Q75068L63388n74811o79751
39453b15688k2489M49325K41236l95771q91833p14829J39512Q60598O60969q3492
39443B7538l14717J19725L39814m1053l71826k00074M4839J0941M2370L30306
$$ plain form
39513 319172 394426 240078 208802 479137 867191 999007 626998 -87209 -620397 -637137
39503 -637137 -456637 -636591 -1105366 -1204232 -715380 -253116 -317941 -559456 -463113 -208612
39493 -208612 -202801 -241307 73357 415252 110354 -726004 -1266319 -1137811 -738012 -419577
39483 -419577 -147647 17799 -106137 -301062 -160558 105792 -124597 -794632 -1122466 -794349
39473 -794349 -330564 -61683 334856 964748 1309690 1123357 892815 959024 1010563 913964
39463 913964 1132040 1705982 1746308 763480 -278195 -199582 675486 1038874 464063 -215688
39453 -215688 -238177 211148 452384 56613 -835220 -1550049 -1410537 -549939 111030 27538
39443 27538 -287179 -167454 172360 131307 -240519 -440593 -395754 -384813 -342443 -12137
39433a2137L75426j10720n62240m30523m6176k6952l49338n23993k95999J99191
39423a783461O35877O65708K53812j34553j30785p7331l95831o24791n8237Q44435
39413h05157R01919P8174m18661r4451J89526p4639j71834L32379O42302J88540
39403G68098k53278L7414L63021j35453q40830o40765J81721M42162k9159l21429
39393d28498m8315K36881J74714M9585L8562o9771k77968k45672J11520M60701
39383A739N55854M39856J73964j87665m16374l23888q8065j738j9936Q7896K78037
39372D99680K84045K7144l03857m80397l76381o4220J37111j0201k44057j16889
39362f48022K48960K88556m2378j41556J99158M16561J83046k2583J74712L60028
$$ plain form
39433 -12137 363289 252569 -309671 -740194 -786370 -813322 -1162660 -1686653 -1982652 -1783461
39423 -1783461 -1147584 -481876 -228064 -362617 -493402 -570733 -966564 -1591355 -1649592 -805157
39413 -805157 96762 174936 -243725 -338176 -148650 -223289 -395123 -62744 579558 768098
39403 768098 514820 552234 915255 779802 -61028 -701793 -520072 -77910 -107069 -428498
39393 -428498 -476813 -239932 -65218 -15633 22929 -46842 -324810 -570482 -458962 1739
39383 1739 557593 997449 1171413 983748 567374 243486 155421 153683 133747 221643 499680
39372 499680 783725 810869 507012 26615 -349766 -413986 -276875 -287076 -531133 -648022
39362 -648022 -399062 -110506 -152884 -294440 -95282 321279 504325 481742 656454 1016482
39352A016482J32960j54545j16492o9465l37072n17737k43432l044l08665o33284
39342a234294j93646O43291P91693N2848o67438o41148k4870O07103P64444K46225
39332C44208n52202p95629k37680L07558J46948j91712J19476P42977P15259P5695
39322F74898k37886M0795K32376K1032j02762J16077K31731m8172l87910m66609
39312G3570l74655j87337J58913M33956K72093j19050j40291J91519J99660l07635
39302B00743o46767l09091L10255N78844M20697J19179j44181k58575j46862J7256
39292A41498l4128j87055r2788J77406J95371o0570j49759L3767R6555q2487j33679
39281i5869N0916P3934k01150l57712j94762p4559j79098j52967J39032K54897
$$ plain form
39352 1016482 1149442 994897 878405 808940 471868 -45869 -289301 -292345 -601010 -1234294
39342 -1234294 -1427940 -784649 7044 59892 -607546 -1248694 -1273564 -666461 97983 344208
39332 344208 -207994 -1003623 -1241303 -933745 -786797 -978509 -859033 -116056 599203 674898
39322 674898 437012 477807 710183 731215 628453 744530 976261 928089 540179 73570
39312 73570 -301085 -488422 -329509 104447 376540 257490 117199 308718 508378 200743
39302 200743 -446024 -755115 -444860 133984 554681 673860 529679 271104 124242 141498
39292 141498 107370 -79685 -172473 4933 200304 139734 -10025 23742 120297 37810 -95869
39281 -95869 -44953 28981 -172169 -529881 -724643 -799202 -978300 -1131267 -992235 -737338
39271g37338K0615m1174L33566N45661J51525k61173l7982L57267R3457n79574
39261a55150p02279j51523K64289J77934Q1053K61971L10702j6178k74250r4397
39251b97828J95115J65103k4518m191J47590J09163j04858k14492j40103k4887
39241a93906N4185P2557q1738l94806n20938j69164L87208N76075K82901m3215
39231c0841p6706q046j05417k45328j42690J72935L80352K69203o2029l39275
39221a87842l39813r0580R9746k5020k58466j34626L45624N65261J44402m18074
39211b99388l87842J80405N77346M49482J19013o9233j53287k21908j93033q7560
39201h6005r3960j97195j36406J21644K66122J48433o521n0730j27409k45145
$$ plain form
39271 -737338 -716723 -757897 -424331 121330 272855 11682 -26300 330967 424424 -155150
39261 -155150 -857429 -1008952 -744663 -566729 -485676 -223705 86997 70819 -203431 -297828
39251 -297828 -102713 62390 37872 33681 181271 290434 185576 -28916 -169019 -193906
39241 -193906 -139721 -67164 -148902 -543708 -1064646 -1233810 -846602 -270527 12374 -30841
39231 -30841 -107547 -115593 -221010 -466338 -609028 -436093 -55741 213462 151433 -187842
39221 -187842 -527655 -618235 -518489 -543509 -801975 -936601 -590977 -25716 118686 -299388
39211 -299388 -687230 -506825 70521 520003 639016 569783 416496 194588 1555 -86005
39201 -86005 -179965 -377160 -513566 -391922 -125800 22633 16112 -34618 -162027 -407172
39191d07172j29389K27925L64299N0922k66735j67450M6331j10087m21760k91913
39181a105029K35248M52216L3169m72884l97605J83376O02972M32764o8352l23741
39171d27866j19826K12042L04520K25578K32442K66555Q9366j91476k27196l9146
39161C24993K2993m0134J11798L61928J22360n94166r02947l38098L53230L52089
39151b25954o889M2486L55311K25707l07222n11396j51368K86184M78198N41820
39141G26877M76369J40215k23411k14171k5110j87452n75745n21650J4427K95568
39131i4083J9518k35944q6850M2005j69173k60170J46626N26525K42055l73533
39121b43024n05337q4426K36797J39874n4868p8723m8728m9778N4413K48436K57517
$$ plain form
39191 -407172 -536561 -308636 55663 106585 -160150 -327600 -281269 -391356 -813116 -1105029
39181 -1105029 -869781 -417565 -384396 -857280 -1254885 -1071509 -468537 -35773 -104125 -427866
39171 -427866 -547692 -335650 -31130 194448 426890 693445 782811 591335 364139 324993
39161 324993 347986 307852 419650 781578 903938 309772 -593175 -931273 -578043 -225954
39151 -225954 -232843 -190357 164954 390661 83439 -427957 -579325 -293141 185057 726877
39141 726877 1203246 1343461 1120050 905879 880769 693317 117572 -404078 -389651 -94083
39131 -94083 -74565 -310509 -397359 -355354 -524527 -784697 -638071 -111546 130509 -243024
39121 -243024 -748361 -832787 -595990 -456116 -510984 -589707 -638435 -688213 -633800 -385364 -127847
39110a27847k035k19350j28477J32849K89777K99675K44415Q7593j83559l41245
39100E1796j74565J10431J08615j54034k05730J27643L87047J79061j72552j26134
39090A31578K01856K30149j47380m38235l71391j96645n3424K72554O94465O18831
39080I42358j29674p49401m42432M32427Q25254L71714l18621o23558n48066l73016
39070f13015j75180J24324M96866P26440N44276p3971p04578q04301l50961J36801
39060f93299L34737M48146O04274M46657k26214q68787q05424j59286L66005M13470
39050a39721J87845n0443k08516k20184j07208m9816q9064j1062J88745J39773
39040c59651k24673l37454J19723N42245K97827k16492k43307O2337J1415k97516
$$ plain form
39110 -127847 -129882 -349232 -477709 -344860 -55083 244592 489007 576600 393041 51796
39100 51796 -122769 -12338 96277 -57757 -263487 -135844 251203 430264 257712 131578
39090 131578 333434 563583 416203 -22032 -393423 -590068 -643492 -370938 323527 942358
39080 942358 812684 63283 -379149 53278 878532 1250246 931625 308067 -239999 -613015
39070 -613015 -788195 -663871 -167005 559435 1103711 1029740 325162 -479139 -830100 -693299
39060 -693299 -358562 89584 693858 1140515 914301 45514 -759910 -919196 -553191 -139721
39050 -139721 48124 -2319 -210835 -431019 -538227 -588043 -677107 -688169 -499424 -359651
39040 -359651 -584324 -921778 -802055 -259810 38017 -178475 -421782 -359445 -348030 -645546
39030f45546j47232M29810N89312P2359l89571k89710j3331J0057m2158N0381
39020c75629Q3144r3358k53128k75754l57751m74871k53535L23433O89061N00420
39010d87968J17728m3096q4217k05803k44054l8187J70160J05451r3934j16528
39000i20448R5207L67438M78209K19630l74616q01813n25392K69211Q10399P22127
38990C39952L76255J79175Q3609k1762k8888K9502j21469m57841n16056r0317
38980b27840L87303M55285J90448r2287k82467l51695k00509R1872K12835M0862
38970B23807j88311k75144k63540j80140J5895J72344J03725K2028K43581M77441
38960C51686J32776n82447p16986J3388P21788O53407J79128k4429k2248k02328
$$ plain form
39030 -645546 -792778 -362968 226344 298703 -90868 -380578 -393909 -383852 -426010 -375629
39020 -375629 -292485 -385843 -638971 -914725 -1272476 -1747347 -2000882 -1677449 -988388 -487968
39010 -487968 -370240 -413336 -497553 -703356 -947410 -985597 -815437 -709986 -803920 -920448
39000 -920448 -825241 -457803 20406 240036 -134580 -936393 -1461785 -1192574 -382175 339952
38990 339952 716207 895382 978991 957229 928341 957843 836374 378533 -137523 -227840
38980 -227840 159463 614748 805196 712909 430442 78747 -121762 -29890 182945 223807
38970 223807 35496 -239648 -503188 -683328 -667433 -495089 -391364 -369336 -125755 351686
38960 351686 484462 -97985 -814971 -801583 -79795 573612 752740 728311 706063 503735
38950E03735m39412l86107j48284k8468L4129J98978K57464j7240l58845l49750
38940g33800j9762K89341L72156J81038k06168l87287N2874P39701P14294j36282
38930H66105o72071j60096N21900K57729n16302n99122m1449N8480m39751m49556
38920a174133L97436R76042M32316m58070n38218P638J79752j54559k02401L05833
38910b28364O56124L33943j77540k19138L9468J5596k46820j80730K51692L64775
38900F09006j81517p61417o44551O411M92280N46481L87331J16512k76877m96694
38890b03035k13431L01491M49986J77183n4135q7634j69285k61044n4215K87240
38880A73121K39621j09525j01453K90953K84381l46818p40257l12240L08086L74351
$$ plain form
38950 503735 64323 -321784 -470068 -498536 -464407 -265429 -7965 -25205 -384050 -733800
38940 -733800 -753562 -464221 -92065 88973 -117195 -504482 -451608 288093 1002387 866105
38930 866105 194034 33938 555838 813567 297265 -301857 -343306 -284826 -724577 -1174133
38920 -1174133 -776697 199345 631661 173591 -364627 -356989 -177237 -331796 -534197 -228364
38910 -228364 427760 761703 584163 365025 404493 420089 173269 -7461 244231 609006
38900 609006 427489 -333928 -978479 -972068 -479788 66693 454024 570536 293659 -203035
38890 -203035 -416466 -114975 335011 512194 458059 370425 201140 -59904 -114119 173121
38880 173121 412742 303217 201764 492717 777098 430280 -309977 -622217 -314131 60220
38870F0220J51995J71237J93231j49999m04235k8942M69876K51423m00215m69726
38860a55135J35738M67323Q6167l25989j39736L11719L63980n1399m81233n70730
38850c59295l34352k0923J50306J98041K61591K53056m5390m12667k52337M37886
38840a24084P78057K45702m18695l17376J79970J39430k64849p5452O02311N38104
38830A283118n49838j255839n29138O84943Q32809k7103n44970j87887J92389
38821a01516q2897m77360j78903O34888J051002O11280k42057p80952o77701j38664
38811c82880L20437K38267l60226q70054p16336p1927L60572L05757J94686L38336
38801f43368L88419J5481l96197l24299J4673O5764p5971J10860N08770M17906
$$ plain form
38870 60220 212215 383452 576683 426684 22449 -6493 463383 714806 314591 -155135
38860 -155135 -19397 447926 534093 208104 68368 380087 744067 692668 211435 -359295
38850 -359295 -693647 -714570 -564264 -366223 -104632 148424 103034 -309633 -561970 -124084
38840 -124084 653973 899675 480980 163604 343574 483004 218155 142703 745014 1283118
38830 1283118 733280 -522559 -1051697 -366754 466055 438952 -106018 -293905 -101516
38821 -101516 -184413 -661773 -840676 -205788 845214 1456494 1214437 433485 -244216 -382880
38811 -382880 -62443 175824 -184402 -1054456 -1770792 -1842719 -1482147 -1176390 -981704 -643368
38801 -643368 -254949 -239468 -635665 -959964 -945291 -879527 -955498 -844638 -335868 82038
38791H2038k59001p44645n13951N2033L86904M26268L15332R1040o6370J10296
38781a20056M15079L01747j96527l81939J2010L88690K73128l4946j55918j98092
38771C03176k30939J933L94375L32313k63318n97510k46744J47845L7684j31723
38761b52908J00103K85875k5412l70999k63934r8725k25142r2017O02884R33295
38751E93020K12710n44929j51184O58249L90879o53566r35634l01161J0965k25224
38741i45875L1879Q27788Q59371j49220p48982j68308M50380J29046l51077n8980
38731a23978L95611R4982m86003m03478O4971L3418l78955l75937N3978K46607
38721h78784J21224J83312M39954L65881p5322k95222m0546K69643K76493J13320
$$ plain form
38791 82038 -176963 -921608 -1435559 -1383526 -996622 -570354 -255022 -163982 -230352 -120056
38781 -120056 295023 596770 400243 18304 30314 419004 692132 657186 501268 303176
38771 303176 72237 74170 468545 800858 537540 -59970 -306714 -158869 -121185 -252908
38761 -252908 -152805 133070 107658 -263341 -527275 -626000 -851142 -943159 -340275 593020
38751 593020 805730 260801 109617 767866 1158745 505179 -430455 -731616 -720651 -945875
38741 -945875 -913996 -86208 773163 623943 -125039 -293347 157033 286079 -64998 -123978
38731 -123978 271633 366615 -119388 -522866 -457895 -424477 -803432 -1179369 -1125391 -878784
38721 -878784 -757560 -574248 -134294 231587 156265 -138957 -179503 90140 366633 479953
38711D79953k2254j73963l31623k85586k963J72452m7772m30361m32901J14898
38701i60120P26072P98563L47978p2417j83686k79445n18474m71978J21016O41299
38691A48808L93210k10350j89482M21400N76189j04751p30184n61149n1261Q1551
38681b26019k8510R5997L10175J67650k11136l10572k1513L00868L91695K30732
38671F99367j47299n71538o66261k66058K64588M55629K84099J9793k10857l60211
38661d98748k32595K39163O57335N42077q5l59854j87168K22351L52865O9294
38651H04635k94622l55081j04817J11243L5200k07069l28550k40557k6741K55669
38641c50690M96806M42180J6577m03982m10862j22413N8172P4278J33937J59345
$$ plain form
38711 479953 457699 283736 -47887 -333473 -336436 -163984 -211756 -642117 -1075018 -960120
38701 -960120 -234048 564515 912493 840076 656390 376945 -141529 -613507 -492491 148808
38691 148808 542018 331668 142186 563586 1139775 1035024 304840 -256309 -307570 -226019
38681 -226019 -254529 -158532 151643 319293 108157 -202415 -223928 76940 468635 699367
38671 699367 552068 -19470 -685731 -951789 -687201 -231572 52527 72320 -138537 -498748
38661 -498748 -731343 -492180 165155 707232 707147 347293 160125 382476 735341 804635
38651 804635 510013 154932 50115 161358 196558 -10511 -339061 -579618 -606359 -350690
38641 -350690 146116 588296 604873 200891 -209971 -332384 -274212 -199934 -65997 93348
38631I3348r5393m40326l84263Q9609M60076M36262K32094L4271k01460l49041
38621a24823j38788K76258L78595N7808k50785l04185l00636k83382m081M33048
38611b60971N16313J67585p0835M1592P6159j92245l27273o9210J32037o2481
38601d9329k39258J178K82579J07791k70362k99383r963J77320J62921J28647
38591g859J18831J31327K71349M20001J96277l58342o00844k45646R8328j10229
38581h6807m72113l79532j1238J38541J56851L28969L85842K4175k82560M3776
38571a54096N74847M49485k18546n49547l21869j03466n6921K37341O86551N69774
38561A113553j87709o60933k85007L13891L52394l358j38368P730N3252j05011
$$ plain form
38631 93348 -2045 -442371 -826634 -737025 -276949 159313 391407 425678 224218 -124823
38621 -124823 -263611 12647 391242 449050 198265 -105920 -406556 -689938 -694019 -260971
38611 -260971 255342 422927 352092 393684 469843 277598 -49675 -118885 13152 -49329
38601 -49329 -288587 -287409 -4830 102961 -167401 -466784 -476747 -299427 -136506 -7859
38591 -7859 110972 242299 513648 933649 1129926 771584 170740 -74906 23422 -86807
38581 -86807 -558920 -938452 -949690 -811149 -654298 -325329 60513 84688 -197872 -154096
38571 -154096 420751 870236 651690 102143 -219726 -323192 -380113 -142772 543779 1113553
38561 1113553 925844 264911 -20096 293795 646189 642831 504463 512193 565445 460434
38551D60434k28923j69706K0103K25723K89933J11420j35764j58269M16K6007
38541D41374q3218J0402K94512K71048k14282n85826l88710m349j2865k93953
38531e65867l52567j70963o4028M7236M53319Q53066N56508l74987r45229n11566
38521a075078L42550O44724K67198j68058k59793j41301j4534P7597N8323j29332
38511c97704k64697o4229L21989M39481J96750k3986Q41M9005o0469j50082o0261
38500a3362P9742J66279K66685K52546j63291p38724p08748N1504N60550J19256
38490a27563m85038j14752Q58295J002481k5854r91637q81422j02907M43058N28131
38480A02792L72424N6692l00068l70115j03514Q8108j4068r3039Q5844K56068
$$ plain form
38551 460434 231511 61805 81908 307631 597564 708984 573220 414951 415367 441374
38541 441374 358156 368558 663070 934118 719836 134010 -254700 -259049 -271914 -565867
38531 -565867 -918434 -1089397 -1153425 -1106189 -652870 200196 756704 381717 -563512 -1075078
38521 -1075078 -732528 -87804 179394 11336 -248457 -389758 -404292 -326695 -268372 -397704
38511 -397704 -662401 -726630 -404641 34840 231590 207604 208445 257450 196981 46899 -13362
38500 -13362 66380 232659 499344 751890 588599 -150125 -858873 -807369 -246819 -127563
38490 -127563 -612601 -727353 130942 1133423 1107569 115932 -765490 -868397 -425339 102792
38480 102792 475216 531908 231840 -138275 -241789 -153681 -167749 -260788 -174944 81124
38470H1124J85248R2808J76768K29108O4744j51066k89757m49897n23736k02308
38460g86964L24142L98680l9932k36335J26301L54109j2922l48698r3307J97449
38450a17477q1516l60370R7088P28998N61589m2137o733M90009K98025n96467
38440I71009r25308k71138K81518N4818j96051J75168N39568K47854j53036J4401
38430G38803K77214o7974n54838l03836L75184M17001k44869n96409j79325L21050
38420A82001K86445j1206r5725k994M0715L5136j2628j89009l13282l9782M33895
38409C13566M02276k51053o73197k84016K60095P9134n03514m95160J34740M42694
38399e74435Q2371k26458j7565K09009N2224o293M31457P82479M13544k08994
$$ plain form
38470 81124 266372 359180 535948 765056 829800 678734 388977 -60920 -584656 -786964
38460 -786964 -462822 -64142 -104074 -340409 -214108 140001 127079 -221619 -314926 -117477
38450 -117477 -198993 -559363 -462275 266723 828312 786175 779442 1269451 1567476 971009
38440 971009 45701 -225437 56081 110899 -85152 90016 629584 877438 724402 738803
38430 738803 1016017 948043 393205 89369 464553 881554 636685 40276 -139049 182001
38420 182001 468446 457240 361515 358521 399236 434372 421744 232735 -80547 -120329 313566
38409 313566 715842 464789 -208408 -492424 -232329 -153195 -656709 -1151869 -1017129 -574435
38399 -574435 -492064 -718522 -736087 -527078 -474854 -481147 -49690 732789 1146333 937339
38389I37339k72891P687j39223n72084m45505K39421N48776J90918n2028K14842
38379F57252L02822k45038p32190m64371Q0553J27082q7341J30752N99616N55574
38369I24711p992l29268j33008M1043j57356l84982l05143j01506k6481J3870
38359d66112J47308K52843K53942L13059M69902M26433n58m74170n28099k12186
38349A82362J001q3449j31745J40301M32280K23436m25781q32557n69137j5966
38339a079255K32205J89833K81629N38923N47892J66527k40920l59764k48084
38330B8986l5712K18262K93444k8490m45458l60014J97852M99211K20206p0974
38320E17313Q1104K38934j19873o30651o09995j54260R9810J4342j9707Q6044
$$ plain form
38389 937339 664448 672135 532912 -39172 -484677 -245256 303520 494438 442410 657252
38379 657252 960074 715036 -17154 -481525 -400972 -273890 -361231 -230479 369137 924711
38369 924711 916719 587451 454443 495486 338130 -46852 -351995 -453501 -479982 -466112
38359 -466112 -318804 -65961 187981 501040 970942 1397375 1396817 922647 394548 182362
38349 182362 183363 99914 -31831 108470 540750 764186 338405 -494152 -1063289 -1079255
38339 -1079255 -847050 -657217 -375588 163335 711227 877754 636834 277070 28986
38330 28986 -6726 211536 504980 476490 31032 -328982 -131130 368081 588287 517313
38320 517313 598417 837351 717478 86827 -523168 -677428 -577618 -563276 -582983 -496939
38310d96939J9996k26188k46091J02457M56287M93134K82585J8446k05719k86677
38300h8709j32758J23915K15872Q8749o7268j28063j49221j82350j87267j26686
38290f33786j0821J13700J50297M7862n6193j52Q1006o7213k85281j23400L57792
38279d26189M89879M919m53689k78664K05704L61579K27938K04960K00666r0392
38269D46711l72146j12776M13023L69583l01741o71001j85277N19008N64360J4228
38259F83972l74639k30705Q2595R1102j73171k64907Q4925N82633O56237J11136
38249A249178o37832j011943p75017r7978O04521Q59036N00518m4498j95826m088
38239D46071k6765l44380l63768J38549N17387K77717j05879k1650K49682J03243
$$ plain form
38310 -496939 -476943 -703131 -949222 -846765 -390478 102656 385241 403687 197968 -88709
38300 -88709 -221467 -97552 118320 207069 139801 11738 -137483 -319833 -507100 -633786
38290 -633786 -644607 -530907 -380610 -332748 -388941 -389093 -308087 -375300 -660581 -783981 -426189
38279 -426189 63690 68609 -385080 -663744 -458040 -96461 131477 336437 537103 446711
38269 446711 74565 -38211 374812 744395 442654 -228347 -413624 105384 669744 683972
38259 683972 309333 78628 161223 252325 79154 -185753 -100828 481805 1138042 1249178
38249 1249178 611346 -400597 -1175614 -1273592 -669071 189965 690483 645985 450159 446071
38239 446071 419306 74926 -288842 -150293 367094 644811 538932 517282 766964 870207
38229H70207k95416l36113l5525P2193j06853j85181o1395K2177P5623L09698
38219C29415N75166N02921J21887k27467m28894m91625k10822M14004P46073K76896
38209A607554m55166n54716j17535M4028j93596j95676J67041K97641J9525j22699
38199D96401P0871R2319k60281m34153p4831L83572M71868L04901R8683k16963
38189I32387n45571m80152j995L10372J43504q1609M4843K99950L07872P8604
38179A008205k53467o50434q30047l55248N51108R29080L04080n70149o98168
38170e65040r3130M64180M99081J68544j68319k55660m9209J72977O4806k42507
38160d277k43371J19836K71024p8570m05460j94178K51710L42453J03918k7055
$$ plain form
38229 870207 574791 238678 203153 275346 168493 -16688 -78083 -55906 19717 329415
38219 329415 904581 1407502 1529389 1301922 873028 381403 170581 584585 1330658 1607554
38209 1607554 1152388 597672 480137 524165 330569 134893 301934 599575 619100 496401
38199 496401 567272 659591 399310 -34843 -109674 273898 745766 1050667 1149350 932387
38189 932387 386816 -93336 -95331 215041 358545 276936 321779 621729 929601 1008205
38179 1008205 754738 104304 -725743 -1080991 -529883 399197 703277 133128 -565040
38170 -565040 -658170 -193990 305091 473635 305316 49656 447 173424 238230 -4277
38160 -4277 -247648 -127812 143212 64642 -340818 -534996 -283286 59167 163085 136030
38150A36030L2905M9547M5101K58363O28632Q02923O28705K80133n3164k97872
38140B511303l93124l42984l16578m53513o21591n61934k14331K42573N71714
38131D21535N80527K11149k98716n00726k03249K29348K54254j93796o06913n14366
38121f20953n0169K39318J25427r449K19820N49454M34652n5935k91795p4397
38111D65973R1143p4536j73579M955j8729m48220n64493R7332O87759K63257n58772
38100b27910m85410L39105O03308M4537k18907K66774N26004n8078o47660m06495
38090b64732J57377J88076j48262k00544J9606R9585M9465R3677J26712K2144
38080A43104R714J92060K07343j04984k82459k7541K04650J2439j91548P4041
$$ plain form
38150 136030 168935 218482 263583 521946 1150578 1953501 2582206 2862339 2809175 2511303
38140 2511303 2118179 1775195 1458617 1005104 383513 -178421 -392752 -150179 421535
38131 421535 1002062 1213211 914495 413769 210520 439868 694122 500326 -106587 -620953
38121 -620953 -671122 -431804 -306377 -315826 -96006 453448 888100 832165 540370 465973
38111 465973 557116 482580 309001 313956 295227 -152993 -717486 -620154 67605 330862 -227910
38100 -227910 -713320 -374215 229093 273630 54723 321497 847501 789423 141763 -264732
38090 -264732 -107355 80721 -67541 -268085 -248479 -148894 -99429 -5752 120960 143104
38080 143104 152818 344878 552221 447237 164778 137237 341887 354326 162778 236819
38070B36819M38390K93251j43503j96241J84051M85065N21578N23173N20418L15704
38060C178705m9243l52760n91244q45139r30762o48718j96267Q8568J88405K37100
38050G8645J64129q8550k78472k02167m4307j4430K8486J99837K34673l2563k34262
38039a88981l4043K57422J99687l764J13250M14363L65960n9245l49369k67118
38029D48162j10819j53178l05006l77376l07993j08829J40893K86800K73108K02164
38019a2074R4784j53277m33473m11360o6712J65435N5115p5613L3107J39493O5219
38008e99356J39207N55593Q10404M06108l01770o01715m08216j24871J02376L19729
37998B97489K97130j28112m88278k22407L83369N19660K0768m77721m92773j64631
$$ plain form
38070 236819 675209 968460 824957 628716 812767 1297832 1819410 2342583 2863001 3178705
38060 3178705 3129462 2776702 2185458 1340319 409557 -239161 -435428 -346860 -158455 78645
38050 78645 242774 154224 -124248 -326415 -370722 -385152 -356666 -156829 77844 45281 -188981
38039 -188981 -223024 34398 234085 230321 343571 757934 1123894 1064649 715280 448162
38029 448162 337343 184165 -120841 -498217 -806210 -915039 -774146 -487346 -214238 -12074
38019 -12074 82710 -70567 -504040 -915400 -982112 -816677 -761562 -837175 -804068 -664575 -599356
38008 -599356 -460149 95444 905848 1311956 1010186 408471 255 -124616 -22240 297489
37998 297489 594619 466507 -21771 -244178 139191 658851 679619 201898 -290875 -455506
37988d55506J96457M33176M10500R5891k26099k59054j34861j37911j85190p1317
37978c33914P469k27417m95902l04951J96286L96635J86860M6189J78866K64050
37968h5829J30947K2428O4306O1270n3022r5169n0513r1214j27128R6421L98697
37957B71194K89497j83470l70864k7411K62326K518m38872m17131M7412L82841
37947a81960K62790j12093l74176l21708k116L12204L22541K3023k81994l48686
37937g02175k13187J2872L14815O05711O26745K47800k55831m42785j95014J69390
37927A68341K70037N7307j95002k37539j07376l839O411R579Q331j05576k87322
37916d16648k93075l8612K03068J41180j53685l76752l52127j17345K00620M29105
$$ plain form
37988 -455506 -259049 174127 584627 680518 454419 195365 60504 -77407 -262597 -333914
37978 -333914 -326445 -553862 -1049764 -1354715 -1158429 -761794 -574934 -528745 -349879 -85829
37968 -85829 45118 67546 131852 193122 140100 44931 -5582 -96796 -223924 -127503 271194
37957 271194 560691 377221 6357 -21054 241272 243790 -195082 -612213 -564801 -181960
37947 -181960 80830 -31263 -405439 -727147 -729263 -417059 -94518 -71495 -353489 -702175
37937 -702175 -915362 -902490 -587675 18036 644781 892581 636750 193965 -1049 168341
37927 168341 438378 495685 300683 63144 -44232 -48071 -41660 -32081 -23750 -129326 -416648
37916 -416648 -709723 -748335 -545267 -404087 -557772 -934524 -1286651 -1403996 -1203376 -774271
37906g74271M10839J88787J8698O4493J93052J75699k5689k50488l00256r0200
37896c89336K14883K66540m8912l52170k36852J24023K44832P6497l6926m4547
37886a81968j69539k52468Q1290N38115L75040k82568l83713L58409Q15422J85054
37876A083074o55391n06625L00659N58247O3262l60179l21462j57621J110L31187
37866C36261N92462L46302j65350l27507k39104m72548q34275n25073L72867P73461
37856a42504K66339k14872Q9350N93004M01826k84154o09333l63921m5819P7247
37846b32837K24064M81054N28099J34367m06389n56057j83902K24255J40028k99086
37836E3596m52255r5613K64793K37437J64741M08297N37371l982p64977p53582
$$ plain form
37906 -774271 -363432 -174645 -155947 -91454 101598 277297 251608 1120 -299136 -389336
37896 -389336 -174453 92087 43175 -308995 -545847 -421824 -176992 -100495 -137421 -181968
37886 -181968 -351507 -603975 -522685 15430 390470 107902 -275811 82598 898020 1083074
37876 1083074 427683 -78942 221717 779964 843226 483047 161585 3964 5074 336261
37866 336261 928723 1275025 1109675 782168 543064 70516 -763759 -1288832 -915965 -142504
37856 -142504 123835 -91037 -1687 591317 993143 708989 99656 -264265 -310084 -232837
37846 -232837 -8773 472281 1000380 1134747 728358 172301 -11601 212654 352682 53596
37836 53596 -398659 -494272 -229479 7958 172699 580996 1118367 1114385 349408 -404174
37826d04174N9853O46081M28383r759m027K22952J24487k64603n00869m14882
37816a16558j89663j2641N4564O0391J64638M19032N22811J63679l84099m92567
37806A89587j00972J49324j04303m05104k51423J10577J42674j10603j44620J85886
37796c38977M79872M23806K05266J48737J91936j6967n19405q10139m41850K65290
37786d12431N31765J89169p2505K10019N04017J27380n99819p89988l11986J28515
37776d95864J40390N3025J15499J05249o0174o8399J33173J08548k75322m59909
37766g03784n6329M50165L98513o2891k72795o3632J19739l733j93657j52789
37756e41193N5306J85826J59403Q1475L9871K1170J7666J06694L19841M79244
$$ plain form
37826 -404174 -344321 301760 730143 720384 716357 939309 1063796 799193 298324 -116558
37816 -116558 -306221 -318862 -264298 -203907 -39269 379763 902574 1066253 682154 189587
37806 189587 88615 237939 133636 -271468 -522891 -412314 -269640 -380243 -524863 -338977
37796 -338977 140895 564701 769967 918704 1110640 1093673 574268 -235871 -677721 -412431
37786 -412431 119334 308503 235998 446017 950034 1077414 477595 -312393 -624379 -495864
37776 -495864 -355474 -302449 -186950 -81701 -141875 -210274 -77101 31447 -243875 -703784
37766 -703784 -760113 -309948 88565 25674 -247121 -310753 -191014 -194747 -388404 -541193
37756 -541193 -485887 -300061 -140658 -59183 -19312 1858 19524 126218 446059 925303
37746I25303L63681Q7814M9696L29465M40543O765n69673n87292o3663K62548
37736A245187k3307m87506n44331k38374l8296j25205k13073r300L65180M89237
37726D20212J62124k60516k24494K88170O47168L68127k59546o08585n03907k16488
37716a87735Q1734L87973N42936L45619k0649j13195J83665N32881N93935L03671
37706B650835k04592o41398o52420k34121R8076l8799k84368q9269L33752K97996
37696A235692k00452m00979J9049M22397K09937l08962m94296l32142k77301m21230
37686e48287l63101J09793O09316N74796j3623n13032l11354M05631Q09424M33377
37676A192940k67168n63853l45364k0442J67303K51158J72838j42884m12274k31017
$$ plain form
37746 925303 1288984 1376798 1426494 1755959 2196502 2203267 1633594 1046302 982639 1245187
37736 1245187 1221880 734374 190043 -48331 -86627 -211832 -424905 -434205 -69025 420212
37726 420212 582336 321820 97326 385496 1032664 1400791 1141245 532660 28753 -187735
37716 -187735 -106001 281972 824908 1170527 1149878 1036683 1220348 1753229 2347164 2650835
37706 2650835 2446243 1804845 1152425 918304 1016380 977581 693213 603944 937696 1235692
37696 1235692 1035240 634261 653310 1075707 1285644 976682 482386 150244 -127057 -548287
37686 -548287 -911388 -801595 -192279 382517 368894 -144138 -455492 -49861 759563 1192940
37676 1192940 925772 361919 16555 -3887 163416 414574 587412 444528 32254 -198763
37666a98763K75238N15367K35850j51935j68480J40249L39884J25492l69289o67012
37656G6601m11814J66311M47851K06968j20939j41881l0066l8692q353J58956
37646C04942P8983m20154p02686k27015M13069L08238k52049j98604N38163Q72845
37636G15732K98300l80222l76272J3505J32149o2983k25370j88096O9527M67093
37626D63363N94072O0648p21804q33136j63637L49645J36236k04592j094M09187
37616H8888L56727o9516l38811l66178l55091j84769K83851O06221K52152m39333
37606a65859n60699Q2959O57844M42959k38920n40685k12547J99047K22767J32066
37596A8932M44622R39200P43837l59825j283216r05354L23535Q75503J93890o56589
$$ plain form
37666 -198763 76475 591842 827692 675757 507277 647526 987410 1112902 743613 76601
37656 76601 -335213 -168902 278949 485917 364978 223097 193031 154339 145986 304942
37646 304942 383925 -36229 -738915 -965930 -552861 -244623 -496672 -695276 -157113 715732
37636 715732 1014032 633810 257538 271043 403192 340209 114839 -73257 -3730 463363
37626 463363 1057435 1118083 396279 -436857 -600494 -250849 -114613 -319205 -320299 88888
37616 88888 445615 376099 37288 -328890 -683981 -868750 -584899 21322 273474 -165859
37606 -165859 -726558 -643599 14245 457204 218284 -322401 -534948 -335901 -113134 18932
37596 18932 463554 1402754 2146591 1786766 503550 -401804 -78269 797234 991124 334535
37586C34535o36891j35373j16616n40192n08770K41927Q72745O34779q9508l40039
37576b83403J37374O35001N01303j8587k23637M1091K66117R6007k26769l50738
37566E73759k87059j78705k0586J33794R6377n7366L7831L73434M04597p2833
37556A003243m71934l34831p9814j95672l20429O2727N59332M46424q7960k88684
37546B92402j10653j18009l24485k10297J93083K89806K245j19431Q3253J82989
37536A60903M2303k3610R94j82629m29047k87214J01529J84129L6956K03472N39275
37525C47061L74536j49080j73228L06095L11077l84109p81089l80226J0514j71341
37515f89790k32581L81810R10238N30474j97503k49257K68046N20032L51834K33064
$$ plain form
37586 334535 -302356 -437729 -554345 -1094537 -1603307 -1361380 -488635 146144 56636 -283403
37576 -283403 -146029 488972 990275 971688 748051 789142 1055259 1151266 924497 573759
37566 573759 286700 107995 87409 221203 317580 260214 298045 671479 1076076 1003243
37556 1003243 531309 196478 116664 -79008 -399437 -336710 222622 669046 581086 292402
37546 292402 181749 63740 -260745 -471042 -277959 11847 14092 -105339 -22086 160903
37536 160903 203206 179596 180590 -2039 -431086 -718300 -616771 -432642 -395686 -192214 347061
37525 347061 721597 572517 399289 705384 1016461 632352 -148737 -528963 -518449 -689790
37515 -689790 -922371 -540561 369677 900151 702648 453391 721437 1241469 1593303 1826367
37505A826367K09416q7956n78638p08998k65234L33778N36049J78872l41572l45241
37495G56843L48466R46760N73009m05896p62152j89086L09503Q1358k31250N9391
37485A486946N35393M90784L5975l49013o00411p15467l80124L30000O38129K00175
37475A672387k21798m742K46714j97021p88624n51952K52929N27285L3366m67092
37465E01452n49750m87254l75360K8469N45432O08305J98377n7728J15468K73333
37455H00744O2621k52695l14733j78524m5814O6295J49476O5500j66364k31559
37445d5053O3429M25628M02119R46k86123j49384R8356p188l28114k75220K46048
37434A45444N72325K46624k62724k67825J56815M69176N37075N40767L50388j98351
$$ plain form
37505 1826367 2035783 1947827 1369189 660191 394957 728735 1264784 1443656 1102084 756843
37495 756843 1105309 2052069 2625078 2219182 1457030 1267944 1577447 1658805 1427555 1486946
37485 1486946 2022339 2513123 2549098 2200085 1599674 884207 504083 834083 1472212 1672387
37475 1672387 1450589 1445847 1692561 1495540 706916 154964 407893 935178 968544 501452
37465 501452 -48298 -535552 -910912 -882443 -337011 271294 469671 411943 527411 800744
37455 800744 863365 610670 295937 117413 71599 137894 287370 352870 186506 -45053
37445 -45053 18376 444004 846123 847069 560946 411562 509918 502730 174616 -100604 145444
37434 145444 717769 964393 701669 433844 590659 1059835 1596910 2137677 2488065 2289714
37424B289714o55537m45701J43939L20638K809k12630j68301k33021l35334q639
37414F97937N32315M90998j43761m47208n8497K75173L7340k53995q7257J79388
37404A222433Q2624j49465j44991l6223n3946p7648J1144P3521N9268N7008o7056
37393I76669m17569n35103K1486O72328M70056l14772n14237K0579K52088j38539
37383D92986k52644K37243M17374j32959m92369o4360L61429R3402k81794j41247
37373B37061M9538j58801k14368K74948N79306J31572l50011j41154J77131j31024
37363D54198n31319k24518L30431K29964k76197l12068Q3641J92722m5007p1398
37353a69551K18571M09178L26694J17509j63912m59230n21205k53034J43762N62325
$$ plain form
37424 2289714 1634177 1188476 1332415 1653053 1655862 1443232 1274931 1041910 706576 697937
37414 697937 1230252 1721250 1577489 1130281 1071784 1346957 1384297 1130302 1043045 1222433
37404 1222433 1305057 1155592 1010601 974378 920432 842784 853928 927449 986717 1043725 976669
37393 976669 559100 23997 45483 717811 1187867 873095 358858 379437 631525 492986
37383 492986 240342 477585 894959 762000 269631 205271 566700 660102 378308 237061
37373 237061 286599 127798 -86570 188378 767684 899256 549245 408091 585222 454198
37363 454198 -77121 -301639 28792 258756 -17441 -329509 -245868 -53146 -98153 -169551
37353 -169551 49020 458198 784892 902401 738489 279259 -241946 -494980 -351218 211107
37343B11107R66486R45307J64093p08866o42373J10357L17022j71709k44360L47616
37333A294680N28797N6007J32711J064967J345787J82884j022073j006195n58401
37324B019164o77292p07733L9930N95740P4425n06598l6340N91753J54011n85369
37314I61691l11705M05083K69096l21511j96004K97625J11578l38692j3871O07480
37304A470770L89171k71070k56253P7879k72558p43562j41124Q89283P46469k94827
37294A594178n71160L5115J14996n16262n51970K73663O98537K01563l08939l13155
37284F56566l03608m02551j16187L88960L93932K7027J816J43277j87489n28628
37274G3115j1492P21121L22774p67554q26937K24810O72106o1733o04981j69955
$$ plain form
37343 211107 1177593 2122900 2286993 1578127 935754 1046111 1363133 1191424 947064 1294680
37333 1294680 1823477 1879484 2012195 3077162 4422949 4605833 3583760 2577565 2019164
37324 2019164 1341872 634139 674069 1269809 1344234 837636 801296 1393049 1547060 961691
37314 961691 649986 1055069 1324165 1002654 806650 1104275 1215853 877161 863290 1470770
37304 1470770 1859941 1588871 1332618 1410497 1137939 394377 253253 1142536 1889005 1594178
37294 1594178 1023018 1058133 1173129 656867 104897 378560 1077097 1278660 969721 656566
37284 656566 352958 -49593 -165780 223180 617112 644139 645955 789232 601743 73115
37274 73115 61623 782744 1105518 337964 -488973 -264163 407943 346210 -258771 -428726
37264d28726K89721Q1933o7265L55542O20925J95906k88223k84824k17583m19370
37254a61964m12143Q0272M79991L30310K813o4710j7556p3382p1981J52188M70019
37243G13857O36944M06310l09102j018483r31411j23691L53015R0089j6868N12369
37233C13029P05906o0642o76951j79635M12011j00089q32088l93599N31513M29850
37223A49305l04989k64165L00849J83069k47883J67357P91970J55531j055754
37214a24710q50110N62013J031432J24842l98259J47526M96142J10859K248M44229
37204A546212M48102m5814O3205O65478L33977r45119j423609n36313K26544P335
37194C39998k35436Q2904J26802m11587m94169K72453P96052M41348j293M4564
$$ plain form
37264 -428726 -139005 -57072 -124337 231205 852130 1048036 759813 474989 257406 -161964
37254 -161964 -574107 -493835 -13844 316466 319279 254569 237013 163631 91650 243838 713857
37243 713857 1350801 1757111 1448009 429526 -501885 -625576 -272561 -182472 -199340 313029
37233 313029 1018935 958293 281342 101707 513718 413629 -418459 -812058 -280545 149305
37223 149305 -155684 -419849 -119000 64069 -183814 -16457 775513 931044 -124710
37214 -124710 -974820 -412807 618625 743467 345208 492734 988876 1099735 1101983 1546212
37204 1546212 1994314 1948500 2011705 2677183 3011160 2066041 642432 106119 332663 339998
37194 339998 104562 187466 314268 -97319 -591488 -319035 477017 918365 917072 961636
37184I61636P2634j81845k26836m6285k21319n79817l75868J33981M9329l52882
37174g67272p5893N40911L51552k73792l608Q12189O11386m12969n42816K87058
37164E26746M07504l60120l77509N87914Q39486j1053k58198P32405J411215Q68103
37154D366493Q0440l42132r80504j580167r81098L25610M22050o63388p89526
37145a42222M65338R91318q898o51011P4800O28307P5490k43497L81415N25561
37135B096601m43386q86630N4416P55715R0626o07406j97085K82415r8101m04664
37125F42501M6333K56486l09199n49396n413J68694l14601j06721R15227R37268
37115A681179l53309p13943P42960J730992O62610p33999o55004j28015n25608
$$ plain form
37184 961636 1034270 852425 625589 579304 357985 -221832 -597700 -463719 -414390 -767272
37174 -767272 -843165 -302254 49298 -224494 -228102 584087 1195473 782504 239688 526746
37164 526746 934250 574130 196621 784535 1624021 1612968 1354770 2087175 3498390 4366493
37154 4366493 4446933 4104801 3124297 1544130 563032 888642 1310692 647304 -142222
37145 -142222 323116 1314434 1305536 654525 729325 1357632 1433122 1189625 1571040 2096601
37135 2096601 1653215 766585 821001 1576716 1667342 1059936 862851 1145266 1047165 642501
37125 642501 688834 945320 636121 86725 81312 250006 -64595 -171316 743911 1681179
37115 1681179 1327870 613927 1356887 3087879 3750489 3016490 2361486 2233471 1707863
37106A707863r28740k50145M64927P6431n09923k40474J45792j35604l14623J70264
37096A85768M05215q5661l22928L6805o3348p15270n15894O04440Q56710j06555
37086B79282m09348N16947Q92054J46013K9621J012152J267067M83855P18454
37077D936097K057766J729542p49312k001873m18539J154453O35886j6305O54926
37068G982641N46587j460530k534597q94118O28924l87783j680661q25334K25228
37059A600357p69019j761056l17962J597646J205583j21117J24868Q17290j29943
37050B246647j348556o72546N95591L02517m12672L15726J138475J76306j085053
37041A256435n70383M37447M501n99744L94316J531707R06605j89195j2786K65970
$$ plain form
37106 1707863 779123 528978 993905 1070336 560413 319939 465731 330127 15504 185768
37096 185768 590983 505322 182394 219199 155851 -559419 -1075313 -470873 385837 279282
37086 279282 -130066 386881 1278935 1424948 1454569 2466721 3733788 4217643 4936097
37077 4936097 6993863 8723405 7974093 5972220 5553681 6708134 7344020 7327715 7982641
37068 7982641 8529228 7068698 4534101 3639983 4268907 3881124 2200463 1375129 1600357
37059 1600357 831338 -929718 -1247680 349966 1555549 1434432 1559300 2376590 2246647
37050 2246647 898091 225545 821136 1123653 710981 1026707 2165182 2341488 1256435
37041 1256435 686052 1123499 1128000 528256 922572 2454279 3360884 3171689 3158903 3424873
37031C424873n63302q61264L88181R10951m57701q15481J456175K816152M54071
37022F752655k422631k027386l01439o14406j501555k36027J404184O31128q47508
37013H37015l48811N16995m90038j273864M09220J930229N54422j090171k5712
37004A019285J215113k53361j545483M90127K603040Q83876j729280q89188J104195
36995B898324J57168j609904m58388J256584p1942j698875R4675K146274L31799
36986C045715k023733l94603J918283J93703k164926k12039K495537O97714k002218
36977A553433j59765K480526L68966k359971Q8765K995658K12l619250o25098
36968G23476L439800N37404l527622O0916N038781J478164m054458m18476N647498
$$ plain form
37031 3424873 2861571 2000307 2388488 3299439 2841738 2026257 3482432 6298584 6752655
37022 6752655 4330024 2302638 2001199 1386793 -114762 -350789 1053395 1684523 837015
37013 837015 488204 1005199 515161 -758703 -349483 1580746 2135168 1044997 1019285
37004 1019285 2234398 1981037 435554 925681 3528721 4412597 2683317 1794129 2898324
36995 2898324 3055492 1445588 987200 2243784 2171842 472967 567642 2713916 3045715
36986 3045715 1021982 627379 2545662 2739365 574439 362400 2857937 3555651 1553433
36977 1553433 1393668 3874194 4243160 1883189 1971954 4967612 4967824 1348574 723476
36968 723476 4163276 4700680 1173058 1233974 6272755 7750919 3696461 3277985 8925483
36959H925483J949451m207001P89552Q937104N067458j364367P195611J8577656
36951D5870947R797530n426417L713009K4623657K0455872J0680723N6469496
36944A66184817J42323126J54693552L3966159j18857690j61268993q9374608
36938A27666363j8171777j2197415k7116715j5118174L178829l055056j6742004
36931C8444051j1525948P56951j460046r283755n086363L371696P31522o215909
36923I732199l634788K814114R14570m277082j830996L425423J261466l871370
36915D533536k198233K487546J107683l000858j459044K582717J152328k854639
36907B351036j751007J980553J078424k282252j268115K117225J294378k006722
$$ plain form
36959 8925483 10874934 6667933 7457485 16394589 21462047 20097680 27293291 45870947
36951 45870947 55668477 50242060 53955069 78578726 99034598 109715321 166184817
36944 166184817 308507943 463201495 497167654 378309964 217040971 127666363
36938 127666363 109494586 97297171 70180456 55062282 58241111 55186055 38444051
36931 38444051 26918103 27675054 26215008 16931253 11844890 15216586 15948108 9732199
36923 9732199 6097411 8911525 9826095 5549013 3718017 7143440 8404906 4533536
36915 4533536 2335303 4822849 5930532 2929674 1470630 4053347 5205675 2351036
36907 2351036 600029 2580582 3659006 1376754 108639 2225864 3520242 1513520
36899A513520j444509J668895J443184j130193p87009J477171Q63568j511203
36891B093424j132271Q17767J54190j635315l60657K265548J678083q15040p75891
36882B289838P87943j10061k172990j276787J310247J227615p31520n12273J212963
36873B024975O74379j328553j003341R03149N97139j249347q08641J354723J287611
36864B452094p28911o33150J834821K710962Q38161q39816j002335j290486j920041
36855A421299j231314L40199N98004k74540k32763N48156L27486l61218K08203
36846A343512J091869K26731j298225r18829O25794O43182n49568n25167N01374
36837A140673L72304n63594k25258Q84888N82896o48951n81855L80865R3663r66421
$$ plain form
36899 1513520 69011 1737906 3181090 2050897 1263888 2741059 3604627 2093424
36891 2093424 961153 1778920 1933110 297795 -62862 2202686 3880769 3065729 2289838
36882 2289838 3077781 2967720 794730 -482057 828190 2055805 1324285 812012 2024975
36873 2024975 2699354 1370801 367460 1270609 1867748 618401 -190240 1164483 2452094
36864 2452094 1723183 1090033 2924854 5635816 6473977 5634161 4631826 3341340 1421299
36855 1421299 189985 530184 1128188 853648 620885 1169041 1496527 1135309 1343512
36846 1343512 2435381 2662112 1363887 445058 1070852 1714034 1164466 639299 1140673
36837 1140673 1512977 949383 724125 1609013 2191909 1542958 961103 1341968 1435631 469210
36827D69210o13877O26275M34960p52134n46423P51114P54794l75030l54098O89507
36817A084298N48424n98892m97226O84113N83064p38094p86983O74299J201784
36808B154787J64941m16921J29735K10701n57303o60884R1702J66918n33643m64103
36798B85930L95672M63628k45435j65283N48814J97766r65477q95980M51114R65817
36788A036566K25433J2756P06293O43750m59904q56896r8581K09062m34201o16770
36778C67508O3304K96539j74333n7500P03062N95351m79552q16961m8007K27630
36768F77041m69345o54602K03836P11396K25457j19317K22220L05304j91185l27900
36758E82905Q0843J03604k98705j93087K29496j05443p83506l86243O49698N08912
$$ plain form
36827 469210 -144667 481608 916568 164434 -381989 369125 1123919 748889 394791 1084298
36817 1084298 1632722 1033830 536604 1220717 1803781 1065687 278704 953003 2154787
36808 2154787 2319728 1902807 2032542 2243243 1685940 1025056 1116758 1283676 750033 285930
36798 285930 681602 1145230 899795 734512 1283326 1481092 515615 -380365 70749 1036566
36788 1036566 1261999 1274755 1981048 2624798 2164894 1307998 1209417 1418479 984278 367508
36778 367508 430812 727351 553018 495518 1198580 1793931 1314379 497418 449411 677041
36768 677041 207696 -446906 -243070 468326 693783 574466 796686 1101990 910805 582905
36758 582905 663748 767352 468647 275560 505056 399613 -383893 -770136 -120438 388474
36748C88474n95232n77841O82675R36434m10831j148279r4678J027938P53898
36739I62558N2045L7065J11842k60992l01284K82352M01523l25161o66987k5762
36729B67199M50015P070m41487j61117J93636J14733J48855M71624L58278k31583
36719A177223l37545J65744K49298k96031m72258m0558J08022j49122K0058M62045
36709H86876J39217o39018m82728M02918M06864m18440l38211O69850O28704o98457
36699E57575j064809K69247J094482J43326p70565j43735O92094L02974l41579
36690G39010o8098K95995j24481m25718O0417K03830o16804r44527J08301R55327
36680A83252L01011m81494R6323R37147N40505k23396R406M31031r8814l82765
$$ plain form
36748 388474 -206758 -784599 -101924 834510 423679 -724600 -819278 208660 962558
36739 962558 1014603 1051668 1163510 902518 601234 883586 1285109 959948 292961 267199
36729 267199 717214 724284 282797 121680 315316 430049 578904 1050528 1408806 1177223
36719 1177223 839678 1005422 1254720 958689 486431 445873 553895 404773 424831 886876
36709 886876 1026093 387075 -95653 307265 714129 295689 -42522 627328 1256032 557575
36699 557575 -507234 -237987 856495 999821 229256 85521 777615 1080589 739010
36690 739010 670912 966907 842426 416708 477125 680955 64151 -880376 -772075 183252
36680 183252 484263 2769 99092 1036239 1576744 1353348 1362754 1793785 1694971 1312206
36670A312206J072446K826545K311976j26172j820154j718221j105483q67279
36662A885864n33638P2912L59367J91040J3520j27796m12940m86736n7103L03994
36652A208484O1389k98752k24892j18875l27195k12055N80760J099030O11629
36643B379523m3176M6635L10901K8141j77515K82336N02644k76333r60836l90445
36633A701875M93830K39486o16208p06303l07063m61397p09597q44J019184R43193
36623A596156Q9728j73439J19746j3343l13880J39186P85890L92696n19818m55451
36613A647471K96869J49900q44179j066576k35223K48741o8852j05146N01372
36604E24377P80805L83010R2243J30683j23251n54105l53976K49475K16762l22458
$$ plain form
36670 1312206 2384652 5211197 7523173 7397001 5576847 3858626 2753143 1885864
36662 1885864 1352226 1425138 1784505 1975545 1989065 1861269 1448329 961593 904490 1208484
36652 1208484 1269873 971121 746229 627354 300159 88104 668864 1767894 2379523
36643 2379523 2336347 2382982 2693883 2722024 2544509 2826845 3329489 3053156 2092320 1701875
36633 1701875 2195705 2435191 1818983 1112680 805617 344220 -365377 -366221 652963 1596156
36623 1596156 1685884 1512445 1632191 1618848 1304968 1444154 2230044 2622740 2102922 1647471
36613 1647471 1944340 2094240 1250061 183485 -51738 197003 128151 23005 524377
36604 524377 1305182 1688192 1780435 1911118 1787867 1233762 879786 1129261 1346023 1023565
36594A023565k74810K59582J26198n82712n70839K14042M30283j62197l34539
36585A28573K10171L65852j05010j44761L48681J89049o91047q51218O5414O67157
36575A82861L31784Q1354L66859L44935n5055K08445R67427P30445m96466r42028
36565A720561k40291j5452o49334n84015L73972M47334m66985k36577J242376
36556A591589J257102o97624j460365K12123J211940k09617j135031M17934J561402
36547B749453R2696j038597O32172K101385Q10074J67189K900297M540925J258945
36538A4214539j556630J886020O164078M278165L934989J7296679L5194879L1526356
36530A12939075q073l1533279l5100384j6957233l399424l878613o207848k280117
$$ plain form
36594 1023565 748755 1008337 1134535 551823 -19016 195026 625309 463112 128573
36585 128573 338744 704596 599586 454825 803506 992555 301508 -549710 -484296 182861
36575 182861 514645 595999 962858 1307793 1252738 1461183 2428610 3159055 2662589 1720561
36565 1720561 1480270 1464818 815484 231469 605441 1052775 585790 349213 1591589
36556 1591589 2848691 2151067 690702 902825 2114765 1905148 770117 1188051 2749453
36547 2749453 2842149 1803552 2435724 4537109 5347183 5514372 8414669 12955594 14214539
36538 14214539 12657909 14543929 20708007 24986172 28921161 46217840 81412719 112939075
36530 112939075 112931002 81397723 46297339 29340106 25940682 22062069 15854221 13574104
36522A3574104J235281j213762m223975k575534L0373p62416k244092r50945O95450
36513C564484l58065j851756p76955J001226N74459o88115k39609P83143J73186
36504B181998r19559l52211Q04199L73904q10296o34794L42440K02261o66875
36495E21067n27616M05660O57452L10052L88410N74484P1549m29316l9011L47393
36485B280124l04046r46573l08778N09776p9002j110497p36460L69654K96668
36476b9134n22684k18006Q50088O62491o54854r30692K09545Q12164J44646k87422
36466C6142K21237M14164k80864n95797J16910O28732J12444m25140j12170K65312
36456C80970j05677n41894j86775M81800O02366K92541P6670r1646l70877m34290
$$ plain form
36522 13574104 14809385 13595623 9371648 6796114 6826487 6064071 3819979 2869034 3564484
36513 3564484 3206419 1354663 577708 1578934 2153393 1465278 1225669 2008812 2181998
36504 2181998 1262439 910228 1714427 2088331 1278035 643241 985681 1187942 521067
36495 521067 -6549 399111 1056563 1366615 1755025 2329509 2401058 1971742 1932731 2280124
36485 2280124 1976078 1029505 720727 1230503 1151501 41004 -695456 -325802 -29134
36476 -29134 -551818 -769824 80264 742755 87901 -842791 -633246 178918 323564 36142
36466 36142 257379 671543 390679 -205118 -88208 540524 652968 227828 115658 380970
36456 380970 275293 -266601 -453376 28424 630790 923331 1000001 908355 537478 103188
36446A03188p7826K87471L09705J84490R7136p2343k04670O1308N12071M19316
36436A619846k79453p23400l77273K57712M73391J66284l82511q26982p46940
36427h19326m8253O06425N27930O2827M7752L87203K77422k56580l25890K26159
36417F85669M94445N4209l96282l17296j10074j68666j97548L0293J66406K2537
36407B63693j8212K36436L74530J06307k96003n61784p22592o64388j52546N15022
36397i19537O74401K90207M51N8192P5915q1199p4101J02457M1821j83687k2789
36386c7869M82531O16108J90258j65688j36235j14066k32682q9950K59560J50708
36376I22675m53567o64215r4367M56876L04399j14850j50765K0273p5097l57340
$$ plain form
36446 103188 25362 312833 622538 807028 904164 831821 627151 688459 1200530 1619846
36436 1619846 1340393 616993 239720 497432 970823 1137107 754596 -72386 -819326
36427 -819326 -867579 -261154 266776 329603 377355 764558 1041980 785400 459510 685669
36417 685669 1180114 1234323 838041 520745 410671 242005 44457 74750 241156 263693
36407 263693 245481 481917 856447 962754 666751 104967 -617625 -1282013 -1434559 -919537
36397 -919537 -245136 45071 45522 103714 179629 98430 24329 126786 168607 -15080 -37869
36386 -37869 444662 1060770 1251028 1085340 949105 835039 602357 512407 771967 922675
36376 922675 469108 -195107 -289474 167402 471801 356951 206186 226459 151362 -205978
36366b05978m79816l84931j27086K94133O08078M09038j18429k78690J07718M57258
36356B81295L78646J19571q8830l23564m69485k71587J2693r6235l34211m1496
36346h33203N26953M54258j96898l64070J74576M10936n4181l15558J05681L61714
36336B70208j06802n04378j65731K36615J1851k65138P3977M64078J69382l17420
36326a33358j97107J71275M831m28507l49663R9833K07715P061M8201K18515m5335
36315c96539n72710n50512K35831J072092J218987N93631l03975p28367k64068
36306C04370N68278P31737L7049n42732l19057J46553R4607k56993l42802k78492
36296A42518l98464m41432r1981K61880J91350O3343L26093N62299K30777k11514
$$ plain form
36366 -205978 -685794 -1070725 -1197811 -903678 -295600 113438 -4991 -283681 -175963 281295
36356 281295 659941 779512 690682 367118 -102367 -373954 -361261 -457496 -791707 -833203
36346 -833203 -306250 148008 -48890 -412960 -238384 172552 118371 -197187 -91506 270208
36336 270208 163406 -340972 -506703 -270088 -258237 -523375 -449398 14680 184062 -133358
36326 -133358 -330465 -159190 -154359 -582866 -932529 -832696 -624981 -617920 -569719 -351204 -396539
36315 -396539 -969249 -1519761 -1283930 -211838 1007149 1600780 1296805 568438 304370
36306 304370 872648 1604385 1641434 1098702 779645 926198 1020805 763812 421010 142518
36296 142518 -255946 -697378 -789359 -527479 -336129 -272786 53307 615606 846383 634869
36286F34869p877N25248M52183k51613p26253o10189l49344k09581J8355K99934
36276b24268K49480j33298l61792k18667N043R8752J89143L30933L42415J47878
36266D25619q8731k19708k32562j50247k6390N6895J20741K27631K32120n4434
36256B90934l93382l16896Q9744K20324n7468j65118J43684L12869j0544l23896
36246b09749j81062M4146m0776p4190K66793M58587Q319n29390l98325N6618k959
36235f01988m21413l03895M40795R00082N24949j97912n51520l71255O6754L85523
36225a29880K97190j07249l15218k4473L52285K39926k46469m84480k35815J10057
36215e44126J23855j84282m46605l18369J38114M48131L43176K41062O02911R82666
$$ plain form
36286 634869 626992 1152240 1604423 1352810 626557 16368 -332976 -542557 -524202 -224268
36276 -224268 25212 -108086 -469878 -688545 -683502 -584750 -395607 -64674 277741 425619
36266 425619 336888 117180 -115382 -265629 -292019 -235124 -114383 113248 345368 290934
36256 290934 -102448 -419344 -329600 -109276 -166744 -331862 -188178 124691 114147 -209749
36246 -209749 -390811 -346665 -387441 -461631 -194838 263749 272068 -257322 -655647 -599029 -601988
36235 -601988 -1023401 -1327296 -886501 13581 538530 340618 -210902 -582157 -515403 -129880
36225 -129880 167310 60061 -255157 -279630 72655 312581 66112 -418368 -654183 -544126
36215 -544126 -420271 -604553 -1051158 -1369527 -1231413 -783282 -440106 -199044 403867 1386533
36205A386533N43730m84893r06228l42650J87901o0192m45624j83937L34925L43498
36195C73063m3649k62405k69582k42901r35M72399O14479J73593k11814p6902
36185E25346N8763k35224l61134J64966N73821M7075p65363p42755j10824J02093
36175g43236j62624j74699R3269P2949j29309O2933M62640L88412l8231j07872
36165b75768J66005J71402o8203o685K58893J51615k16425k32426L2586J9060
36155E4j50522O1962L96550J72133l17611j93988L56890L19180l04027m39915
36145i9294J51342M97895J73985j23940r3702l38323q69717o83464M40566J156043
36135B11391M89562o38875q11376m7015O18574O80371L63770q3898m45729l54652
$$ plain form
36205 1386533 1930263 1445370 539142 196492 384393 324201 -121423 -305360 29565 373063
36195 373063 329414 67009 -202573 -445474 -446409 25990 640469 814062 602248 525346
36185 525346 584109 348885 -12249 152717 726538 773613 8250 -734505 -845329 -743236
36175 -743236 -905860 -1080559 -987290 -914341 -1043650 -980717 -518077 -129665 -167896 -275768
36165 -275768 -109763 61639 -6564 -13249 245644 397259 180834 -51592 -19006 54
36155 54 -150468 -88506 308044 480177 162566 -31422 325468 644648 340621 -99294
36145 -99294 52048 549943 723928 599988 506286 167963 -701754 -1385218 -944652 211391
36135 211391 700953 62078 -749298 -796313 -177739 502632 866402 782504 336775 -17877
36125a7877K26424P19159O47429K46795k8619j26014j66732j26892q9284k75539
36115A008850n24826l44061K07604L59798k32420q46032o83504M7426N60088N26496
36105G9419J89575j74263m23666m46109k59291m8264Q3149J87404K58306K48370
36095c05370K64461L52927K12120l41910p76241m30236L70410O29212J43500k50335
36085a31462l5250L28478L58171K16629Q0617k23320n41243l02448L93915N74740
36075G18827j08863o58565k67190L88111L50699j4510J83857O87530N94178P4598
36065A948672P6002N14907M16838P120Q52028L122106M338552K318610j590699
36056A2004136l891669l173464j327563n13445o62276o55617m11147m91362o26996
$$ plain form
36125 -17877 208547 927706 1575135 1821930 1793311 1667297 1500565 1373673 1284389 1008850
36115 1008850 484024 139963 347567 707365 474945 -371087 -1054591 -1007165 -447077 79419
36105 79419 268994 94731 -328935 -775044 -1034335 -1082599 -999450 -812046 -553740 -305370
36095 -305370 -40909 312018 524138 182228 -594013 -1024249 -653839 -24627 118873 -131462
36085 -131462 -166712 161766 519937 736566 817183 593863 52620 -249828 144087 718827
36075 718827 609964 -48601 -315791 72320 423019 408509 592366 1279896 1874074 1948672
36065 1948672 2024674 2539581 2956419 2963539 3815567 6937673 11276225 13594835 12004136
36056 12004136 8112467 4939003 3611440 3097995 2435719 1780102 1368955 877593 250597
36047B50597j47478N76263N69444n0970k32124J71705J84109m46463p09124j42647
36037B3312L08604K716k80032Q8287K96481l32594p76789N8849J192608R25875
36027A507317l45381p19974J24396N58047j56285o95787L4173J167153J328779
36018B802438N34179k88214o98122q02236o36267k65167j8488o8684j58634o7756
36008C33049R0122K14891L40466L05585p4503m47684k74783J89795J32199m55521
35998C53616o18862L1308O28149M03845j63825k30261J25139K46110J5907j34349
35988F56777m2077J5292j43812l60017m04140k44204n7821l1604q1475R3133M87869
35977a12079O09717J93658k40498j24268K06159O8297l24630j56974N32805P64009
$$ plain form
36047 250597 103119 679382 1248826 1197856 965732 1137437 1321546 875083 165959 23312
36037 23312 331916 334632 54600 142887 439368 106774 -670015 -611166 581442 1507317
36027 1507317 1161936 441962 566358 1124405 968120 272333 306506 1473659 2802438
36018 2802438 3336617 3048403 2350281 1548045 911778 646611 628123 559439 400805 333049
36008 333049 423171 638062 978528 1284113 1209610 761926 487143 676938 809137 353616
35998 353616 -265246 -233938 394211 798056 634231 403970 529109 775219 791126 656777
35988 656777 614700 629992 486180 126163 -277977 -522181 -580002 -611606 -693081 -599948 -112079
35977 -112079 497638 691296 450798 326530 532689 600986 276356 119382 652187 1416196
35967A416196J46931n19038n16611j62542m8686j37384j43731j75065m22477o50305
35957a212712m83904M0195N09654N54890J58538k59201j78247L32212N54765J48192
35947A64382k34054K5540M09314J14309m83498l78434L63802P35383M58044J92411
35937A367199J38042j68524o05225m79130M4418K4259n08020m68226K69862N02948
35927A17603j17783l45780L93278Q26874Q2808o36907j24831O33719J46672r03831
35917G1822p17408O06917J191045K98870p55622p79084j72449J75372J82010J77332
35907B78805J17980j74546m87512m31121K113L68505K71485j19875j90583K83506
35897h1243O45851K12379n76649o54544O4738N86581M83187M41331P47875N46340
$$ plain form
35967 1416196 1563127 1044089 527478 364936 316250 178866 35135 -139930 -562407 -1212712
35957 -1212712 -1696616 -1656421 -1146767 -591877 -433339 -692540 -870787 -538575 16190 164382
35947 164382 -69672 -44132 365182 479491 -4007 -382441 -18639 716744 1174788 1367199
35937 1367199 1505241 1336717 731492 252362 296780 321039 -186981 -655207 -385345 117603
35927 117603 -180 -345960 47318 874192 957000 320093 195262 828981 975653 71822
35917 71822 -645586 -38669 1152376 1451246 695624 -83460 -255909 -80537 101473 278805
35907 278805 396785 222239 -265273 -696394 -694281 -325776 -54291 -174166 -364749 -81243
35897 -81243 564608 776987 200338 -454206 -389468 197113 680300 1121631 1869506 2415846
35887B415846n80244j484222j032566J17324N44618J42941j17792L3501M062l04626
35877b61158k85569K01905N42570L89810R7970k8253j71683m86713p12847n22949
35867a236917N2501O18586O96412J87067l30976j62595M77079N92206j17926o56649
35857A18788j88490O23974N85207k63449q06522n08416L9897J79947j6383j35215
35847c70662l9655Q6979M9269q6925q953L87656O51875L33155j98466j92309K22257
35836H34221J60661m59163o29045L8778N45978J85881k32609J45426O46428K43866
35826A480422n95342o81457p5833J87992o7484r4124K41116K73572j21470k99812
35816B47580m6001J41871P5756J33798L63854L16350o7412k95640j99355j28302
$$ plain form
35887 2415846 1835602 351380 -681186 -563862 -19244 123697 5905 39406 43468 -261158
35877 -261158 -546727 -344822 197748 587558 685528 657275 485592 -1121 -713968 -1236917
35867 -1236917 -1184416 -565830 130582 317649 -13327 -175922 301157 893363 775437 118788
35857 118788 -69702 554272 1139479 876030 69508 -438908 -399011 -219064 -235447 -370662
35847 -370662 -410317 -323338 -274069 -360994 -369947 17709 669584 1002739 804273 611964 834221
35836 834221 994882 535719 -93326 -54548 491430 677311 444702 590128 1236556 1480422
35826 1480422 885080 203623 127790 315782 248298 154174 395290 668862 547392 247580
35816 247580 201579 343450 419206 553004 916858 1233208 1165796 870156 670801 542499
35806E42499j66295M862L26189K89261j54216l85769p2119L46868L61568L927
35796A096775m34062p51911p47540k87263L51151O26671L65451p9356l18236k57666
35786d35986j600K38551K16744n7064k34430r8971J25566K03925K59987L93271
35776F09993L76481J32905K619Q2303q7189o16258p62904r1084N74287L03237
35766E24390m42431n55977l2222K19993l7078k00667m8617N9395R3669L25200
35756i4345M71623K9018n89810m48084L43706O63664J25539m16094l46192q4571
35746c45546m1232Q3250M51568N49975P8986m38979m93926l18952k89913k64135
35736a028904k9103J64233K3005k61159l03614o159M78679Q90597Q61502K37331
$$ plain form
35806 542499 376204 381066 707255 996516 842300 456531 384412 731280 1092848 1096775
35796 1096775 662713 -89198 -836738 -1124001 -772850 -146179 219272 139916 -178320 -435986
35786 -435986 -437586 -199035 17709 -39355 -273785 -372756 -247190 -43265 216722 609993
35776 609993 986474 1119379 1121998 1204301 1117112 500854 -262050 -353134 221153 524390
35766 524390 81959 -474018 -506240 -286247 -323325 -523992 -572609 -513214 -419545 -94345
35756 -94345 377278 406296 -183514 -631598 -287892 375772 501311 85217 -260975 -345546
35746 -345546 -386778 -303528 148040 698015 777001 338022 -155904 -474856 -764769 -1028904
35736 -1028904 -1058007 -893774 -870769 -1131928 -1435542 -1441701 -963022 -72425 789077 1026408
35726A026408n09357o86658k67928J48285K52630K67100K65138k890m62743o14823
35716e84838k99927O2002J81996K28304K77166R4401l02876m64145j41707L64150
35706e85474O43864N35241O2618m69471m62724K29562P36595K06323p68691q45792
35696g17949n67M08519j39233m88112J86084Q93598L94054p80507j108725k88949
35686a641787N48688N81524J59718q3635j00060j56792k65519k01995J06691M02065
35676f51102L31604r7569m00882j69010L48150N41826K65177o5599j55349j10422
35666a63176j2840K18524M29336K66522k01060m41607k53421o4728j92026l29079
35656g43555j01288L23050N26647M01229J17915j62114l16243k76180j81383k44002
$$ plain form
35726 1026408 517051 -169607 -437535 -289250 -36620 230480 495618 492728 29985 -584838
35716 -584838 -884765 -822763 -640767 -412463 -135297 -40896 -343772 -807917 -949624 -585474
35706 -585474 58390 593631 656249 186778 -275946 -46384 690211 896534 127843 -717949
35696 -717949 -718516 -309997 -449230 -937342 -751258 142340 536394 -244113 -1352838 -1641787
35686 -1641787 -1093099 -511575 -351857 -435492 -535552 -692344 -957863 -1159858 -1053167 -651102
35676 -651102 -319498 -417067 -817949 -986959 -638809 -96983 168194 102595 -52754 -163176
35666 -163176 -176016 42508 471844 738366 537306 95699 -157722 -222450 -414476 -743555
35656 -743555 -844843 -521793 4854 406083 523998 361884 45641 -230539 -411922 -655924
35646f55924l74281k66769Q3546L30721L07737K11801J99659K03969K06316K80587
35636E27362L24034J54154j25162k69428l31113m71808m75075o0617M26596L67221
35626F6164j18936k81749R1805M13823L04682N4706q9868k86013n08068l98751
35616g52205J8805K35646J24644J38170L78035L18222j90149n01170k22372J31804
35606c20570N5372j44190k8504J87891J47219J9967O7195J05818j0848N0652M65090
35595E95092P12947L26491l06640n28347l73772l09567l81172k78393O472J81174
35585c55715J49214M4600n8047j13101n109K15491K60494L6783j50869p8730M5753
35574i236m3723k72774l97242k65299J67714P00191P93198J69619n50130n20024
$$ plain form
35646 -655924 -1030205 -1296974 -1213428 -882707 -574970 -363169 -163510 40459 246775 527362
35636 527362 851396 1005550 880388 610960 279847 -191961 -667036 -727653 -301057 66164
35626 66164 -52772 -334521 -242716 171107 475789 530495 440627 154614 -353454 -752205
35616 -752205 -733400 -497754 -373110 -234940 143095 461317 271168 -230002 -452374 -320570
35606 -320570 -265198 -409388 -437892 -250001 -102782 -82815 -15620 90198 79350 130002 595092
35595 595092 1308039 1634530 1327890 799543 425771 116204 -264968 -543361 -536889 -355715
35585 -355715 -206501 -161901 -219948 -333049 -338158 -122667 137827 174610 23741 -54989 -9236
35574 -9236 -52959 -325733 -722975 -988274 -820560 -120369 672829 842448 292318 -227706
35564b27706O5669K51307j40011l24271l8081O0455k00642r3735M40476L04791
35554I8252p70193j244445o3102J382816J203944j08457n88872J06891N08681
35545E25515j7911m31219n6210L08503p2834o20299m81838J51548M90784K50018
35535D6057k39708n34178l50658K28343O48961M39177q4386k12134P2854J11127
35525A25455k73470m49838o3262L43523K14708j60185j88171J01275K21049L6039
35515i2877j05068L1722K18678R8226l01699n17708k01391L39723M37957N957
35505h6480k29922K31166Q12683O24062k07060o93092m03321L9382J5442k44467
35495a41607k04243J25589L24353K33145O4605k3261j08064k38580k28587J17273
$$ plain form
35564 -227706 -162037 89270 -50741 -375012 -413093 -352638 -553280 -647015 -206539 98252
35554 98252 -671941 -1916386 -1979488 -596672 607272 498815 -90057 16834 525515
35545 525515 507604 76385 20175 328678 255844 -364455 -846293 -694745 -203961 46057
35535 46057 -193651 -727829 -1078487 -850144 -201183 237994 153608 -58526 14328 125455
35525 125455 -148015 -597853 -661115 -317592 -102884 -263069 -451240 -349965 -128916 -92877
35515 -92877 -197945 -166223 52455 150681 -151018 -668726 -870117 -530394 -92437 -86480
35505 -86480 -316402 -85236 727447 1351509 1144449 451357 48036 87418 102860 -141607
35495 -141607 -345850 -220261 104092 337237 401842 378581 270517 31937 -196650 -79377
35485g9377N93190O24281m3533p93292p23375J25534O71672K26233n40545o08029
35475e47241p0243J95199o537l0888L27956M32302j9903l27309J16907P38572
35465H08815N53248l50853q95435n01010K20151M17744P0960k47984k83825k69083
35455d77272l10400j39192L62562P91595P00898K14768j77352k81763k76815k43218
35445A63811p2772J59222J94012M1545l114J03722O1102j86787k57644M0744L54458
35434E98299L32877R5780j30911l72430n62695l59730K37727N63411J34265n57130
35424b0537p03216l07852J0894Q9280L18842P30131P41583M0383q19853j004836
35414i25181l32081N54021Q17057K22924o00630p93219k37339L27830L08041q030
$$ plain form
35485 -79377 513813 1138094 1094561 301269 -422106 -296572 375100 601333 60788 -547241
35475 -547241 -617484 -422285 -428822 -459710 -131754 300548 280645 -46664 70243 808815
35465 808815 1362063 1011210 115775 -385235 -165084 252660 323620 75636 -208189 -477272
35455 -477272 -787672 -926864 -564302 227293 928191 1142959 965607 683844 407029 163811
35445 163811 91039 250261 444273 485818 482704 586426 647528 460741 203097 243841 598299
35434 598299 931176 1026956 896045 523615 -39080 -398810 -161083 402328 536593 -20537
35424 -20537 -723753 -1031605 -1020711 -931431 -612589 117542 859125 899508 79655 -925181
35414 -925181 -1257262 -703241 113816 336740 -263890 -1057109 -1294448 -966618 -658577 -666607
35404f66607l3202J89671J75385j21663k20022J20036N51773O41597L42586r5526
35394H84028m01492m29374k51067j02642r2451o3607J09222K82201L05418K92441
35384E32677L61770L34218J869m72195p15518n73065j70718K45595L74292P3444
35374g631k99228j62538M27453O82114J95388l87996l12806K00786M28144K36661
35364A000347P153j59436l92059m93417k12742J34500P5015j84494r1417K68181
35354d8369L36199Q6353n031J01455J3999j71756O0205N68624N51886j38609o53606
35343G01350m67848j19107j61103k57657O1116M82826M70846J81182J02157J89744
35333A183506N9446k45537l34520j49521M265J124k6613p0562k43615m25558l35378
$$ plain form
35404 -666607 -699809 -510138 -334753 -456416 -676438 -556402 -4629 636968 979554 884028
35394 884028 482536 53162 -197905 -300547 -392998 -456605 -347383 -65182 240236 532677
35384 532677 894447 1228665 1230534 758339 42821 -530244 -700962 -455367 -81075 -7631
35374 -7631 -306859 -469397 -41944 640170 835558 447562 134756 335542 763686 1000347
35364 1000347 1007500 848064 456005 -37412 -250154 -115654 -40639 -225133 -316550 -48369
35354 -48369 287830 374183 369152 470607 484606 312850 373055 941679 1493565 1354956 701350
35343 701350 233502 114395 -46708 -304365 -243249 239577 710423 891605 993762 1183506
35333 1183506 1242952 997415 662895 513374 517639 518763 492150 421588 177973 -247585 -582963
35322e82963P056K42926J66869l1008j08306j06614j83566k67808j12504K92303
35312f83615N62888L58847j03633k46767R8893M16027J94640l54191n91831k93658
35302f42400J54424L25944J85369m0688j43797o5679O3267N2843n9309j5641K11774
35291B6107K65866l3034l04799j84773N4546k5498k39801j00660K89434L88078
35281A35466J38720j3131J7871j07350l22853j57163K74061K29028l60116n22275
35271f87742K35808R55052O00143l18142n34974J9758K46915k58650n79188k4998
35261c46018P07760N98790j42554m24638R5122N73191K71674m33349p18640m74260
35251b92922k25090j77593m1993K14848J72006k40807l98130J06035P18035O71504
$$ plain form
35322 -582963 -575907 -332981 -166112 -197120 -305426 -412040 -595606 -863414 -975918 -683615
35312 -683615 -120727 238120 134487 -112280 -13387 402640 597280 243089 -348742 -642400
35302 -642400 -487976 -162032 23337 -17351 -161148 -226827 -163560 -110717 -170026 -185667 26107
35291 26107 291973 258939 -45860 -230633 -176087 -201585 -441386 -542046 -252612 135466
35281 135466 274186 261055 278926 171576 -151277 -308440 -34379 194649 -165467 -687742
35271 -687742 -451934 503118 1103261 785119 250145 269903 516818 258168 -321020 -346018
35261 -346018 361742 960532 817978 393340 488462 1061653 1333327 899978 181338 -292922
35251 -292922 -518012 -695605 -737598 -522750 -350744 -591551 -989681 -883646 -165611 505893
35241E05893Q4844l19325k92183j58639m8698J89822L74163R7958m38550m90423
35231d95138J05052N79390L49881j53674k15068J39426L41572J50898j59254k81665
35221C61420j72338P109L5067j28868j83315J44305N50047M45559j11982l85550
35211E61454q6941J42657j91607n67843l10484K45670K94288j13091k16837J23262
35201a19472K27859j75409m46405r3381M12649L69974j46276n18494m48622j01689
35191a039266L21807O70791O97236L01791j69825k89182j29554r2791k30856k01350
35181a61199R0963K92804J69183n7260j10064j2930J48739M06165N96430L12215
35171A675046m67890j084711r75030m14623k5825J01637K32971K88727O0526j22104
$$ plain form
35241 505893 590737 271412 -20771 -179410 -228108 -38286 335877 433835 -4715 -495138
35231 -495138 -390086 189304 539185 385511 170443 309869 651441 802339 643085 361420
35221 361420 189082 196191 231258 102390 -80925 63380 613427 1058986 947004 561454
35211 561454 474513 617170 425563 -142280 -452764 -207094 87194 -25897 -242734 -119472
35201 -119472 108387 -67022 -513427 -606808 -194159 175815 29539 -488955 -937577 -1039266
35191 -1039266 -717459 -46668 650568 952359 782534 493352 363798 271007 40151 -161199
35181 -161199 -70236 222568 391751 334491 224427 211497 360236 766401 1362831 1675046
35171 1675046 1207156 122445 -852585 -1267208 -1293033 -1191396 -958425 -669698 -609172 -731276
35161g31276K00139O53446M25912l36607n65189O0933N50312J86300l61499k48601
35151a66130J36089m6523n58285m60634L10629Q20728N26278j09257m56140m40445
35141d43690l02368k01762j87321j75113K4889L47165L50811j17221m44329l1939
35131a180878P03185Q24527K33456k40678j08723J87261J08262k29194m07864
35122a10646l18790j34378L007P3093J59260L70387O07940N50643J23142k57486
35112A066172k47825r2633j37722j95262J2225J46122k27143o80668m21023L61794
35102d15963O31489Q3952m01104j71795K53238J34908l38448m63270j01478K42608
35092e45863K02034l8347o0985K53920N30351L01886l04799n78228j84277K75252
$$ plain form
35161 -731276 -531137 122309 548221 211614 -353575 -292642 257670 443970 82471 -166130
35151 -166130 -30041 -76564 -634849 -1095483 -784854 35874 562152 452895 -3245 -443690
35141 -443690 -746058 -947820 -1135141 -1310254 -1285365 -938200 -587389 -704610 -1148939 -1180878
35131 -1180878 -477693 346834 580290 339612 230889 418150 526412 297218 -110646
35122 -110646 -429436 -563814 -560807 -487714 -328454 41933 649873 1200516 1323658 1066172
35112 1066172 818347 725714 587992 392730 404955 551077 323934 -356734 -777757 -415963
35102 -415963 215526 299478 -101626 -273421 -20183 114725 -223723 -686993 -788471 -545863
35092 -545863 -343829 -382176 -443161 -189241 341110 642996 338197 -240031 -424308 -149056
35082a49056J51653k27220j39989K78511K96973r1843j59521K28396L46436j01877
35072D32463m46273j91363J97467J34003k06075l37525j82961J07335M96357Q15389
35062H18817O92611J03826m51035n97484m59292k15641J42318M23690K50774k69379
35052D39205m97280j67874K33800K50952J2700k13904l96460m27624j00142L61531
35042e05096M07304L2129j49416Q7331K48225L8260j94830k08734k32264k99765
35032g76856q9911K78634K32794j54618q8932N32958P71266K18899k70473q5487
35022E68274J45238j27797l04535J09882L75993j62844p21126l63511L05458J97199
35012B2231l44339k56152K67945J90892l92233l88668L36362P43857M03137K9167
$$ plain form
35082 -149056 2597 -224623 -364612 -86101 210872 119029 -40492 187904 534340 432463
35072 432463 -13810 -205173 -7706 126297 -79778 -417303 -600264 -492929 3428 818817
35062 818817 1511428 1615254 1164219 566735 107443 -108198 34120 457810 708584 439205
35052 439205 -58075 -225949 7851 258803 271503 57599 -338861 -766485 -866627 -505096
35042 -505096 -97792 -65663 -215079 -127748 120477 158737 -36093 -244827 -477091 -776856
35032 -776856 -866767 -588133 -355339 -509957 -598889 -65931 705335 924234 653761 568274
35022 568274 713512 585715 281180 391062 767055 604211 -116915 -480426 -174968 22231
35012 22231 -322108 -578260 -310315 -119423 -511656 -900324 -563962 179895 583032 612199
35002F12199Q3706J65929K8757M496J45754J9645l64931m10914J2153K73623J6342
34991E86759l31981l35514j12167P7661J53322L0813k53425k65468K85321Q33902
34981F69223N94089j96685n64933k67852N423r7729j66754O275O2796j01485j12648
34970a70280N3267m2671l57976k81581K36585M60159J03219k07755r7983l5643
34960c40659k64912k04352M18408Q11969L27786m07646m74464q8819p8515m52406
34950g53610n21743j53150R6742K2353N5368M01125O19848L34922j42414k29357
34940b69916J36247M22828J96757l23911n58803l24646q592Q8739J58984L48585
34930a33728L08874j61967m72468k7329O49078N42965k49713o44781l04106m4097
$$ plain form
35002 612199 695905 861834 890591 895087 1040841 1060486 695555 284641 296794 570417 586759
34991 586759 254778 -80736 -192903 -115242 38080 68893 -184532 -450000 -164679 669223
34981 669223 1263312 1066627 501694 233842 239265 141536 -25218 -18943 43853 -57632 -170280
34970 -170280 -117013 -159684 -517660 -799241 -562656 -102497 722 -207033 -305016 -340659
34960 -340659 -605571 -809923 -391515 420454 748240 340594 -133870 -222689 -301204 -753610
34950 -753610 -1275353 -1428503 -1331761 -1309408 -1254040 -852915 -233067 101855 -40559 -269916
34940 -269916 -133669 289159 485916 162005 -396798 -721444 -730036 -641297 -482313 -133728
34930 -133728 175146 13179 -459289 -486618 162460 705425 455712 -189069 -493175 -537272
34920e37272k80958l45706J39258M40293L7296l45181Q828M85637J95212m32978
34910f35571l57244L12631N52862J32319j68033M7305L10649K53429N0671j62059
34900C36959m06062l67066K70331R45271P00325k97791p83209k50728K97466j2914
34890D32582n91862m65786J60284L86181Q9029r4751N0944J11716q8233k30007
34880b39903j31759L3475J67888L00779K45038j61640n01504j91986M81945N59341
34870E61674j51256o58481k48013M42285M57755k1517j06413L38930N72918J74362
34860A362244m52247p80153o88132k60348L06112N63160K13967l03635k86397
34851c25429J42670J62971l97756o99544j99128N01542O13331K45551n0827j81219
$$ plain form
34920 -537272 -818230 -1163936 -1024678 -584385 -547089 -892270 -883442 -397805 -202593 -635571
34910 -635571 -992815 -680184 -127322 4997 -163036 -115731 194918 448347 499018 336959
34900 336959 -69103 -436169 -165838 779433 1479758 1181967 398758 148030 445496 432582
34890 432582 -159280 -625066 -464782 -78601 10428 -84323 -33379 78337 -9896 -239903
34880 -239903 -371662 -338187 -170299 130480 375518 213878 -287626 -479612 2333 561674
34870 561674 410418 -248063 -496076 -53791 403964 382447 276034 614964 1187882 1362244
34860 1362244 909997 129844 -558288 -818636 -512524 50636 264603 -39032 -325429
34851 -325429 -182759 -19788 -417544 -1117088 -1316216 -814674 -201343 44208 -6619 -187838
34841a87838k83515j73259K35985M15274o7215o51485m45910M13752Q97485N18093
34831F71367j30934l30609p1377J94107J33278k31892n28468l27468K49557M62372
34821H9933p5339o96464n62325J01948M39764L41822M11951O75894M51239l26756
34811H51667p48855l14093K83434K81510p1860j93242j80174l93197n73033k17767
34801a275610M46972O57256J99195l17192l16509P4472L25588J72853j41531k03098
34791c77604N4965K42568N0482k36652r6931M16206O72457L49224j54647l55195
34781E64873k76101j72629q7300L1670J13282J25626J51410J25777j28630m45799
34771B179l73186Q3990L11428J1179k84184q0739K43968R0210l38125l93807o9224
$$ plain form
34841 -187838 -471353 -644612 -408627 6647 -60568 -712053 -1157963 -744211 153274 671367
34831 671367 540433 209824 138447 332554 465832 233940 -294528 -621996 -372439 89933
34821 89933 14594 -681870 -1244195 -1142247 -702483 -360661 51290 727184 1178423 851667
34811 851667 102812 -211281 72153 353663 281803 88561 -91613 -484810 -1057843 -1275610
34801 -1275610 -828638 -171382 27813 -289379 -605888 -531416 -205828 -32975 -174506 -377604
34791 -377604 -322639 -80071 -29589 -266241 -363172 53034 725491 1074715 920068 564873
34781 564873 288772 116143 28843 60513 173795 299421 450831 576608 447978 2179
34771 2179 -371007 -287017 24411 35590 -248594 -329333 -85365 4845 -333280 -727087 -796311
34760g96311P6301o9960n2752K22503K41977j89764m70455p6710N81990P10915
34750A77734K39283j71680j33279J7916r2993k36326j3001L64643K87999k70110
34740A70186n82515k09346L11775K51188k46989m54873j44666K55969M38102M73202
34730B62033L73841Q3901j18157N7215J96715l31475j106927r43414K22907Q96593
34720d06768J55264q66542o29930N38821J068264M76017k49572l73983k24247
34711e12676k09316j77731p067Q4399Q2303K56013M96756L49071j13548k62572
34701a4368J1955P9285k61631l31997K04795O05622K51796k45063n8278M08493
34691F50609J88000n67444p68085j22013M86329M69117K76856L34830K72454k03255
$$ plain form
34760 -796311 -720010 -789970 -842722 -620219 -378242 -568006 -1038461 -1115171 -533181 177734
34750 177734 417017 245337 112058 129974 36981 -199345 -212346 152297 440296 170186
34740 170186 -412329 -621675 -309900 -58712 -305701 -760574 -905240 -649271 -211169 262033
34730 262033 635874 719775 601618 658833 855548 524073 -582854 -1526268 -1303361 -406768
34720 -406768 -251504 -1118046 -1747976 -1209155 -140891 335126 85554 -288429 -512676
34711 -512676 -721992 -899723 -906790 -822391 -740088 -484075 12681 361752 248204 -14368
34701 -14368 -2413 76872 -184759 -516756 -311961 293661 545457 300394 242116 650609
34691 650609 838609 271165 -496920 -618933 -132604 336513 613369 948199 1220653 1017398
34681A017398n24710j38305M38769L07722m08133p25680k60252K99696K77537
34672B84042j28488l20144j22055J73302K53229M2740k56149k74141J24861N31217
34662C08414M25849o5222l21013j78116j20457l32243k93342K43230N92430J58084
34652D17614m69662l36681L37085M74547j40077n54924k07508K64347J80393j23637
34642a58503j6369L39734L49029p135k41315k00302j80930l00009l11377p6373
34632h03550K06099L03480J98103R591j15208n7699J40417K49480J14362j35393
34622A09682k73773k53402j58663m8774J0004l3935r827L57521Q72204P91686
34612A362723k00549j235187j130856K6745Q81036N54937k64977m13175J35407
$$ plain form
34681 1017398 492688 354383 793152 1100874 692741 -32939 -293191 6505 284042
34672 284042 155554 -164590 -286645 -113343 139886 182626 -73523 -347664 -222803 308414
34662 308414 734263 669041 348028 169912 49455 -282788 -576130 -332900 259530 417614
34652 417614 -52048 -388729 -51644 422903 282826 -272098 -479606 -215259 -34866 -158503
34642 -158503 -174872 164862 513891 506756 265441 65139 -115791 -415800 -727177 -803550
34632 -803550 -597451 -293971 -95868 -86277 -201485 -259184 -118767 130713 245075 109682
34622 109682 -164091 -417493 -576156 -624930 -614926 -648861 -658688 -301167 571037 1362723
34612 1362723 1162174 -73013 -1203869 -1177124 -296088 258849 -6128 -419303 -283896
34603b83896M10610l0201n14039l39794K07273L70755M1741k13855r1138R4591
34593c47953N5624k0956O7769R5030j89497n31924n05255j73526K8090l1362o7224
34582a621184R4187K97166L83938L71758K75089Q6137n3736J1357J54162J30189
34572A29063p842l9052m2237k57746n08992l23235K75821O44999L79278j74830
34562G5227m52737l02182O3972L30227K04625k61760m61418Q3146Q16517P07113
34552H02730j87832o62867j82920K95846p1090o34980m00947L03558M59040O1819
34542b17643m2175K92778L68681l6400l53703k95581k06460k11182K466L48705
34532c50514K50949l08683n45989q1069M38044L97964J44669K52320N07708L27461
$$ plain form
34603 -283896 126714 96513 -417526 -757320 -550047 -179292 -137551 -351406 -442544 -347953
34593 -347953 -292329 -313285 -245516 -150486 -339983 -871907 -1377162 -1550688 -1522598 -1553960 -1621184
34582 -1621184 -1526997 -1229831 -845893 -474135 -199046 -112909 -166645 -155288 -1126 129063
34572 129063 121221 82169 39932 -217814 -726806 -1050041 -774220 -129221 250057 75227
34562 75227 -377510 -679692 -615720 -285493 -80868 -342628 -804046 -720900 95617 802730
34552 802730 614898 -47969 -230889 64957 -6133 -641113 -1042060 -738502 -279462 -217643
34542 -217643 -259818 32960 401641 365241 11538 -284043 -490503 -701685 -699219 -350514
34532 -350514 -99565 -408248 -954237 -1035306 -597262 -199298 -54629 197691 705399 1032860
34522A032860k30006n57136l90629n8439N5731j12086l71510m33780j35996K92476
34512i08515M10061J83851R3219L63592N08819N7016o11399p00117r7281N11087
34502a89667N91362L17274R4216k8025k46568n67640p23114m85215L4974M41194
34492g61209M56814K52037K03083L18551K06465k51808n70754l32519J35269K27376
34482a16695k4708r5039R5469Q8978j75004j05722N06573R07205M26498m11846
34472A095709n95071j19273R0645l09718n86618j84745L63782L11242j53228k98604
34462c85879r094J83322N5164m0386R9175J75150k3741j95192j5213K85900K18683
34451C47889k45354n91553m19286M9505K52856M365k66499j08312K88563L50837
$$ plain form
34522 1032860 802854 245718 -144911 -203350 -147619 -259705 -631215 -1064995 -1200991 -908515
34512 -908515 -498454 -314603 -221384 142208 651027 708043 96644 -603473 -700754 -189667
34502 -189667 401695 718969 813185 785160 538592 -29048 -752162 -1237377 -1202403 -761209
34492 -761209 -304395 -52358 150725 469276 675741 423933 -146821 -479340 -344071 -116695
34482 -116695 -141403 -236442 -140973 -51995 -226999 -332721 173852 1081057 1507555 1095709
34472 1095709 500638 381365 472010 162292 -424326 -609071 -245289 65953 -87275 -385879
34462 -385879 -394973 -211651 -156487 -196873 -97698 77452 53711 -141481 -156694 129206 347889
34451 347889 102535 -489018 -908304 -858799 -605943 -601578 -868077 -976389 -687826 -336989
34441c36989J0780j44850K00845N45633L55152p4804j46096K4174j20501m98534
34431a85190m64699N4805L95711K68671J55100L11291K60536k62874o70613m26579
34421e63841P3830J91468L7610P5518K24121J29972m5568Q8501L36689J78345
34411G26645k94695m56520j30070J86323J17633j34317k08917j4475K92328M21004
34401E04939J36908l52931m42296O7175N43967M03034j1926p7271K3628k53741
34391E41486o31226l64937L45680M95716p7971l93354K0813L59566j4811m69516
34381a88554k37273K50954J34972m04724m63191J43239O78460O14218J95935j11232
34371F12804j60866q0206p6861k54760l86749r2861N13396P47257K95206k12370
$$ plain form
34441 -336989 -326209 -471059 -270214 275419 630571 555767 409671 433845 313344 -185190
34431 -185190 -649889 -595084 -199373 69298 224398 535689 796225 533351 -137262 -563841
34421 -563841 -490011 -298543 -260933 -185415 38706 168678 123110 211611 548300 726645
34411 726645 431950 -24570 -154640 31683 149316 14999 -193918 -208393 83935 504939
34401 504939 641847 288916 -153380 -86205 457762 860796 848870 771599 795227 541486
34391 541486 -89740 -454677 -108997 386719 308748 -84606 -63793 295773 280962 -188554
34381 -188554 -425827 -174873 -39901 -444625 -907816 -764577 -86117 528101 724036 612804
34371 612804 451938 371732 294871 40111 -346638 -439499 73897 821154 1116360 903990
34361I03990r6970L26707K79294k44160n45313l58335j12942r0943q1899L7816
34351A7245O6855m5475q2705l1007r0552j52489R0184M21841K39265l91464o07183
34340e65485l2886N78829M85562M357j95796j76998l33625m60720j24366L92965
34330d28163M39460P3942j02716m4317k27001n69396m28525J88854M64696J31774
34320e01392m0654L88097O97879K59381k97719j17023L98389K44040m94142p85342
34310b48486l11796J64263J35626j3015P1642J09671j08832k18253N6158L52080
34300a0942K57205o0765k39018k84867l38654k80911j0637K23477J90536R3935
34290d60641K30641M83498N23027L02257J8728k15241l65775l50099j96603j19458
$$ plain form
34361 903990 807020 1133727 1413021 1168861 623548 265213 152271 61328 -20571 17245
34351 17245 84100 38625 -44080 -75087 -165639 -318128 -227944 193897 433162 41698 -565485
34340 -565485 -598371 -19542 466020 470377 274581 97583 -236042 -696762 -821128 -428163
34330 -428163 11297 85239 -17477 -61794 -288795 -858191 -1286716 -1097862 -633166 -501392
34320 -501392 -542046 -153949 543930 803311 505592 388569 786958 1030998 536856 -248486
34310 -248486 -560282 -396019 -260393 -273408 -201766 -92095 -200927 -419180 -363022 -10942
34300 -10942 246263 185498 -53520 -338387 -677041 -957952 -968589 -745112 -554576 -460641
34290 -460641 -230000 253498 776525 1078782 1097510 882269 516494 166395 -30208 -149666
34280a49666j81004j31795J51050L60185K11966p7106j26688M1601J45030J23106
34270C66679R9838N7778p2610j67967j08390l3864n8025M0067M17419O83787L38124
34259A562836m17898q28208n48817o805K55629J79011K3055m5302l0815K2625
34249A65311J07645K48129M05215L79827k914n21168o51203k48992J51501L1412
34239F4763l75950m25737L5845N16272N48807J73676k26837l21663r1105J59776
34229E7847J47991J6427J20947L74010K72723k41580n32922k30629J56524P9632
34219B20970j81542j17401Q8533l871j88674j365L36225K50848j53250k96037
34209d5564j49270j43750k20194M2155M38904L18174k30573l95301L8315L93336
$$ plain form
34280 -149666 -330670 -462465 -311415 48770 260736 183630 56942 98543 243573 366679
34270 366679 466517 524295 451685 283718 175328 141464 83439 123506 540925 1224712 1562836
34259 1562836 1144938 316730 -232087 -238892 16737 195748 218803 173501 142686 165311
34249 165311 272956 521085 926300 1306127 1303213 782045 130842 -118150 33351 64763
34239 64763 -311187 -736924 -701079 -184807 364000 537676 310839 -10824 -101929 57847
34229 57847 205838 222265 343212 717222 989945 748365 215443 -15186 141338 220970
34219 220970 39428 -77973 10560 6689 -181985 -183350 152875 403723 250473 -45564
34209 -45564 -194834 -338584 -558778 -516623 -77719 240455 9882 -385419 -347104 46232
34199D6232K96854J55247J90720J9878m49388o55365l43453k4616n1865p0729
34189h86485J87028L87235L07302K53656L38449J82594k20412k54373J99341L53581
34179H47916j61229n54525j99973K76644J22625k53166j41758J50958o104k80754
34169a99366j1354M50732L15787j83227k20250R0825k7810m42086k66457M34740
34159e8466N86662o5818m87888r5123L59088J76225k10337k18486j03276j90886
34149c08305q2654M91347Q29099K64310n76617n73455J96679O03037J49435m62453
34139E30423n27858k28889o0685m6201O9091K60577K79263P4318j48134k17509
34129a5604j49620l5608P5225J62303J82977R2141p4927j71955o2893K01584L92160
$$ plain form
34199 46232 343086 498333 689053 708931 259543 -395822 -739275 -763891 -815756 -886485
34189 -886485 -699457 -312222 -4920 248736 587185 769779 549367 294994 494335 847916
34179 847916 686687 132162 -67811 208833 331458 78292 -63466 87492 81388 -199366
34169 -199366 -210720 240012 555799 372572 152322 243147 215337 -226749 -493206 -58466
34159 -58466 528196 462378 -25510 -120633 238455 414680 204343 -14143 -117419 -308305
34149 -308305 -390959 100388 929487 1193797 617180 43725 240404 843441 992876 530423
34139 530423 2565 -226324 -287009 -333210 -264119 -3542 275721 350039 201905 -15604
34129 -15604 -165224 -200832 -125607 36696 219673 311814 236887 64932 2039 203623 595783
34118E95783L42352J46201M9383J44058K32104M7049l91326p25968o46604k68041
34108d75009K0676O7775J04972L11356M75528K92868j68044n40389o08911m54520
34098i73698k15961M9635K80593L98009L97568L10226J13142j60916l08717j77332
34088b87451N3921O8545j26057k02792o441K28345K27372J5546j84063j98650
34078d11725R894L13863M27747J76824j84117j89996J92271M39841J79142k71044
34068F82700l40280K5798L66049L36896N906m09993p37364p74484l92707J82104
34058a055375M84614L46392P6991p299M5704R5997K36783N38449P11219M28558
34048A902033j28243m56879m22235l41264l70674k79470L1446K42395J16552q8776
$$ plain form
34118 595783 938135 1084336 1133719 1277777 1509881 1556930 1165604 439636 -206968 -475009
34108 -475009 -454333 -386558 -281586 29770 505298 798166 630122 89733 -519178 -973698
34098 -973698 -1189659 -1140024 -859431 -461422 -63854 246372 359514 198598 -110119 -287451
34088 -287451 -233530 -164985 -291042 -493834 -500275 -271930 -44558 -29012 -213075 -411725
34078 -411725 -401831 -87968 339779 516603 332486 142490 334761 774602 953744 682700
34068 682700 342420 368218 734267 1071163 1077069 667076 -70288 -844772 -1237479 -1055375
34058 -1055375 -570761 -224369 -147378 -154677 -108973 -12976 223807 762256 1473475 1902033
34048 1902033 1773790 1316911 894676 553412 182738 -96732 -65286 177109 293661 204885
34038B04885n3703N9481j04416m50997n14322j29009L37624M61057K15570q5892
34028e9722j43640N5004K40106J91764O1086J46487L42835K03880l03919n96939
34018A36942l36279J6597k0103j30196J57620M56941O9432o88556p51230N3795
34008a035037O59052L44596k70522l10594Q8088K45669Q9615R6654L81069M99371
33998G87961J16073n40638q88894n14998L67966R42413N85656k94751o60795j84008
$$ plain form
34038 204885 151182 210663 106247 -344750 -859072 -988081 -650457 -189400 26170 -59722
34028 -59722 -203362 -148358 91748 283512 344598 491085 833920 1037800 733881 136942
34018 136942 -199337 -182740 -202843 -333039 -175419 281522 350954 -337602 -1088832 -1035037
34008 -1035037 -375985 -31389 -301911 -612505 -524417 -278748 -189133 -92479 288590 787961
33998 787961 904034 363396 -525498 -1040496 -672530 269883 855539 560788 -100007 -284015
$$ [...]
##END NTUPLES=NMR SPECTRUM
##END=
