##TITLE=31Pdec_DPAA0104
 CDCl3, 24 sc
 4.4.2022
##JCAMPDX= 6.0         $$ Bruker NMR JCAMP-DX V2.0
##DATA TYPE= NMR SPECTRUM
##DATA CLASS= NTUPLES
##ORIGIN= UXNMR, Bruker Analytische Messtechnik GmbH
##OWNER= root
$$ XWIN-NMR		Version 3.5
$$ Mon Apr  4 10:17:30 2022 Russian Standard Time (UT+4h)  she@DPX200
##.OBSERVE FREQUENCY= 81.013821
##.OBSERVE NUCLEUS= ^31P
##.ACQUISITION MODE= SIMULTANEOUS
##.ACQUISITION SCHEME= undefined
##.AVERAGES= 24
##.DIGITISER RES= 16
##SPECTROMETER/DATA SYSTEM= spect
##.PULSE SEQUENCE= zgpg30
##.SOLVENT NAME= CDCl3
##.SHIFT REFERENCE= (INTERNAL, CDCl3, 0, 248.564)
##AUDIT TRAIL= $$ (NUMBER, WHEN, WHO, WHERE, WHAT)
$$ ##TITLE= Audit trail, XWIN-NMR		Version 3.5
$$ ##JCAMPDX= 5.01
$$ ##ORIGIN= Bruker BioSpin GmbH
$$ ##OWNER= she
$$ F:/spectra/data/she/nmr/P31/1/pdata/1/auditp.txt
$$ ##AUDIT TRAIL=  $$ (NUMBER, WHEN, WHO, WHERE, WHAT)
(   1,<2022-04-04 10:16:36.09 +0400>,<she>,<DPX200>,
      <created by zg, POWCHK disabled, PULCHK disabled
       configuration hash MD5:
       00 E9 B6 7A A2 85 ED C7 34 08 36 98 17 FE 4E 26
       data hash MD5: 32K
       96 18 BF A0 1B B2 A2 CA B4 55 6E 77 8B 79 51 8B>)
(   2,<2022-04-04 10:16:38.46 +0400>,<she>,<DPX200>,
      <Start of raw data processing
       efp BC_mod = 2 LB = 1 FT_mod = 6 PKNL = 1 PHC0 = -9382.37 PHC1 = 153.4756 SI = 64K 
       data hash MD5: 64K
       10 7C F3 56 AB E8 70 3D CA 5D 41 5C E8 B0 09 65>)
(   3,<2022-04-04 10:16:56.92 +0400>,<she>,<DPX200>,
      <pk PHC0 = -179.7508 PHC1 = 0 
       data hash MD5: 64K
       EF 16 4E 3D 84 81 00 B0 13 9C B0 21 A1 A6 DF B6>)
$$ ##END=
$$ 
$$ hash MD5
$$ 46 8B 9F BF 15 67 80 E8 C1 5D 77 E2 E5 51 1C B9
##$RELAX= 
##$RELAX= 
##$RELAX= 
##$RELAX= 
##$RELAX= 
##$RELAX= 
##$RELAX= 
##$RELAX= 
$$ Bruker specific parameters
$$ --------------------------
##$DU= <F:/spectra>
##$EXPNO= 1
##$NAME= <P31>
##$PROCNO= 1
##$TYPE= <nmr>
##$USER= <she>
##$AMP= (0..31)
100 100 100 100 100 100 100 100 100 100 100 100 100 100 100 100 100 100 
100 100 100 100 100 100 100 100 100 100 100 100 100 100 
##$AQSEQ= 0
##$AQ_mod= 1
##$AUNM= <au_zg>
##$AUTOPOS= <>
##$BF1= 81.014009
##$BF2= 200.13
##$BF3= 200.13
##$BF4= 200.13
##$BF5= 200.13
##$BF6= 200.13
##$BF7= 200.13
##$BF8= 200.13
##$BYTORDA= 1
##$CFDGTYP= 0
##$CFRGTYP= 5
##$CHEMSTR= <none>
##$CNST= (0..31)
1 1 145 1 1 1 1 1 1 1 1 1 1 1 1 1 1 1 1 1 1 1 1 1 1 1 1 1 1 1 1 1 
##$CPDPRG= <waltz16>
##$CPDPRG1= <>
##$CPDPRG2= <waltz16>
##$CPDPRG3= <>
##$CPDPRG4= <mlev>
##$CPDPRG5= <mlev>
##$CPDPRG6= <mlev>
##$CPDPRG7= <mlev>
##$CPDPRG8= <mlev>
##$CPDPRGB= <>
##$CPDPRGT= <>
##$D= (0..31)
0 1 0 0 0 0 0 0 0 0 0 0.03 2e-05 3e-06 0 0 0 0 0 0 0 0 0 0 0 0 0 0 0 0 
0 0 
##$DATE= 1649052995
##$DBL= (0..7)
120 120 120 11 120 120 24 19 
##$DBP= (0..7)
150 150 150 150 150 150 150 150 
##$DBP07= 0
##$DBPNAM0= <>
##$DBPNAM1= <>
##$DBPNAM2= <>
##$DBPNAM3= <>
##$DBPNAM4= <>
##$DBPNAM5= <>
##$DBPNAM6= <>
##$DBPNAM7= <>
##$DBPOAL= (0..7)
0.5 0.5 0.5 0.5 0.5 0.5 0.5 0.5 
##$DBPOFFS= (0..7)
0 0 0 0 0 0 0 0 
$$ [...]
##$SUBNAM2= <"">
##$SUBNAM3= <"">
##$SUBNAM4= <"">
##$SUBNAM5= <"">
##$SUBNAM6= <"">
##$SUBNAM7= <"">
##$SUBNAM8= <"">
##$SUBNAM9= <"">
##$SW= 501.771253377433
##$SWIBOX= (0..15)
0 1 3 0 0 0 0 0 0 0 0 0 0 0 0 0 
##$SW_h= 40650.406504065
##$TD= 32768
##$TD0= 1
##$TE= 0
##$TE2= 300
##$TE3= 300
##$TEG= 300
##$TL= (0..7)
0 120 53 12 22 120 120 120 
##$TP= (0..7)
150 150 150 150 150 150 150 150 
##$TP07= 0
##$TPNAME0= <>
##$TPNAME1= <>
##$TPNAME2= <>
##$TPNAME3= <>
##$TPNAME4= <>
##$TPNAME5= <>
##$TPNAME6= <>
##$TPNAME7= <>
##$TPOAL= (0..7)
0.5 0.5 0.5 0.5 0.5 0.5 0.5 0.5 
##$TPOFFS= (0..7)
0 0 0 0 0 0 0 0 
##$TUNHIN= 0
##$TUNHOUT= 0
##$TUNXOUT= 0
##$USERA1= <user>
##$USERA2= <user>
##$USERA3= <user>
##$USERA4= <user>
##$USERA5= <user>
##$V9= 5
##$VALIST= <valist>
##$VCLIST= <CCCCCCCCCCCCCCC>
##$VD= 0
##$VDLIST= <DDDDDDDDDDDDDDD>
##$VPLIST= <PPPPPPPPPPPPPPP>
##$VTLIST= <TTTTTTTTTTTTTTT>
##$WBST= 1024
##$WBSW= 4
##$XGAIN= (0..3)
0 0 0 0 
##$XL= 0
##$YL= 0
##$YMAX_a= 9262
##$YMIN_a= -10066
##$ZGOPTNS= <>
##$ZL1= 120
##$ZL2= 120
##$ZL3= 120
##$ZL4= 120
##$ABSF1= 0
##$ABSF2= 0
##$ABSG= 0
##$ABSL= 0
##$ALPHA= 0
##$AQORDER= 0
##$ASSFAC= 0
##$ASSFACI= 0
##$ASSFACX= 0
##$ASSWID= 0
##$AUNMP= <proc_1d>
##$AZFE= 0.1
##$AZFW= 0.5
##$BCFW= 0
##$BC_mod= 2
##$BYTORDP= 0
##$COROFFS= 0
##$CY= -3
##$DATMOD= 1
##$DC= 0
##$DFILT= <>
##$DTYPP= 0
##$F1P= 0
##$F2P= 0
##$FCOR= 1
##$FTSIZE= 65536
##$FT_mod= 6
##$GAMMA= 0
##$GB= 0
##$INTBC= 1
##$INTSCL= 5.30512e-09
##$ISEN= 30
##$LB= 1
##$LEV0= 0
##$LPBIN= 0
##$MAXI= 10000
##$MC2= 0
##$MEAN= 0
##$ME_mod= 0
##$MI= 50
##$NCOEF= 0
##$NC_proc= -4
##$NLEV= 6
##$NOISF1= 182.463
##$NOISF2= 159.3651
##$NSP= 0
##$NTH_PI= 0
##$NZP= 0
##$OFFSET= 248.5645
##$PC= 4
##$PHC0= -9562.121
##$PHC1= 153.4756
##$PH_mod= 1
##$PKNL= yes
##$PPARMOD= 0
##$PSCAL= 0
##$PSIGN= 0
##$REVERSE= no
##$SF= 81.014009
##$SI= 65536
##$SIGF1= 159.3651
##$SIGF2= -187.1042
##$SINO= 113.3802
##$SIOLD= 16384
##$SREGLST= <1H.CDCl3>
##$SSB= 0
##$STSI= 65536
##$STSR= 0
##$SW_p= 40650.406504065
##$SYMM= 0
##$S_DEV= 0
##$TDeff= 32768
##$TDoff= 0
##$TI= <>
##$TILT= no
##$TM1= 0
##$TM2= 0
##$TOPLEV= 0
##$USERP1= <user>
##$USERP2= <user>
##$USERP3= <user>
##$USERP4= <user>
##$USERP5= <user>
##$WDW= 1
##$XDIM= 65536
##$YMAX_p= 493206553
##$YMIN_p= -9635444
$$ End of Bruker specific parameters
$$ ---------------------------------
##NTUPLES= NMR SPECTRUM
##VAR_NAME=  FREQUENCY,     SPECTRUM/REAL,   SPECTRUM/IMAG
##SYMBOL=    X,             R,               I
##VAR_TYPE=  INDEPENDENT,   DEPENDENT,       DEPENDENT
##VAR_FORM=  AFFN,          ASDF,            ASDF
##VAR_DIM=   65536,         65536,           65536
##UNITS=     HZ,            ARBITRARY UNITS, ARBITRARY UNITS
##FACTOR=    0.620285442955139, 1,           1
##FIRST=     20137.2065510759, 0,            0
##LAST=      -20513.1999529892, 0,           0
##MIN=       -20513.1999529892, -9635444,    0
##MAX=       20137.2065510759, 493206553,    0
$$ Real data points
##PAGE= N=1
##DATA TABLE= (X++(R..R)), XYDATA
$$ [...]
$$ plain form
40010 65674 194253 127070 -7486 -75193 -93964 -101519 -17596 211475 448067 529744 518832
39999 518832 576718 642769 486521 92437 -256216 -351781 -297333 -257990 -191062 1144 208707
39988 208707 219117 10959 -242693 -419228 -524486 -560277 -497566 -388120 -333530 -314891
39978 -314891 -211231 -23602 88961 58932 12984 21577 -61981 -337561 -594902 -550965 -253816
39967 -253816 3818 115254 223667 372917 413479 316130 261086 297881 238156 62763
39957 62763 95358 483497 802501 564547 -69197 -501618 -508749 -397917 -400073 -372515 -188941
39946 -188941 -5428 31630 17778 59617 88369 63582 96723 199649 166354 -95205 -342835
39935 -342835 -330055 -161405 -94305 -157657 -210079 -247614 -395362 -645015 -813329 -760479 -523050
$$ packed form
40010F5674J28579o7183j34556o7707j8771p555Q3923K29071K36592Q1677j0912
39999E18832N7886O6051j56248l94084l48653r5565N4448L9343O6928J92206K07563
39988B08707J0410k08158k53652j76535j05258l5791O2711J09446N4590J8639
39978c14891J03660J87629J12563l0029m5948Q593q3558k75580k57341M3937K97149
39967b53816K57634J11436J08413J49250M0562r7349n5044L6795n9725j75393
39957F2763L2595L88139L19004k37954o33744m32421p131J10832k156K7558J83574
39946a88941J83513L7058j3852M1839K8752k4787L3141J02926l3295k61559k47630
39935c42835J2780J68650O7100o3352n2422l7535j47748k49653j68314N2850K37429
$$ plain form
39924 -523050 -251413 -93400 -86441 -111729 -33642 96828 110161 -1729 -73079 -67819 -138792
39913 -138792 -288403 -257260 69632 404513 430172 215109 25821 -64137 -124051 -131937 -85599
39902 -85599 -170085 -485828 -744603 -587087 -124518 177861 110743 -121883 -321669 -497185
39892 -497185 -601422 -443320 -21364 331335 329534 85370 -91660 -104499 -103347 -191133 -276596
39881 -276596 -245130 -157850 -184509 -352392 -470243 -381623 -205792 -167898 -236897 -162596 97501
39870 97501 252085 98843 -164041 -228122 -84253 53780 74205 16195 -68792 -111593 -2989
39859 -2989 246204 438340 426162 274580 71194 -206075 -482176 -520569 -286773 -93268
39849 -93268 -114526 -69636 262183 530288 288118 -263528 -543721 -442035 -337894 -366856
$$ packed form
39924e23050K71637J58013O959k5288P8087J30470J3333j11890p1350N260p0973
39913a38792j49611L1143L26892L34881K5659k15063j89288q9958n9914p886M6338
39902h5599q4486l15743k58775J57516M62569L02379o7118k32626j99786j75516
39892d97185j04237J58102M21956L52699j801k44164j77030j2839J152q7786q5463
39881b76596L1466Q7280k6659j67883j17851Q8620J75831L7894o8999P4301K60097
39870I7501J54584j53242k62884o4081J43869J38033K0425n8010q4987m2801J08604
39859b989K49193J92136j2178j51582k03386k77269k76101l8393K33796J93505
39849i3268k1258M4890L31819K68105k42170n51646k80193J01686J04141k8962
$$ plain form
39839 -366856 -283368 -70896 -65248 -324069 -434892 -180895 85353 12657 -205832 -170937
39829 -170937 143596 446837 546414 460897 289860 170212 218681 376202 443604 345784
39819 345784 192878 51579 -111637 -231591 -179972 -63758 -166822 -480815 -617902 -350754
39809 -350754 56804 231749 127704 -88510 -296041 -371475 -167042 234867 495319 461752
39799 461752 380325 450454 469849 219199 -84015 -99007 71055 43541 -212457 -321004
39789 -321004 -74219 292712 461803 384649 194084 -2247 -129759 -113920 38323 197103
39779 197103 222144 93251 -78988 -150291 -77918 18595 -14392 -157834 -231916 -146201 -14244
39768 -14244 44823 77066 155664 203077 108590 -56811 -108047 -471 121244 128841 58282
$$ packed form
39839c66856Q3488K12472N648k58821j10823K53997K66248p2696k18489L4895
39829a70937L14533L03241R9577q5517j71037j19648M8469J57521O7402r7820
39819C45784j52906j41299j63216j19954N1619J16214j03064l13993j37087K67148
39809c50754M07558J74945j04045k16214k07531p5434K04433M01909K60452l3567
39799D61752q1427P0129J9395k50650l03214j4992J70062k7514k55998j08547
39789c21004K46785L66931J69091p7154j90565j96331j27512J5839J52243J58780
39779A97103K5041j28893j72239p1303P2373R6513l2987j43442p4082Q5715J31957
39768a4244N9067L2243P8598M7413r4487j65401n1236J07576J21715P597p0559
$$ plain form
39757 58282 35400 124744 271831 358335 302959 124134 -80195 -192638 -129757 81713 247359
39746 247359 138710 -219208 -504635 -474710 -266770 -152860 -127596 7761 250598 400760
39736 400760 423267 472319 538083 418485 109534 -126321 -187851 -276570 -465043 -497020 -245583
39725 -245583 -23472 -132908 -385122 -405223 -198762 -59300 -67096 -46184 57018 95289
39715 95289 12914 -62321 -38763 37684 102747 122508 56256 -60983 -59458 147434 344527
39704 344527 239786 -111763 -337184 -223130 41350 157082 74235 -35426 -51129 -36486
39694 -36486 -120483 -301497 -407464 -287883 -20805 167503 190318 167111 170500 98576 -94492
39683 -94492 -240135 -209098 -155555 -274486 -443552 -389621 -148494 -44716 -191484 -323507
$$ packed form
39757E8282k2882Q9344J47087Q6504n5376j78825k04329j12443O2881K11470J65646
39746B47359j08649l57918k85427K9925K07940J13910K5264J35357K42837J50162
39736D00760K2507M9052O5764j19598l08951k35855o1530q8719j88473l1977K51437
39725b45583K22111j09436k52214k0101K06461J39462p796K0912J03202L8271
39715I5289q2375p5235K3558P6447O5063J9761o6252j17239J525K06892J97093
39704C44527j04741l51549k25421J14054K64480J15732q2847j09661j5703J4643
39694c6486q3997j81014j05967J19581K67078J88308K2815k3207L389p1924j93068
39683i4492j45643L1037N3543j18931j69066N3931K41127J03778j46768j32023
$$ plain form
39673 -323507 -241681 -142888 -295294 -583817 -661169 -475900 -350461 -477523 -605106 -404829
39663 -404829 21873 268869 200689 109434 229935 379616 270863 -24959 -183527 -84548
39653 -84548 96845 195701 198474 107329 -72318 -194161 -74959 217748 411939 408848 375237
39642 375237 404338 353614 134841 -81655 -111700 -12537 61440 92140 136763 177190 175118
39631 175118 163047 162947 119968 8188 -102469 -145131 -107916 27992 236124 327007 115635
39620 115635 -251492 -400135 -239260 -88160 -176496 -316611 -254647 -71973 -8185 -103833
39610 -103833 -240046 -341266 -343842 -173214 46613 -6359 -402783 -736864 -622808 -217020
39600 -217020 45298 52187 34398 128942 261241 374478 458156 406674 152594 -91828 -16870
$$ packed form
39673c23507Q1826R8793j52406k88523p7352J85269J25439j27062j27583K00277
39663d04829M26702K46996o8180r1255J20501J49681j08753k95822j58568R8979
39653h4548J81393R8856K773r1145j79647j21843J19202K92707J94191l091l3611
39642C75237K9101n0724k18773k16496l0045R9163P3977L0700M4623M0427k072
39631A75118j2071j00m2979j11780j10657m2662L7215J35908K08132R0883k11372
39620A15635l67127j48643J60875J51100q8336j40115O1964J82674O3788r5648
39610a03833j36213j01220k576J70628K19827n2972l96424l34081J14056M05788
39600b17020K62318O889j7789R4544J32299J13237Q3678n1482k54080k44422P4958
$$ plain form
39589 -16870 352240 646302 593494 281808 -9528 -72420 103007 301767 231645 -151190
39579 -151190 -531549 -593751 -390693 -199906 -147438 -177899 -266743 -413631 -509541 -450016 -318662
39568 -318662 -247907 -182531 -4018 202276 250270 151396 69772 50845 35008 59693 183514
39557 183514 280721 194839 43593 71794 230134 215681 -52461 -301206 -301554 -132910 13614
39546 13614 56559 -15639 -183850 -326052 -293866 -112193 65875 205339 376517 490822
39536 490822 320776 -129863 -522248 -589805 -462633 -430036 -522131 -510640 -270375 25837
39526 25837 116817 -18736 -130281 -19251 186827 208403 26905 -71219 96782 374759
39516 374759 538796 575687 542903 387566 116499 -63727 -18442 92540 108056 163571
$$ packed form
39589a6870L69110K94062n2808l11686k91336o2892J75427J98760p0122l82835
39579a51190l80359o2202K03058J90787N2468l0461q8844j46888r5910N9525J31354
39568c18662P0755O5376J78513K06294M7994r8874q1624j8927j5837K4685J23821
39557A83514R7207q5882j51246K8201J58340j4453k68142k48745l48J68644J46524
39546A3614M2945p2198j68211j42202L2186J81673J78068J39464J71178J14305
39536D90822j70046m50639l92385o7557J27172L2597r2095J1491K40265K96212
39526B5837R0980j35553j11545J11030K06078K1576j81498r8124J68001K77977
39516C74759J64037L6891l2784j55337k71067j80226M5285J10982J5516N5515
$$ plain form
39506 163571 397021 580780 431320 116513 26307 152393 150833 -44482 -158868 -126225
39496 -126225 -194000 -392275 -392763 -77204 190826 103347 -140213 -178643 395 152067 151266
39485 151266 45558 -87637 -147083 -42338 120312 71595 -249178 -551876 -585648 -470765
39475 -470765 -457356 -544649 -558325 -458111 -341802 -242815 -131797 -51807 -64812 -107165 -66143
39464 -66143 16533 -38089 -307116 -637385 -790472 -685985 -480983 -388637 -418474 -372541 -147120
39453 -147120 82683 106850 -10922 -66815 -67103 -188520 -429242 -586750 -599450 -615845 -663134
39442 -663134 -549708 -219029 77777 127571 37316 -1168 -3100 -46173 -38805 121228 297613
39431 297613 274807 84982 -47017 -30081 33024 83531 193750 386064 534336 520463
$$ packed form
39506A63571K33450J83759j49460l14807r0206J26086j560j95315j14386L2643
39496a26225o7775j98275m88L15559K68030q7479k43560l8430J79038J51672q01
39485A51266j05708j33195n9446J04745J62650m8717l20773l02698l3772J14883
39475d70765J3409q7293j3676J00214J16309R8987J11018P9990j3005m2353M1022
39464f6143Q2676n4622k69027l30269j53087J04487K05002R2346k9837M5933K25421
39453a47120K29803K4167j17772n5893k88j21417k40722j57508j2700j6395m7289
39442f63134J13426L30679K96806M9794r0255l8484j932m3073P368J60033J76385
39431B97613k2806j89825j31999J6936O3105N0507J10219J92314J48272j3873
$$ plain form
39421 520463 394059 309678 350989 462141 530510 495488 362626 143714 -149822 -434169
39411 -434169 -557392 -455727 -253781 -121101 -73493 -13745 77262 115292 65156 10461 72800
39400 72800 324588 721797 1037687 970746 479776 -64195 -243158 -55024 171783 252538
39390 252538 290481 378013 436284 407621 365660 346294 269498 122332 47204 148866 341456
39379 341456 456088 394991 163682 -114055 -216111 -32504 227844 225966 -80611 -381764
39369 -381764 -414605 -230302 -31486 49779 -36360 -253546 -413600 -316570 -39411 103363
39359 103363 -33411 -249129 -310521 -239231 -177580 -158378 -143508 -134888 -112051 11488 245644
39348 245644 446766 490853 427936 374908 348957 295093 206077 139732 152486 238157 306599
$$ packed form
39421E20463j26404q4381M1311J11152O8369l5022j32862k18912k93536k84347
39411d34169j23223J01665K01946J32680M7608N9748R1007L8030n0136n4695O2339
39400G2800K51788L97209L15890o6941m90970n43971j78963J88134K26807Q0755
39390B52538L7943Q7532N8271k8663m1961j9366p6796j47166p5128J01662J92590
39379C41456J14632o1097k31309k77737j02056J83607K60348j878l06577l01153
39369c81764l2841J84303J98816Q1265q6139k17186j60054R7030K77159J42774
39359A03363j36774k15718o1392P1290O1651J9202J4870Q620K2837J23539K34156
39348B45644K01122M4087o2917n3028k5951n3864q9016o6345J2754Q5671O8442
$$ plain form
39337 306599 263865 157136 137876 201917 138980 -97271 -184703 118428 510543 520043 217515
39326 217515 95731 280327 373219 153318 -86579 -87680 -39164 -181039 -387692 -441910
39316 -441910 -396059 -365321 -251811 20433 240984 185040 -43170 -196027 -224043 -207713
39306 -207713 -158987 -117248 -219416 -436755 -476372 -204835 67405 14547 -218496 -277096
39296 -277096 -134217 -11734 62114 223356 395962 330142 6156 -309261 -414048 -334815
39286 -334815 -170266 -7125 42000 -57236 -148713 -73779 84524 137546 87860 71925 87043
39275 87043 18658 -110618 -161043 -124628 -136761 -244596 -351699 -392604 -407088 -444556 -505664
39264 -505664 -548112 -485461 -279052 -88076 -150947 -425208 -579523 -484120 -420857 -585993
$$ packed form
39337C06599m2734j06729j9260O4041o2937k36251q7432L03131L92115R500l02528
39326B17515j21784J84596R2892k19901k39897j101M8516j41875k06653n4218
39316d41910M5851L0738J13510K72244K20551n5944k28210j52857k8016J6330
39306b07713M8726M1739j02168k17339l9617K71537K72240n2858k33043n8600
39296b77096J42879J22483P3848J61242J72606o5820l23986l15417j04787P9233
39286c34815J64549J63141M9125r9236r1477P4934J58303N3022m9686j5935J5118
39275H7043o8385j29276n0425L6415j2133j07835j07103m0905j4484l7468o1108
39264e05664m2448O2651K06409J90976o2871k74261j54315R5403O3263j65136
$$ plain form
39254 -585993 -706630 -488636 -153089 -88644 -192044 -63464 272053 389796 191281 55942
39244 55942 181406 281621 116478 -119718 -167683 -98421 -90861 -105230 -27362 83868 113525
39233 113525 74665 2149 -149981 -338799 -352710 -91138 227950 312113 119138 -190445
39223 -190445 -464629 -583934 -456722 -179247 -51912 -230395 -470138 -416875 -63865 272716
39213 272716 358505 222056 -12501 -257802 -427112 -452085 -373038 -281554 -165706 45464
39203 45464 267660 260166 -73823 -499061 -667603 -473625 -110333 177765 300673 293656
39193 293656 198005 46655 -76955 -74979 19066 1436 -276824 -634092 -642050 -102058 628851
39182 628851 946357 644046 104758 -189462 -159974 -36374 41992 89222 55268 -133541
$$ packed form
39254e85993j20637K17994L35547O4445j03400J28580L35517J17743j98515j35339
39244E5942J25464J00215j65143k36196m7965O9262P560j4369P7868J11230K9657
39233A13525l8860p2516j52130j88818j3911K61572L19088Q4163j92975l09583
39223a90445k74184j19305J27212K77475J27335j78483k39743N3263L53010L36581
39213B72716Q5789j36449k34557k45301j69310k4973P9047R1484J15848K11170
39203D5464K22196p494l33989m25238j68542J93978L63292K88098J22908p017
39193B93656r5651j51350j23610J976R4045j7630k78260l57268p958N39992P30909
39182F28851L17506l02311n39288k94220K9488J23600P8366M7230l3954j88809
$$ plain form
39172 -133541 -309989 -167603 271322 590341 538677 355640 312942 255037 -42948 -321997
39162 -321997 -142873 362451 577371 281378 -65426 -68534 55826 -44447 -250695 -228564
39152 -228564 -17610 51970 -100741 -231162 -191361 -100347 -70652 -36145 75892 198433
39142 198433 239292 215171 191663 166042 82680 -54675 -137109 -57423 131633 233801 145754
39131 145754 3788 -8201 89454 166545 229819 339432 350955 63465 -361351 -482767
39121 -482767 -187075 128091 131753 -9019 10044 153083 212980 199869 234045 236172 58024
39110 58024 -195367 -283456 -195793 -128313 -153870 -164984 -99484 -1495 101105 188648 179509
39099 179509 50763 -48044 11460 116795 87137 -25606 -27718 100083 210063 261312 347349
$$ packed form
39172a33541j76448J42386M38925L19019n1664j83037m2698n7905k97985k79049
39162c21997J79124N05324K14920k95993l46804l108J24360j00273k06248K2131
39152b28564K10954O9580j52711j30421L9801R1014K9695L4507J12037J22541
39142A98433M0859k4121k3508k5621q3362j37355q2434P9686J89056J02168q8047
39131A45754j41966j1989R7655P7091O3274J09613J1523k87490m24816j21416
39121d82767K95692L15166L662j40772J9063J43039N9897j3111L4176K127j78148
39110E8024k53391q8089Q7663O7480k5557j1114O5500R7989J02600Q7543r139
39099A79509j28746r8807N9504J05335k9658j12743k112J27801J09980N1249Q6037
$$ plain form
39088 347349 457336 431236 200038 -79246 -182312 -46829 157537 168612 -97080 -413992
39078 -413992 -511643 -446882 -492200 -648619 -595873 -232553 98490 130850 63938 147015 217386
39067 217386 32947 -213318 -151446 174177 398845 392228 305693 166383 -153098 -587669
39057 -587669 -867859 -859251 -648792 -361521 -137969 -146091 -326727 -315700 43783 336189
39047 336189 133049 -317380 -464913 -314207 -303504 -461449 -373582 7873 215273 52382
39037 52382 -107572 -3007 123529 53740 -23726 58167 103611 -64547 -280019 -345114 -296730
39026 -296730 -160385 149210 480193 451484 54813 -210439 -76534 98801 -3906 -117900
39016 -117900 73501 326871 275454 80194 84713 139117 -129251 -589731 -765548 -600205
$$ packed form
39088C47349J09987k6100k31198k79284j03066J35483K04366J1075k65692l16912
39078d13992r7651O4761m5318j56419N2746L63320L31043L2360o6912Q3077P0371
39067B17386j84439k46265O1872L25623K24668o617q6535j39310l19481m34571
39057e87669k80190Q608K10459K87271K23552q122j80636J1027L59483K92406
39047C36189k03140m50429j47533J50706J0703j57945Q7867L81455K07400j62891
39037E2382j59954J04565J26536o9789p7466Q1893M5444j68158k15472o5095M8384
39026b96730J36345L09595L30983k8709l96671k65252J33905J75335j02707j13994
39016a17900J91401K53370n1417j95260M519N4404k68368m60480j75817J65343
$$ plain form
39006 -600205 -482445 -544749 -494596 -195793 77147 87738 -50645 -138954 -152674 -125791 -40658
38995 -40658 64762 89398 28886 -39212 -133913 -323125 -498647 -437375 -129495 156977 188747
38984 188747 -8164 -239560 -304183 -91264 299964 554856 439088 89025 -151660 -135121
38974 -135121 30005 235830 441800 530874 387603 139385 53689 151586 175186 -9034
38964 -9034 -233592 -332026 -353843 -361698 -267478 -39935 129461 62251 -148542 -288291 -308484
38953 -308484 -302922 -305889 -281879 -238197 -200199 -145614 -89820 -135745 -284126 -306079 -23720
38942 -23720 346486 389808 48279 -271659 -228903 40403 178968 84417 -69714 -161819
38932 -161819 -230477 -286683 -244524 -88647 55010 85890 44558 2335 -45914 -107461 -128728
$$ packed form
39006f00205J17760o2304N0153K98803K72940J0591j38383q8309j3720K6883Q5133
38995d0658J05420K4636o0512o8098r4701j89212j75522O1272L07880K86472L1770
38984A88747j96911k31396o4623K12919L91228K54892j15768l50063k40685J6539
38974a35121J65126K05825K05970Q9074j43271k48218q5696R7897K3600j84220
38964i034k24558r8434k1817p855R4220K27543J69396o7210k10793j39749k0193
38953c08484N562k967K4010M3682L7998N4585N5794m5925j48381k1953K82359
38942b3720L70206M3322l41529l19938M2756K69306J38565r4551j54131r2105
38932a61819o8658n6206M2159J55877J43657L0880m1332m2223m8249o1547k1267
$$ plain form
38921 -128728 -107322 -168069 -400248 -680348 -789300 -681195 -515309 -424660 -366622 -233207
38911 -233207 -25511 136656 155945 78051 51863 145426 228769 123094 -130967 -277429
38901 -277429 -174453 2680 -12447 -248312 -506471 -616987 -563639 -432439 -356774 -433471
38891 -433471 -570517 -520043 -211943 65079 17584 -222696 -273600 -38637 216782 301832
38881 301832 300176 293297 200421 6507 -128871 -136141 -160993 -264953 -250814 -3388 216964
38870 216964 106531 -192516 -245428 62839 344794 196430 -327045 -805418 -906692 -667813
38860 -667813 -378487 -248719 -215908 -104247 65442 57570 -238258 -595799 -708055 -546894
38850 -546894 -309713 -96363 147817 392429 469789 337302 191661 194721 242863 167092
$$ packed form
38921a28728K1406o0747k32179k80100j08952J08105J65886R0649N8038J33415
38911b33207K07696J62167J9289p7894k6188R3563Q3343j05675k54061j46462
38901b77429J02976J77133j5127k35865k58159j10516N3348J31200P5665p6697
38891d33471j37046N0474L08100K77022m7495k40280n0904K34963K55419Q5050
38881C01832j656o879r2876j93914j35378p270k4852j03960J4139K47426K20352
38870B16964j10433k99047n2912L08267K81955j48364n23475m78373j01274K38879
38860f67813K89326J29768L2811J11661J69689p872k95828l57541j12256J61161
38850e46894K37181K13350K44180K44612P7360j32487j45641L060M8142p5771
$$ plain form
38840 167092 29607 7218 57276 -37198 -279287 -390827 -232784 -34866 -32328 -111013 -64665
38829 -64665 -578 -148643 -398916 -435149 -288870 -319900 -594116 -740821 -574088 -389757
38819 -389757 -403202 -356578 -45672 187119 -33721 -440149 -508189 -290085 -259442 -462998
38809 -462998 -481516 -238004 -183417 -516802 -807445 -662586 -295694 -121836 -173518 -239517
38799 -239517 -267606 -299933 -250253 -54558 140394 198951 229732 359708 461905 362017 149091
38788 149091 19532 -39171 -135518 -172721 32909 385440 549520 375056 61710 -129435
38778 -129435 -147913 -99916 -74458 -90309 -132681 -188279 -263414 -364939 -451204 -438097 -277876
38767 -277876 -3683 300434 529764 592643 497216 372346 307002 227530 67281 -27352
$$ packed form
38840A67092j37485k2389N0058r4474k42089j11540J58043J97918K538p8685M6348
38829f4665O4087j48065k50273l6233J46279l1030k74216j46705J66733J84331
38819c89757j3445M6624L10906K32791k20840m06428o8040K18104L0643k03556
38809d62998j8518K43512N4587l33385k90643J44859L66892J73858n1682o5999
38799b39517k8089l2327M9680J95695J94952N8557L0781J29976J02197r9888k12926
38788A49091j29559n8703r6347l7203K05630L52531J64080j74464l13346j91145
38778a29435j8478M7997K5458j5851m2372n5598p5135j01525q6265J3107J60221
38767b77876K74193L04117K29330O2879r5427j24870o5344p9472j60249r4633
$$ plain form
38757 -27352 125709 411149 525366 423520 374547 519175 667378 638661 516914 417676
38747 417676 267012 290 -239925 -299375 -224688 -116184 40217 227143 283121 126207
38737 126207 -88031 -206901 -286906 -387917 -395353 -271628 -244154 -455499 -640224 -491106
38727 -491106 -178460 -117694 -321187 -399113 -195346 -7977 -82910 -245453 -206892 24351
38717 24351 226049 274906 204425 83550 -4883 36595 192647 275440 140503 -73799 -77029
38706 -77029 188160 440499 415840 203184 85024 126449 135923 33985 1007 143706 265044
38695 265044 178069 33624 45146 63829 -190166 -566071 -598143 -210354 137629 129895 -728
38684 -728 55118 195589 172917 34854 -15713 23649 36478 37597 63711 -11203 -265372 -482317
$$ packed form
38757b7352J53061K85440J14217j01846m8973J44628J48203k8717j21747r9238
38747D17676j50664k66722k40215n9450P4687J08504J56401J86926N5978j56914
38737A26207k14238j18870q0005j01011p436J23725K7474k11345j84725J49118
38727d91106L12646O0766k03493p7926K03767J87369p4933j62543L8561K31243
38717B4351K01698M8857p0481j20875q8433M1478J56052Q2793j34937k14302l230
38706g7029K65189K52339k4659k12656j18160M1425R474j01938l2978J42699J21338
38695B65044q6975j44445J1522J8683k53995l75905l2072L87789L47983p734j30623
38684g28N5846J40471k2672j38063n0567L9362J2829J119K6114p4914k54169k16945
$$ plain form
38672 -482317 -405047 -130019 19819 -72059 -248968 -355261 -346851 -218900 -47258 -13070
38662 -13070 -175928 -327607 -282235 -179674 -255778 -446328 -507094 -418727 -357146 -337874 -228744
38651 -228744 -86389 -128197 -334587 -409566 -222171 7269 75674 79396 163722 216674 41420
38640 41420 -275828 -390530 -103052 389432 694098 631319 392454 280376 353059 412828
38630 412828 321991 176041 112681 103779 49623 -37105 -72668 -47896 -15821 1846 1804 -36544
38618 -36544 -93724 -100856 -59369 -68418 -161252 -232757 -207404 -152044 -146924 -186016 -269740 -417825
38606 -417825 -517957 -387955 -100578 6694 -194138 -401027 -341918 -182759 -199105 -289805
38596 -289805 -172069 107873 236744 124899 -10408 -20578 19787 28520 22578 -2870 -93135
$$ packed form
38672d82317P7270K75028J49838r1878j76909j06293Q410J27951J71642L4188
38662a3070j62858j51679M5372J02561p6104j90550o0766Q8367O1581J9272J09130
38651b28744J42355m1808k06390p4979J87395K29440O8405L722Q4326N2952j75254
38640D1420l17248j14702K87478M92484L04666o2779k38865j12078P2683N9769
38630D12828r0837j45950o3360q902n4156q6728l5563K4772L2075J7667m2l8348
38618c6544n7180p132M1487r049r2834p1505K5353N5360N120l9092q3724j48085
38606d17825j00132J30002K87377J07272k00832k06889N9109J59159j6346r0700
38596b89805J17736K79942J28871j11845j35307j0170M0365Q733n942k5448r0265
$$ plain form
38585 -93135 -230138 -362265 -486893 -570699 -506961 -316217 -232944 -382410 -535039 -429972
38575 -429972 -182531 -87700 -164419 -206286 -165337 -158127 -175240 -103082 24836 79492 59926
38564 59926 10987 -138678 -365562 -371550 8456 404099 365623 70619 58665 364299 504556
38553 504556 319863 192826 312035 337143 39684 -264519 -242468 -63111 -49279 -164391
38543 -164391 -178770 -61142 100768 321044 576921 678125 540285 382007 406336 491931
38533 491931 438601 308193 263463 260656 176570 82574 114838 193105 137686 -17246 -75349
38522 -75349 11280 104899 126086 142502 217086 315249 373450 369192 325501 288568 271649 221625
38510 221625 115481 58775 146936 255372 171464 -58785 -164610 -82231 -73052 -293744 -528141
$$ packed form
38585i3135j37003j32127j24628q3806O3738J90744Q3273j49466j52629J05067
38575d29972K47441R4831p6719m1867M0949P210j7113P2158J27918N4656j9566
38564E9926m8939j49665k26884n988L80006L95643l8476k95004j1954L05634J40257
38553E04556j84693j27037J19209K5108k97459l04203K2051J79357J3832j15112
38543a64391j4379J17628J61910K20276K55877J01204j37840j58278K4329Q5595
38533D91931n3330j30408m4730k807q4086r3996L2264P8267n5419j54932n8103
38522g5349Q6629R3619K1187J6416P4584R8163N8201m258m3691l6933j6919n0024
38510B21625j06144n6706Q8161J08436q3908k30249j05825Q2379R179k20692k34397
$$ plain form
38499 -528141 -530351 -387610 -316949 -310317 -240119 -158908 -216260 -365988 -409445 -289901 -137528
38488 -137528 -52911 -22334 -17526 -23669 -1158 44285 5735 -165858 -304171 -200830 85730
38477 85730 263877 168838 -52637 -162072 -125408 -114416 -252383 -429236 -412306 -137130
38467 -137130 182788 297833 205082 80480 289 -87148 -141710 -25387 226705 362145
38457 362145 256220 104059 129090 278395 364380 337635 233783 9801 -334933 -587404
38447 -587404 -522708 -224977 19459 106586 155627 193245 81478 -177057 -331551 -228500
38437 -228500 -61092 -85771 -236265 -242118 -53059 98353 59011 -58627 -129236 -231357
38427 -231357 -448694 -620369 -517946 -196681 61474 134143 157127 226732 256985 202620
$$ packed form
38499e28141k210J42741P0661O632P0198Q1211n7352j49728m3457J19544J52373
38488a37528Q4617L0577M808o143K2511M5443l8550j71593j38313J03341K86560
38477H5730J78147r5039k21475j09435L6664J0992j37967j76853J6930K75176
38467a37130L19918J15045r2751j24602q0191q7437n4562J16323K52092J35440
38457C62145j05925j52161K5031J49305Q5985k6745j03852k23982l44734k52471
38447e87404O4696K97731K44436Q7127M9041L7618j11767k58535j54494J03051
38437b28500J67408k4679j50494n853J89059J51412l9342j17638p0609j02121
38427b31357k17337j71675J02423L21265K58155P2669K2984O9605L0253n4365
$$ plain form
38417 202620 170136 179622 52434 -291329 -634582 -765271 -786805 -896098 -1022090 -951784
38407 -951784 -689004 -417319 -207698 -28870 51239 -44396 -197711 -262543 -331988 -525578
38397 -525578 -630070 -349548 150558 388083 252484 101413 134868 162070 101638 195416
38387 195416 496124 620590 335431 -7997 13543 267506 323173 76981 -247331 -502478
38377 -502478 -653924 -602341 -345096 -167518 -306247 -541547 -482813 -149253 108290 170552
38367 170552 217527 263234 65921 -409323 -811632 -832491 -536210 -149921 209891 476992
38357 476992 558517 485819 449133 529346 561569 405956 190948 127839 216296 293907 269372
38346 269372 154237 -31782 -219779 -248373 -54319 152201 110632 -115808 -216086 -99996
$$ packed form
38417B02620l2484R486j27188l43763l43253j30689k1534j09293j25992P0306
38407i51784K62780K71685K09621J78828Q0109r5635j53315o4832o9445j93590
38397e25578j04492K80522N00106K37525j35599j51071L3455K7202o0432R3778
38387A95416L00708J24466k85159l43428K1540K53963N5667k46192l24312k55147
38377e02478j51446N1583K57245J77578j38729k35300N8734L33560K57543O2262
38367A70552M6975M5707j97313m75244m02309k0859K96281L86289L59812K67101
38357D76992Q1525p2698l6686Q0213L2223j55613k15008o3109Q8457P7611k4535
38346B69372j15135j86019j87997k8594J94054K06520m1569k26440j00278J16090
$$ plain form
38336 -99996 -27822 -159740 -241193 15530 415219 486112 160902 -112735 -34583 122248
38326 122248 -26120 -363582 -464740 -244060 -28455 -5391 13292 176635 292394 152100
38316 152100 -93127 -145133 4791 115432 81040 4123 -90683 -324666 -663356 -792666
38306 -792666 -481011 62441 382649 288550 7266 -153961 -123561 -2218 138452 266792
38296 266792 313153 232752 93066 -23554 -132770 -222515 -121671 266191 654779 614461
38286 614461 163892 -195684 -149428 51306 57719 -62430 -65741 106 -55935 -155751 -96943
38275 -96943 17730 -73906 -279100 -231671 87804 256755 50207 -220921 -189766 80222
38265 80222 300968 381414 408922 402957 314544 165484 37788 6408 136434 394094 521655
$$ packed form
38336i9996P2174j31918q1453K56723L99689P0893l25210k73637P8152J56831
38326A22248j48368l37462j01158K20680K15605K3064J8683J63343J15759j40294
38316A52100k45227n2006J49924J10641l4392p6917r4806k33983l38690j29310
38306g92666L11655N43452L20208r4099k81284j61227L0400J21343J40670J28340
38296B66792M6361q0401j39686j16620j09216q9745J00844L87862L88588m0318
38286F14461m50569l59576M6256K00734O413j20149l311O5847n6041r9816N8808
38275i6943J14673r1636k05194M7429L19475J68951k06548k71128L1155K69988
38265H0222K20746Q0446K7508n965q8413j49060j27696l1380J30026K57660J27561
$$ plain form
38254 521655 233789 -355106 -733780 -580260 -143245 126272 120127 42641 12229 -46662
38244 -46662 -194246 -378951 -515897 -508230 -260341 160825 444165 317533 -89860 -343859
38234 -343859 -199156 139830 301313 174755 -27404 -72313 37864 129698 95308 -11930
38224 -11930 -91249 -108383 -82284 -53353 -91060 -220456 -304610 -156313 149444 257020 -22288
38213 -22288 -407774 -489321 -226898 107759 342818 485411 500285 326671 76191 -74037
38203 -74037 -151185 -271048 -318577 -86168 295585 442984 270076 89327 104263 176099
38193 176099 187769 254471 421948 512880 454092 431205 532267 553642 360412 134966 55921
38182 55921 28241 -46987 -41839 107562 182964 47929 -51930 123172 373595 370048 177102
$$ packed form
38254E21655k87866n88895l78674J53520M37015K69517o145p7486l0412n8891
38244d6662j47584j84705j36946P667K47889M21166K83340j26632m07393k53999
38234c43859J44703L38986J61483j26558k02159m4909J10177R1834l4390j07238
38224a1930p9319j7134K6099K8931l7707j29396q4154J48297L05757J07576k79308
38213b2288l85486q1547K62423L34657K35059J42593J4874j73614k50480j50228
38203g4037p7148j19863m7529K32409L81753J47399j72908j80749J4936P1836
38193A76099J1670O6702J67477R0932n8788k2887J01062K1375j93230k25446p9045
38182E5921k7680p5228N148J49401P5402j35035r9859J75102K50423l547j92946
$$ plain form
38171 177102 83110 88516 -13422 -157304 -50229 317805 610743 641739 579806 584606 564370
38160 564370 429697 304114 296049 273796 84872 -134138 -103439 179895 389459 298717
38150 298717 86768 70124 238006 274864 42260 -211277 -228011 -96218 -41558 -72869
38140 -72869 -94314 -189961 -462960 -718727 -697045 -546495 -625129 -836681 -673741 -40200
38130 -40200 480324 426012 82410 -19650 143549 232610 163227 144924 243607 298452 234901
38119 234901 161129 160511 201015 233901 235342 197900 178488 253450 345896 256497 -35935 -291058
38107 -291058 -331033 -234859 -100871 111752 345080 358172 126452 32107 344348 761527
38097 761527 825671 584262 444317 518247 543471 392503 244179 216614 189968 78342
$$ packed form
38171A77102r3992N406j01938j43882J07075L68034K92938L0996o1933M800k0236
38160E64370j34673j25583q065k2253j88924k19010L0699K83334K09564r0742
38150B98717k11949j6644J67882L6858k32604k53537j6734J31793N4660l1311
38140g2869k1445r5647k72999k55767K1682J50550p8634k11552J62940O33541
38130d0200N20524n4312l43602j02060J63199Q9061o9383j8303R8683N4845o3551
38119B34901p3772o18M0504L2886J441l7442j9412P4962R2446q9399k92432k55123
38107b91058l9975R6174J33988K12623K33328J3092k31720r4345L12241M17179
38097G61527O4144k41409j39945P3930K5224j50968j48324k7565k6646j11626
$$ plain form
38087 78342 -9159 22326 106973 171054 248012 351276 374951 215678 -79804 -341722 -421752
38076 -421752 -316296 -170498 -121716 -134681 -82781 11068 -12619 -146825 -145713 110425 376674
38065 376674 358919 111837 -86638 -132966 -138685 -151834 -82852 87459 223023 214714 135443
38054 135443 148861 295906 414428 315551 55237 -68365 114591 392509 462508 357828
38044 357828 327382 377156 282198 56868 25804 312662 594084 524618 144815 -262239
38034 -262239 -472327 -385737 -67312 190896 133752 -68923 -30458 215931 220433 -140920
38024 -140920 -423058 -316471 -99794 -98455 -156557 -3800 263724 452988 656538 974327
38014 974327 1186822 1092976 862366 686417 421732 -26756 -329884 -198643 98813 161860
$$ packed form
38087G8342q7501L1485Q4647O4081P6958J03264K3675j59273k95482k61918q0030
38076d21752J05456J45798M8782j2965N1900R3849k3687j34206J112K56138K66249
38065C76674j7755k47082j98475m6328n719j3149O8982J70311J35564q309p9271
38054A35443J3418J47045J18522r8877k60314j23602J82956K77918O9999j04680
38044C57828l0446M9774r4958k25330l1064K86858K81422o9466l79803m07054
38034b62239k10088Q6590L18425K58208n7144k02675L8465K46389M502l61353
38024a40920k82138J06587K16677J339n8102J52757K67524J89264K03550L17789
38014I74327K12495r3846k30610j75949k64685m48488l03128J31241K97456O3047
$$ plain form
38004 161860 96407 226278 451316 449105 299443 340462 548360 598436 439232 305551
37994 305551 249629 131095 -12228 -32919 -20016 -140973 -246502 -78781 233197 340807
37984 340807 237406 191943 218124 96043 -133429 -178885 6434 170678 191528 163785
37974 163785 100343 -61577 -204110 -159349 -31432 -23705 -54604 66542 225087 199009 121532
37963 121532 257864 449975 319913 -53741 -215246 -57720 70247 -14053 -124938 -155159
37953 -155159 -221852 -319115 -293188 -202627 -256413 -378330 -284582 688 165697 140742 141368
37942 141368 201477 153604 57334 134083 284562 203940 -27594 -33372 169467 166229 -117366
37931 -117366 -287102 -185556 -112098 -204727 -210656 -47151 -772 -162359 -225535 -65618 23310
$$ packed form
38004A61860o5453J29871K25038k211j49662M1019K07898N0076j59204j33681
37994C05551n5922j18534j43323k0691J2903j20957j05529J67721L11978J07610
37984C40807j03401m5463K6181j22081k29472m5456J85319J64244K0850k7743
37974A63785o3442j61920j42533M4761J27917P727l0899J21146J58545k6078p7477
37963A21532J36332J92111j30062l73654j61505J57526J27967q4300j10885l0221
37953a55159o6693r7263K5927R0561n3786j21917R3748K85270J65009k4955O26
37942A41368O0109m7873r6270P6749J50479q0622k31534n778K02839l238k83595
37931a17366j69736J01546P3458r2629n929J63505M6379j61587o3176J59917Q8928
$$ plain form
37920 23310 -107360 -190059 -63431 54352 45421 125531 355559 434699 234216 32886 -22584
37909 -22584 -160030 -421658 -424268 -10099 396451 444468 359800 415440 412366 133326 -144519
37898 -144519 -74528 194270 330709 362110 467368 549475 448688 301200 277084 224936
37888 224936 -37221 -336421 -419309 -355217 -315375 -225726 -894 157293 81112 -3798 165172
37877 165172 407600 369651 67244 -209637 -333930 -334122 -170871 116684 256835 104322
37867 104322 -58732 53090 235979 135632 -142901 -223960 -94574 -68455 -215660 -303771
37857 -303771 -276526 -342131 -550648 -673980 -581439 -421388 -354796 -360273 -359832 -327440 -235068
37846 -235068 -66602 96266 140965 64667 -55265 -166338 -221338 -173540 -106254 -212283
$$ packed form
37920B3310j30670q2699J26628J17783q931Q0110K30028P9140k00483k01330n5470
37909b2584j37446k61628k610M14169M06550M8017q4668N5640l074k79040k77845
37898a44519O9991K68798J36439L1401J05258Q2107j00787j47488k4116n2148
37888B24936k62157k99200q2888O4092L9842Q9649K24832J58187p6181q4910J68970
37877A65172K42428l7949l02407k76881j24293j92J63251K87555J40151j52513
37867A04322j63054J11822J82889j00347k78533q1059J29386K6119j47205q8111
37857c03771K7245o5605k08517j23332R2541J60051O6592n477M41L2392R2372
37846b35068J68466J62868M4699p6298j19932j11073n5000M7798O7286j06029
$$ plain form
37836 -212283 -502849 -713301 -663278 -509953 -444078 -362735 -116328 126950 102122 -107808
37826 -107808 -198968 -125561 -93011 -124559 -20147 219373 300336 98064 -98295 -3387 223576
37815 223576 211984 -44477 -120323 270834 842386 1057501 799789 465347 343589 217725
37805 217725 -186076 -621155 -610373 -209742 1563 -241067 -523746 -417527 -91312 39562
37795 39562 -37133 1143 269168 542966 605100 462232 251958 123299 176451 375616
37785 375616 554661 600827 566884 536979 491956 388395 259225 156360 93370 89040 145394
37774 145394 162782 38652 -129967 -136776 13715 98630 33648 -6829 101511 252304 330655
37763 330655 373981 406038 346309 199553 117107 163624 223905 207547 128320 -38234 -290633
$$ packed form
37836b12283k90566k10452N0023J53325O5875Q1343K46407K43278k4828k09930
37826a07808r1160P3407L2550l1548J04412K39520Q0963k02272j96359R4908K26963
37815B23576j1592k56461p5846L91157N71552K15115k57712l34442j21758j25864
37805B17725m03801m35079J0782M00631K11305k42630k82679J06219L26215J30874
37795C9562p6695L8276K68025K73798O2134j42868k10274j28659N3152J99165
37785C75616J79045M6166l3943k9905m5023j03561j29170j02865o2990m330N6354
37774A45394J7388j24130j68619o809J50491Q4915o4982m0477J08340J50793P8351
37763C30655M3326L2057n9729j46756q2446M6517O0281j6358p9227j66554k52399
$$ plain form
37752 -290633 -386450 -69904 418827 496400 51038 -339394 -230625 89541 140545 -20348
37742 -20348 -15637 205243 370251 354028 267717 205287 195044 266247 315342 90964 -423024
37731 -423024 -810465 -703574 -279235 23172 100836 183408 385376 602588 753814 816866
37721 816866 714233 451868 277044 401763 646186 650247 380141 137112 105359 175835
37711 175835 207057 197501 185838 201000 310655 510402 584452 319145 -123436 -292229 6499
37700 6499 452788 626803 518838 460059 654384 1019981 1507833 2279077 3316837 4045164
37690 4045164 3770042 2578625 1394588 919123 893019 733346 494794 636403 1083116
37681 1083116 1221344 827810 359036 198244 200086 165705 205383 359555 363762 115582
$$ packed form
37752b90633r5817L16546M88731P7573m45362l90432J08769L20166N1004j60893
37742b0348M711K20880J65008j6223q6311o2430j0243P1203M9095k24378n13988
37731d23024l87441J06891M24339L02407P7664Q2572K01968K17212J51226O3052
37721H16866j02633k62365j74824J24719K44423M061k70106k43029l1753P0476
37711A75835L1222r556j1663J5162J09655J99747P4050k65307m42581j68793K98728
37700F499M46289J74015j07965n8779J94325L65597M87852P71244J037760P28327
37690D045164k75122j191417j184037m75465k6104j59673k38552J41609M46713
37681A083116J38228l93534m68774j60792J842l4381L9678J54172M207k48180
$$ plain form
37671 115582 -56353 77847 251190 187135 106428 328891 668062 672058 285657 -123376
37661 -123376 -273292 -171162 74073 325526 387516 181803 -86036 -143948 13856 172247
37651 172247 199595 156106 151578 205096 221305 94790 -99279 -97671 208253 531075 541782
37640 541782 362081 370137 597472 727035 657431 610316 652018 589312 416579 384232 516607
37629 516607 542788 418791 412665 543401 483246 191276 71589 270835 392982 195228
37619 195228 4843 115808 303089 283957 159271 63428 -111075 -315089 -222234 148488
37609 148488 285054 38079 -31844 373022 672952 378693 -11020 154686 535556 383779
37599 383779 -163485 -328319 21575 263940 108141 -72325 -25922 18916 -96776 -181820
$$ packed form
37671A15582j71935J34200J73343o4055q0707K22463L39171L996l86401m09033
37661a23376j49916J02130K45235K51453O1990k05713k67839n7912J57804J58391
37651A72247K7348m3489m528N3518J6209j26515j94069J608L05924L22822J0707
37640E41782j79701Q056K27335J29563o9604m7115M1702o2706j72733l2347J32375
37629E16607K6181j23997o126J30736o0155k91970j19687J99246J22147j97754
37619A95228j90385J10965J87281j9132j24686r5843j74503k04014R2855L70722
37609A48488J36566k46975o9923M04866K99930k94259l89713J65706L80870j51777
37599C83779n47264j64834L49894K42365j55799j80466M6403M4838j15692q5044
$$ plain form
37589 -181820 -113807 -43375 -60087 -61824 -30474 -79690 -190264 -216645 -160954 -153111 -186606 -138988
37577 -138988 -6289 112173 183210 211023 177860 165197 314794 516885 441913 72364
37567 72364 -164714 -33794 156117 124112 79107 236860 357182 231663 179899 515355
37557 515355 913672 897495 612399 525822 652133 680361 613732 675661 788250 718652 559023
37546 559023 536778 559659 453006 385853 528735 584333 248950 -150425 -119899 172070
37536 172070 210665 34055 80529 322949 331463 106588 85279 330910 439366 286001
37526 286001 187891 257778 239422 85103 97326 359493 554570 496293 386920 415772 485444
37515 485444 438960 257113 8583 -143465 17228 433194 672345 487511 234598 327550
$$ packed form
37589a81820O8013P0432j6712j737L1350m9216j10574k6381N5691P843l3495M7618
37577a38988J32699J18462P1037K7813l3163j2663J49597K02091p4972l69549
37567G2364k37078J30920J89911l2005m5005J57753J20322j25519n1764L35456
37557E15355L98317j6177k85096q6577J26311K8228o6629O1929J12589o9598j59629
37546E59023k2245K2881j06653o7153J42882N5598l35383l99375L0526K91969
37536A72070L8595j76610M6474K42420Q514k24875k1309K45631J08456j53365
37526B86001r8110O9887j8356j54319J2223K62167J95077n8277j09373K8852O9672
37515D85444m6484j81847k48530j52048J60693M15966K39151j84834k52913R2952
$$ plain form
37505 327550 553999 441337 61064 -108558 46476 220842 287764 394699 542395 581402
37495 581402 562730 653762 823395 1001930 1327547 1804947 2026245 1741073 1366215 1349004
37485 1349004 1395778 1016493 468560 355176 583599 600328 433255 553492 837539 673812
37475 673812 106792 -122838 187279 368618 17507 -394873 -359551 -36414 204692 314016
37465 314016 325341 149885 -111335 -134836 121932 326827 329834 355308 518861 625545
37455 625545 579733 556376 650035 743462 775345 766262 614899 277988 55989 227394 518714
37444 518714 467657 186250 172104 465481 626271 485544 288686 145583 -27298 -78253
37434 -78253 212688 595678 635321 448886 474348 627072 476278 165256 261946 689888
$$ packed form
37505C27550K26449j12662l80273j69622J55034J74366O6922J06935J47696L9007
37495E81402j8672R1032J69633J78535L25617M77400K21298k85172l74858j7211
37485A349004M6774l79285n47933j13384K28423J6729j67073J20237K84047j63727
37475F73812n67020k29630L10117J81339l51111m12380L5322L23137K41106J09324
37465C14016J1325j75456k61220k3501K56768K04895L007K5474J63553J06684
37455F25545m5812k3357R3659R3427L1883r083j51363l36911k21999J71405K91320
37444E18714n1057k81407j4146K93377J60790j40727j96858j43103j72881n0955
37434g8253K90941L82990L9643j86435K5462J52724j50794l11022R6690M27942
$$ plain form
37424 689888 751523 334152 139006 468514 711976 416533 42895 172891 623147 837797
37414 837797 669133 350811 78142 -69847 -95784 -140902 -282120 -269778 131745 610162
37404 610162 634192 264733 54943 179372 300051 286553 377532 572878 554724 316866
37394 316866 229838 386303 499893 508687 639564 838017 805639 634799 701743 900614
37384 900614 742996 284988 157769 538685 869838 780277 548270 457093 405992 357372
37374 357372 488028 710584 689894 469129 431826 568099 485239 209080 202855 490447
37364 490447 555818 246856 -13256 -51102 -168070 -391955 -336293 6432 152454 4172
37354 4172 22689 328700 470832 313625 307815 613388 785594 626998 555314 820061 1101119
$$ packed form
37424F89888O1635m17371j95146L29508K43462k95443l73638J29996M50256K14650
37414H37797j68664l18322k72669j47989k5937m5118j41218J2342M01523M78417
37404F10162K4030l69459k09790J24429J20679j3498R0979J95346j8154k37858
37394C16866q7028J56465J13590Q794J30877J98453l2378j70840O6944J98871
37384I00614j57618m58008j27219L80916L31153q9561k32007r1177n1101m8620
37374C57372J30656K22556k0690k20765l7303J36273q2860k76159o225K87592
37364D90447O5371l08962k60112l7846j16968k23885N5662L42725J46022j48282
37354D172J8517L06011J42132j57207n810L05573J72206j58596p1684K64747K81058
$$ plain form
37343 1101119 1160407 1173191 1190719 1006604 746908 851078 1317267 1713870 1988461 2403752
37333 2403752 2661755 2133682 1085196 572165 886762 1199259 1004063 766868 781188
37324 781188 580387 7816 -241323 236675 836524 954628 818814 771354 621424 268871
37314 268871 129640 399288 665022 690396 789103 1053034 1086664 870860 954476 1408827
37304 1408827 1566169 1193919 938120 1225927 1774401 2520959 3812415 5205280 5404046
37295 5404046 4079059 2533418 1853174 1608156 1142671 856888 1215730 1637989 1472205
37286 1472205 1130640 1208966 1349061 1002021 522328 494717 683048 590651 403031 501694
37276 501694 681028 643952 627042 809356 795368 373172 45339 143429 212032 -70658
$$ packed form
37343A101119N9288J2784J7528j84115k59696J04170M66189L96603K74591M15291
37333B403752K58003n28073j048486n13031L14597L12497j95196k37195J4320
37324G81188k00801n72571k49139M77998N99849J18104j35814m7460j49930l52553
37314B68871j39231K69648K65734K5374R8707K63931L3630k15804Q3616M54351
37304A408827J57342l72250k55799K87807N48474P46558J291456J392865J98766
37295E404046j324987j545641o80244k45018m65485k85783L58842M22259j65784
37286A472205l41565P8326J40095l47040m79693k7611J88331r2397j87620R8663
37276E01694J79334l7076j6910J82314j3988m22196l27833R8090O8603k82690
$$ plain form
37266 -70658 -220931 122071 490724 499574 522488 763605 674772 75151 -208996 308336
37256 308336 831462 608577 157453 192742 367889 138438 -113243 89367 300749 63346
37246 63346 -96904 304349 621846 176894 -454318 -424151 -13827 122599 219621 678422
37236 678422 968407 541719 16935 150264 446617 133186 -307587 -8974 633267 675202
37226 675202 327902 444634 880432 865322 523736 543850 759668 513271 56416 170692
37216 170692 709623 882881 688790 733890 926638 686524 208377 216879 649961 804054
37206 804054 603465 574552 759461 750823 584734 578119 572504 317916 202154 589419 933337
37195 933337 637038 240554 547756 1129281 1041005 570262 823936 1857515 2607579 2534872
$$ packed form
37266g0658j50273L43002L68653Q850K2914K41117q8833n99621k84147N17332
37256C08336N23126k22885m51124L5289J75147k29451k51681K02610K11382k37403
37246F3346j60250M01253L17497m44952o31212L0167M10324J36426R7022M58801
37236F78422K89985m26688n24784J33329K96353l13431m40773K98613O42241M1935
37226F75202l47300J16732M35798j5110l41586K0114K15818k46397m56855J14276
37216A70692N38931J73258j94091M5100J92748k40114m78147Q502M33082J54093
37206H04054k00589k8913J84909q638j66089o615n615k54588j15762L87265L43918
37195I33337k96299l96484L07202N81525q8276m70743K53674J033579P50064p2707
$$ plain form
37185 2534872 2070179 1568743 1015442 642292 734695 962339 872896 761491 1077172 1395117
37175 1395117 1074279 500015 493893 883070 865270 434550 221323 244451 47190 -221584
37165 -221584 -66780 291345 277378 83330 282041 644208 515845 76341 58439 484861
37155 484861 778470 820394 845952 676049 126221 -246171 112810 724750 863068 808441
37145 808441 1197110 1746255 1860955 1876407 2372214 2855362 2514816 1732551 1438376 1498579
37135 1498579 1173520 645339 615679 871303 727648 433580 662054 1070716 856125 285628
37125 285628 199407 457376 362413 126328 395249 823094 661795 260767 428222 852496
37115 852496 750363 486256 868057 1442010 1264697 787210 1104917 1865085 1864949 1276501
$$ packed form
37185B534872m64693n01436n53301l73150R2403K27644q9443j11405L15681L17945
37175A395117l20838n74264o122L89177j7800m30720k13227K3128j97261k68774
37165b21584J54804L58125j3967j94048J98711L62167j28363m39504j7902M26422
37155D84861K93609M1924K5558j69903n49828l72392L58981O11940J38318n4627
37145H08441L88669N49145J14700J5452M95807M83148l40546p82265k94175O0203
37135A498579l25059n28181k9660K55624j43655k94068K28474M08662k14591n70497
37125B85628q6221K57969r4963k36085K68921M27845j61299m01028J67455M24274
37115H52496j02133k64107L81801N73953j77313m77487L17707P60168j36n88448
$$ plain form
37105 1276501 1279105 1838757 1869906 1348442 1269688 1673541 1636438 1101763 883890 1002682
37095 1002682 790780 447331 715081 1262937 1152214 604552 539617 754300 407368 -132205
37085 -132205 128492 808309 749593 191164 285435 860360 787367 206503 229037 763730
37075 763730 792914 461754 730350 1336353 1294755 969976 1395018 2074605 1867929 1455736
37065 1455736 2297516 3664247 3539022 2107466 1440018 1939758 2091917 1628574 1858922
37056 1858922 2752585 2744610 1716477 1256812 1662638 1542383 695043 513052 1171689 1251094
37046 1251094 527489 355088 925925 932145 271744 285737 1005757 1003527 257888 284192
37036 284192 1138423 1232939 405914 185689 744484 653952 -71667 155770 1310947 1642766
$$ packed form
37105A276501K604N59652L1149n21464p8754M03853l7103n34675k17873J18792
37095A002682k11902l43449K67750N47856j10723n47662o4935K14683l46932n39573
37085a32205K60697O79817n8716n58429R4271N74925p2993n80864K2534N34693
37075G63730K9184l31160K68596O06003m1598l24779M25042O79587k06676m12193
37065A455736Q41780J366731j25225j431556o67448M99740J52159m63343K30348
37056A858922Q93663p975j028133m59665M05826j20255q47340j81991O58637P9405
37046A251094p23605j72401N70837O220o60401J3993P20020k230p45639K6304
37036B84192Q54231R4516q27025k20225N58795r0532p25619K27437J155177L31819
$$ plain form
37026 1642766 1020593 1115934 1996509 1953685 1008643 1051370 2145730 2329289 1456321 1480214
37016 1480214 2535501 2705462 2145739 3207752 5734039 6575477 4813187 3182397 3153687
37007 3153687 2901570 1484998 742618 1466063 1786135 948647 750564 1756863 2041870
36998 2041870 1070332 819724 1756326 1834811 722068 680081 2022499 2248448 991349
36989 991349 1057504 3094467 4131392 3010278 2286331 3071984 3099954 1654041 1205822
36980 1205822 2344667 2398552 876744 768473 2666133 3384760 2190564 2251478 4058670
36971 4058670 3998988 1527773 796993 2841847 3446309 1309730 646482 2847548 3625804
36962 3625804 1574529 1125271 3605043 4239267 1725340 1367955 4682382 5907590 3240330
$$ packed form
37026A642766o22173R5341Q80575m2824r45042M2727J094360J83559q72968K3893
37016A480214J055287J69961n59723J062013K526287Q41438j762290j630790k8710
37007C153687k52117j416572p42380P23445L20072q37488j98083J006299K85007
36998B041870r71538k50608R36602P8485j112743m1987J342418K25949j257099
36989I91349O6155K036963J036925j121114p23947P85653K7970j445913m48219
36980A205822J138845N3885j521808j08271J897660P18627j194196O0914J807192
36971D058670n9682k471215p30780K044854O04462k136579o63248K201066P78256
36962C625804k051275m49258K479772O34224k513927l57385L314427J225208k667260
$$ plain form
36953 3240330 2776703 6461921 7783801 4857051 5067429 10521886 12815279 9422358
36945 9422358 9948312 17775996 22745657 22047214 28588514 45757124 56366782 53701397
36937 53701397 58334001 81785991 103553536 118480510 174884468 308999402 455896083
36930 455896083 493206553 385884284 230942579 136918065 110984167 96398909 70981786
36923 70981786 56426283 58730522 55897027 39874721 27410303 26489732 24981203 16734450
36915 16734450 11556100 13948104 14777548 9663312 6344694 8545840 9379535 5652549
36907 5652549 3650265 6102038 7016882 3802041 2050909 4208452 5035786 2245172
36899 2245172 832240 3025079 4063290 1713191 447735 2468535 3550835 1482112
$$ packed form
36953C240330m63627L685218J321880k926750K10378N454457K293393l392921
36945I422358N25954P827684M969661o98443O541300J7168610J0609658k665385
36937E3701397M632604K3451990K1767545J4926974N6403958J34114934J46896681
36930D55896083L7310470j07322269j54941705r4024514k5933898j4585258k5417123
36923G0981786j4555503K304239k833495j6022306j2464418r20571j508529q246753
36915A6734450n178350K392004Q29444n114236l318618K201146Q33695l726986
36907E652549k002284K451773R14844l214841j751132K157543Q27334k790614
36899B245172j412932K192839J038211k350099j265456K020800J082300k068723
$$ plain form
36891 1482112 178738 1792399 2695958 876193 -226859 1277743 2084243 437584
36883 437584 -345693 1522841 2748816 1364923 420388 1889281 2894499 1455970 343984
36874 343984 1715480 3169698 2544811 1704065 2284189 2412155 863616 -26984 1240333
36865 1240333 2307637 1354463 394886 1231461 2116067 1402950 706640 1471059 2027025
36856 2027025 985371 109907 942943 1874840 1434318 1346657 3378346 5938713 6648325
36847 6648325 5827079 4925779 3890320 2426487 1580438 1880929 2073611 1537604 1636483
36838 1636483 2963296 3769523 2930620 1934708 2081869 2248468 1357242 581309 1064249
36829 1064249 1746839 1445103 936656 1116006 1192144 521891 147763 748824 1104378 311682
$$ packed form
36891A482112j303374J613661R03559j819765j103052J504602Q06500j646659
36883D37584p83277J868534J225975j383893r44535J468893J005218j438529j111986
36874C43984J371496J454218o24887q40746N80124J27966j548539q90600J267317
36865A240333J067304r53174r59577Q36575Q84606p13117o96310P64419N55966
36856B027025j041654q75464Q33036R31897m40522q7661K031689K560367P09612
36847F648325q21246r01300j035459j463833q46049L00491J92682n36007R8879
36838A636483J326813Q06227q38903r95912J47161J66599q91226p75933M82940
36829A064249O82590l01736n08447J79350P6138o70253l74128O01061L55554p92696
$$ plain form
36819 311682 -470791 -148452 422246 260414 -2348 249134 237769 -436854 -644322 175293
36809 175293 755552 292990 -69536 494824 884349 262805 -269382 170507 515141 -140982
36799 -140982 -741855 -319839 143972 -318593 -781087 -310086 160656 -296333 -686095 32356
36789 32356 882639 629719 -17066 105664 463265 103534 -357834 21557 600983 372524
36779 372524 -137844 18188 390753 166024 -148198 213345 653434 339964 -133314 146183
36769 146183 697188 634581 338144 575859 975827 884807 732075 1058123 1234932 656648
36759 656648 157859 700800 1632567 1776904 1316119 1087123 953307 412456 -60468 184274
36749 184274 616434 418544 -47757 -45929 95724 -246212 -597865 -205640 493672 625341
$$ packed form
36819C11682p82473L22339N70698j61832k62762K51482j1365o74623k07468Q19615
36809A75293N80259m62562l62526N64360L89525o21544n32187M39889L44634o56123
36799a40982o00873M22016M63811m62565m62494M71001M70742m56989l89762P18451
36789C2356Q50283k52920o46785J22730L57601l59731m61368L79391N79426k28459
36779C72524n10368J56032L72565k24729l14222L61543M40089l13470m73278K79497
36769A46183N51005o2607k96437K37715L99968r1020j52732L26048J76809n78284
36759F56648m98789N42941R31767J44337m60785k28996j33816n40851m72924K44742
36749A84274M32160j97890m66301J828J41653l41936l51653L92225O99312J31669
$$ plain form
36739 625341 401813 532335 789735 524013 -13502 -163253 -93110 -316732 -567355 -335799
36729 -335799 49498 9868 -200146 -56585 205104 131023 -53729 -54465 -251513 -844941
36719 -844941 -1084128 -418692 395073 429875 27006 7359 263033 267509 191428 360500
36709 360500 372522 -110139 -463166 -121971 298439 45117 -436024 -382678 -97359 -211761
36699 -211761 -395233 -91059 244802 -21119 -369247 -9021 592601 472880 -143186 -329947
36689 -329947 -90864 -95449 -259357 8872 511090 550915 231222 228927 555379 684270
36679 684270 606644 670875 718023 431643 160232 349680 592334 299064 -153917 -52696
36669 -52696 354549 336537 24041 103312 538156 750715 748751 962135 1267643 1241043 1058697
$$ packed form
36739F25341k23528J30522K57400k65722n37515j49751P0143k23622k50623K31556
36729c35799L85297l9630k10014J43561K61689p4081j84752p36j97048n93428
36719h44941k39187O65436Q13765L4802m02869j9647K55674M476p6081J69072
36709C60500J2022m82661l53027L41195M20410k53322m81141N3346K85319j14402
36699b11761j83472L04174L35861k65921l48128L60226O01622j19721o16066j86761
36689c29947K39083m585j63908K68229N02218L9825l19693k295L26452J28891
36679F84270p7626O4231M7148k86380k71411J89448K42654k93270m52981J01221
36669e2696M07245j8012l12496P9271M34844K12559j964K13384L05508k6600j82346
$$ plain form
36658 1058697 1123056 1157449 710026 168328 202089 567614 540343 176029 64820 183015
36648 183015 76985 -133241 -6931 265413 199591 -6406 150852 464315 397922 144272
36638 144272 279440 691677 849057 781955 821363 765200 312828 -102327 50945 388421
36628 388421 286979 64076 348356 800162 701427 340947 494879 945415 890806 484412
36618 484412 545709 991379 987389 506222 318960 516613 422564 -29503 -159293 173414
36608 173414 383311 298893 320034 454892 358905 267493 690430 1258958 1132647 488567
36598 488567 295329 637572 645695 142401 -72855 237647 339462 -41348 -207799 191819
36588 191819 551491 429171 181529 99307 -50284 -280741 -199153 139252 185241 -56020
$$ packed form
36658A058697O4359L4393m47423n41698L3761L65525k7271l64314j11209J18195
36648A83015j06030k10226J26310K72344o5822k05997J57258L13463o6393k53650
36638A44272J35168M12237J57380o7102L9408n6163m52372m15155J53272L37476
36628C88421j01442k22903K84280M51806r8735l60480J53932M50536n4609m06394
36618D84412O1297M45670l990m81167j87262J97653r4049m52067j29790L32707
36608A73414K09897q4418K1141J34858r5987r1412M22937N68528j26311o44080
36598D88567j93238L42243Q123n03294k15256L10502J01815l80810j66451L99618
36588A91819L59672j22320k47642q2222j49591k30457Q1588L38405M5989k41261
$$ plain form
36578 -56020 30847 459950 492363 -27994 -332515 -70995 141498 -68348 -199934 63443
36568 63443 234974 -691 -186646 -16733 70218 -239126 -546282 -544065 -556309 -776369
36558 -776369 -803117 -430588 -93014 -64078 -20614 183491 177135 -71365 19838 587827 930134
36547 930134 685370 453064 666677 826620 511139 191564 312268 476217 311491 245554
36537 245554 607434 859208 590195 377704 722706 1046567 793764 608275 1215781 2038424
36527 2038424 2288628 2556666 3687952 4878339 4839719 4289640 5018788 6814915 8131756
36518 8131756 10127039 16546267 27554068 36450873 35891309 26406745 15744374 10025398
36510 10025398 8516875 7467619 5753840 4713521 4629413 4225168 3069966 2169084 2033700
$$ packed form
36578e6020Q6867M29103L2413n20357l04521K61520K12493k09846j31586K63377
36568F3443J71531k35665j85955J69913Q6951l09344l07156K217j2244k20060
36558g76369k6748L72529L37574K8936M3464K04105o356k48500R1203N67989L42307
36547I30134k44764k32306K13613J59943l15481l19575J20704J63949j64726o5937
36537B45554L61880K51774k69013k12491L45002L23861k52803j85489O07506Q22643
36527B038424K50204K68038J131286J190387l8620n50079P29148J796127J316841
36518H131756J995283O419228J1007801Q896805n59564r484564j0662371n718976
36510A0025398j508523j049256j713779j040319q4108m04245j155202r00882j35384
$$ plain form
36501 2033700 1922293 1371670 1022070 1333277 1653799 1299181 675684 559542 892669
36492 892669 1038532 795873 492542 375841 461399 738912 1075427 1157543 903582 659173
36482 659173 667670 697327 513567 291750 179260 -79383 -603282 -917726 -596372 22551
36472 22551 332008 313484 314702 320612 98185 -197316 -212775 -6817 108864 133478 230161
36461 230161 261767 60723 -85332 160499 521178 487556 151270 4674 115863 184449
36451 184449 229372 496565 814270 764269 408874 162483 47723 -216104 -502479 -419212
36441 -419212 -91018 -20877 -197073 -128512 223868 371764 223112 246515 560001 673507
36431 673507 385019 168598 343325 531519 327505 -43238 -116421 169057 524646 689617
$$ packed form
36501B033700j11407n50623l49600L11207L20522l54618o23497j16142L33127
36492H92669J45863k42659l03331j16701Q5558K77513L36515Q2116k53961k44409
36482F59173Q497K9657j83760k21817j12490k58643n23899l14444L21354O18923
36472B2551L09457j8524J218N910k22427k95501j5459K05958J15681K4614R6683
36461B30161L1606k01044j46055K45831L60679l3622l36286j46596J11189O8586
36451A84449M4923K67193L17705n0001l55395k46391j14760k63827k86375Q3267
36441d19212L28194P0141j76196O8561L52380J47896j48652K3403L13486J13506
36431F73507k88488k16421J74727J88194k04014l70743p3183K85478L55589J64971
$$ plain form
36421 689617 570112 292200 185536 405497 612546 407593 -29701 -221707 -167781 -236640
36411 -236640 -398172 -271950 77283 144423 -135606 -245282 35809 310733 303774 250658
36401 250658 349774 448896 466043 521725 513030 192809 -213971 -183407 189231 240130 -103285
36390 -103285 -101243 523383 1001325 725146 202849 148532 343926 174289 -256734 -364963
36380 -364963 -79802 160674 191123 225498 317629 303334 211995 242129 362875 345305 161812
36369 161812 22260 43738 145466 216866 182224 -7383 -260395 -345664 -186295 -17962
36359 -17962 -78727 -276793 -339984 -174892 80844 263357 311384 270762 248246 289109 295157
36348 295157 172152 17048 1223 123806 261328 373026 442081 344965 65231 -101142
$$ packed form
36421F89617j19505k77912j06664K19961K07049k04953m37294j92006N3926o8859
36411b36640j61532J26222L49233O7140k80029j09676K81091K74924o959n3116
36401B50658R9116R9122J7147N5682q695l20221m06780L0564L72638N0899l43415
36390a03285K042O24626M77942k76179n22297n4317J95394j69637m31023j08229
36380c64963K85161K40476L0449L4375R2131j4295r1339L0134J20746j7570j83493
36369A61812j39552K1478J01728P1400l4642j89607k53012q5269J59369J68333
36359a7962o0765j98066o3191J65092K55736J82513M8027m0622k2516M0863O048
36348B95157j23005j55104j5825J22583J37522J11698O9055r7116k79734j66373
$$ plain form
36338 -101142 92561 397020 384051 107918 -6318 135221 217469 133853 137674 296905
36328 296905 325198 109070 -70819 -29415 33073 -73797 -215710 -204427 -71801 79981
36318 79981 226692 323543 325869 345327 496000 599562 392668 9932 -134064 50164
36308 50164 242183 241066 168916 133335 101683 122822 262704 331532 103877 -222463 -244445
36297 -244445 17270 195151 214791 314801 480606 448836 257889 195678 222946 79388
36287 79388 -77337 148170 575632 596106 193175 3019 238375 406146 281377 263723
36277 263723 474499 410480 -84094 -362435 -10118 437216 376770 47177 -34469 81717
36267 81717 106038 133163 327710 452268 278798 57710 72641 145152 47926 -38810 47570
$$ packed form
36338a01142J93703L04459j2969k76133j14236J41539Q2248q3616L821J59231
36328B96905K8293k16128j79889M1404O2488j06870j41913J1283J32626J51782
36318G9981J46711R6851K326J9458J50673J03562k06894l82736j43996J84228
36308E0164J92019j117p2150l5581l1652K1139J39882O8828k27655l26340k1982
36297b44445K61715J77881J9640J00010J65805l1770j90947o2211K7268j43558
36287G9388j56725K25507M27462K0474m02931j90156K35356J67771j24769j7654
36277B63723K10776o4019m94574k78341L52317M47334o0446l29593q1646J16186
36267H1717K4321K7125J94547J24558j73470k21088J4931P2511r7226q6736Q6380
$$ plain form
36256 47570 44116 -223330 -392385 -166196 89999 -73989 -429120 -469517 -219307 -44964
36246 -44964 24404 189195 333765 167059 -237204 -510686 -473336 -199401 192875 503446
36236 503446 470409 144419 -48299 96896 262359 196170 156039 395213 667411 684787
36226 684787 623875 697569 670207 335402 49109 183461 421530 244858 -174550 -242204
36216 -242204 103697 359960 268931 67871 -21662 -42354 -56439 -61635 -118893 -250677 -307688
36205 -307688 -193381 -48165 14351 86745 159201 12349 -292106 -274748 213078 591120
36195 591120 397951 52107 160302 514943 505415 180868 106406 367187 505681 358828
36185 358828 217883 178114 23184 -209152 -187062 107508 292494 196347 58858 52704
$$ packed form
36256D7570l454k67446j69055K26189K56195j63988l55131m0397K50210J74343
36246d4964O9368J64791J44570j66706m04263k73482L7350K73935L92276L10571
36236E03446l3037l25990j92718J45195J65463o6189m0131K39174K72198J7376
36226F84787o0912P3694k7362l34805k86293J34352K38069j76672m19408o7654
36216b42204L45901K56263r1029k01060q9533k0692j4085n196n7258j31784n7011
36205c07688J14307J45216O2516P2394P2456j46852l04455J7358M87826L78042
36195E91120j93169l45844J08195L54641r528l24547p4462K60781J38494j46853
36185C58828j40945l9769j54930k32336K2090K94570J84986r6147j37489o154
$$ plain form
36175 52704 71310 60606 126803 245641 251118 152774 109582 98845 -23827 -170799 -113128
36164 -113128 113454 279179 381607 586862 804267 762732 495860 318444 330165 385828
36154 385828 553032 1095880 1903879 2401522 2214593 1590201 1009934 688611 583861 608995
36144 608995 669554 686662 698124 787860 883805 805305 533565 258245 138637 170160 270230
36133 270230 342817 292566 127256 4255 43652 163276 214013 172118 85470 -23345 -80118
36122 -80118 29826 238909 302169 173095 119891 294396 481801 495042 489133 612653 700219
36111 700219 658053 804185 1386871 2051087 2260102 2028403 1771365 1635658 1473223 1302376
36101 1302376 1260851 1204545 877619 436200 305954 521886 673264 537704 352037 393953
$$ packed form
36175E2704J8606j0704O6197J18838N477r8344m3192j0737j22672j46972N7671
36164a13128K26582J65725J02428K05255K17405m1535k66872j77416J1721N5663
36154C85828J67204N42848Q07999M97643j86929o24392n80267l21323j04750K5134
36144F08995O0559J7108J1462Q9736R5945p8500k71740k75320j19608L1523J00070
36133B70230P2587n0251j65310j23001L9397J19624N0737m1895q6648j08815n6773
36122h0118J09944K09083O3260j29074n3204J74505J87405J3241n909J23520Q7566
36111G00219m2166J46132N82686O64216K09015k31699k57038j35707j62435j70847
36101A302376m1525n6306l26926m41419j30246K15932J51378j35560j85667M1916
$$ plain form
36091 393953 643546 904438 973313 707783 214724 -86265 100659 510293 631189 378891
36081 378891 114391 64265 95804 51464 -39887 -106821 -119179 -37410 104690 146703 43368
36070 43368 6040 151141 214541 -54672 -422099 -484272 -284835 -182901 -240506 -205661 -33396
36059 -33396 43546 -37277 -69629 35930 126091 106942 77213 132440 263049 422235 520722
36048 520722 471044 405615 631597 1150425 1509276 1411267 1134952 997515 801814 301248
36038 301248 -173751 -168684 112235 134089 -91890 -141480 15510 77293 131590 527910 1093101
36027 1093101 1278634 1096191 1092612 1346705 1384512 1273386 1850903 3419063 4989820 5405005
36017 5405005 4664077 3624953 2857589 2338308 1938938 1663436 1515554 1482360 1564513 1655344
$$ packed form
36091C93953K49593K60892O8875k65530m93059l00989J86924M09634J20896k52298
36081C78891k64500n0126L1539m4340r1351o6934j2358Q1769J42100M2013j03335
36070D3368l7328J45101O3400k69213l67427o2173J99437J01934n7605L4845J72265
36059c3396P6942q0823l2352J05559R0161j9149k9729N5227J30609J59186R8487
36048E20722m9678o5429K25982N18828L58851r8009k76315j37437j95701n00566
36038C01248m74999N067K80919K1854k25979m9590J56990O1783N4297L96320N65191
36027A093101J85533j82443l579K54093L7807j11126N77517J568160J570757M15185
36017E405005p40928j039124p67364n19281l99370k75502j47882l3194Q2153R0831
$$ plain form
36007 1655344 1582072 1402984 1412242 1706706 2010297 2056188 1861814 1513142 1004130 440991
35997 440991 83456 7437 10540 -8147 113324 430147 684518 660389 463587 273897
35987 273897 92867 -89921 -152085 -46789 82435 160361 319993 621958 857267 806183
35977 806183 526649 248987 117575 112245 97102 -64758 -305413 -329873 -3118 357573
35967 357573 365393 112600 -30603 -40456 -187901 -420872 -355539 43700 319128 218155
35957 218155 44140 98412 221520 148605 -52278 -156555 -100099 82692 359845 589042
35947 589042 591246 452683 449065 597848 649314 578877 634482 786212 645850 141500 -240359
35936 -240359 -172264 32839 -6017 -131734 -13211 267563 422779 445847 467860 389268
$$ packed form
36007A655344p3272j79088R258K94464L03591M5891j94374l48672n09012n63139
35997D40991l57535p6019L103j8687J21471L16823K54371k4129j96802j89690
35987B73897j81030j82788o2164J05296J29224P7926J59632L01965K35309n1084
35977H06183k79534k77662j31412n330j5143j61860k40655k4460L26755L60691
35967C57573P820k52793j43203r853j47445k32971O5333L99239K75428j00973
35957B18155j74015N4272J23108p2915k00883j04277N6456J82791K77153K29197
35947E89042K204j38563l618J48783N1466p0437N5605J51730j40362n04350l81859
35936b40359O8095K05103l8856j25717J18523K80774J55216K3068K2013p8592
$$ plain form
35926 389268 86881 -208663 -162064 164072 413755 440754 392264 388013 408496 427485 407151
35915 407151 242654 -67684 -293352 -232036 -13123 67719 -50029 -143823 -19792 272206
35905 272206 507687 489655 227112 -54947 -147860 -74277 31176 150900 288053 270862
35895 270862 -17453 -297794 -195711 143686 210280 -76354 -264717 -168181 -154437 -394395
35885 -394395 -449037 -26297 394762 244764 -236370 -375121 -61685 229231 246901 201395
35875 201395 240558 229283 107425 38303 111276 222245 304703 387866 395638 199146 -50653
35864 -50653 69489 751435 1617544 2029945 1691854 898101 232188 30400 133505 182388
35854 182388 94369 91911 277437 441472 411350 346051 470575 689335 714735 491167 253681
$$ packed form
35926C89268l02387k95544M6599L26136K49683K6999m8490m251K0483J8989k0334
35915D07151j64497l10338k25668O1316K18913Q0842j17748r3794J24031K91998
35905B72206K35481j8032k62543k82059r2913P3583J05453J19724J37153j7191
35895B70862k88315k80341J02083L39397O6594k86634j88363R6536J3744k39958
35885c94395n4642M22740M21059j49998m81134j38751L13436K90916J7670m5506
35875B01395L9163j1275j21858o9122P2973J10969Q2458Q3163P772j96492k49799
35864e0653J20142O81946Q66109M12401l38091p93753o65913k01788J03105M8883
35854A82388q8019k458J85526J64035l0122o5299J24524K18760K5400k23568k37486
$$ plain form
35843 253681 189420 240058 265209 256933 322021 493665 615567 477958 105012 -194842 -189537
35832 -189537 -32849 -16867 -107884 -17503 288969 495515 416223 248579 213892 232033 124770
35821 124770 -90456 -278293 -368922 -336559 -180778 -22150 -7006 -43213 119220 463821
35811 463821 651136 493675 184092 -71918 -308211 -516466 -483670 -167726 93716 50558
35801 50558 -65829 64813 317168 334775 93817 -107983 -116301 -51398 -32534 -37452 -12200
35790 -12200 62482 173705 236167 153897 3633 -13854 112416 172463 122950 205749 504975
35779 504975 711445 586473 357402 335893 411708 292661 34588 -66805 22482 67002
35769 67002 -16525 -78429 -52033 -59466 -202732 -456775 -728505 -859391 -684226 -273468 29157
$$ packed form
35843B53681o4261N0638K5151q276O5088J71644J21902j37609l72946k99854N305
35832a89537J56688J5982r1017R0381L06472K06546p9292j67644l4687J8141j07263
35821A24770k15226j87837r0629L2363J55781J58628J5144l6207J62433L44601
35811D63821J87315j57461l09583k56010k36293k08255L2796L15944K61442m3158
35801E0558j16387J30642K52355J7607k40958k01800q318O4903J8864m918K5252
35790a2200P4682J11223O2462q2270j50264j7487J26270O0047m9513Q2799K99226
35779E04975K06470j24972k29071k1509P5815j19047k58073j01393Q9287M4520
35769F7002q3527o1904K6396p433j43266k54043k71730j30886J75165M10758L02625
$$ plain form
35758 29157 22604 -63227 63451 282834 268507 27761 -107596 24549 233843 272077 78180
35747 78180 -228945 -407058 -233131 207826 503538 400904 140044 39437 -31904 -377333
35737 -377333 -833100 -902706 -512746 -143508 -107251 -148597 36182 272650 214469 -67813
35727 -67813 -156690 121051 461740 495652 239121 12573 -5156 32223 -64073 -198880 -151303
35716 -151303 40861 118460 29435 20681 194504 276302 44562 -249449 -185524 237628 602782
35705 602782 599290 305114 -19423 -198054 -196991 -95243 -28516 -67493 -157756 -231257 -311174
35694 -311174 -442785 -597812 -701978 -677933 -456399 -85955 175261 92834 -187834 -264185
35684 -264185 -8521 294486 400157 360710 234847 -56444 -393290 -395137 13227 352586
$$ packed form
35758B9157o553q5831J26678K19383j4327k40746j35357J32145K09294L8234j93897
35747G8180l07125j78113J73927M40957K95712j02634k60860j00607p1341l45429
35737c77333m55767o9606L89960L69238L6257m1346J84779K36468n8181k82282
35727f7813q8877K77741L40689L3912k56531k26548j7729L7379r6296j34807M7577
35716a51303J92164P7599q9025q754J73823Q1798k31740k94011O3925M23152L65154
35705F02782l492k94176l24537j78631J063J01748O6727l8977r0263p3501p9917
35694c11174j31611j55027j04166K4045K21534L70444K61216q2427k80668p6351
35684b64185K55664L03007J05671l9447j25863k91291l36846j847M08364L39359
$$ plain form
35674 352586 246328 -28790 -32563 148052 163812 60391 132921 321778 302032 65032
35664 65032 -104133 -149650 -239100 -297047 -81509 268785 303457 -35825 -277730 -126597
35654 -126597 146341 196214 81946 27115 39909 17416 -18684 -11124 -6279 -29025 23337
35643 23337 210641 392657 356688 30509 -455903 -825863 -813863 -429030 -25701 65163
35633 65163 -77400 -142221 -58261 -13904 -71909 -103785 -105129 -217190 -378228 -320686 -39606
35622 -39606 91391 -128153 -366236 -220484 179590 336805 49898 -364145 -501910 -307487
35612 -307487 -15515 184849 296674 361204 312887 107788 -79662 324 291820 417936
35602 417936 176870 -148759 -167057 111908 365243 410917 318657 184812 68846 72592
$$ packed form
35674C52586j06258k75118l773J80615J5760j03421P2530J88857j9746k37000
35664F5032j69165m5517q9450n7947K15538L50294L4672l39282k41905J51133
35654a26597K72938M9873j14268n4831J2794k2493l6100P560M845k2746N2362
35643B3337J87304J82016l5969l26179m86412l69960J2000L84833M03329R0864
35633F5163j42563o4821Q3960M4357n8005l1876j344j12061j61038N7542K81080
35622c9606J30997k19544k38083J45752M00074J57215k86907m14043j37765J94423
35612c07487K91972K00364J11825O4530m8317k05099j87450P9986K91496J26116
35602D17936k41066l25629j8298K78965K53335M5674r2260j33845j15966L746
$$ plain form
35592 72592 217805 315522 212298 73070 132922 271437 185652 -74248 -137640 105098
35582 105098 344667 349059 249559 211363 155371 -23095 -223627 -293972 -215936 -37619 172399
35571 172399 239839 9438 -356472 -470892 -227975 46522 79122 11623 110930 366625
35561 366625 582030 661387 601211 374667 38641 -183282 -130889 73902 196871 179892
35551 179892 120354 76679 45534 39361 50198 20488 -39611 -10556 147547 280030 239774
35540 239774 94064 -3366 -34944 -65020 -69112 8051 98362 93573 38163 66884 175039
35529 175039 222828 169625 136515 201925 285137 292669 250589 209574 130600 -22722 -159231
35518 -159231 -166814 -105848 -141010 -271407 -295614 -114040 90946 100566 -44353 -154278 -190942
$$ packed form
35592G2592J45213R7717j03224j39228N9852J38515q5785k59900o3392K42738
35582A05098K39569M392r9500l8196n5992j78466k00532p0345P8036J78317K10018
35571A72399O7440k30401l65910j14420K42917K74497L2600o7499R9307K55695
35561C66625K15405P9357o0176k26544l36026k21923N2393K04791J22969j6979
35551A79892n9538m3675l1145o173J0837k9710o0099K9055J58103J32483m0256
35540B39774j45710r7430l1578l0076m092P7163R0311m789n5410K8721J08155
35529A75039M7789n3203l3110O5410Q3212P532m2080m1015p8974j53322j36509
35518a59231p583O0966l5162j30397k4207J81574K04986R620j44919j09925l6664
$$ plain form
35507 -190942 -252590 -331169 -324965 -273774 -332443 -493417 -582685 -554515 -511634 -394109 4746
35496 4746 589435 896188 699163 357586 284935 374918 289264 48583 -65685 -11741 25899
35485 25899 26490 99176 139953 -63355 -408392 -550894 -408116 -228552 -146527 -33031 168171
35474 168171 316640 366412 453574 606291 675008 637777 666622 786763 774658 527669 255539
35463 255539 157335 159775 123741 72829 59462 20100 -72192 -99069 -1448 68212 -49142
35452 -49142 -290065 -468578 -492972 -391252 -236039 -120111 -100330 -120476 -93307 -48622 -48398
35441 -48398 6904 256641 562983 585955 242987 -155141 -316496 -282279 -234267 -227319 -241620
35430 -241620 -289609 -330333 -250999 -54793 86927 55590 -101060 -319150 -568085 -700664
$$ packed form
35507a90942o1648p8579O204N1191n8669j60974q9268K8170M2881J17525L98855
35496D746N84689L06753j97025l41577p2651Q9983q5654k40681j14268N3944L7640
35485B5899N91P2686M0777k03308l45037j42502J42778J79564Q2025J13496K01202
35474A68171J48469M9772Q7162J52717O8717l7231K8845J20141j2105k46989k72130
35463B55539r8204K440l6034n0912j3367l9362r2292k6877R7621O9660j17354
35452d9142k40923j78513k4394J01720J55213J15928J9781k0146K7169M4685K24
35441d8398N5302K49737L06342K2972l42968l98128j61355L4217M8012O948j4301
35430b41620m7989m0724P9334J96206J41720l1337j56650k18090k48935j32579
$$ plain form
35420 -700664 -523232 -122520 143507 115921 30768 93733 152905 18398 -164403 -153703
35410 -153703 -24740 -36740 -216158 -359084 -358927 -273039 -143799 -5232 8547 -168108 -303927
35399 -303927 -100584 342103 576623 391465 83705 22260 163820 201519 48316 -80171
35389 -80171 -42550 8215 -123659 -372162 -515022 -492099 -426615 -357351 -176445 105396 253800
35378 253800 115677 -139452 -251673 -198931 -107543 15572 217508 378042 336932 190376
35368 190376 179366 300623 307570 103734 -146772 -327990 -499159 -649972 -620045 -378100
35358 -378100 -134036 -47183 -35097 18368 81113 119096 213436 386745 489002 401892 219299
35347 219299 107018 101573 127236 91064 -76746 -324761 -413130 -154092 258136 413092
$$ packed form
35420g00664J77432M00712K66027k7586q5153O2965N9172j34507j82801J0700
35410a53703J28963j2000j79418j42926J57Q5888J29240J38567J3779j76655j35819
35399c03927K03343M42687K34520j85158l07760o1445J41560L7699j53203j28487
35389h0171L7621N0765j31874k48503j42860K2923O5484O9264J80906K81841J48404
35378B53800j38123k55129j12221N2742R1388J23115K01936J60534m1110j46556
35368A90376j1010J21257O947k03836k50506j81218j71169j50813K9927K41945
35358c78100K44064Q6853J2086N3465O2745L7983R4340J73309J02257q7110j82593
35347B19299j12281n445K5663l6172j67810k48015q8369K59038M12228J54956
$$ plain form
35337 413092 236553 92520 228358 420756 357099 104924 -37839 19846 103949 46906
35327 46906 -147739 -327735 -294600 -8841 268191 229206 -46663 -168959 7258 222053
35317 222053 304316 429723 677338 733242 376003 -63904 -123597 150153 368980 406201
35307 406201 414249 406959 284721 185652 340493 587955 493354 16215 -365216 -326078 -114274
35296 -114274 -116038 -324584 -474584 -462709 -373355 -235563 -11633 221482 284152 111740
35286 111740 -151198 -303623 -284574 -200746 -175765 -195693 -145678 -2548 105397 100870 112499
35275 112499 279358 468283 393368 37306 -251142 -183769 94957 213968 69558 -65765
35265 -65765 65583 369498 550674 503712 404180 412654 442437 313363 39122 -169044 -151024
$$ packed form
35337D13092j76539j44033J35838J92398o3657k52175j42763N7685Q4103n7043
35327D6906j94645j79996L3135K85759K77032l8985k75869j22296J76217K14795
35317B22053Q2263J25407K47615N5904l57239m39907n9693K73750K18827L7221
35307D06201Q048p290j22238r9069J54841K47462r4601m77139l81431L9138K11804
35296a14274j764k08546j50000J1875Q9354J37792K23930K33115O2670j72412
35286A11740k62938j52425J9049Q3828K4981j9928N0015J43130J07945m527J1629
35275A12499J66859J88925p4915l56062k88448O7373K78726J19011j44410j35323
35265f5765J31348L03915J81176m6962r9532Q474K9783j29074k74241k08166J8020
$$ plain form
35254 -151024 63399 341696 556203 614785 513433 378053 346558 399664 417983 394914
35244 394914 435215 524964 494513 292580 120975 160111 288683 239396 -30390 -274797
35234 -274797 -259502 -24546 166196 89144 -226966 -531986 -600906 -435716 -201938 -24059
35224 -24059 76790 101488 60999 21869 27998 -1801 -144675 -268850 -164325 107614 237368
35213 237368 121195 46751 260933 556442 526986 127040 -276575 -404090 -383997 -480240
35203 -480240 -653658 -585926 -152489 297055 292903 -164746 -570636 -528387 -204099 -35419
35193 -35419 -167999 -381242 -441540 -299679 -26972 215849 220731 -26962 -223330 -94420
35183 -94420 220812 391278 377879 374166 375446 215440 -9917 -3633 211234 276434 93323
$$ packed form
35254a51024K14423K78297K14507N8582j01352j35380l1495N3106J8319k3069
35244C94914M0301Q9749l0451k01933j71605L9136J28572m9287k69786k44407
35234b74797J5295K34956J90742p7052l16110l05020o8920J65190K33778J77879
35224b4059J00849K4698m0489l9130O129k9799j42874j24175J04525K71939J29754
35213B37368j16173p4444K14182K95509k9456l99946m03615j27515K0093r6243
35203d80240j73418O7732M33437M49544m152m57649m05890M2249L24288J68680
35193c5419j32580k13243o0298J41861K72707K42821M882k47693j96368J28910
35183i4420L15232J70466j3399l713J280j60006k25357O284K14867O5200j83111
$$ plain form
35172 93323 -8653 160851 345389 292505 119671 14848 -63888 -162523 -152015 -14727
35162 -14727 16337 -156376 -288882 -210299 -110134 -163171 -223325 -180904 -258862 -594282 -851910
35151 -851910 -658392 -158707 252623 502277 724782 817300 588097 212576 78238 228999
35141 228999 356001 298561 194634 160196 149035 127499 112936 49980 -120697 -303850 -352201
35130 -352201 -259789 -97128 109254 263341 159768 -221039 -568755 -624434 -503138 -410652
35120 -410652 -298648 -86586 43677 -80104 -286322 -333632 -277630 -238902 -115591 89261
35110 89261 20700 -449737 -766501 -435579 89129 7173 -561681 -751445 -313092 82931
35100 82931 -3492 -202526 -156913 -125995 -378025 -638915 -593775 -416092 -366968 -312449 -60801
$$ packed form
35172I3323j01976J69504J84538n2884j72834j04823p8736r8635J0508J37288
35162a4727L1064j72713j32506P8583J00165n3037o0154M2421p7958l35420k57628
35151h51910J93518M99685M11330K49654K22505R2518k29203l75521j34338J50761
35141B28999J27002n7440j03927l4438j1161k1536j4563o2956j70677j83153m8351
35130c52201R2412J62661K06382J54087j03573l80807l47716n5679J21296R2486
35120d10652J12004K12062J30263j23781k06218m7310N6002L8728J23311K04852
35110H9261o8561m70437l16764L30922N24708q1956n68854j89764M38353L96023
35100H2931q6423j99034M5613L0918k52030k60890M5140J77683M9124N4519K51648
$$ plain form
35089 -60801 199364 207123 68412 31510 102328 189750 342795 543978 559437 295838 23856
35078 23856 -41101 -80471 -295313 -506539 -479329 -348931 -339684 -325705 -88117 207963 230021
35067 230021 17944 -111976 -87374 -96719 -166919 -124456 50478 191640 262258 380989 535525
35056 535525 568813 451759 295378 105439 -195388 -511582 -630630 -548996 -468736 -450412
35046 -450412 -343938 -99706 122069 207084 201744 127974 -50316 -215788 -142341 137947
35036 137947 290499 153320 -2913 112146 361720 396206 157710 -93573 -178139 -179267
35026 -179267 -239558 -362222 -435241 -350574 -122230 49557 -65270 -401111 -574298 -362311
35016 -362311 -53305 -59906 -309243 -365308 -112443 95434 36838 -51336 67430 246372
$$ packed form
35089f0801K60165P759j38711l6902P0818Q7422J53045K01183J5459k63599k71982
35078B3856o4957l9370k14842k11226K7210J30398R247J3979K37588K96080K2058
35067B30021k12077j29920K4602r345p0200M2463J74934J41162P0618J18731J54536
35056E35525L3288j17054j56381j89939l00827l16194j19048Q1634Q0260J8324
35046d50412J06474K44232K21775Q5015n340p3770j78290j65472P3447K80288
35036A37947J52552j37179j56233J15059K49574L4486k38496k51283q4566j128
35026a79267o0291j22664p3019Q4667K28344J71787j14827l35841j73187K11987
35016c62311L09006o601k49337n6065K52865K07877n8596q8174J18766J78942
$$ plain form
35006 246372 309784 418832 701819 836279 492153 -17491 -86587 275380 474770 287086
34996 287086 147331 325234 447067 195783 -54305 183782 659933 687881 124470 -479448
34986 -479448 -659260 -502832 -297286 -113132 115696 354190 463233 337114 9741 -313715
34976 -313715 -401360 -267718 -182711 -282215 -346048 -163176 73547 31341 -234836 -349225
34966 -349225 -150378 155030 346265 394541 319975 136242 -34832 -49378 35676 53154
34956 53154 20489 86091 201039 142674 -107341 -299279 -288398 -209290 -213361 -275128 -322010
34945 -322010 -328579 -228703 42164 368754 533914 507996 454244 445827 406304 312954 204479
34934 204479 27745 -221506 -266158 147225 716813 817976 352683 -95234 -99248 88840
$$ packed form
35006B46372O3412J09048K82987J34460l44126n09644o9096L61967J99390j87684
34996B87086j39755J77903J21833k51284k50088K38087M76151K7948n63411o03918
34986d79448j79812J56428K05546J84154K28828K38494J09043j26119l27373l23456
34976c13715q7645J33642Q5007r9504o3833J82872K36723m2206k66177j14389
34966c49225J98847L05408J91235M8276p4566j83733j71074j4546Q5054J7478
34956E3154l2665O5602J14948n8365k50015j91938J0881P9108m071o1767m6882
34945c22010o569R9876K70867L26590J65160k5918n3752q417l9523r3350j08475
34934B04479j76734k49251m4652M13383N69588J01163m65293m47917m014J88088
$$ plain form
34924 88840 79318 -63585 -98194 -77875 -160896 -245326 -173107 -66369 -113333 -229580 -256055
34913 -256055 -272728 -376998 -375177 -75257 301825 397738 242031 103745 -16252 -288530
34903 -288530 -575970 -568932 -364991 -380373 -632324 -654404 -282635 9897 -145637 -402727
34893 -402727 -244937 187297 307565 -30053 -342837 -237452 92801 230369 97233 -58796
34883 -58796 -80764 -74995 -187339 -370872 -436066 -273483 16841 208641 157045 -64946 -244078
34872 -244078 -254101 -182229 -195963 -316974 -403628 -352453 -212412 -61504 113899 323076
34862 323076 451876 380474 172140 1497 -77879 -141715 -186957 -104375 96278 214207
34852 214207 111083 -94117 -191562 -142155 -65872 -43785 -34493 53669 268002 533674 638329
$$ packed form
34924H8840r522j42903l4609K0319q3021q4430P2219J06738m6964j16247k6475
34913b56055j6673j04270J821K99920L77082R5913j55707j38286j19997k72278
34903b88530k87440P038K03941j5382k51951k2080L71769K92532j55534k57090
34893d02727J57790M32234J20268l37618l12784J05385L30253J37568j33136j56029
34883e8796k1968N769j12344j83533o5194J62583K90324J91800n1596k21991j79132
34872b44078j0023P1872j3734j21011q6654N1175J40041J50908J75403K09177
34862C23076J28800p1402k08334j70643p9376o3836m5242Q2582K00653J17929
34852B14207j03124k05200r7445M9407P6283K2087R292Q8162K14333K65672J04655
$$ plain form
34841 638329 403092 -61953 -392448 -366473 -160326 -83790 -174952 -239609 -207466 -200186 -238708
34830 -238708 -146451 136694 352222 230604 -116958 -331563 -283790 -187415 -212407 -225953
34820 -225953 -48946 219917 341623 295277 277248 374736 450302 366148 141867 -130386
34810 -130386 -349057 -370122 -126899 175455 223887 32597 -44630 147215 305911 146889
34800 146889 -153157 -271611 -252832 -349889 -528681 -533409 -365468 -290823 -368465 -353114 -135718
34789 -135718 58589 32496 -95806 -101969 50209 233337 312400 205196 -58054 -286368
34779 -286368 -286568 -99282 54792 45809 -92029 -284742 -415088 -289490 117183 453256
34769 453256 345981 -75091 -357647 -389393 -452872 -602232 -507011 -90662 182786 -19879
$$ packed form
34841F38329k35237m65045l30495K5975K06147P6536r1162o4657L2143P280l8522
34830b38708R2257K83145K15528j21618l47562k14605M7773R6375k4992j3546
34820b25953J77007K68863J21706m6346j8029R7488P5566q4154k24281k72253
34810a30386k18671k1065K43223L02354M8432j91290p7227J91845J58696j59022
34800A46889l00046j18454J8779r7057j78792m728J67941P4645p7642J5351K17396
34789a35718J94307k6093j28302o163J52178J83128P9063j07204k63250k28314
34779b86368k00J87286J54074q983j37838j92713j30346J25598M06673L36073
34769D53256j07275m21072k82556l1746o3479j49360R5221M16349K73448k02665
$$ plain form
34759 -19879 -351597 -302593 33362 146995 -111861 -384703 -379311 -216461 -148934 -206936 -233325
34748 -233325 -134162 1880 19901 -80765 -98470 103059 337360 294817 -13936 -253892
34738 -253892 -241214 -157126 -199465 -293715 -291216 -204040 -76796 143342 425661 557425 421425
34727 421425 190496 67963 16849 -77601 -166079 -150172 -73351 -15179 49917 131385 135222
34716 135222 53077 48151 191508 312743 276564 192186 177847 156171 74590 72725 208304
34705 208304 274977 137636 -12978 -2094 16690 -103525 -148615 102730 431095 497498
34695 497498 389158 402980 485823 380647 175292 170820 289019 173448 -121322 -113303 330597
34684 330597 729378 686166 397745 235467 210317 137495 32088 33439 116324 140286 91735
$$ packed form
34759a9879l31718M9004L35955J13633k58856k72842N392J62850O7527n8002k6389
34748b33325R9163J36042J8021j00666j7705K01529K34301m2543l08753k39956
34738b53892J2678Q4088m2339r4250K499Q7176J27244K20138K82319J31764j36000
34727D21425k30929j22533n1114r4450q8478J5907P6821N8172O5096Q1468L837
34716A35222q2145m926J43357J21235l6179q4378j4339k1676q1581j865J35579
34705B08304O6673j37341j50614J0884J8784j20215m5090K51345L28365O6403
34695D97498j08340J3822Q2843j05176k05355m472J18199j15571k94770Q019M43900
34684C30597L98781m3212k88421j62278k5150p2822j05407J351Q2885K3962m8551
$$ plain form
34673 91735 88633 191334 311541 276318 -23692 -468325 -730244 -602028 -259270 -39155
34663 -39155 -24100 -46225 -21404 -4837 41199 220328 428124 414364 170863 -31312 -46184
34652 -46184 2156 39890 175691 391325 428317 172372 -121467 -190316 -110414 -71705 -34117
34641 -34117 130049 314876 287810 55400 -114469 -34851 200277 374190 394924 350386
34631 350386 355931 380093 277425 29068 -154178 -89739 117750 252171 315905 437743
34621 437743 541249 437968 227994 222320 406171 386743 23856 -286522 -189926 125450
34611 125450 290932 297442 336502 381005 311907 249291 348813 429742 234446 -53691 -12318
34600 -12318 332536 484534 197472 -208809 -361197 -267987 -94270 116389 285654 209450
$$ packed form
34673I1735l102J02701J20207l5223l00010m44633k61919J28216L42758K20115
34663c9155J5055k2125K4821J6567M6036J79129K07796j3760k43501k02175j4872
34652d6184M8340L7734J35801K15634L6992k55945k93839o8849P9902L8709L7588
34641c4117J64166J84827k7066k32410j69869P9618K35128J73913K0734m4538
34631C50386N545K4162j02668k48357j83246O4439K07489J34421O3734J21838
34621D37743J03506j03281k09974n674J83851j9428l62887l10378R6596L15376
34611A25450J65482O510L9060M4503o9098o2616R9522Q0929j95296k88137M1373
34600a2318L44854J51998k87062m06281j52388R3210J73717K10659J69265p6204
$$ plain form
34590 209450 -103040 -274396 -46983 285014 251768 -138154 -455117 -470280 -380810 -426496
34580 -426496 -591629 -736934 -774160 -647170 -360130 -88830 -57883 -238877 -368813 -330303
34570 -330303 -287092 -351508 -376293 -246243 -138851 -253265 -455435 -467447 -296153 -187054
34560 -187054 -210685 -186822 -26757 113946 77015 -116109 -367322 -587191 -638533 -412166
34550 -412166 -35350 189657 144065 20270 18844 104095 153940 163145 170205 141759 60525
34539 60525 -5242 -25840 -58227 -78183 47021 290800 384528 193997 -15491 63496 310246
34528 310246 351425 118989 -73738 -3009 205823 341616 378530 378093 317846 167108 23096
34517 23096 26345 169388 285375 236767 67702 -56351 -46242 18738 26130 429 46250
$$ packed form
34590B09450l12490j71356K27413L31997l3246l89922l16963j5163Q9470m5686
34580d26496j65133j45305l7226J26990K87040K71300L0947j80994j29936L8510
34570c30303M3211o4416k4785J30050J07392j14414k02170j2012J71294J09099
34560a87054k3631K3863J60065J40703l6931j93124k51213k19869n1342K26367
34550d12166L76816K25007m5592j23795j426Q5251M9845R205P060k8446q1234
34539F0525o5767k0598l2387j9956J25204K43779R3728j90531k09488P8987K46750
34528C10246M1179k32436j92727P0729K08832J35793L6914m37o0247j50738j44012
34517B3096L249J43043J15987m8608j69065j24053J0109O4980P392k5701M5821
$$ plain form
34506 46250 153937 195158 120066 14583 -66566 -160149 -234015 -153208 85938 257666 185376
34495 185376 -14918 -109467 -44708 64244 121237 84451 -68785 -270663 -367548 -323038 -284848
34484 -284848 -326428 -301194 -122211 14779 -74313 -222642 -157208 50695 101035 -52869
34474 -52869 -176998 -182357 -232494 -389255 -477772 -402710 -317151 -339396 -337933 -172706 23842
34463 23842 11677 -188438 -281162 -75493 244675 325217 91783 -138455 -85073 88624
34453 88624 18938 -277230 -399784 -200087 -33572 -176143 -352820 -179500 208843 373113
34443 373113 225104 53550 15027 8616 -9341 19789 19870 -134991 -326343 -333353 -217522
34432 -217522 -190512 -169551 84528 417032 387609 -5312 -236885 -48425 179965 82050
$$ packed form
34506D6250J07687M1221p5092j05483q1149r3583p3866Q0807K39146J71728p2290
34495A85376k00294r4549O4759J08952N6993l6786j53236k01878r6885M4510L8190
34484b84848m1580K5234J78983J36990q9092j48329O5434K07903N0340j53904
34474e2869j24129n359n0137j56761q8517P5062Q5559k2245J463J65227J96548
34463B3842j2165k00115r2724K05669L20168Q0542k33434k30238N3382J73697
34453H8624o9686k96168j22554J99697J66515j42571j76677J73320L88343J64270
34443C73113j48009j71554l8523o411j7957K9130Q1j54861j91352p010J15831
34432b17522K7010K0961K54079L32504k9423l92921k31573J88460K28390r7915
$$ plain form
34422 82050 -143704 -150981 -11738 6154 -70892 -30987 121158 197105 122030 -50527 -278835
34411 -278835 -481632 -513384 -385231 -326959 -440210 -501301 -317557 -51735 51651 37421
34401 37421 61202 57621 -92902 -248821 -208906 -88422 -127338 -227922 -84023 263513 412046
34390 412046 194118 -82582 -115447 -7719 -9945 -107582 -86416 130187 402336 563009
34380 563009 543886 355209 63924 -200648 -291269 -138077 172187 403803 329220 -34459
34370 -34459 -382733 -426846 -229576 -122437 -286738 -558718 -690884 -648281 -539047 -390657
34360 -390657 -175983 6033 -8002 -179807 -261945 -140782 -14130 -95089 -290739 -359451
34350 -359451 -268903 -166032 -69683 123181 336422 332060 97478 -84704 -69923 -52624 -165327
$$ packed form
34422H2050k25754p277J39243J7892p7046L9905J52145P5947p5075j72557k28308
34411b78835k02797l1752J28153N8272j13251o1091J83744K65822J03386j4230
34401C7421K3781l581j50523j55919L9915J20484l8916j00584J43899L47536J48533
34390D12046k17928k76700l2865J07728k226r7637K1166K16603K72149J60673
34380E63009j9123j88677k91285k64572r0621J53192L10264K31616p4583l63679
34370c4459l48274m4113J97270J07139j64301k71980j32166M2603J09234J48390
34360c90657K14674J82016j4035j71805q2138J21163J26652q0959j95650o8712
34350c59451R0548J02871R6349J92864K13241m362k34582j82182J4781J7299j12703
$$ plain form
34339 -165327 -187801 85315 448900 570925 473089 407440 420337 378050 291190 259592 199887
34328 199887 -7598 -186039 -64897 231102 294439 34612 -217049 -217679 -51961 156138
34318 156138 373245 456817 241843 -90035 -139386 107660 220276 -7463 -267945 -297435
34308 -297435 -270514 -382810 -458092 -292932 -46942 48765 84600 238311 388247 286831
34298 286831 -60197 -447770 -715458 -732762 -405003 62758 198924 -139544 -478945 -354108
34288 -354108 57347 284182 257644 213785 132806 -199632 -671356 -886760 -730695 -467979
34278 -467979 -270698 -47756 214286 327038 218743 66406 4444 -44207 -156377 -252543
34268 -252543 -245232 -176477 -146759 -227292 -434526 -664592 -710219 -495866 -211382 -41008 107793
$$ packed form
34339a65327k2474K73116L63585J22025r7836o5649J2897m2287q6860l1598n9705
34328A99887k07485j78441J21142K95999O3337k59827k51661o30J65718K08099
34318A56138K17107Q3572k14974l31878m9351K47046J12616k27739k60482k9490
34308b97435K6921j12296p5282J65160K45990R5707L5835J53711J49936j01416
34298B86831l47028l87573k67688j7304L27759M67761J36166l38468l39401J24837
34288c54108M11455K26835k6538m3859q0979l32438m71724k15404J56065K62716
34278d67979J97281K22942K62042J12752j08295j52337o1962m8651j12170r6166
34268b52543P311O8755K9718q0533k07234k30066m5627K14353K84484J70374J48801
$$ plain form
34257 107793 369790 567051 427010 79845 -40140 190130 413174 306804 -36975 -338879
34247 -338879 -460978 -400916 -200385 23555 147093 218218 383237 596473 625829 397265
34237 397265 93765 -148529 -375712 -559313 -504262 -185356 86157 54715 -123920 -152449
34227 -152449 -46248 -50960 -214815 -327673 -268800 -165954 -157332 -184280 -115721 30256 89663
34216 89663 -48135 -297433 -446023 -372128 -181252 -87336 -155016 -229465 -160221 -18008 495
34205 495 -151117 -296716 -265596 -106047 -4493 -38905 -107348 -107430 -84274 -132051 -224966 -259393
34193 -259393 -230173 -229455 -261767 -209089 -41383 75736 -3992 -177618 -207036 -17090 233797
34182 233797 353948 284713 81166 -163257 -344692 -377890 -254032 -63175 59666 29672
$$ packed form
34257A07793K61997J97261j40041l47165j19985K30270K23044j06370l43779l01904
34247c38879j22099O0062K00531K23940J23538P1125J65019K13236K9356k28564
34237C97265l03500k42294k27183j83601N5051L18906K71513l1442j78635k8529
34227a52449J06201m712j63855j12858N8873J02846Q622k6948O8559J45977N9407
34216H9663j37798k49298j48590P3895J90876R3916o7680p4449O9244J42213J8503
34205D95j51612j45599L1120J59549J01554l4412o8443q2K3156m7777r2915l4427
34193b59393K9220P18l2312N2678J67706J17119p9728j73626k9418J89946K50887
34182B33797J20151o9235k03547k44423j81435l3198J23858J90857J22841k9994
$$ plain form
34172 29672 -120122 -264680 -302675 -240487 -145388 -58408 -1038 -9092 -74477 -111168 -92036
34161 -92036 -155494 -416461 -718539 -779652 -582258 -399503 -400777 -460338 -426148 -342528 -285774
34150 -285774 -189339 10207 208036 254499 127737 -101561 -331361 -393900 -166142 188187
34140 188187 307932 90022 -170472 -229770 -220415 -334346 -451265 -356968 -125403 11236
34130 11236 23124 37667 66397 46211 35931 111794 179652 143136 131157 283733 436564
34119 436564 327642 29507 -137790 -67685 61172 129274 184814 219414 128910 -72948
34109 -72948 -235289 -277154 -226067 -99455 45473 29876 -225035 -476689 -446115 -253337
34099 -253337 -253609 -487790 -642589 -560539 -439784 -465879 -557111 -567494 -488551 -370869 -256187
$$ packed form
34172B9672j49794j44558l7995O2188R5099Q6980N7370q054o5385l6691J9132
34161i2036o3458k60967l02078o1113J97394J82755j274n9561L4190Q3620N6754
34150b85774R6435J99546J97829M6463j26762k29298k29800o2539K27758L54329
34140A88187J19745k17910k60494n9298R355j13931j16919R4297K31565J36639
34130A1236J1888J4543K8730k0186j0280P5863O7858l6516j1979J52576J52831
34119D36564j08922k98135j67297P0105J28857O8102N5540L4600r0504k01858
34109g2948j62341m1865N1087J26612J44928j5597k54911k51654L0574J92778
34099b53337k72k34181j54799Q2050J20755k6095r1232j0383P8943J17682J14682
$$ plain form
34088 -256187 -220252 -278498 -268657 -68285 119323 1969 -307190 -385963 -114053 179951
34078 179951 240038 168603 86552 -97194 -390286 -538778 -379143 -96277 87872 227981
34068 227981 427990 542291 387934 99711 -7537 128425 236350 55567 -365612 -716946
34058 -716946 -731865 -473084 -280698 -355221 -487805 -384351 -147842 -135625 -374979 -494150
34048 -494150 -307149 -97857 -162040 -390146 -513175 -490984 -425834 -313991 -123070 51033
34038 51033 117178 139450 180778 148858 -25430 -203319 -216042 -107203 -32445 -28925 -36665
34027 -36665 -46257 -85845 -147128 -227175 -349014 -469038 -483689 -383586 -258922 -120738 88677
34016 88677 270637 209635 -70072 -250260 -154896 9714 -1318 -145282 -284853 -445878
$$ packed form
34088b56187L5935n8246R841K00372J87608j17354l09159p8773K71910K94004
34078A79951O0087p1435q2051j83746k93092j48492J59635K82866J84149J40109
34068B27981K00009J14301j54357k88223j07248J35962J07925j80783m21179l51334
34058g16946j4919K58781J92386p4523j32584J03454K36509J2217k39354j19171
34048d94150J87001K09292o4183k28106j23029K2191O5150J11843J90921J74103
34038E1033O6145K2272M1328l1920j74288j77889j2723J08839P4758L520p740
34027c6665r592l9588o1283q0047j21839j20024j4651J00103J24664J38184K09415
34016H8677J81960o1002k79707j80188R5364J64610j1032j43964j39571j61025
$$ plain form
34006 -445878 -660716 -782581 -698356 -541348 -469109 -408971 -240611 -48489 28857 21505 -15345
33995 -15345 -169233 -456493 -639759 -526464 -276947 -156611 -163128 -166173 -207671 -342004 -376081
33984 -376081 -144743 109190 35379 -252015 -326967 -114316 45904 1508 480 198734
33974 198734 364476 259252 5492 -129745 -102833 -67027 -125164 -244388 -323274 -276263
33964 -276263 -127850 -15009 2192 58129 249810 392271 251145 -54452 -180250 -64438
33954 -64438 11330 -113078 -280605 -348845 -385605 -424488 -345149 -146302 -39997 -95536 -68117
33943 -68117 209398 517138 563950 390177 207053 38198 -193968 -382873 -350468 -163291
33933 -163291 -56557 -90689 -128694 -104031 -61324 25394 202152 314516 129923 -270719
$$ packed form
34006d45878k14838j21865Q4225J57008P2239O0138J68360J92122P7346p352l6850
33995a5345j53888k87260j83266J13295K49517J20336o517l045m1498j34333l4077
33984c76081K31338K53933p3811k87394p4952K12651J60220m4396j028J98254
33974A98734J65742j05224k53760j35237K6912L5806n8137j19224p8886M7011
33964b76263J48413J12841J7201N5937J91681J42461j41126l05597j25798J15812
33954f4438P5768j24408j67527o8240l6760l8883P9339J98847J06305n5539K7419
33943f8117K77515L07740M6812j73773j83124j68855k32166j88905L2405J87177
33933a63291J06734l4132l8005K4663M2707Q6718J76758J12364j84593m00642
$$ plain form
33923 -270719 -502735 -380601 -164097 -168420 -355798 -493652 -523321 -539498 -533347 -417133 -257291
33912 -257291 -235495 -359979 -427394 -324541 -184309 -162316 -216565 -211338 -114018 18395 140552
33901 140552 198590 116647 -70081 -168426 -60541 104056 116746 24523 24780 105203 56774
33890 56774 -140963 -237001 -110561 14641 -65386 -179239 -27784 355019 643983 656031
33880 656031 503749 342143 191698 39827 -77702 -154322 -220783 -228777 -77446 180448
33870 180448 312310 195393 15840 40266 257282 397999 300822 108075 49162 141932
33860 141932 211969 156889 69337 76299 153266 168835 71955 -36306 -19389 137733 288632
33849 288632 252535 26334 -148757 -39474 248235 354840 161977 -5918 140889 383299
$$ packed form
33923b70719k32016J22134K16504m323j87378j37854k9669j6177O151J16214J59842
33912b57291K1796j24484o7415J02853J40232K1993n4249N227R7320J32413J22157
33901A40552N8038q1943j86728r8345J07885J64597J2690r2223K57Q0423m8429
33890E6774j97737r6038J26440J25202q0027j13853J51455L82803K88964J2048
33880F56031j52282j61606j50445j51871j17529p6620o6461p994J51331K57894
33870A80448J31862j16917j79553K4426K17016J40717r7177j92747n8913R2770
33860A41932P0037n5080q7552O962P6967J5569r6880j08261J6917J57122J50899
33849B88632l6097k26201j75091J09283K87709J06605j92863j67895J46807K42410
$$ [...]
##END NTUPLES=NMR SPECTRUM
##END=
