##TITLE=31Pdec_DPA3005
 CDCl3, 24 sc
 31.5.2019
##JCAMPDX= 6.0         $$ Bruker NMR JCAMP-DX V2.0
##DATA TYPE= NMR SPECTRUM
##DATA CLASS= NTUPLES
##ORIGIN= UXNMR, Bruker Analytische Messtechnik GmbH
##OWNER= root
$$ XWIN-NMR		Version 3.5
$$ Fri May 31 12:26:20 2019 Russian Standard Time (UT+4h)  she@DPX200
##.OBSERVE FREQUENCY= 81.013821
##.OBSERVE NUCLEUS= ^31P
##.ACQUISITION MODE= SIMULTANEOUS
##.ACQUISITION SCHEME= undefined
##.AVERAGES= 24
##.DIGITISER RES= 17
##SPECTROMETER/DATA SYSTEM= spect
##.PULSE SEQUENCE= zgpg30
##.SOLVENT NAME= CDCl3
##.SHIFT REFERENCE= (INTERNAL, CDCl3, 0, 182.463)
##AUDIT TRAIL= $$ (NUMBER, WHEN, WHO, WHERE, WHAT)
$$ ##TITLE= Audit trail, XWIN-NMR		Version 3.5
$$ ##JCAMPDX= 5.01
$$ ##ORIGIN= Bruker BioSpin GmbH
$$ ##OWNER= she
$$ F:/spectra/data/she/nmr/P31/1/pdata/1/auditp.txt
$$ ##AUDIT TRAIL=  $$ (NUMBER, WHEN, WHO, WHERE, WHAT)
(   1,<2019-05-31 12:25:18.75 +0400>,<she>,<DPX200>,
      <created by zg, POWCHK disabled, PULCHK disabled
       configuration hash MD5:
       00 E9 B6 7A A2 85 ED C7 34 08 36 98 17 FE 4E 26
       data hash MD5: 32K
       64 63 BA 2E 8E AB 2F 8E 5D 8E F3 AC AE EF B4 84>)
(   2,<2019-05-31 12:25:21.78 +0400>,<she>,<DPX200>,
      <Start of raw data processing
       efp BC_mod = 2 LB = 1 FT_mod = 6 PKNL = 1 PHC0 = -2172.179 PHC1 = 71.7991 SI = 64K 
       data hash MD5: 64K
       71 36 8E 9B 1F 08 3E 9B C0 CE F8 2D DE C0 7F 18>)
(   3,<2019-05-31 12:25:43.51 +0400>,<she>,<DPX200>,
      <pk PHC0 = -14.27504 PHC1 = -3 
       data hash MD5: 64K
       55 D0 2F DF 11 30 2B 4B 00 22 03 34 2F CF 12 C7>)
$$ ##END=
$$ 
$$ hash MD5
$$ 9E FB 43 6E 9C 0E 02 04 72 8F 0D DA 50 00 10 05
##$RELAX= 
##$RELAX= 
##$RELAX= 
##$RELAX= 
##$RELAX= 
##$RELAX= 
##$RELAX= 
##$RELAX= 
$$ Bruker specific parameters
$$ --------------------------
##$DU= <F:/spectra>
##$EXPNO= 1
##$NAME= <P31>
##$PROCNO= 1
##$TYPE= <nmr>
##$USER= <she>
##$AMP= (0..31)
100 100 100 100 100 100 100 100 100 100 100 100 100 100 100 100 100 100 
100 100 100 100 100 100 100 100 100 100 100 100 100 100 
##$AQSEQ= 0
##$AQ_mod= 1
##$AUNM= <au_zg>
##$AUTOPOS= <>
##$BF1= 81.014009
##$BF2= 200.13
##$BF3= 200.13
##$BF4= 200.13
##$BF5= 200.13
##$BF6= 200.13
##$BF7= 200.13
##$BF8= 200.13
##$BYTORDA= 1
##$CFDGTYP= 0
##$CFRGTYP= 5
##$CHEMSTR= <none>
##$CNST= (0..31)
1 1 145 1 1 1 1 1 1 1 1 1 1 1 1 1 1 1 1 1 1 1 1 1 1 1 1 1 1 1 1 1 
##$CPDPRG= <waltz16>
##$CPDPRG1= <>
##$CPDPRG2= <waltz16>
##$CPDPRG3= <>
##$CPDPRG4= <mlev>
##$CPDPRG5= <mlev>
##$CPDPRG6= <mlev>
##$CPDPRG7= <mlev>
##$CPDPRG8= <mlev>
##$CPDPRGB= <>
##$CPDPRGT= <>
##$D= (0..31)
0 1 0 0 0 0 0 0 0 0 0 0.03 2e-05 3e-06 0 0 0 0 0 0 0 0 0 0 0 0 0 0 0 0 
0 0 
##$DATE= 1559291118
##$DBL= (0..7)
120 120 120 11 120 120 24 19 
##$DBP= (0..7)
150 150 150 150 150 150 150 150 
##$DBP07= 0
##$DBPNAM0= <>
##$DBPNAM1= <>
##$DBPNAM2= <>
##$DBPNAM3= <>
##$DBPNAM4= <>
##$DBPNAM5= <>
##$DBPNAM6= <>
##$DBPNAM7= <>
##$DBPOAL= (0..7)
0.5 0.5 0.5 0.5 0.5 0.5 0.5 0.5 
##$DBPOFFS= (0..7)
0 0 0 0 0 0 0 0 
$$ [...]
##$SUBNAM2= <"">
##$SUBNAM3= <"">
##$SUBNAM4= <"">
##$SUBNAM5= <"">
##$SUBNAM6= <"">
##$SUBNAM7= <"">
##$SUBNAM8= <"">
##$SUBNAM9= <"">
##$SW= 369.568048894756
##$SWIBOX= (0..15)
0 1 3 0 0 0 0 0 0 0 0 0 0 0 0 0 
##$SW_h= 29940.119760479
##$TD= 32768
##$TD0= 1
##$TE= 0
##$TE2= 300
##$TE3= 300
##$TEG= 300
##$TL= (0..7)
0 120 53 12 22 120 120 120 
##$TP= (0..7)
150 150 150 150 150 150 150 150 
##$TP07= 0
##$TPNAME0= <>
##$TPNAME1= <>
##$TPNAME2= <>
##$TPNAME3= <>
##$TPNAME4= <>
##$TPNAME5= <>
##$TPNAME6= <>
##$TPNAME7= <>
##$TPOAL= (0..7)
0.5 0.5 0.5 0.5 0.5 0.5 0.5 0.5 
##$TPOFFS= (0..7)
0 0 0 0 0 0 0 0 
##$TUNHIN= 0
##$TUNHOUT= 0
##$TUNXOUT= 0
##$USERA1= <user>
##$USERA2= <user>
##$USERA3= <user>
##$USERA4= <user>
##$USERA5= <user>
##$V9= 5
##$VALIST= <valist>
##$VCLIST= <CCCCCCCCCCCCCCC>
##$VD= 0
##$VDLIST= <DDDDDDDDDDDDDDD>
##$VPLIST= <PPPPPPPPPPPPPPP>
##$VTLIST= <TTTTTTTTTTTTTTT>
##$WBST= 1024
##$WBSW= 4
##$XGAIN= (0..3)
0 0 0 0 
##$XL= 0
##$YL= 0
##$YMAX_a= 85259
##$YMIN_a= -92980
##$ZGOPTNS= <>
##$ZL1= 120
##$ZL2= 120
##$ZL3= 120
##$ZL4= 120
##$ABSF1= 0
##$ABSF2= 0
##$ABSG= 0
##$ABSL= 0
##$ALPHA= 0
##$AQORDER= 0
##$ASSFAC= 0
##$ASSFACI= 0
##$ASSFACX= 0
##$ASSWID= 0
##$AUNMP= <proc_1d>
##$AZFE= 0.1
##$AZFW= 0.5
##$BCFW= 0
##$BC_mod= 2
##$BYTORDP= 0
##$COROFFS= 0
##$CY= -3
##$DATMOD= 1
##$DC= 0
##$DFILT= <>
##$DTYPP= 0
##$F1P= 0
##$F2P= 0
##$FCOR= 1
##$FTSIZE= 65536
##$FT_mod= 6
##$GAMMA= 0
##$GB= 0
##$INTBC= 1
##$INTSCL= 5.30512e-09
##$ISEN= 30
##$LB= 1
##$LEV0= 0
##$LPBIN= 0
##$MAXI= 10000
##$MC2= 0
##$MEAN= 0
##$ME_mod= 0
##$MI= 50
##$NCOEF= 0
##$NC_proc= -4
##$NLEV= 6
##$NOISF1= 182.463
##$NOISF2= 159.3651
##$NSP= 0
##$NTH_PI= 0
##$NZP= 0
##$OFFSET= 182.463
##$PC= 4
##$PHC0= -2186.454
##$PHC1= 68.7991
##$PH_mod= 1
##$PKNL= yes
##$PPARMOD= 0
##$PSCAL= 0
##$PSIGN= 0
##$REVERSE= no
##$SF= 81.0140089999434
##$SI= 65536
##$SIGF1= 159.3651
##$SIGF2= -187.1042
##$SINO= 113.3802
##$SIOLD= 16384
##$SREGLST= <1H.CDCl3>
##$SSB= 0
##$STSI= 65536
##$STSR= 0
##$SW_p= 29940.119760479
##$SYMM= 0
##$S_DEV= 0
##$TDeff= 32768
##$TDoff= 0
##$TI= <>
##$TILT= no
##$TM1= 0
##$TM2= 0
##$TOPLEV= 0
##$USERP1= <user>
##$USERP2= <user>
##$USERP3= <user>
##$USERP4= <user>
##$USERP5= <user>
##$WDW= 1
##$XDIM= 65536
##$YMAX_p= 492775286
##$YMIN_p= -8527126
$$ End of Bruker specific parameters
$$ ---------------------------------
##NTUPLES= NMR SPECTRUM
##VAR_NAME=  FREQUENCY,     SPECTRUM/REAL,   SPECTRUM/IMAG
##SYMBOL=    X,             R,               I
##VAR_TYPE=  INDEPENDENT,   DEPENDENT,       DEPENDENT
##VAR_FORM=  AFFN,          ASDF,            ASDF
##VAR_DIM=   65536,         65536,           65536
##UNITS=     HZ,            ARBITRARY UNITS, ARBITRARY UNITS
##FACTOR=    0.456856943014862, 1,           1
##FIRST=     14782.0589164792, 0,            0
##LAST=      -15158.0608439998, 0,           0
##MIN=       -15158.0608439998, -8527126,    0
##MAX=       14782.0589164792, 492775286,    0
$$ Real data points
##PAGE= N=1
##DATA TABLE= (X++(R..R)), XYDATA
$$ [...]
$$ plain form
40317 226054 329659 749923 1073099 943400 604690 493673 627675 738966 739513 715438
40307 715438 660428 507869 296417 106330 -37529 -87259 15162 166216 194138 211439
40297 211439 553938 1208868 1636628 1413601 791996 357463 352899 620793 1021651 1564823
40287 1564823 2175404 2607761 2634192 2205557 1468707 732873 341092 418813 740527 914192
40277 914192 702693 175975 -377196 -669804 -620267 -362871 -51125 262535 503760 516029
40267 516029 300742 154196 315467 611069 732876 718216 780740 799165 476794 -11975
40257 -11975 -108471 259467 445144 -7596 -694985 -943705 -693207 -406519 -393521 -609594
40247 -609594 -907413 -1118014 -1041711 -687119 -385027 -388249 -520339 -488090 -333948 -257295
$$ packed form
40317B26054J03605M20264L23176j29699l38710j11017J34002J11291N47k4075
40307G15438n5010j52559k11452j90087j43859m9730J02421J51054K7922J7301
40297B11439L42499O54930M27760k23027o21605m34533m564K67894M00858N43172
40287A564823O10581M32357K6431m28635p36850p35834l91781P7721L21714J73665
40277I14192k11499n26718n53171k92608M9537K57396L11746L13660K41225J2269
40267E16029k15287j46546J61271K95602J21807j4660O2524J8425l22371m88769
40257a1975r6496L67938J85677m52740o87389k48720K50498K86688J2998k16073
40247f09594k97819k10601P6303L54592L02092l222j32090L2249J54142P6653
$$ plain form
40237 -257295 -198084 6468 207338 123917 -140701 -205383 -16046 92970 -7976 -24190
40227 -24190 241063 515228 431581 24177 -358237 -448962 -209864 233456 612425 615739
40217 615739 186094 -334394 -516239 -278121 98960 345815 447576 498684 461851 204624
40207 204624 -232951 -541030 -436893 -34112 238234 144031 -78214 -66893 158548 253125
40197 253125 56817 -194180 -221550 -56690 88710 138324 150906 100598 -107498 -384095
40187 -384095 -436052 -123341 302302 473752 344790 178954 149935 164954 106644 29095
40177 29095 21723 68345 153278 315505 456665 305516 -215923 -765869 -960925 -834044
40167 -834044 -677580 -601633 -537870 -511146 -560304 -541541 -392889 -418469 -829114 -1167033 -815665
$$ packed form
40237b57295N9211K04552K00870q3421k64618o4682J89337J09016j00946j6214
40227b4190K65253K74165q3647m07404l82414r0725K39098M43320L78969L314
40217F15739m29645n20488j81845K38118L77081K46855J01761N1108l6833k57227
40207B04624m37575l08079J04137M02781K72346r4203k22245J1321K25441R4577
40197B53125j96308k50997k7370J64860J45400M9614J2582n0308k08096k76597
40187c84095n1957L12711M25643J71450j28962j65836k9019J5019n8310p7549
40177B9095p372M6622Q4933J62227J41160j51149n21439n49946j95056J26881
40167h34044J56464P5947O3763K6724m9158J8763J48652k5580m10645l37919L51368
$$ plain form
40156 -815665 -17592 350708 92262 -38799 367028 668961 278550 -300676 -271878 170896
40146 170896 180359 -455365 -1150947 -1449836 -1372477 -969741 -264994 377163 503961 260222
40136 260222 245427 634580 985196 963947 714552 429232 100274 -183691 -202018 754
40126 754 135063 174210 369569 686245 754406 503105 293770 263067 110475 -226949 -268952
40115 -268952 302276 1119186 1647295 1776185 1582581 1011419 208463 -286461 -165987 174474
40105 174474 242228 174846 379958 776317 953312 867942 825205 889411 830701 594780 368375
40094 368375 214161 44853 -86752 -67188 -52582 -321622 -791861 -1039326 -827891 -321899
40084 -321899 216758 636893 816634 699158 449651 309626 270043 128877 -137045 -327994
$$ packed form
40156h15665P98073L68300k58446j31061M05827L01933l90411n79226K8798M42774
40146A70896R463o35724o95582k98889P7359M02736P04747O42157J26798k43739
40136B60222j4795L89153L50616k1249k49395k85320l28958k83965j8327K02772
40126G54J34309L9147J95359L16676O8161k51301k09335l0703j52592l37424m2003
40115b68952N71228Q16910N28109J28890j93604n71162q02956m94924J20474L40461
40105A74474O7754o7382K05112L96359J76995q5370m2737O4206n8710k35921k26405
40094C68375j54214j69308j31605J9564J4606k69040m70239k47465K11435N05992
40084c21899N38657M20135J79741j17476k49507j40025l9583j41166k65922j90949
$$ plain form
40074 -327994 -364409 -403912 -549747 -657123 -517447 -114921 330994 516192 317291 -9099
40064 -9099 -32890 315831 604431 473005 144130 104144 463862 932112 1261378 1398613
40054 1398613 1338221 1172085 1172934 1483708 1827099 1856144 1650867 1486298 1280327 778861
40044 778861 203758 130738 637385 1087305 934869 343851 -148142 -224440 79404 481483
40034 481483 545586 200 -869099 -1409108 -1291267 -774530 -259497 87686 228288 154922
40024 154922 15763 7129 74174 60259 149407 669910 1379220 1527541 882299 153521
40014 153521 53811 411846 635008 621353 680316 831371 760388 401570 97262 137855
40004 137855 445772 751839 881956 850082 786024 770664 738879 640237 625937 837704 1071658
$$ packed form
40074c27994l6415l9503j45835j07376J39676M02526M45915J85198j98901l26390
40064i099k3791L48721K88600j31426l28875l9986L59718M68250L29266J37235
40054A398613o0392j66136Q49L10774L43391K9045k05277j64569k05971n01466
40044G78861n75103p3020N06647M49920j52436n91018m91993p6298L03844M02079
40034D81483O4103n45386q69299n40009J17841N16737N15033L47183J40602p3366
40024A54922j39159q634O7045j3915Q9148N20503P09310J48321o45242p28778
40014A53521r9710L58035K23162j3655N8963J51055p0983l58818l04308M0593
40004A37855L07917L06067J30117l1874o4058j5360l1785r8642j4300K11767K33954
$$ plain form
39993 1071658 1015273 811025 915316 1311809 1411700 954008 443662 356765 461123 383751
39983 383751 333556 655011 1065846 1035414 680853 589140 864244 1025407 843057 641918
39973 641918 677054 757774 657922 468690 380408 455231 727125 1198888 1643242 1738411 1527947
39962 1527947 1453832 1800961 2364742 2791326 2990211 3042725 2915148 2494294 1840695 1234096
39952 1234096 935057 956286 1101698 1219199 1339313 1501131 1560075 1369718 1092304 1050439
39942 1050439 1260102 1407434 1324237 1158040 1025793 891666 869604 1187772 1703645 1944425
39932 1944425 1822969 1782314 2002014 2083451 1846404 1735513 1961778 1977385 1455815 1072824
39922 1072824 1457357 1982892 1633069 643183 171516 559630 1013298 954170 662506 527370
$$ packed form
39993A071658n6385k04248J04291L96493R9891m57692n10346q6897J04358p7372
39983C83751n0195L21455M10835l0432l54561r1713K75104J61163j82350k01139
39973F41918L5136Q0720r9852j89232q8282P4823K71894M71763M44354R5169k10464
39962A527947p4115L47129N63781M26584J98885N2514j27577m20854o53599o06599
39952A234096k99039K1229J45412J17501J20114J61818N8944j90357k77414m1865
39942A050439K09663J47332q3197j66197j32247j34127k2062L18168N15873K40780
39932A944425j21456m0655K19700Q1437k37047j10891K26265J5607n21570l82991
39922A072824L84533N25535l49823r89886m71667L88114M53668n9128k91664j35136
$$ plain form
39912 527370 590294 923586 1602881 2208656 2164103 1647112 1387758 1534981 1555084 1287065
39902 1287065 1205120 1516932 1856664 2011883 2158714 2305965 2328841 2557415 3410197 4441731
39892 4441731 4772783 4507279 4640609 5504038 6473907 7317596 8534926 10163758 11591239
39883 11591239 12844584 14737971 17463942 20428369 23674549 27862748 32631889 36848182
39875 36848182 40747412 45703613 51725988 58160274 67536002 84857748 110993724 140359911
39867 140359911 167770439 193218351 215159054 223133391 205282623 163824503 116584284
39860 116584284 80853543 60127764 48107422 39774975 34190253 30435896 26666010
39853 26666010 22648434 19529777 17193666 14434027 11345682 9145417 7899468 6582470
$$ packed form
39912E27370O2924L33292O79295O05775m4553n16991k59354J47223K0103k68019
39902A287065q1945L11812L39732J55219J46831J47251K2876K28574Q52782J031534
39892D441731L31052k65504J33330Q63429R69869Q43689J217330J628832J427481
39883A1591239J253345J893387K725971K964427L246180M188199M769141M216293
39875C6848182L899230M956201O022375O434286R375728J7321746K6135976K9366187
39867A40359911K7410528K5447912K1940703P974337j7850768m1458120m7240219
39860A16584284l5730741k0725779j2020342q332447n584722l754357l769886
39853B6666010m017576l118657k336111k759639l088345k200265j245949j316998
$$ plain form
39845 6582470 5156086 4530292 4565618 4085897 2966492 2403918 2866614 3389439 3243027
39836 3243027 2871477 2764100 2654705 2299149 1985643 1842882 1556842 1132389 1071116 1446280
39826 1446280 1620132 1250475 830191 834499 1003670 907366 679134 742566 1157941 1573662
39816 1573662 1605192 1127116 431495 101885 416069 925815 1001174 691122 578261 864769
39806 864769 1151588 1126495 928025 765792 679485 748964 1079206 1505434 1738130 1826614
39796 1826614 2044979 2334627 2357201 2110524 1958698 1988485 1864209 1424673 925863 583445
39786 583445 359454 298020 554114 954450 1054465 814121 711497 970684 1178480 953741
39776 953741 556031 491409 842890 1303767 1631061 1812771 1960248 2176911 2368807 2191303
$$ packed form
39845F582470j426384o25794L5326m79721j119405n62574M62696N22825j46412
39836C243027l71550j07377j09395l55556l13506j42761k86040m24453o1273L75164
39826A446280J73852l69657m20284M308J69171r6304k28232O3432M15375M15721
39816A573662L1530m78076o95621l29610L14184N09746P5359l10052j12861K86508
39806H64769K86819k5093j98470j62233q6307O9479L30242M26228K32696Q8484
39796A826614K18365K89648K2574k46677j51826K9787j24276m39536m98810l42418
39786E83445k23991o1434K56094M00336J00015k40344j02624K59187K07796k24739
39776I53741l97710o4622L51481M60877L27294J81710J47477K16663J91896j77504
$$ plain form
39766 2191303 1473217 653379 378459 657911 897485 805135 680854 681060 467804 -94358
39756 -94358 -515889 -405140 -94800 -45609 -81464 206432 664188 833744 771781 936504
39746 936504 1340879 1469814 1114033 729874 789665 1200447 1578411 1764957 1828912 1796941
39736 1796941 1646632 1454556 1333976 1259008 1105930 865249 681390 640115 619765 448288
39726 448288 152043 -86997 -218288 -391403 -660677 -800921 -582545 -107799 305932 479285
39716 479285 439110 270544 123808 231621 638583 1020044 1073195 971653 1066886 1258890
39706 1258890 1155795 837573 879425 1451417 1931585 1717164 1005672 437425 301287 443907
39696 443907 684182 932764 1072821 1064446 1073086 1252774 1518204 1723702 1893452 2052535
$$ packed form
39766B191303p18086q19838k74920K79452K39574r2350j24281K06k13256n62162
39756i4358m21531J10749L10340M9191l5855K87896M57756J69556o1963J64723
39746I36504M04375J28935l55781l84159N9791M10782L77964J86546O3955l1971
39736A796941j50309j92076j20580p4968j53078k40681j83859m1275k0350j71477
39726D48288k96245k39040j31291j73115k69274j40244K18376M74746M13731J73353
39716D79285m0175j68566j46736J07813M06962L81461N3151j01542R5233J92004
39706A258890j03095l18222M1852N71992M80168k14421p11492n68247j36138J42620
39696D43907K40275K48582J40057q375Q640J79688K65430K05498J69750J59083
$$ plain form
39686 2052535 2014800 1614033 1034220 673305 753736 1211480 1809280 2195452 2070422 1548906
39676 1548906 1186068 1375195 1853228 2058703 1841060 1533482 1436187 1532443 1659668 1677389
39666 1677389 1484284 1113751 800960 739159 791968 664854 353358 205725 506688 1154738
39656 1154738 1771705 2016010 1811188 1398484 1154444 1247107 1484520 1569146 1432545 1232088
39646 1232088 1110739 1085202 1105704 1106504 1034822 903326 766836 628360 471530 380174 447582
39635 447582 564055 549364 536143 884129 1580052 2096055 2088878 1883577 1931404 2120906
39625 2120906 2068318 1843137 1888149 2332794 2888259 3402852 4061676 5000881 6124973 7328356
39615 7328356 8479546 9140754 8776124 7425635 5811833 4591426 3806025 3208795 2742702
$$ packed form
39686B052535l7735m00767n79813l60915Q0431M57744N97800L86172j25030n21516
39676A548906l62838J89127M78033K05475k17643l07578r7295R6256J27225J7721
39666A677389j93105l70533l12791o1801N2809j27114l11496j47633L00963O48050
39656A154738O16967K44305k04822m12704k44040R2663K37413Q4626j36601k00457
39646A232088j21349k5537K0502Q00p1682j31496j36490j38476j56830r1356O7408
39635D47582J16473j4691j3221L47986O95923N16003p177k05301M7827J89502
39625B120906n2588k25181M5012M44645N55465N14593O58824R39205J124092J203383
39615G328356J151190O61208l64630j350489j613802j220407p85401n97230m66093
$$ plain form
39606 2742702 2427807 2106228 1663126 1313191 1326261 1575597 1672119 1500548 1338431 1436997
39596 1436997 1729009 1992793 2088515 1955489 1575941 1089856 813609 945143 1273854 1365357
39586 1365357 1082572 761276 758090 977199 1062226 982395 1119504 1678440 2280700 2363461
39576 2363461 1833447 1100479 559581 279270 152369 82953 -27894 -253871 -486647 -463192
39566 -463192 -74527 459576 845973 1064473 1315197 1660757 1892415 1801545 1448761 1061432
39556 1061432 763211 551202 471877 598819 809292 821053 578460 408228 622157 1124233
39546 1124233 1586502 1838791 1873978 1676622 1356676 1282762 1700401 2309413 2591108 2459286
39536 2459286 2188710 1837581 1278186 730511 619837 839935 821299 478396 389565 799909
$$ packed form
39606B742702l14895l21579m43102l49935J3070K49336R6522j71571j62117R8566
39596A436997K92012K63784R5722j33026l79548m86085k76247J31534L28711R1503
39586A365357k82785l21296l186K19109Q5027p9831J37109N58936O02260Q2761
39576B363461n30014p32968n40898k80311j26901o9416j10847k25977k32776K3455
39566d63192L88665N34103L86397K18500K50724L45560K31658r0870l52784l87329
39556A061432k98221k12009p9325J26942K10473J1761k42593j70232K13929N02076
39546A124233M62269K52289L5187j97356l19946p3914M17639O09012K81695j31822
39536B459286k70576l51129n59395n47675j10674K20098j8636l42903q8831M10344
$$ plain form
39526 799909 1197791 1251141 1380144 1852737 2073996 1533716 834197 880779 1503923 1830151
39516 1830151 1689262 1634050 1737978 1458630 763622 378181 653159 1041765 1031265 858134
39506 858134 932686 1199793 1466132 1805176 2228355 2421474 2203576 1861360 1691400 1592412
39496 1592412 1436374 1444879 1798789 2184366 2137829 1651872 1119020 830123 781431 829116
39486 829116 832874 772733 819351 1103086 1398737 1362625 1126568 1221687 1762531 2173346 1984533
39475 1984533 1465447 1135027 1041267 926471 779580 776108 885244 942932 948975 941721 770801
39464 770801 369956 74288 247508 718178 1017454 1098091 1343642 1834608 2090460 1749892
39454 1749892 1153700 945391 1270111 1676438 1768788 1654295 1629304 1676085 1563193 1344579
$$ packed form
39526G99909L97882N3350J29003M72593K21259n40280o99519M6582O23144L26228
39516A830151j40889n5212J03928k79348o95008l85441K74978L88606j0500j73131
39506H58134P4552K67107K66339L39044M23179J93119k17898l42216j69960r8988
39496A592412j56038Q505L53910L85577m6537m85957n32852k88897m8692M7685
39486H29116L758o0141M6618K83735K95651l6112k36057R5119N40844M10815j88813
39475A984533n19086l30420r3760j14796j46891l472J09136N7688O043p254j70920
39464G70801m00845k95668J73220M70670K99276Q0637K45551M90966K55852l40568
39454A749892n96192k08309L24720M06327R2350j14493k4991M6781j12892k18614
$$ plain form
39444 1344579 1355670 1608913 1610319 1079245 502239 522774 1021115 1334991 1247339 1134403
39434 1134403 1153791 974734 495208 202017 494419 1124409 1627256 1897507 2036873 2033788
39424 2033788 1928769 1943680 2116970 2133672 1821855 1477640 1379330 1336865 1093832 839869
39414 839869 896919 1159097 1274346 1195131 1165617 1311001 1555953 1796590 1902072 1753858
39404 1753858 1507810 1535747 1866285 2035883 1790374 1526616 1644190 1874160 1761761 1463365
39394 1463365 1474432 1812261 2067498 2104738 2136314 2209331 2168500 2061570 2074519 2122473 1987100
39383 1987100 1793897 1862779 2137187 2265854 2239082 2440650 3013394 3614035 3876409 3759845
39373 3759845 3403911 2976033 2681654 2620117 2637054 2572099 2553499 2773371 3147595 3542246
$$ packed form
39444A344579J1091K53243J406n31074n77006K0535M98341L13876q7652j12936
39434A134403J9388j79057m79526k93191K92402O29990N02847K70251J39366l085
39424B033788j05019J4911J73290J6702l11817l44215r8310m2465k43033k53963
39414H39869N7050K62178J15249p9215k9514J45384K44952K40637J05482j48214
39404A753858k46048K7937L30538J69598k45509k63758J17574K29970j12399k98396
39394A463365J1067L37829K55237L7240L1576P3017m0831j06930J2949M7954j35373
39383A987100j93203O8882K74408J28667k6772K01568N72744O00641K62374j16564
39373C759845l55934m27878k94379o1537J6937o4955j8600K19872L74224L94651
$$ plain form
39363 3542246 4130242 5097948 6178888 6934876 7325436 7520979 7366878 6626215 5605602
39354 5605602 4885753 4485096 3938875 3199107 2784152 2953144 3361336 3663185 3878369
39345 3878369 4023843 3948062 3706646 3603868 3704815 3753560 3650992 3524959 3295569 2762003
39335 2762003 2205335 2248716 2919157 3471462 3409829 3111215 3135238 3450561 3694236 3749917
39325 3749917 3723778 3701192 3796757 4123099 4527923 4711055 4720979 4920429 5354329 5631894
39315 5631894 5570401 5448281 5460194 5449622 5380029 5557293 6169131 7069968 8168769 9523040
39305 9523040 10938803 12055584 12951536 14060511 15408613 16637900 17873320 19731805
39297 19731805 22292733 24946376 27510198 30574918 34474337 38925802 44033427 50563620
$$ packed form
39363C542246N87996R67706J080940P55988L90560J95543j54101p40663j020613
39354E605602p19849m00657n46221p39768m14955J68992M08192L01849K15184
39345C878369J45474p5781k41416j02778J00947M8745j02568j26033k29390n33566
39335B762003n56668M3381O70441N52305o1633k98614K4023L15323K43675N5681
39325C749917k6139k2586R5565L26342M04824J83132R924J99450M33900K77565
39315E631894o1493j22120J1913j0572o9593J77264O11838R00837J098801J354271
39305I523040J415763J116781Q95952J108975J348102J229287J235420J858485
39297A9731805K560928K653643K563822L064720L899419M451465N107625O530193
$$ plain form
39289 50563620 58828124 68464702 79749276 93781325 110911406 130717480 154338515
39282 154338515 184753031 223175858 266779464 311105012 351804982 381290039 387131327
39275 387131327 360335334 306508419 244526452 191852273 153256949 124216400 100653666
39268 100653666 81932678 67456578 55428270 45168266 37541187 32558620 28704470
39261 28704470 25008052 21926878 19746272 17765181 15632488 14050169 13451064 13130625
39253 13130625 12385530 11528189 11038626 10541475 9441273 7994190 6965989 6579485 6444213
39244 6444213 6253288 5969562 5526522 4895924 4358433 4242174 4420773 4438627 4109625 3668279
39234 3668279 3351066 3154604 3035746 3038828 3118776 3081136 2842812 2587277 2521043 2604147
$$ packed form
39289E0563620Q264504R636578J1284574J4032049J7130081J9806074K3621035
39282A54338515L0414516L8422827M3603606M4325548M0699970K9485057N841288
39275C87131327k6795993n3826915o1981967n2674179l8595324k9040549k3562734
39268A00653666j8720988j4476100j2028308j0260004p627079m982567l854150
39261B8704470l696418l081174k180606j981091k132693j582319n99105l20439
39253A3130625p45095q57341m89563m97151j100202j447083j028201l86504j35272
39244F444213j90925k83726m43040o30598n37491j16259J78599J7854l29002m41346
39234C668279l17213j96462j18858L082P9948l7640k38324k55535o6234Q3104
$$ plain form
39224 2604147 2670269 2707481 2825392 2981858 2961774 2689901 2383499 2265519 2251677 2086618
39214 2086618 1720737 1372486 1236131 1306537 1511784 1830904 2194000 2416804 2372856 2167179
39204 2167179 2032247 2080962 2237989 2398749 2596702 2992320 3682181 4511600 5147162 5415709
39194 5415709 5495055 5614569 5623073 5109310 4017923 2883909 2262798 2111967 1984483 1709654
39184 1709654 1549589 1667054 1780655 1538896 1020810 617855 523970 590869 642023 651856
39174 651856 575301 293176 -118009 -301826 -33097 453349 776898 891642 967944 948941
39164 948941 625803 121840 -117558 106220 545659 947381 1301770 1550640 1496131 1215410
39154 1215410 1143850 1469458 1835551 1936622 1976034 2151530 2138571 1613248 921359 617451
$$ packed form
39224B604147O6122L7212J17911J56466k0084k71873l06402j17980j3842j65059
39214B086618l65881l48251j36355P0406K05247L19120L63096K22804m3948k05677
39204B167179j34932M8715J57027J60760J97953L95618O89861Q29419O35562K68547
39194E415709P9346J19514Q504n13763j091387j134014o21111j50831j27484k74829
39184A709654j60065J17465J13601k41759n18086m02955r3885O6899N1154R833
39174F51856p6555k82125m11185j83817K68729M86446L23549J14744P6302j9003
39164I48941l23138n03963k39398K23778M39439M01722L54389K48870n4509k80721
39154A215410p1560L25608L66093J01071L9412J75496j2959n25323o91889l03908
$$ plain form
39144 617451 613110 434979 116714 108474 399404 496601 317746 362134 840058 1318318 1455607
39133 1455607 1454394 1510094 1422331 1101247 908778 1091489 1342178 1335304 1266418 1418147 1579966
39122 1579966 1395958 999147 806843 885782 967652 937525 891501 829229 669346 486597
39112 486597 417202 423893 423981 501016 701169 799162 614766 417764 638494 1254333 1818356
39101 1818356 2043888 2018222 1869986 1582061 1188280 877287 813837 1004980 1325409 1529090
39091 1529090 1332500 713010 71467 -123257 168039 566363 703796 485143 57116
39082 57116 -268833 -188003 264054 652563 636791 385588 270100 341363 437540 610220
39072 610220 997853 1380608 1364837 1028717 899301 1187297 1506411 1526321 1463272 1647090
$$ packed form
39144F17451m341j78131l18265q240K90930R7197j78855M4388M77924M78260J37289
39133A455607j213N5700q7763l21084j92469J82711K50689o874o8886J51729J61819
39122A579966j84008l96811j92304P8939Q1870l0127m6024o2272j59883j82749
39112D86597o9395O691Q8P7035K00153R7993j84396j97002K20730O15839N64023
39101A818356K25532k5666j48236k87925l93781l10993o3450J91143L20429K03681
39091A529090j96590o19490o41543j94724K91296L98324J37433k18653m28027
39082E7116l25949Q0830M52057L88509j5772k51203j15488P1263R6177J72680
39072F10220L87633L82755j5771l36120j29416K87996L19114J9910o3049J83818
$$ plain form
39062 1647090 1971747 2144464 2239796 2599787 3267942 3892352 4243771 4554928 5207523 6251314
39052 6251314 7435051 8671906 10205353 12097155 13672294 13849178 12202608 9485461
39044 9485461 6898652 5027998 3714870 2721926 2091011 1875307 1917020 2001994 2005033 1861213
39034 1861213 1636158 1606753 1960544 2391879 2341448 1723590 1081826 903021 1111520 1387527
39024 1387527 1606749 1709350 1486376 880668 289917 179056 486858 748360 732784 627611
39014 627611 615276 603751 441248 133379 -236172 -581172 -725237 -454728 199286 871243
39004 871243 1187973 1107179 856092 650384 583245 680360 889607 1042453 990818 820878
38994 820878 795864 995579 1109218 744255 -48800 -708386 -723052 -179375 390443 666296
$$ packed form
39062A647090L24657J72717R5332L59991O68155O24410L51419L11157O52595J043791
39052F251314J183737J236855J533447J891802J575139J76884j646570k717147
39044I485461k586809j870654j313128r92944o30915k15704M1713Q4974L039j43820
39034A861213k25055k9405L53791M31335n0431o17858o41764j78805K08499K76007
39024A387527K19222J02601k22974o05708n90751j10861L07802K61502j5576j05173
39014F27611j2335j1525j62503l07869l69551l45000j44065K70509O54014O71957
39004H71243L16730q0794k51087k05708o7139R7115K09247J52846n1635j69940
38994H20878k5014J99715J13639l64963p93055o59586j4666N43677N69818K75853
$$ plain form
38984 666296 836107 1165174 1505137 1491342 1141693 926457 1135507 1443336 1332622 797975
38974 797975 354377 391579 791030 1211493 1481297 1584329 1486520 1181822 794539 463297
38964 463297 198836 -20534 -125127 -68653 56923 187341 425912 802224 1035003 833016
38954 833016 355591 58111 117705 342863 620754 1036842 1484469 1609799 1349288 1125758
38944 1125758 1233937 1378440 1159766 714140 444132 325400 -14683 -575596 -839136
38935 -839136 -483870 126856 407615 288353 229042 557117 1026639 1144541 818181 470404
38925 470404 463832 633975 594072 320620 105123 23229 -118193 -285615 -148447 348974
38915 348974 810928 1015040 1245347 1681314 1924770 1593238 999860 714573 747665 727731
$$ packed form
38984F66296J69811L29067L39963j3795l49649k15236K09050L07829j10714n34647
38974G97975m43598L7202L99451M20463K69804J03032r7809l04698l87283l31242
38964D63297k64461k19370j04593N6474J25576J30418K38571L76312K32779k01987
38954H33016m77425k97480N9594K25158K77891M16088M47627J25330k60511k23530
38944A125758J08179J44503k18674m45626k70008j18732l40083n60913k63540
38935h39136L55266O10726K80759j19262n9311L28075M69522J17902l26360l47777
38925D70404o572J70143l9903k73452k15497q1894j41422j67422J37168M97421
38915C48974M61954K04112K30307M35967K43456l31532n93378k85287L3092j9934
$$ plain form
38905 727731 642142 782761 1108893 1288991 1296908 1363334 1399689 1115021 687610 618674 842012
38894 842012 713303 81882 -360102 -130439 324101 416515 325459 533696 925449 1018306
38884 1018306 843370 935062 1489800 2062433 2158501 1758125 1196496 811265 764652 992721
38874 992721 1250664 1309772 1133017 841936 600128 549019 699360 837848 723932 424702
38864 424702 237981 256242 301320 337801 560522 939999 1120636 1000440 956008 1170117
38854 1170117 1211863 744153 210239 214481 549656 536437 130958 -66400 136673 243606
38844 243606 -24306 -261815 -101187 215711 354664 468747 832138 1281066 1453649 1300987
38834 1300987 975479 499395 -34356 -202154 295752 1067863 1429694 1305732 1238102 1520323
$$ packed form
38905G27731q5589J40619L26132J80098P917O6426L6355k84668m27411o8936K23338
38894H42012j28709o31421m41984K29663M54540R2414r1056K08237L91753R2857
38884A018306j74936R1692N54738N72633R6068m00376n61629l85231m6613K28069
38874I92721K57943N9108j76755k91081k41808n1109J50341J38488j13916k99230
38864D24702j86721J8261M5078L6481K22721L79477J80637j20196m4432K14109
38854A170117M1746m67710n33914M242L35175j3219m05479j97358K03073J06933
38844B43606k67912k37509J60628L16898J38953J14083L63391M48928J72583j52662
38834A300987l25508m76084n33751j67798M97906P72111L61831j23962o7630K82221
$$ plain form
38824 1520323 1874689 2093069 2443799 3188890 4166641 5171073 6296505 7457087 7944951
38815 7944951 7098821 5287514 3631311 2727057 2191039 1543332 949678 800751 1038689
38806 1038689 1314508 1510843 1709950 1856767 1839772 1761996 1777060 1775007 1579347 1351784
38796 1351784 1421833 1752540 1937475 1738357 1307951 874747 528693 347762 420540 675477
38786 675477 938642 1173844 1406732 1464847 1164897 761201 773841 1263293 1687322 1641526
38776 1641526 1348968 1202683 1202971 1143196 1052371 1120609 1370194 1670293 1933701 2100583
38766 2100583 2093729 1960917 1871506 1823377 1599083 1188291 960678 1160146 1489102 1501791
38756 1501791 1202732 942793 896795 963106 1044344 1114041 1096750 951206 783268 651161
$$ packed form
38824A520323L54366K18380L50730P45091R77751J004432J125432J160582M87864
38815G944951q46130j811307j656203r04254n36018o47707n93654j48927K37938
38806A038689K75819J96335J99107J46817j6995p7776J5064k053j95660k27563
38796A351784P0049L30707J84935j99118m30406m33204l46054j80931P2778K54937
38786F75477K63165K35202K32888N8115k99950m03696J2640M89452M24029m5796
38776A641526k92558j46285K88n9775r0825O8238K49585L00099K63408J66882
38766B100583o854j32812q9411m8129k24294m10792k27613J99468L28956J2689
38756A501791k99059k59939m5998O6311Q1238O9697j7291j45544j67938j32107
$$ plain form
38746 651161 397753 -76242 -534537 -694916 -653757 -696424 -798249 -677819 -309483 -34431
38736 -34431 -121533 -478978 -832901 -975015 -820169 -417887 63353 481234 810003 1006363
38726 1006363 947802 672025 494337 645851 944366 1071289 1008412 913071 739798 357791
38716 357791 -69825 -222983 -97206 32554 91741 268022 586181 807224 815454 758599
38706 758599 722586 596759 368864 254580 401749 696330 948259 1052565 931650 583672
38696 583672 235673 158688 260315 166574 -189730 -384301 -74417 517719 893646 839377
38686 839377 525712 248618 232104 489754 720533 559493 119600 39274 709366 1646893
38676 1646893 1997591 1568711 967036 697949 573852 237517 -109754 44266 677735
$$ packed form
38746F51161k53408m73995m58295j60379M1159m2667j01825J20430L68336K75052
38736c4431q7102l57445l53923j42114J54846M02282M81240M17881L28769J96360
38726A006363n8561k75777j77688J51514K98515J26923o2877r5341j73273l82007
38716C57791m27616j53158J25777J29760N9187J76281L18159K21043Q230n6855
38706G58599l6013j25827k27895j14284J47169K94581K51929J04306j20915l47978
38696E83672l47999p6985J01627r3741l56304j94571L09884N92136L75927n4269
38686H39377l13665k77094j6514K57650K30779j61040m39893q0326O70092R37527
38676A646893L50698m28880o01675k69087j24097l36335l47271J54020O33469
$$ plain form
38667 677735 1148036 1075491 871645 1079683 1535512 1654364 1359301 1147380 1229320 1210910
38657 1210910 835128 484772 569088 837124 761061 307180 -142911 -417900 -617120 -693711
38647 -693711 -484616 -119790 58460 17241 84775 429446 827150 1011784 969921 830435
38637 830435 702222 657338 685342 685113 657500 776847 1063242 1190060 936381 630919 742782
38626 742782 1192343 1524333 1636834 1821023 2138191 2309320 2255445 2230927 2351261 2469451
38616 2469451 2578528 2839613 3147592 3206811 3144772 3487073 4350257 5207774 5657972 5862670
38606 5862670 5987104 5824406 5352894 5094328 5423178 5962956 6166743 6100782 6111305 6060871
38596 6060871 5535548 4635671 3938425 3691212 3555312 3192258 2665275 2169216 1737384
$$ packed form
38667F77735M70301p2545k03846K08038M55829J18852k95063k11921Q1940j8410
38657A210910l75782l50356Q4316K68036p6063m53881m50091k74989j99220p6591
38647f93711K09095L64826J78250m1219O7534L44671L97704J84634m1863j39486
38637H30435j28213m4884K8004k29k7613J19347K86395J26818k53679l05462J11863
38626G42782M49561L31990J12501J84189L17168J71129n3875k4518J20334J18190
38616B469451J09077K61085L07979N9219o2039L42301Q63184Q57517M50198K04698
38606E862670J24434j62698m71512k58566L28850N39778K03787o5961J0523n0434
38596F060871n25323q99877o97246k47213j35900l63054n26983m96059m31832
$$ plain form
38587 1737384 1367679 1169694 1210558 1357045 1400104 1279492 1135889 1176003 1474874 1856273
38577 1856273 1991962 1695997 1142111 757448 855934 1327487 1701485 1616863 1252400 1150890
38567 1150890 1564357 2171484 2552017 2690614 2815325 3008279 3271613 3732803 4411923
38558 4411923 4980146 5162193 5240202 5752916 6816815 8130728 9489520 10872587 12209825
38549 12209825 13506203 14938886 16276822 16510368 14827201 11819245 8951615 6935350
38541 6935350 5428836 4206557 3571219 3482226 3310990 2790944 2344341 2167809 1865358
38532 1865358 1321503 1053088 1291401 1566379 1618339 1846841 2383895 2619866 2216364 1731868
38522 1731868 1631346 1524894 1064206 755272 1102568 1689649 1902025 1878044 1965524 1929209
$$ packed form
38587A737384l69705j97985M0864J46487M3059j20612j43603M0114K98871L81399
38577A856273J35689k95965n53886l84663R8486M71553L73998q4622l64463j01510
38567A150890M13467O07127L80533J38597J24711J92954K63334M61190O79120
38558D411923N68223J82047P8009N12714J063899J313913J358792J383067J337238
38549A2209825J296378J432683J337936K33546j683167l007956k867630k016265
38541F935350j506514j222279o35338q8993j71236n20046m46603j76532l02451
38532A865358n43855k68415K38313K74978N1960K28502N37054K35971m03502m84496
38522A731868j00522j06452m60688l08934L47296N87081K12376k3981Q7480l6315
$$ plain form
38512 1929209 1524794 1196491 1338650 1484398 1110613 652348 796312 1311905 1518197
38503 1518197 1413084 1410126 1434940 1236794 1170445 1712500 2544481 2984623 2987581 2936539 2870210
38492 2870210 2694828 2688030 3012384 3234885 3060793 2927247 3143643 3225041 2896217 2850823
38482 2850823 3568900 4372761 4722758 5359340 6935411 8691760 9897574 11356581 13866229
38473 13866229 16484197 18156728 19701832 22121083 24459486 25775774 27623539 31703839
38465 31703839 36874756 42210442 51315988 68787331 93304703 119458974 145407131
38458 145407131 171377314 189695959 185551245 153678360 108617679 71690459 50966939
38451 50966939 39692511 30629233 23773158 20665814 19285543 17316810 15442291 14678969
$$ packed form
38512A929209m04415l28303J42159J45748l73785m58265J43964N15593K06292
38503A518197j05113k958K4814j98146o6349N42055Q31981M40142K958n1042o6329
38492B870210j75382o798L24354K22501j74092j33546K16396Q1398l28824m5394
38482B850823P18077Q03861L49997O36582J576071J756349J205814J459007K509648
38473A3866229K617968J672531J545104K419251K338403J316288J847765M080300
38465C1703839N170917N335686R105546J7471343K4517372K6154271K5948157
38458A45407131K5970183J8318645m144714l1872885m5060681l6927220k0723520
38451E0966939j1274428r063278o856075l107344j380271j968733j874519p63322
$$ plain form
38443 14678969 13840322 11777411 9426498 7844587 6486470 4884475 3899943 3930786 3819171
38434 3819171 2842369 2023584 2252619 2766696 2685157 2499858 2845031 3182879 2878405 2358990
38424 2358990 2159871 1959249 1493348 1290426 1613414 1807222 1532560 1471898 1958445 2131494
38414 2131494 1410143 617406 600274 852622 610687 265342 501772 960532 970687 827629
38404 827629 1149260 1646456 1688014 1473834 1528259 1603172 1206039 702847 767581 1160969
38394 1160969 1150265 773657 614743 639686 338659 -192862 -347761 -59989 158960 130924
38384 130924 114645 118837 -73835 -297705 -177591 195359 445406 571574 716507 559212
38374 559212 -208834 -1018121 -971869 -178387 381200 284557 39826 1555 -94328 -319375
$$ packed form
38443A4678969q38647k062911k350913j581911j358117j601995r84532L0843j11615
38434C819171r76802q18785K29035N14077q1539j85299L45173L37848l04474n19415
38424B358990j99119k00622m65901k02922L22988J93808k74662o0662M86547J73049
38414B131494p21351p92737j7132K52348k41935l45345K36430M58760J0155j43058
38404H27629L21631M97196M1558k14180N4425P4913l97133n03192O4734L93388
38394A160969j0704l76608j58914K4943l01027n31521j54899K87772K18949k8036
38384A30924j6279M192j92672k23870J20114L72950K50047J26168J44933j57295
38374E59212p68046q09287M6252P93482N59587r6643k44731l8271r5883k25047
$$ plain form
38364 -319375 -232987 251700 484519 15094 -718222 -1064230 -971201 -702392 -262412 378277
38354 378277 860915 785066 311813 -5698 74093 257247 163957 -230854 -629626 -756092
38344 -756092 -618794 -438691 -339263 -214176 40121 317224 467108 514487 528483 438423
38334 438423 206333 13783 -2448 -42653 -337198 -670059 -597361 -102228 351844 452923
38324 452923 380722 436139 628566 761284 722264 554678 333250 57399 -315595 -691905
38314 -691905 -774386 -405853 40682 3043 -425412 -471768 222063 1002292 1159214 976771
38304 976771 1163795 1628931 1660601 1147093 723517 682125 609671 292354 150116 426211
38294 426211 673986 503978 235338 297997 498267 433781 221144 206745 259139 -11249
$$ packed form
38364c19375Q6388M84687K32819m69425p33316l46008R3029K68809M39980O40689
38354C78277M82638p5849m73253l17511P9791J83154r3290l94811l98772j26466
38344g56092J37298J80103R9428J25087K54297K77103J49884M7379J3996r0060
38334D38423k32090j92550j6231m0205k94545l32861P2698M95133M54072J01079
38324D52923p2201N5417J92427J32718l9020j67586k21428k75851l72994l76310
38314f91905q2481L68533M46535l7639m28455m6356O93831P80229J56922j82443
38304I76771J87024M65136L1670n13508m23576m1392p2454l17317j42238K76095
38294D26211K47775j70008k68640O2659K00270o4486k12637j4399N2394k70388
$$ plain form
38284 -11249 -496683 -691740 -513738 -419228 -594099 -568102 91950 1070200 1609962 1355838
38274 1355838 623984 -57627 -415313 -456375 -295222 -88558 -6659 -91510 -169329 -51099
38264 -51099 182320 264108 144085 94293 294045 533235 548513 457318 524848 609476 269976
38253 269976 -504036 -1070193 -876916 -174331 292164 167065 -204357 -324724 -158871 -78248
38243 -78248 -294688 -537351 -404918 45027 288811 1686 -493155 -642577 -355969 -976
38233 -976 170552 237480 276772 200137 12003 -103112 -88182 -122659 -286917 -407452 -395307
38222 -395307 -427162 -573915 -572129 -271833 -17008 -172460 -488514 -428173 -31298 85496
38212 85496 -347160 -836899 -834605 -421940 -17283 233457 402152 398366 106508 -223093
$$ packed form
38284a1249m85434j95057J78002R4510j74871K5997O60052R78250N39762k54124
38274A355838p31854o81611l57686m1062J61153K06664Q1899q4851p7819J18230
38264e1099K33419Q1788j20023m9792J99752K39190J5278r1195O7530Q4628l39500
38253B69976p74012n66157J93277P02585M66495j25099l71422j20367J65853Q0623
38243g8248k16440k42663J32433M49945K43784k87125m94841j49422K86608L54993
38233i76J71528O6928L9292p6635j88134j15115J4930l4477j64258j20535J2145
38222c95307l1855j46753J786L00296K54825j55452l16054O0341L96875J16794
38212H5496m32656m89739K294M12665M04657K50740J68695l786k91858l29601
$$ plain form
38202 -223093 -183929 181841 399129 239558 -17678 -126078 -246590 -526709 -685374 -415245
38192 -415245 41654 168538 -79588 -238257 -30937 314665 521885 644320 824340 998149
38182 998149 1067899 1128199 1273510 1340173 1091322 590357 182494 99809 209047 186857
38172 186857 -81596 -304952 -73985 593509 1156952 1188448 928317 879047 989703 751700
38162 751700 128831 -206398 167741 735999 736621 179838 -275259 -210333 241070 795426
38152 795426 1260457 1438300 1212641 769847 451926 401025 566532 942961 1496584 1956513
38142 1956513 2035199 1839197 1753359 1928260 2162922 2262870 2208559 1977972 1523181 973722
38132 973722 586004 412296 235060 -103542 -479023 -644015 -499415 -206123 -90212 -341043
$$ packed form
38202b23093L9164L65770K17288j59571k57236j08400j20512k80119j58665K70129
38192d15245M56899J26884k48126j58669K07320L45602K07220J22435J80020J73809
38182I98149O9750O0300J45311O6663k48851n00965m07863q2685J09238k2190
38172A86857k68453k23356K30967O67494N63443L1496k60131m9270J10656k38003
38162G51700o22869l35229L74139N68258O22n56783m55097O4926M51403N54356
38152G95426M65031J77843k25659m42794l17921n0901J65507L76429N53623M59929
38142A956513P8686j96002q5838J74901K34662R9948n4311k30587m54791n49459
38132I73722l87718j73708j77236l38602l75481j64992J44600K93292J15911k50831
$$ plain form
38122 -341043 -724066 -763713 -326876 203908 484677 620833 791586 851355 692442 638080
38112 638080 957008 1282221 1106726 620729 391565 401324 182060 -167176 15772 794158
38102 794158 1326728 1048640 427261 137601 133417 24134 -164816 -152953 56610 288818
38092 288818 545316 825250 895376 639855 358153 330701 374879 227234 68819 213501
38082 213501 519450 605768 490452 518269 742064 857373 753993 698850 877054 1078902
38072 1078902 983573 573430 173130 149154 552585 997902 982939 410716 -303159 -681386
38062 -681386 -580884 -126850 453599 816698 652898 91328 -297771 -146661 282935 530101
38052 530101 529547 510426 557796 602422 657305 742246 723804 525994 352588 412525 575702
$$ packed form
38122c41043l83023l9647M36837N30784K80769J36156J70753N9769j58913n4362
38112F38080L18928L25213j75495m85997k29164R759k19264l49236J82948P78386
38102G94158N32570k78088o21379k89660m184j09283j88950J1863K09563K32208
38092B88818K56498K79934P0126k55521k81702k7452M4178j47645j58415J44682
38082B13501L05949Q6318j15316K7817K23795J15309j03380n5143J78204K01848
38072A078902r5329m10143m00300k3976M03431M45317j4963n72223p13875l78227
38062f81386J00502M54034N80449L63099j63800n61570l89099J51110M29596K47166
38052E30101n54j9121M7370M4626N4883Q4941j8442j97810j73406N9937J63177
$$ plain form
38041 575702 597883 536879 614726 768815 678272 222975 -335715 -640349 -563687 -301339
38031 -301339 -210592 -425722 -614940 -376425 109722 241194 -92904 -297283 -18842 295505
38021 295505 216610 98011 403743 809934 760821 506911 679942 1090282 951586 260730
38011 260730 -56589 446461 1092417 1149787 760013 412580 183559 -50308 -192615 -178079
38001 -178079 -209337 -359078 -340022 -11861 305685 375453 456163 769027 978503 695947
37991 695947 170062 -35412 181407 476719 649409 739954 696887 427792 119686 81353
37981 81353 281638 403611 340713 303355 432252 617418 733388 798504 864215 936675 1007514
37970 1007514 1018218 871884 635627 574927 755336 799008 382743 -168913 -233892 206431
$$ packed form
38041E75702K2181o1004P7847J54089r0543m55297n58690l04634P6662K62348
38031c01339R0747k15130j89218K38515M86147J31472l34098k04379K78441L14347
38021B95505p8895j18599L05732M06191m9113k53910J73031M10340j38696o90856
38011B60730l17319N03050O45956N7370l89774l47433k29021k33867j42307J4536
38001a78079l1258j49741J9056L28161L17546O9768Q0710L12864K09476k82556
37991F95947n25885k05474K16819K95312J72690R0545m3067k69095l08106l8333
37981H1353K00285J21973o2898l7358J28897J85166J15970O5116O5711P2460P0839
37970A007514J0704j46334k36257o0700J80409M3672m16265n51656o4979M40323
$$ plain form
37960 206431 512260 322018 49367 207715 663537 916560 816823 595644 385444 156430
37950 156430 43737 268387 681160 816957 559164 365805 591699 930473 889009 561807
37940 561807 472848 754699 982469 873245 680183 711780 858221 856095 702734 503305
37930 503305 165822 -405145 -987862 -1258063 -1206170 -1036791 -786703 -388521 -13769 35751
37920 35751 -229232 -479096 -490890 -281951 107780 576389 741194 244170 -620453 -1037696
37910 -1037696 -624399 132821 593778 719983 819503 897023 690447 199458 -205811 -190928
37900 -190928 249428 850767 1252533 1194119 726540 189603 -143140 -323466 -536625 -776809
37890 -776809 -858217 -659539 -230382 271305 660721 843168 918689 1050031 1188757 1125720
$$ packed form
37960B06431L05829j90242k72651J58348M55822K53023r9737k21179k10200k29014
37950A56430j12693K24650M12773J35797k57793j93359K25894L38774m1464l27202
37940E61807q8959K81851K27770j09224j93062L1597J46441k126j53361j99429
37930E03305l37483n70967n82717k70201N1893J69379K50088L98182L74752M9520
37920C5751k64983k49864j1794K08939L89731M68609J64805m97024q64623m17243
37910a037696M13297P57220M60957J26205R9520P7520k06576m90989m05269J4883
37900a90928M40356O01339M01766n8414m67579n36937l32743j80326k13159k40184
37890g76809q1408J98678M29157N01687L89416J82447P5521J31342J38726o3037
$$ plain form
37880 1125720 878992 772225 974934 1220736 1203340 1024808 976892 1065446 1074610 979809
37870 979809 947694 968288 830216 500849 230103 175302 162915 -31379 -321938 -387343
37860 -387343 -48343 525877 976875 1086262 954272 853142 910680 991428 901273 613512
37850 613512 238809 -115557 -347949 -321124 13852 462140 689080 522556 100432 -274717
37840 -274717 -365136 -100299 443477 1084847 1565987 1626088 1168942 408283 -241568 -516305
37830 -516305 -496510 -388682 -233811 9683 207864 134636 -196576 -525858 -702273 -826036
37820 -826036 -1000461 -1172875 -1281154 -1329496 -1244124 -882745 -279876 330131 808550 1190946
37810 1190946 1398856 1183530 534216 -121166 -347204 -155572 135904 300540 294668 168398
$$ packed form
37880A125720k46728j06767K02709K45802j7396j78532m7916Q8554R164r4801
37870I79809l2115K0594j38072l29367k70746n4801j2387j94294k90559o5405
37860c87343L39000N74220M50998J09387j31990j01130N7538Q0748r0155k87761
37850F13512l74703l54366k32392K6825L34976M48288K26940j66524m22124l75149
37840b74717r0419K64837N43776O41370M81140O0101m57146p60659o49851k74737
37830e16305J9795J07828J54871K43494J98181p3228l31212l29282j76415j23763
37820h26036j74425j72414j08279m8342Q5372L61379O02869O10007M78419L82396
37810A190946K07910k15326o49314o55382k26038J91632K91476J64636n872j26270
$$ plain form
37800 168398 86983 263988 679742 1013662 1009019 753293 492918 370026 423914 583770
37790 583770 569651 145569 -402259 -465168 7641 323462 65805 -231719 73833 708297
37780 708297 953358 774546 698259 773211 511268 -125291 -498784 -264145 117770 118833
37770 118833 -167161 -389056 -508646 -642096 -694644 -514201 -171135 180458 494892 677805
37760 677805 508059 -15957 -469220 -428036 16412 394631 406103 145339 -120508 -209492
37750 -209492 -90447 173440 505131 822301 956831 706987 136917 -302136 -228269 142846
37740 142846 234675 -131014 -552838 -671943 -596028 -560597 -530037 -384369 -238231 -288277
37730 -288277 -488893 -617037 -575719 -454019 -336018 -170467 186839 806265 1480178 1749822
$$ packed form
37800A68398q1415J77005M15754L33920m643k55726k60375j22892N3888J59856
37790E83770j4119m24082n47828o2909M72809L15821k57657k97524L05552O34464
37780G08297K45061j78812p6287P4952k61943o36559l73493K34639L81915J063
37770A18833k85994k21895j19590j33450n2548J80443L43066L51593L14434J82913
37760F77805j69746n24016m53263M1184M44448L78219J1472k60764k65847q8984
37750b09492J19045K63887L31691L17170J34530k49844n70070m39053P3867L71115
37740A42846R1829l65689m21824j19105P5915L5431L0560J45668J46138n0046
37730b88277k00616j28144M1318J21700J18001J65551L57306O19426O73913K69644
$$ plain form
37720 1749822 1339721 554391 9657 -44559 114639 199330 255368 404087 583911 728477
37710 728477 916653 1141561 1178817 908342 563932 439773 511082 545963 445947 288753
37700 288753 167630 158162 313816 536975 585889 362187 63722 -91822 -159853 -325747
37690 -325747 -576982 -677013 -416297 196291 933377 1506589 1799461 1919715 1927064 1657318
37680 1657318 1069917 609060 777201 1381394 1716905 1581745 1553176 2056455 2740830 3139629
37670 3139629 3428708 4053910 5024953 6105895 7370343 9011758 10866715 12677939 14549822
37661 14549822 16457677 17484846 16407735 13239174 9556909 6996305 5828695 5229009
37653 5229009 4475976 3517570 2646380 2051971 1697231 1429322 1157474 931523 814350
$$ packed form
37720A749822m10101p85330n44734n4216J59198Q4691N6038J48719J79824J44566
37710G28477J88176K24908L7256k70475l44410j24159P1309L4881j00016j57194
37700B88753j21123r468J55654K23159M8914k23702k98465j55544o8031j65894
37690c25747k51235j00031K60716O12588P37086N73212K92872J20254P349k69746
37680A657318n87401m60857J68141O04193L35511j35160k8569N03279O84375L98799
37670C139629K89079O25202R71043J080942J264448J641415J854957J811224J871883
37661A4549822J907855J027169j077111l168561l682265k560604j167610n99686
37653E229009p53033r58406q71190n94409l54740k67909k71848k25951j17173
$$ plain form
37644 814350 741254 619062 489929 441199 439315 450456 625808 1089912 1586165 1646683 1174675
37633 1174675 606691 407384 589929 812921 802174 602671 492886 667941 985970 1128847
37623 1128847 1052703 1055528 1268396 1387479 1185211 963463 1063566 1191947 815285 98340
37613 98340 -207640 154838 627312 741043 707288 825971 906932 711914 496571 592683
37603 592683 774910 583834 98684 -120808 199315 767515 1196964 1377064 1355426 1203797
37593 1203797 1096748 1247547 1632873 1958161 1996503 1820582 1616547 1411613 1121669 797325
37583 797325 661215 844785 1164665 1261479 968663 460416 13091 -262005 -387917 -387956
37573 -387956 -330874 -356230 -438658 -266573 353007 1073324 1356965 1206895 1131267 1348027
$$ packed form
37644H14350p3096j22192j29133m8730j884J1141J75352M64104M96253O0518m72008
37633A174675n67984j99307J82545K22992j0747j99503j09785J75055L18029J42877
37623A128847p6144K825K12868J19083k02268k21748J00103J28381l76662p16945
37613I8340l05980L62478M72474J13731l3755J18683Q0961j95018k15343R6112
37603E92683J82227j91076m85150k19492L20123N68200M29449J80100k1638j51629
37593A203797j07049J50799L85326L25288L8342j75921k04035k04934k89944l24344
37583G97325j36110J83570L19880R6814k92816n08247m47325k75096j25912l9
37573c87956N7082k5356q2428J72085O19580P20317K83641j50070p5628K16760
$$ plain form
37563 1348027 1501808 1318507 1039532 910703 695626 127483 -496504 -670412 -415992
37554 -415992 -164049 -34529 234667 654160 804534 440434 -119073 -403199 -330234 -167857
37544 -167857 -149426 -272023 -345222 -164441 250543 594852 628729 560246 820466 1427799
37534 1427799 1875322 1778488 1376524 1207694 1488950 2029412 2616750 3251322 4020562 4889779
37524 4889779 5631648 5941571 5705938 5174704 4724417 4411111 3951458 3220539 2508945
37515 2508945 2107230 1891735 1604312 1327651 1301073 1399028 1271424 1017604 1203687 1998692
37505 1998692 2741846 2739458 2186242 1845939 1982116 2109663 1823827 1391000 1304508 1596591
37495 1596591 1892581 1963297 1918593 1913445 1933749 1916459 1890290 1908986 1954628 1985712 2005926
$$ packed form
37563A348027J53781j83301k78975j28829k15077n68143o23987j73908K54420
37554d15992K51943J29520K69196M19493J50374l64100n59507k84126P2965J62377
37544a67857J8431j22597p3199J80781M14984L44309L3877o8483K60220O07333
37534A427799M47523r6834m01964j68830K81256N40462N87338O34572P69240Q69217
37524D889779P41869L09923k35633n31234m50287l13306m59653p30919p11594
37515B508945m01715k15495k87423k76661k6578R7955j27604k53820J86083P95005
37505A998692P43154k388n53216l40303J36177J27547k85836m32827q6492K92083
37495A596591K95990P0716m4704n148K0304j7290k6169J8696M5642L1084K0214
$$ plain form
37484 2005926 2007905 1911731 1672657 1435275 1436632 1683542 1853635 1671148 1299167 1136690
37474 1136690 1251573 1317801 1197118 1217108 1613230 2028074 1993679 1697773 1738393 2184118
37464 2184118 2460655 2265772 2026451 2200536 2615299 2842478 2848071 2902798 3138783 3525554
37454 3525554 4019270 4445978 4543746 4415361 4567874 5153527 5618172 5586610 5621897 6418179
37444 6418179 7616164 8275301 8342005 8736652 9962458 11511698 12836332 14105852 15706675
37435 15706675 17685559 20050514 23063264 26900750 31493859 36925544 43472833 51039748
37427 51039748 59073310 67213011 75474885 83775421 92144701 101655337 114260712 131472964
37419 131472964 154290227 184707904 225545425 277321816 336076787 395084965 447112096
$$ packed form
37484B005926J979r6174k39074k37382J357K46910J70093j82487l71981j62477
37474A136690J14883O6228j20683J9990L96122M14844l4395k95906M0620M45725
37464B184118K76537j94883k39321J74085M14763K27179N593N4727K35985L86771
37454C525554M93716M26708R7768j28385J52513N85653M64645l1562L5287P96282
37444F418179J197985O59137O6704L94647J225806J549240J324634J269520J600823
37435A5706675J978884K364955L012750L837486M593109N431685O547289P566915
37427E1039748Q033562Q139701Q261874Q300536Q369280R510636J2605375J7212252
37419A31472964K2817263L0417677M0837521N1776391N8754971N9008178N2027131
$$ plain form
37412 447112096 483388733 492775286 466971261 408845471 333771099 260590307 201013004
37405 201013004 157064124 125786600 103858230 88655423 77908038 69889055 63506888
37398 63506888 57849132 52060865 45826306 39548293 33838376 28984039 24893318 21353011
37390 21353011 18332383 16082122 14777187 14038325 13140572 11830790 10566770 9758735
37382 9758735 9201106 8531322 7810341 7280721 6945031 6761831 6836810 6992391 6617923 5499694
37372 5499694 4358368 3913487 3836696 3415922 2875699 3029742 3778371 4067960 3483791
37363 3483791 2822750 2733920 2783828 2438752 2106162 2404910 2999385 3031637 2394392 1771781
37353 1771781 1565467 1509178 1319486 1064040 798094 410905 6950 -26072 448650 1059014
$$ packed form
37412D47112096L6276637R386553k5804025n8125790p5074372p3180792n9577303
37405B01013004m3948880l1277524k1928370j5202807j0747385q018983o382167
37398F3506888n657756n788267o234559o278013n709917m854337m090721l540307
37390B1353011l020628k250261j304935p38862q97753j309782j264020q08035
37382I758735n57629o69784p20981n29620l35690j83200P4979J55581l74468j118229
37372E499694j141326m44881p6791m20774n40223J54043P48629K89589n84169
37363C483791o61041q8830M9908l45076l32590K98748N94475L2252o37245o22611
37353A771781k06314n6289j89692k55446k65946l87189m03955l3022M74722O10364
$$ plain form
37343 1059014 1400696 1490531 1561416 1662077 1671758 1531247 1278897 1000557 869876 1054809
37333 1054809 1434831 1609865 1386217 1063573 995122 1052491 881836 583105 673309 1288222
37323 1288222 1857793 1835625 1427248 1234782 1378492 1401313 1014287 517005 344110 509712
37313 509712 717099 820272 937143 1192101 1554998 1931145 2270768 2560742 2782827 2924269
37303 2924269 3042151 3308173 3891885 4697292 5312577 5416360 5174695 4977306 4817308
37294 4817308 4304029 3361574 2467440 1960666 1551132 908328 349987 381063 782937 822793
37284 822793 337476 -28260 228172 856330 1372925 1639641 1651070 1278803 636452 277525
37274 277525 538664 962672 860606 264971 -148637 16472 482042 777946 713437 368625
$$ packed form
37343A059014L41682Q9835P0885J00661R681j40511k52350k78340j30681J84933
37333A054809L80022J75034k23648l22644o8451N7369j70655k98731R0204O14913
37323A288222N69571k2168m08377j92466J43710K2821l87026m97282j72895J65602
37313E09712K07387J03173J16871K54958L62897L76147L39623K89974K22085J41442
37303B924269J17882K66022N83712Q05407O15285J03783k41665j97389j59998
37294D817308n13279r42455q94134n06774m09534o42804n58341L1076M01874L9856
37284H22793m85317l65736K56432O28158N16595K66716J1429l72267o42351l58927
37274B77525K61139M24008j02066n95635m13608J65109M65570K95904o4509l44812
$$ plain form
37264 368625 -15274 -122230 121960 313178 2319 -619816 -864509 -443601 186133 520456
37254 520456 626864 811981 1051731 1135479 1134936 1305475 1613488 1742857 1572315 1323167
37244 1323167 1176211 1022761 718757 381477 271888 477884 830180 1075708 1059781 802711
37234 802711 489431 354265 489309 753342 910870 863824 720499 657660 768305 1030124
37224 1030124 1328771 1476574 1319698 938565 663145 722235 906739 787173 291319 -177292
37214 -177292 -296317 -229679 -268726 -326149 -128271 248216 449417 422216 493975 798702
37204 798702 1027052 921001 672033 593181 666591 664880 502977 229605 -132520 -497668
37194 -497668 -656396 -550952 -435036 -517161 -644517 -610439 -539829 -610739 -611705 -238170 299499
$$ packed form
37264C68625l83899j06956K44190J91218l10859o22135k44693M20908O29734L34323
37254E20456J06408J85117K39750Q3748n43J70539L08013J29369j70542k49148
37244A323167j46956j53450l04004l37280j09589K05996L52296K45528j5927k57070
37234H02711l13280j35166J35044K64033J57528m7046j43325o2839J10645K61819
37224A030124K98647J47803j56876l81133k75420N9090J84504j19566m95854m68611
37214a77292j19025O6638l9047n7423J97878L76487K01201k7201P1759L04727
37204G98702K28350j06051k48968p8852P3410j711j61903k73372l62125l65148
37194d97668j58728J05444J15916q2125j27356L4078P0610p0910r66L73535N37669
$$ plain form
37183 299499 472710 205761 -61344 -109096 -193008 -430253 -480857 -116923 341202 487832
37173 487832 367702 223243 56360 -177252 -243045 55930 443565 494873 252533 89036
37163 89036 72174 -61950 -349042 -501598 -431599 -411080 -575277 -676600 -535363 -382459
37153 -382459 -491350 -732542 -775695 -563590 -328370 -245163 -284457 -333143 -293755 -137554
37143 -137554 9493 -57805 -321108 -446410 -184033 258802 474095 389371 274105 254456
37133 254456 156520 -85349 -183620 122923 649297 981423 1009985 989640 1095882 1190061
37123 1190061 1098018 900446 797119 825891 884750 933324 971564 864204 432160 -212796
37113 -212796 -635138 -533567 -110193 179990 160904 26806 -49795 -157531 -424599 -765013
$$ packed form
37183B99499J73211k66949k67105m7752q3912k37245n0604L63934M58125J46630
37173D87832j20130j44459j66883k33612o5793K98975L87635N1308k42340j63497
37163H9036j6862j34124k87092j52556O9999K0519j64197j01323J41237J52904
37153c82459j08891k41192m3153K12105K35220Q3207l9294m8686L9388J56201
37143a37554J47047o7298k63303j25302K62377M42835K15293q4724j15266j9649
37133B54456r7936k41869r8271L06543N26374L32126K8562k0345J06242R4179
37123A190061r2043j97572j03327K8772N8859M8574L8240j07360m32044o44956
37113b12796m22342J01571M23374K90183j9086j34098p6601j07736k67068l40414
$$ plain form
37103 -765013 -998528 -1097829 -1147772 -1139769 -997869 -774197 -601500 -429441 -58300 440949
37093 440949 585376 22064 -916793 -1505356 -1441606 -1071213 -783766 -559839 -270620 -53792
37083 -53792 -69976 -140951 -18535 139753 -14331 -396203 -538858 -321365 -200377 -536491
37073 -536491 -1058877 -1245962 -965715 -493870 -117132 47854 32587 35638 286804 695202
37063 695202 838623 520431 108005 51938 294884 469082 460379 402118 300061 104940
37053 104940 31725 322852 739784 784132 449180 263447 509563 889067 1093411 1205199
37043 1205199 1324121 1295478 1116179 1144815 1506744 1690050 1218262 422202 9575 78231
37033 78231 134838 -18744 -60172 134745 187361 -97698 -253469 223963 1087347 1621538
$$ packed form
37103g65013k33515r9301m9943Q003J41900K23672J72697J72059L71141M99249
37093D40949J44427n63312r38857n88563O3750L70393K87447K23927K89219K16828
37083e3792j6184p0975J22416J58288j54084l81872j42655K17493J20988l36114
37073e36491n22386j87085K80247M71845L76738J64986j5267L051K51166M08398
37063F95202J43421l18192m12426n6067K42946J74198q703n8261j02057j95121
37053A04940p3215K91127M16932M4348l34952j85733K46116L79504K04344J11788
37043A205199J18922k8643j79299K8636L61929J83306m71788p96060m12627O8656
37033G8231N6607j53582m1428J94917N2616k85059j55771M77432Q63384N34191
$$ plain form
37023 1621538 1551470 1235303 1011282 807633 509951 307985 392398 552487 421531 32081
37013 32081 -203083 -74319 162042 188734 28276 -102839 -114030 -35123 125475 322444
37003 322444 416745 347301 207256 6942 -399999 -946040 -1208927 -980273 -686718 -796248
36993 -796248 -1069772 -984809 -697450 -827647 -1314883 -1343104 -626695 47411 -19444 -449531
36983 -449531 -504393 -174708 92057 252211 520073 720690 561921 340795 616556 1272976
36973 1272976 1625679 1438780 1139715 996931 796315 464332 320870 464214 508800 242265
36963 242265 23853 196859 559514 766461 846755 951018 944899 663998 303212 162158
36953 162158 209619 240292 250179 305502 247316 -69049 -376605 -254094 267435 725953 844287
$$ packed form
37023A621538p0068l16167k24021k03649k97682k01966Q4413J60089j30956l89450
37013C2081k35164J28764K36361K6692j60458j31115j1191P8907J60598J96969
37003C22444R4301o9444j40045k00314m06941n46041k62887K28654K93555j09530
36993g96248k73524Q4963K87359j30197m87236k8221P16409O74106o6855m30087
36983d49531n4862L29685K66765J60154K67862K00617j58769k21126K75761O56420
36973A272976L52703j86899k99065j42784k00616l31983j43462J43344M4586k66535
36963B42265k18412J73006L62655K06947Q0294J04263o119k80901l60786j41054
36953A62158M7461L0673R887N5323n8186l16365l07556J22511N21529M58518J18334
$$ plain form
36942 844287 771870 681208 483198 95796 -260688 -251816 177587 735464 1080453 1119945
36932 1119945 1020766 957538 885379 615116 108733 -396339 -601012 -408330 41870 482764
36922 482764 638169 406727 29198 -90233 132071 303253 56652 -422597 -606321 -293426
36912 -293426 175099 386792 321891 254408 336965 422228 274026 -126114 -524156 -648621
36902 -648621 -484018 -238239 -71486 33851 136232 223015 298696 437026 634794 730931
36892 730931 598038 324536 87936 -56611 -127382 -60348 210835 567981 788300 806473
36882 806473 738298 648514 474349 219789 48440 71736 156613 80218 -163338 -337781
36872 -337781 -269765 -83172 -53018 -269799 -551640 -697680 -711270 -706205 -704962 -654061 -559125
$$ packed form
36942H44287p2417r0662j98010l87402l56484Q872M29403N57877L44989L9492
36932A119945r9179o3228p2159k70263n06383n05072k04673J92682M50200M40894
36922D82764J55405k31442l77529j19431K22304J71182k46601m79249j83724L12895
36912b93426M68525K11693o4901o7483Q2557Q5263j48202m00140l98042j24465
36902f48621J64603K45779J66753J05337J02381Q6783P5681J38330J97768R6137
36892G30931j32893k73502k36600j44547p0771O7034K71183L57146K20319J8173
36882H06473o8175q9784j74165k54560j71349K3296Q4877p6395k43556j74443
36872c37781O8016J86593L0154k16781k81841j46040j3590N065J243N0901R4936
$$ plain form
36861 -559125 -454204 -298375 -78416 38837 -117125 -401845 -471622 -264594 -101334 -210577
36851 -210577 -422134 -478062 -389723 -288894 -167526 -16707 -13555 -262351 -492273 -341311
36841 -341311 123392 464964 417466 91416 -313929 -680013 -835185 -597950 -90307 247184
36831 247184 123721 -277891 -570192 -598465 -472743 -303127 -94214 132133 265902 210858
36821 210858 4024 -205074 -291773 -251251 -139026 40338 298078 531721 578146 444630
36811 444630 328737 315298 222262 -109544 -537519 -812034 -893710 -854971 -628769 -164553
36801 -164553 264631 268290 -149142 -598019 -830143 -918401 -887409 -582524 -73372 190683
36791 190683 -84265 -593432 -815254 -664739 -479993 -472669 -496496 -362807 -143350 -64386
$$ packed form
36861e59125J04921J55829K19959J17253j55962k84720o9777K07028J63260j09243
36851b10577k11557n5928Q8339J00829J21368J50819L152k48796k29922J50962
36841c41311M64703L41572m7498l26050m05345l66084j55172K37235N07643L37491
36831B47184j23463m01612k92301k8273J25722J69616K08913K26347J33769n5044
36821B10858k06834k09098q6699M0522J12225J79364K57740K33643M6425j33516
36811D44630j15893j3439r3036l31806m27975k74515q1676L8739K26202M64216
36801a64553M29184L659m17432m48877k32124q8258L0992L04885N09152K64055
36791A90683k74948n09167k21822J50515J84746P324k3827J33689K19457P8964
$$ plain form
36781 -64386 -198244 -341692 -230821 107616 304174 76856 -364487 -578279 -521608 -586882
36771 -586882 -943597 -1238189 -1156171 -901603 -793504 -731702 -506758 -360282 -661192 -1159344
36761 -1159344 -1210629 -786873 -598042 -980338 -1289060 -835135 57343 509335 319893 105138
36751 105138 278420 520462 418689 121454 35119 182169 227839 29104 -160712 -70795
36741 -70795 197505 264724 -84918 -630995 -952110 -928770 -864772 -994738 -1059356 -673816
36731 -673816 -29572 212895 -156843 -529535 -310966 244483 451462 183116 -68642 -9808
36721 -9808 122813 94546 42704 146112 323275 465948 650016 909550 1088066 1110340
36711 1110340 1121139 1160367 1009964 601266 252183 193403 165245 -136343 -481277 -429252
$$ packed form
36781f4386j33858j43448J10871L38437J96558k27318m41343k13792N6671o5274
36771e86882l56715k94592Q2018K54568J08099O1802K24944J46476l00910m98152
36761a159344n1285M23756J88831l82296l08722M53925Q92478M51992j89442k14755
36751A05138J73282K42042j01773k97235q6335J47050M5670j98735j89816Q9917
36741g0795K68300O7219l49642n46077l21115K3340O3998j29966o4618L85540
36731f73816O44244K42467l69738l72692K18569N55449K06979k68346k51758N8834
36721i808J32621k8267n1842J03408J77163J42673J84068K59534J78516K2274
36711A110340J0799L9228j50403m08698l49083n8780k8158l01588l44934N2025
$$ plain form
36701 -429252 -51835 158133 13496 -206041 -285734 -283513 -170586 243944 884274 1321270
36691 1321270 1305117 1049207 823610 620785 430452 484254 904892 1356886 1394650 1043687
36681 1043687 752397 827697 1152219 1436739 1555964 1592432 1638887 1609913 1307173 739070
36671 739070 267756 221704 411767 336792 -91852 -378149 -130371 423094 838604 1064482
36661 1064482 1313653 1553353 1514279 1136437 678699 388608 302255 349929 438133 438104 289620
36650 289620 116562 94708 242503 464799 697779 845576 720624 303647 -46195 44698
36640 44698 428172 584524 320641 -17414 -104756 -67125 -171208 -368187 -406970 -245861
36630 -245861 -104675 -172387 -441284 -771517 -960268 -807800 -301825 263373 508015 343872
$$ packed form
36701d29252L77417K09968j44637k19537p9693K221J12927M14530O40330M36996
36691A321270j6153k55910k25597k02825j90333N3802M20638M51994L7764l50963
36681A043687k91290P5300L24522K84520J19225L6468M6455k8974l02740n68103
36671G39070m71314m6052J90063p4975m28644k86297K47778N53465M15510K25878
36661A064482K49171K39700l9074l77842m57738k90091q6353M7674Q8204k9j48484
36650B89620j73058k1854J47795K22296K32980J47797j24952m16977l49842R0893
36640D4698L83474J56352k63883l38055q7342L7631j04083j96979l8783J61109
36630b45861J41186o7712k68897l30233j88751J52468N05975N65198K44642j64143
$$ plain form
36620 343872 30106 -156577 -191014 -212238 -300307 -429967 -559768 -653605 -650662 -522601 -352975
36609 -352975 -256771 -209698 -65780 211354 434638 390588 92592 -229354 -346057 -191267
36599 -191267 121094 379873 454281 460253 662528 1125958 1566114 1664813 1450299 1252242
36589 1252242 1375973 1920045 2741518 3413793 3399735 2559128 1398190 554426 139950
36580 139950 -123098 -289384 -163226 175552 334745 196259 94201 273743 589520 891584
36570 891584 1281694 1783841 2171670 2370489 2668366 3287696 4081336 4847048 5574527 6225291
36560 6225291 6739905 7473857 9118430 11977018 15879986 20857240 26779187 31814901
36552 31814901 32650892 27734636 19677782 12949407 9438545 7639104 5853206 4290227
$$ packed form
36620C43872l13766j86683l4437k1224q8069j29660j29801r3837K943J28061J69626
36609c52975R6204M7073J43918K77134K23284m4050k97996l21946j16703J54790
36599a91267L12361K58779P4408N972K02275M63430M40156R8699k14514j98057
36589A252242J23731N44072Q21473O72275j4058q40607j160938q43764m14476
36580A39950k63048j66286J26158L38778J59193j38486j02058J79542L15777L02064
36570H91584L90110N02147L87829J98819K97877O19330P93640P65712P27479O50764
36560F225291N14614P33952J644573K858588L902968M977254N921947N035714
36552C1814901Q35991m916256q056854o728375l510862j799441j785898j562979
$$ plain form
36544 4290227 3640263 3432200 2906057 2320549 2241133 2324933 1893369 1145840 792506 884356
36534 884356 943576 935209 1172888 1453334 1211359 510470 50893 117973 254021 108014
36524 108014 -61857 41296 246402 271334 172259 152974 219019 261273 277399 327595 412237
36513 412237 500405 563592 544022 410912 242406 134033 84829 96462 244588 460443
36503 460443 428844 9224 -391688 -255807 304068 651492 487308 184625 165680 341073
36493 341073 376808 228802 154276 322559 596548 667217 368354 -88448 -266741 -35852
36483 -35852 172042 -108595 -689031 -927952 -610704 -216028 -195205 -384144 -365676 -102680
36473 -102680 98693 76708 -33876 -72782 -49833 -64945 -157480 -248768 -212330 -47142 44977
$$ packed form
36544D290227o49964k08063n26143n85508p9416Q3800m31564p47529l53334R1850
36534H84356N9220q367K37679K80446k41975p00889m59577O7080J36048j46007
36524A08014j69871J03153K05106K4932r9075j9285O6045M2254J6126N0196Q4642
36513D12237Q8168O3187j9570j33110j68506j08373m9204J1633J48126K15855
36503D60443l1599m19620m00912J35881N59875L47424j64184l02683j8945J75393
36493C41073L5735j48006p4526J68283K73989P0669k98863m56802j78293K30889
36483c5852K07894k80637n80436k38921L17248L94676K0823j88939J8468K62996
36473a02680K01373k1985j10584l8906K2949j5112r2535r1288L6438J65188R2119
$$ plain form
36462 44977 -120426 -423981 -542780 -353675 -58011 124772 194010 249832 330594 423808
36452 423808 458541 266651 -217303 -693027 -726984 -330384 9802 944 -101621 -1395
36442 -1395 155953 120622 37436 200280 531774 745757 887286 1256113 1848589 2318331
36432 2318331 2497633 2527136 2416851 1938164 1123003 460119 315216 436138 316408 -148271
36422 -148271 -625287 -804151 -637054 -251250 119974 206609 -45054 -334730 -344592 -162372
36412 -162372 -137802 -368046 -602627 -654078 -591595 -462731 -152688 316519 642134 632223
36402 632223 499408 490065 453027 150571 -174292 -39924 466098 645463 143451 -500396
36392 -500396 -564037 -62417 422704 581398 597599 650373 657135 551904 436054 341195 142599
$$ packed form
36462D4977j65403l03555j18799J89105K95664J82783O9238N5822Q0762R3214
36452D23808L4733j91890m83954m75724l3957L96600L40186q858j02565J00226
36442a395J57348l5331q3186J62844L31494K13983J41529L68827N92476M69742
36432B318331J79302K9503j10285m78687q15161o62884j44903J20922j19730m64679
36422a48271m77016j78864J67097L85804L71224Q6635k51663k89676r862J82220
36412a62372K4570k30244k34581n1451O2483J28864L10043M69207L25615r911
36402F32223j32815r343l7038l02456l24863J34368N06022J79365n02012o43847
36392e00396o3641N01620M85121J58694J6201N2774O762j05231j15850r4859j98596
$$ plain form
36381 142599 -159449 -320097 -163295 167483 403149 444914 362920 248861 178282 192316
36371 192316 224452 162196 43868 51668 248549 490704 673415 860272 1049360 1025063
36361 1025063 633237 47247 -436875 -740525 -938489 -985339 -764793 -367865 -81287 -75167
36351 -75167 -268980 -511435 -729125 -879386 -920074 -895418 -945115 -1140909 -1342178 -1275206
36341 -1275206 -807365 -166734 189558 52999 -231185 -124961 438100 993631 1194302
36332 1194302 1192406 1218196 1134395 736324 228820 -6839 32307 66777 86500 352731 852884
36321 852884 1202296 1182491 998616 891857 841917 766052 671661 491248 119223 -249538
36311 -249538 -203585 264256 601199 412906 -26684 -272534 -332250 -409890 -385198 -53712
$$ packed form
36381A42599l02048j60648J56802L30778K35666M1765q1994j14059p0579J4034
36371A92316L2136o2256j18328P800J96881K42155J82711J86857J89088k4297
36361A025063l91826n85990m84122l03650j97964m6850K20546L96928K86578O120
36351g5167j93813k42455k17690j50261m0688K4656m9697j95794k01269O6972
36341a275206M67841O40631L56292j36559k84184J06224N63061N55531K00671
36332A194302j896K5790q3801l98071n07504k35659L9146L4470J9723K66231N00153
36321H52884L49412j9805j83875j06759m9940p5865r4391j80413l72025l68761
36311b49538M5953M67841L36943j88293m39590k45850n9716p7640K4692L31486
$$ plain form
36301 -53712 354606 444474 314492 406297 748166 891843 628888 235021 -93988 -506169
36291 -506169 -990284 -1126694 -687674 -104238 58204 -167730 -320835 -224163 -135815 -270852
36281 -270852 -537404 -770503 -946253 -1085536 -1130352 -1010371 -757286 -511426 -425147 -518459
36271 -518459 -620828 -546307 -333291 -163060 -25985 292629 791957 1094048 922279 522001
36261 522001 329130 388283 409199 272094 122691 25636 -103558 -206749 -86926 216231
36251 216231 388317 302939 212597 303338 343740 30331 -508798 -832599 -733301 -446105
36241 -446105 -332398 -502487 -755697 -819387 -655019 -519682 -637847 -852842 -810146 -508478
36231 -508478 -381565 -681384 -1055480 -1003729 -558643 -183897 -100383 -68921 149167 442427
$$ packed form
36301e3712M08318Q9868j29982R1805L41869J43677k62955l93867l29009m12181
36291e06169m84115j36410M39020N83436J62442k25934j53105R6672Q8348j35037
36281b70852k66552k33099j75750j39283m4816J19981K53085K45860Q6279r3312
36271e18459j02369P4521K13016J70231J37075L18614M99328L02091j71769m00278
36261E22001j92871N9153K0916j37105j49403r7055j29194j03191J19823L03157
36251B16231J72086q5378r0342R0741M0402l13409n39129l23801R9298K87196
36241d46105J13707j70089k53210o3690J64368J35337j18165k14995M2696L01668
36231e08478J26913k99819l74096N1751M45086L74746Q3514L1462K18088K93260
$$ plain form
36221 442427 558932 416815 81528 -365137 -783609 -961713 -827196 -601143 -571580 -737458
36211 -737458 -830861 -711539 -578873 -678776 -910377 -935995 -699012 -580835 -856132 -1187838
36201 -1187838 -1004348 -335712 125261 -77766 -571997 -714332 -440438 -202659 -262356 -455618
36191 -455618 -585392 -642360 -614965 -431748 -160766 22049 108509 215450 249175 -30617
36181 -30617 -538323 -847370 -801326 -747677 -939800 -1101692 -905342 -518547 -276273 -127514
36171 -127514 97122 130938 -390709 -1143149 -1345504 -869698 -474397 -703944 -1147947 -1160249
36161 -1160249 -793196 -521536 -440560 -330926 -255711 -432140 -614814 -300310 381145 651210
36151 651210 204146 -261961 -31142 607933 845505 508190 134564 76008 146345 157721
$$ packed form
36221D42427J16505j42117l35287m46665m18472j78104J34517K26053K9563j65878
36211g37458r3403J19322J32666r9903k31601k5618K36983J18177k75297l31706
36201a187838J83490O68636M60973k03027m94231j42335K73894K37779n9697j93262
36191d55618j29774n6968K7395J83217K70982J82815Q6460J06941L3725k79792
36181c0617n07706l09047M6044N3649j92123j61892J96350L86795K42274J48759
36171a27514K24636L3816n21647p52440k02355M75806L95301k29547m44003j2302
36161a160249L67053K71660Q0976J09634P5215j76429j82674L14504O81455K70065
36151F51210m47064m66107K30819O39075K37572l37315l73626n8556P0337J1376
$$ plain form
36141 157721 215208 342348 317522 96446 -32775 30691 -70534 -568967 -1066233 -1041554
36131 -1041554 -637298 -462152 -709995 -952260 -838743 -563345 -467039 -514035 -418008 -117004
36121 -117004 116952 8438 -417897 -867735 -1050217 -914116 -632189 -390017 -260745 -271458
36111 -271458 -432452 -630301 -671373 -565239 -575864 -799921 -906450 -597929 -163558 -174305
36101 -174305 -683254 -1144401 -1151551 -845017 -502242 -159724 169111 295392 154049 7855
36091 7855 73118 184876 106671 -55876 -48027 121061 265214 357687 462447 464935 213813
36080 213813 -146194 -310174 -236035 -126354 -40675 128682 301362 211470 -136474 -350290
36070 -350290 -159668 211670 371004 259424 134648 188111 371444 532224 565547 464800
$$ packed form
36141A57721N7487J27140k4826k21076j29221O3466j01225m98433m97266K4679
36131a041554M04256J75146k47843k42265J13517K75398R6306m6996R6027L01004
36121a17004K33956j08514m26335m49838j82482J36101K81927K42172J29272j0713
36111b71458j60994j97849m1072J06134j0625k24057j06529L08521M34371j0747
36101a74305n08949m61147p150L06534L42775L42518L28835J26281j41343j46194
36091G855O5263J11758p8205j62547P849J69088J44153R2473J04760K488k51122
36080B13813l60007j63980P4139J09681Q5679J69357J72680q9892l47944k13816
36070c50290J90622L71338J59334j11580j24776N3463J83333J60780L3323j00747
$$ plain form
36060 464800 333386 320687 470182 663888 769044 781111 764701 736284 704072 750346 920855
36049 920855 1047205 864922 394597 48321 173726 566446 676519 327848 -36809 18120
36039 18120 298845 274843 -154665 -547859 -544219 -230922 171072 610824 1040764 1280969
36029 1280969 1270854 1184326 1080434 740512 136992 -243730 35926 671079 939762 640840
36019 640840 260194 203881 315006 271381 86761 9073 151331 401021 559456 476481
36009 476481 170932 -140131 -255022 -214971 -165977 -69425 191477 454539 361886 -130392
35999 -130392 -629797 -811140 -774579 -771153 -835920 -869595 -858800 -809678 -626539 -249725 199745
35988 199745 555704 768223 820858 654259 329434 117627 231232 544093 738094 667459
$$ packed form
36060D64800j31414j2699J49495J93706J05156J2067j6410k8417l2212M6274J70509
36049I20855J26350j82283m70325l46276J25405L92720J10073l48671l64657N4929
36039A8120K80725k4002m29508l93194L640L13297M01994M39752M29940K40205
36029A280969j0115q6528j03892l39922o03520l80722K79656O35153K68683k98922
36019F40840l80646n6313J11125m3625j84620p7688J42258K49690J58435q2975
36009D76481l05549l11063j14891M0051M8994R6552K60902K63062r2653m92278
35999a30392m99405j81343L6561L426o4767l3675J0795M9122J83139L76814M49470
35988A99745L55959K12519N2635j66599l24825k11807J13605L12861J94001p0635
$$ plain form
35978 667459 450549 266006 182516 145243 33293 -226440 -529870 -633722 -392559 76291
35968 76291 494063 646467 528792 351777 368823 574883 624094 217780 -467173 -952154
35958 -952154 -1028864 -897059 -749424 -566015 -393163 -440662 -698668 -783091 -434588 65569
35948 65569 249125 46124 -235668 -356199 -326220 -282941 -399540 -782170 -1270163 -1511824
35938 -1511824 -1424507 -1344907 -1481846 -1504044 -1038843 -342379 -4550 -119510 -257408 -224295
35928 -224295 -299775 -600633 -727922 -343875 253017 479796 214450 -119457 -145398 40329
35918 40329 67833 -227656 -611276 -726362 -520326 -302979 -345778 -557542 -685902 -708159
35908 -708159 -799306 -979352 -1061878 -973924 -868069 -825350 -671465 -252323 234513 357099
$$ packed form
35978F67459k16910j84543q3490l7273j11950k59733l03430j03852K41163M68850
35968G6291M17772J52404j17675j77015J7046K06060M9211m06314o84953m84981
35958i52154p6710J31805J47635J83409J72852m7499k58006q4423L48503N00157
35948F5569J83556k03001k81792j20531K9979M3279j16599l82630m87993k41661
35938a511824Q7317P9600j36939k2198M65201O96464L37829j14960j37898L3113
35928b24295p5480l00858j27289L84047N96892K26779k65346l33907k5941J85727
35918D0329K7504k95489l83620j15086K06036K17347m2799k11764j28360k2257
35908g08159r1147j80046q2526Q7954J05855M2719J53885M19142M86836J22586
$$ plain form
35898 357099 -103499 -882448 -1407725 -1269414 -579057 133961 422360 292884 66184 -18844
35888 -18844 33066 91622 32399 -175982 -384199 -353615 -74146 138247 47826 -144900 -113237
35877 -113237 58029 -10224 -375315 -636635 -470843 6821 489689 796450 849318 620222
35867 620222 234141 -94160 -325149 -581872 -821414 -809275 -529904 -320004 -419644 -646622
35857 -646622 -689751 -484797 -147322 184485 263623 -163706 -888014 -1200834 -719082 10759
35847 10759 178533 -208983 -420078 -71623 457087 732194 814424 877232 764707 300490
35837 300490 -276296 -572744 -555649 -456775 -317581 -14824 333214 413454 229968 167001
35827 167001 367977 412711 -86022 -826002 -1147594 -898962 -550002 -448102 -405385 -177572
$$ packed form
35898C57099m60598p78949n25277J38311O90357P13018K88399j29476k26700q5028
35888a8844N1910N8556n9223k08381k08217L0584K79469K12393r0421j92726L1663
35877a13237J71266o8253l65091k61320J65792M77664M82868L06761N2868k29096
35867F20222l86081l28301k30989k56723k39542J2139K79371K09900r9640k26978
35857f46622m3129K04954L37475L31807P9138m27329p24308l12820M81752P29841
35847A0759J67774l87516k11095L48455N28710K75107Q2230O2808j12525m64217
35837C00490n76786k96448J7095R8874J39194L02757L48038Q0240j83486o2967
35827A67001K00976M4734m98733p39980l21592K48632L48960J01900M2717K27813
$$ plain form
35817 -177572 56921 9538 -202132 -231287 -59783 1328 -160009 -285534 -166621 69578
35807 69578 221139 316544 484879 681290 738881 641477 582549 707970 869977 736207
35797 736207 208110 -342496 -433472 -74334 238073 207227 93561 169166 194698 -129019
35787 -129019 -482106 -304109 260159 458465 37629 -409092 -412424 -312225 -601219 -1111713
35777 -1111713 -1337979 -1198316 -986930 -825897 -629884 -440230 -376112 -374096 -316713 -281838
35767 -281838 -360241 -403783 -265963 -88450 -28066 46481 210754 138812 -403073 -983424
35757 -983424 -1028761 -733488 -766666 -1161638 -1261079 -838923 -494247 -666739 -966198 -889436
35747 -889436 -625815 -650289 -934794 -1082194 -976209 -832086 -770386 -727962 -669405 -580404
$$ packed form
35817a77572K34493m7383k11670k9155J71504O1111j61337j25525J18913K36199
35807F9578J51561R5405J68335J96411N7591r7404n8928J25421J62007j33770
35797G36207n28097n50606r0976L59138L12407l0846j13666P5605K5532l23717
35787a29019l53087J77997N64268J98306m20836m46721l332J00199k88994n10494
35777a111713k26266J39663K11386J61033J96013J89654O4118K016N7383L4875
35767b81838p8403m3542J37820J77513O0384P4547J64273p1942n41885n80351
35757i83424m5337K95273l3178l94972r9441M22156L44676j72492k99459P6762
35747h89436K63621k4474k84505j47400J05985J44123O1700M2424N8557Q9001
$$ plain form
35737 -580404 -379523 -89038 71873 5192 -55740 88526 256460 205074 61251 66864
35727 66864 96609 -139926 -544856 -733515 -633366 -530613 -516310 -350355 19719 233281
35717 233281 14166 -423897 -689269 -696754 -636968 -645797 -703777 -744663 -701675 -526474 -272493
35706 -272493 -80112 -2982 58013 182639 291306 239772 -27191 -443829 -850745 -1061781
35696 -1061781 -1043116 -1014798 -1189033 -1408247 -1290612 -793932 -355333 -323841 -507415 -491843
35686 -491843 -204896 77761 138747 -9799 -248612 -422369 -393630 -236051 -242900 -505487
35676 -505487 -648730 -322748 169228 173077 -389955 -865965 -765733 -378790 -241441 -367546
35666 -367546 -377609 -157140 30060 18380 -28184 88163 309682 405983 218957 -196894
$$ packed form
35737e80404K00881K90485J60911o6681o0932J44266J67934n1386j43823N613
35727F6864K9745k36535m04930j88659J00149J02753J4303J65955L70074K13562
35717B33281k19115m38063k65372p485N9786q829n7980m0886M2988J75201K53981
35706b72493J92381P7130O0995J24626J08667n1534k66963m16638m06916k11036
35696a061781J8665K8318j74235k19214J17635M96680M38599L1492j83574J5572
35686d91843K86947K82657O0986j48546k38813j73757K8739J57579o849k62587
35676e05487j43243L25982M91976L849n63032m76010J00232L86943J37349j26105
35666c67546j0063K20469J87200j1680m6564J16347K21519R6301j87026m15851
$$ plain form
35656 -196894 -582063 -641141 -314035 134282 376876 343514 211751 158472 218900 322962
35646 322962 369689 319473 269295 331236 392857 196586 -227253 -448653 -174120 324377
35636 324377 590377 586345 573181 571596 390294 110749 62492 286536 470741 483550 515391
35625 515391 580598 374271 -152764 -536959 -433373 -125621 -65789 -239037 -358717 -395348
35615 -395348 -478293 -490320 -233081 102581 74491 -396491 -891815 -1001738 -709496 -278964
35605 -278964 3871 -7941 -210946 -325382 -241591 -201805 -456363 -868738 -1088493 -998643
35595 -998643 -763808 -570774 -564228 -875047 -1419646 -1821364 -1833936 -1674964 -1615875 -1473611
35585 -1473611 -957954 -322886 -107657 -319263 -465729 -389355 -442903 -762860 -1007811 -995490
$$ packed form
35656a96894l85169n9078L27106M48317K42594l3362j31763n3279O0428J04062
35646C22962M6727n0216n0178O1941O1621j96271m23839k21400K74533M98497
35636C24377K66000m032j3164j585j81302k79545m8257K24044J84205J2809L1841
35625E15391O5207k06327n27035l84195J03586L07752N9832j73248j19680l6631
35615c95348q2945j2027K57239L35662k8090m70982m95324j09923K92242M30532
35605b78964K82835j1812k03005j14436Q3791L9786k54558m12375k19755Q9850
35595i98643K34835J93034O546l10819n44599m01718j2572J58972N9089J42264
35585a473611N15657O35068K15229k11606j46466P6374n3548l19957k44951J2321
$$ plain form
35575 -995490 -981344 -1054429 -869119 -327647 44992 -138314 -475091 -387720 14861 236102
35565 236102 219651 276014 404806 327524 125435 239070 750093 1151755 999666 454127
35555 454127 18365 -35689 135499 177100 -93480 -470057 -567543 -325954 -134385 -287357
35545 -287357 -531504 -427237 15729 395971 482980 361418 102726 -314247 -771249 -1066443
35535 -1066443 -1213780 -1353415 -1394251 -1152436 -849643 -973437 -1495163 -1719795 -1199283 -379254
35525 -379254 35141 11399 12515 116772 -91898 -724471 -1224970 -1080834 -552314 -334783
35515 -334783 -647879 -1027786 -1024138 -749743 -578238 -572528 -502305 -282423 -47720 182458
35505 182458 542837 931363 951049 476173 -22772 -48194 228685 213747 -262866 -730436
$$ packed form
35575i95490J4146p3085J85310N41472L72639j83306l36777Q7371M02581K21241
35565B36102j6451N6363J28792p7282k02089J13635N11023M01662j52089n45539
35555D54127m35762n4054J71188M1601k70580l76577r7486K41589J91569j52972
35545b87357k44147J04267M42966L80242Q7009j21562k58692m16973m57002k95194
35535a066443j47337j39635m0836K41815L02793j23794n21726k24632N20512Q20029
35525c79254M14395k3742J116J04257k08670o32573n00499J44136N28520K17531
35515c34783l13096l79907L648K74395J71505N710P0223K19882K34703K30178
35505A82458L60379L88526J9686m74876m98945k5422K76879j4938m76613m67570
$$ plain form
35495 -730436 -728202 -336701 37396 147987 45736 -107445 -230401 -376901 -608980 -783054
35485 -783054 -592725 16680 616158 737355 469027 313949 494663 738570 763356 605604
35475 605604 376748 59823 -278384 -396080 -223992 -46070 -97822 -208098 -94197 176108
35465 176108 297159 172016 -23910 -145452 -194326 -181918 -109885 -77130 -202492 -422900
35455 -422900 -530299 -438876 -295452 -291929 -435736 -516252 -287195 249774 722310 684144
35445 684144 121483 -470135 -630369 -422243 -242879 -305811 -515346 -725380 -857854 -819454
35435 -819454 -573561 -307819 -287506 -496675 -638906 -550920 -408617 -443470 -649005 -869395
35425 -869395 -997068 -958137 -673320 -200537 203196 327333 228741 69574 -145020 -473378
$$ packed form
35495g30436K234L91501L74097J10591j02251j53181j22956j46500k32079j74074
35485g83054J90329O09405N99478J21197k68328j55078J80714K43907K4786j57752
35475F05604k28856l16925l38207j17696J72088J77922n1752j10276J13901K70305
35465A76108J21051j25143j95926j21542m8874J2408P2033L2755j25362k20408
35455d22900j07399R1423J43424L523j43807q0516K29057N36969M72536l8166
35445F84144n62661n91618j60234K08126J79364o2932k09535k10034j32474L8400
35435h19454K45893K65742K0313k09169j42231Q7986J42303l4853k05535k20390
35425h69395j27673L8931K84817M72783M03733J24137r8592j59167k14594l28358
$$ plain form
35415 -473378 -784600 -866886 -776331 -799899 -998664 -1050620 -704642 -177611 120343 114386 69994
35404 69994 147840 226968 177672 48441 -98974 -318165 -613372 -817943 -788107 -600557
35394 -600557 -424203 -304502 -210024 -182150 -276002 -436098 -588944 -765568 -942450 -864880
35384 -864880 -318829 418855 711351 278648 -433909 -771100 -591664 -287020 -196516 -257512
35374 -257512 -248613 -151216 -122548 -203392 -223604 -36951 254129 403605 321577 167162 116468
35363 116468 124236 -10168 -367340 -758202 -864182 -530359 63965 540543 651949 446054
35353 446054 98850 -275808 -543304 -471617 -23671 385081 310792 -39925 -3093 569484
35343 569484 1036167 910542 551989 482162 491564 60015 -635396 -865771 -426033 115341
$$ packed form
35415d73378l11222q2286R0555k3568j98765n1956L45978N27031K97954n957m4392
35404F9994P7846P9128m9296j29231j47415k19191k95207k04571K9836J87550
35394f00557J76354J19701R4478K7874r3852j60096j52846j76624j76882P7570
35384h64880N46051P37684K92496m32703p12557l37191J79436L04644R0504o0996
35374b57512Q899R7397K8668q0844k0212J86653K91080J49476q2028j54415n0694
35363A16468P768j34404l57172l90862j05980L33823N94324M76578J11406k05895
35353D46054l47204l74658k67496P1687M47946M08752p4289l50717L6832N72577
35343E69484M66683j25625l58553o9827R402m31549o95411k30375M39738N41374
$$ plain form
35333 115341 288674 226669 174610 72041 -166579 -419649 -611057 -800658 -882911 -617647
35323 -617647 -96276 270931 369171 489999 684884 598079 198032 42586 407758 739172
35313 739172 495682 27333 -8138 303171 351215 2996 -314821 -402215 -502988 -754589
35303 -754589 -965984 -963515 -732913 -272850 276820 482180 84267 -466518 -474758 39688
35293 39688 390144 238140 -12750 62250 342505 512236 516526 422630 174997 -266724
35283 -266724 -758320 -1079462 -1069386 -694982 -215593 -148993 -695519 -1296533 -1218206 -500743
35273 -500743 183507 535016 831493 1104281 898171 131123 -514010 -490404 -128640 -37441
35263 -37441 -254968 -463988 -603468 -742801 -709526 -377411 -42745 -9630 -66070 112635
$$ packed form
35333A15341J73333o2005n2059j02569k38620k53070j91408j89601q2253K65264
35323f17647N21371L67207R8240J20828J94885q6805m00047j55446L65172L31414
35313G39172k43490m68349l5471L11309M8044l48219l17817q7394j00773k51601
35303g54589k11395K469K30602M60063N49670K05360l97913n50785q240N14446
35293C9688L50456j52004k50890P5000K80255J69731M290r3896k47633m41721
35283b66724m91596l21142J0076L74404M79389O6600n46526o01014P8327P17463
35273e00743O84250L51509K96477K72788k06110p67048o45133K3606L61764R1199
35263c7441k17527k09020j39480j39333L3275L32115L34666L3115n6440J78705
$$ plain form
35253 112635 296494 24026 -571565 -871486 -665279 -371049 -327659 -387409 -328907 -225442
35243 -225442 -211745 -204504 -47931 247166 512680 546870 245472 -224844 -452059 -204590
35233 -204590 221893 324496 12899 -336907 -397426 -193116 75215 240091 215126 73558
35223 73558 45904 216450 319327 115686 -155493 -85394 227421 265576 -124997 -514083
35213 -514083 -553753 -406033 -315192 -180182 156951 509848 542729 183823 -351267 -752430
35203 -752430 -707306 -105729 647865 846221 280913 -448077 -719609 -680743 -850002 -1207767
35193 -1207767 -1234999 -769566 -258886 -77305 -80617 -16391 47139 -31852 -127812 -85685 -74624
35182 -74624 -336829 -689175 -650983 -105243 473085 571665 208019 -206081 -394878 -402729
$$ packed form
35253A12635J83859k72468n95591k99921K06207K94230M3390n9750N8502J03465
35243b25442J3697P241J56573K95097K65514L4190l01398m70316k27215K47469
35233b04590M26483J02603l11597l49806o0519K04310K68331J64876k4965j41568
35223G3558k7654J70546J02877k03641k71179P0099L12815L8155l90573l89086
35213e14083l9670J47720R0841J35010L37133L52897L2881l58906n35090m01163
35203g52430M5124O01577P53594J98356n65308p28990k71532L8866j69259l57765
35193a207767k7232M65433N10680J81581l312O4226O3530p8991r5960M2127J1061
35182g4624k62205l52346L8192N45740N78328R8580l63646m14100j88797p851
$$ plain form
35172 -402729 -332993 -156931 150347 454569 571764 469428 278739 170686 289232 696591
35162 696591 1225189 1448764 1037659 209757 -371141 -290760 156856 378080 238675 161702
35152 161702 469544 917795 1052095 831178 627673 670929 784897 762597 741548 986880
35142 986880 1431021 1683198 1488565 973166 410014 -56197 -384104 -535707 -540851 -529110
35132 -529110 -559325 -524886 -362593 -235420 -323615 -518163 -539442 -338265 -168717 -240872
35122 -240872 -492484 -752770 -948556 -1058350 -1015589 -786933 -466971 -193505 -12617 114931
35112 114931 224536 304994 291963 95906 -270643 -580527 -545042 -152659 259391 358741
35102 358741 141316 -180989 -478129 -733866 -887253 -862229 -747454 -743970 -874039 -903540
$$ packed form
35172d02729O9736J76062L07278L04222J17195j02336j90689j08053J18546M07359
35162F96591N28598K23575m11105q27902n80898Q0381M47616K21224j39405p6973
35152A61702L07842M48251J34300k20917k03505M3256J13968k2300k1049K45332
35142I86880M44141K52177j94633n15399n63152m66211l27907j51603n144J1741
35132e29110l0215L4439J62293J27173q8195j94548k1279K01177J69548p2155
35122b40872k51612k60286j95786j09794M2761K28656L19962K73466J80888J27548
35112A14931J09605Q0458j3031j96057l66549l09884L5485L92383M12050R9350
35102C58741k17425l22305k97140k55737j53387K5024J14775L484j30069k9501
$$ plain form
35092 -903540 -658848 -315782 -247354 -615754 -1201839 -1619347 -1626273 -1253615 -743343 -403446
35082 -403446 -426915 -731743 -972777 -805815 -204329 508871 970376 1075163 944416 694221
35072 694221 365582 48128 -111100 -100654 -109754 -274895 -455132 -418056 -200295 -94816
35062 -94816 -259834 -519807 -627924 -567664 -479661 -422332 -354612 -258781 -119402 128486 431341
35051 431341 482321 42630 -596106 -801475 -384872 103773 90678 -272158 -397002 -124136
35041 -124136 120338 13289 -234410 -278511 -146956 -94942 -134163 19402 539307 1200632
35031 1200632 1552533 1335708 716818 120078 -157541 -123608 83796 373826 617910 599669
35021 599669 287367 18638 122065 437588 529476 310310 78837 -31338 -184618 -364378
$$ packed form
35092i03540K44692L43066O8428l68400n86085m17508o926L72658N10272L39897
35082d03446k3469l04828k41034J66962O01486P13200M61505J04787j30747k50195
35072F94221l28639l17454j59228J0446r100j65141j80237L7076K17761J05479
35062i4816j65018k59973j08117O0260Q8003N7329O7720R5831J39379K47888L02855
35051D31341N0980m39691o38736k05369M16603M88645j3095l62836j24844K72866
35041a24136K44474j07049k47699m4101J31555N2014l9221J53565N19905O61325
35031A200632L51901k16825o18890n96740k77619L3933K07404K90030K44084j8241
35021E99669l12302k68729J03427L15523R1888k19166k31473j10175j53280j79760
$$ plain form
35011 -364378 -259946 181020 549699 577262 506064 577143 602496 417432 309337 519807
35001 519807 714609 504686 165847 219046 545965 590089 264461 -42176 -255081 -651815
34991 -651815 -1119311 -1170546 -835361 -753229 -1122350 -1302319 -844094 -243331 -178824 -552481
34981 -552481 -818984 -819516 -735213 -579905 -315993 -210974 -518795 -981800 -1154707 -1072566
34971 -1072566 -1097915 -1220367 -1034773 -417698 224698 447665 178642 -373580 -912465 -1159017
34961 -1159017 -1059575 -897464 -957070 -1130418 -1119045 -928510 -817773 -811215 -657432 -315356
34951 -315356 -103703 -233751 -484036 -499017 -214802 135418 291040 155786 -159451 -443283
34941 -443283 -627616 -885653 -1340679 -1748957 -1708271 -1184717 -605715 -380315 -506638 -699112
$$ packed form
35011c64378J04432M40966L68679K7563p1198P1079K5353j85064j08095K10470
35001E19807J94802k09923l38839N3199L26919M4124l25628l06637k12905l96734
34991f51815m67496n1235L35185Q2132l69121j79969M58225O00763O4507l73657
34981e52481k66503n32Q4303J55308K63912J05019l07821m63005j72907Q2141
34971a072566k5349j22452J85594O17075O42396K22967k69023n52222n38885k46552
34961a159017R9442J62111n9606j73348J1373J90535J10737O558J53783L42076
34951c15356K11653j30048k50285j4981K84215L50220J55622j35254l15237k83832
34941d43283j84333k58037m55026m08278M0686N23554N79002K25400j26323j92474
$$ plain form
34931 -699112 -741066 -648963 -593866 -698414 -869250 -886144 -708843 -555690 -569846 -599929 -497441
34920 -497441 -416273 -532787 -649127 -428217 89165 560065 835704 995800 966634 554674
34910 554674 -131352 -722744 -1089069 -1369197 -1486371 -1153125 -490468 -107325 -299898 -622621
34900 -622621 -559762 -225181 -56190 -161095 -340068 -473342 -531016 -440689 -280087 -353478
34890 -353478 -735038 -999072 -788456 -390511 -304188 -483995 -556213 -599330 -1039990 -1772819
34880 -1772819 -2070115 -1577544 -829973 -469553 -430412 -295897 -78390 -127297 -443988 -603883
34870 -603883 -374262 -6361 184172 206210 204426 133436 -138037 -509482 -682245 -540632
34860 -540632 -336490 -401561 -749740 -1067999 -1100585 -950291 -923283 -1107051 -1229566 -1016397
$$ packed form
34931f99112m1954R2103N5097j04548j70836j6894J77301J53153j4156l0083J02488
34920d97441Q1168j16514j16340K20910N17382M70900K75639J60096k9166m11960
34910E54674o86026n91392l66325k80128j17174L33246O62657L83143j92573l22723
34900f22621O2859L34581J68991j04905j78973j33274n7674R0327J60602p3391
34890c53478l81560k64034K10616L97945Q6323j79807p2218m3117m40660p32829
34880a772819k97296M92571P47571L60420L9141J34515K17507m8907l16691j59895
34870f03883K29621L67901J90533K2038j784p0990k71473l71445j72763J41613
34860e40632K04142o5071l48179l18259l2586J50294K7008j83768j22515K13169
$$ plain form
34850 -1016397 -582090 -280503 -189850 -16714 370821 619639 415402 102947 290235 875987
34840 875987 1049483 430318 -359082 -611192 -499586 -588962 -800036 -593753 -1220 309543
34830 309543 38300 -371323 -508070 -508108 -574439 -586746 -496195 -558312 -801783 -764338 -194389
34819 -194389 407459 422305 -43880 -401496 -361667 -41851 404283 777283 720579 134970
34809 134970 -496620 -676955 -568636 -612369 -741773 -589456 -267829 -239853 -487492 -511711
34799 -511711 -178126 110605 148645 164857 221900 60708 -275897 -340301 -55947 44589
34789 44589 -341402 -826429 -1041745 -1171123 -1371615 -1312949 -835893 -482133 -714309 -1087046
34779 -1087046 -908835 -349138 -120879 -334723 -481254 -415097 -531285 -941134 -1241877 -1252036
$$ packed form
34850a016397M34307L01587R0653J73136L87535K48818k04237l12455J87288N85752
34840H75987J73496o19165p89400k52110J11606q9376k11074K06283N92533L10763
34830C09543k71243m09623j36747l8o6331j2307R0551o2117k43471L7445N69949
34819a94389O01848J4846m66185l57616L9829L19816M46134L73000n6704n85609
34809A34970o31590j80335J08319m3733j29404J52317L21627K7976k47639k4219
34799e11711L33585K88731L8040J6212N7043j61192l36605o4404K84354J00536
34789D4589l85991m85027k15316j29378k00492N8666M77056L53760k32176l72737
34779a087046J78211N59697K28259k13844j46531O6157j16188m09849l00743j0159
$$ plain form
34769 -1252036 -1300286 -1564202 -1708131 -1450232 -1010076 -720143 -586968 -474479 -366311 -243618
34759 -243618 -51259 42539 -262512 -856386 -1174413 -928705 -476161 -193416 68517 536658
34749 536658 944303 896822 516916 227468 108657 -34411 -150974 -38140 142713 1445
34739 1445 -426753 -685407 -613676 -555045 -726998 -858566 -650787 -193093 281573 678863
34729 678863 871857 641776 72131 -338708 -271175 -1936 66840 -25367 -63273 -165436
34719 -165436 -538194 -934395 -907252 -527105 -314017 -441478 -511790 -215315 254660 594825
34709 594825 768882 791547 530071 -13666 -534333 -802405 -949961 -1132082 -1179966 -892536
34699 -892536 -439617 -139694 -13620 98636 124403 -150521 -628967 -910272 -789077 -460415
$$ packed form
34769a252036m8250k63916j43929K57899M40156K89933J33175J12489J08168J22693
34759b43618J92359R3798l05051n93874l18027K45708M52544K82745K61933M68141
34749E36658M07645m7481l79906k89448j18811j43068j16563J12834J80853j41268
34739A445m28198k58654P1731N8631j71953j31568K07779M57694M74666L97290
34729F78863J92994k30081n69645m10839O7533K69239O8776r2207l7906j02163
34719a65436l72758l96201K7143L80147K13088j27461p0312K96475M69975L40165
34709E94825J74057K2665k61476n43737n20667k68072j47556j82121m7884K87430
34699h92536M52919K99923J26074J12256K5767k74924m78446k81305J21195L28662
$$ plain form
34689 -460415 -187463 -23651 75626 95425 7730 -176304 -448319 -768178 -988781 -973672
34679 -973672 -795222 -658856 -628731 -588290 -468035 -333401 -228230 -102653 60815 177350
34669 177350 139978 -113362 -558451 -999409 -1136951 -899929 -586709 -458090 -359658 -77374
34659 -77374 113049 -228699 -862036 -959316 -239666 551861 644200 242242 63486 244175
34649 244175 298051 -4221 -329226 -403428 -425529 -654914 -949288 -992405 -802092 -735431
34639 -735431 -992944 -1303229 -1217782 -679146 -140431 -19473 -176151 -165783 70531 131427
34629 131427 -169965 -468056 -408825 -188910 -185006 -322739 -242530 65293 242348 144967
34619 144967 46539 211426 571367 878188 955783 803935 639731 742177 1032927 993387
$$ packed form
34689d60415K72952J63812R9277J9799q7695j84034k72015l19859k20603J5109
34679i73672J78450J36366L0125M0441J20255J34634J05171J25577J63468J16535
34669A77350l7372k53340m45089m40958j37542K37022L13220J28619R8432K82284
34659g7374J90423l41748o33337r7280P19650P91527R2339m01958j78756J80689
34649B44175N3876l02272l25005p4202k2101k29385k94374m3117J90313O6661
34639g35431k57513l10285Q5447N38636N38715J20958j56678J0368K36314O0896
34629A31427l01392k98091N9231K19915L904j37733Q0209L07823J77055r7381
34619A44967r8428J64887L59941L06821P7595j51848j64204J02446K90750l9540
$$ plain form
34609 993387 341685 -403367 -520490 -119962 26211 -319201 -534443 -201597 212313 144706
34599 144706 -184594 -237794 -65665 -114777 -383698 -416953 -67907 295970 379333 281517
34589 281517 159318 -32304 -344990 -686430 -966863 -1163532 -1200823 -1007500 -713595 -539614
34579 -539614 -481287 -375770 -277200 -422374 -749964 -811232 -335832 386475 869222 940418
34569 940418 721872 348659 -46044 -237205 -67096 342030 679120 697542 330834 -277431
34559 -277431 -768159 -802757 -463222 -223443 -348723 -541050 -410410 -73698 38006 -193114
34549 -193114 -507531 -737525 -937780 -1065738 -964267 -761876 -883438 -1442606 -1929298 -1778896
34539 -1778896 -1070512 -404827 -196706 -316101 -381882 -216621 18872 52105 -171333 -401211
$$ packed form
34609I93387o51702p45052j17123M00528J46173l45412k15242L32846M13910o7607
34599A44706l29300n3200J72129m9112k68921l3255L49046L63877Q3363r7816
34589B81517j22199j91622l12686l41440k80433j96669l7291J93323K93905J73981
34579e39614N8327J05517R8570j45174l27590o1268M75400P22307M82747P1196
34569I40418k18546l73213l94703j91161J70109M09126L37090J8422l66708o08265
34559b77431m90728l4598L39535K39779j25280j92327J30640L36712J11704k31120
34549a93114l14417k29994k00255j27958J01471K02391j21562n59168m86692J50402
34539a778896P08384O65685K08121j19395o5781J65261K35493L3233k23438k29878
$$ plain form
34529 -401211 -374774 -141673 33092 38679 -12358 -56538 -146391 -213205 -83899 156416 155666
34518 155666 -167323 -406597 -240651 92267 194590 89076 39865 75452 113294 301116
34508 301116 728201 1001488 687000 43748 -302369 -331182 -563718 -1014997 -1026732 -359863
34498 -359863 342007 549737 557622 704964 629464 -2085 -625175 -499414 97154 294587
34488 294587 13731 -15688 437855 719907 356938 -319701 -865971 -1280973 -1529297 -1224807
34478 -1224807 -300762 541691 615734 128534 -209525 -152758 -5999 15891 -14129 -78145
34468 -78145 -284429 -587214 -775911 -751261 -559214 -208554 270250 639249 625874 290589
34458 290589 -19345 -84412 33988 224063 445618 594534 497044 139021 -262404 -503454
$$ packed form
34529d01211K6437K33101J74765N587n1037m4180q9853o6814J29306K40315p50
34518A55666l22989k39274J65946L32918J02323j05514m9211L5587L7842J87822
34508C01116M27085K73287l14488o43252l46117k8813k32536m51279j1735O66869
34498c59863P01870K07730P885J47342p5500o31549o23090J25761N96568J97433
34488B94587k80856k9419M53543K82052l62969o76639n46270m15002k48324L04490
34478a224807R24045Q42453P4043m87200l38059N6767J46759K1890l0020o4016
34468g8145k06284l02785j88697K4650J92047L50660M78804L68999j3375l35285
34458B90589l09934o5067J18400J90075K21555J48916r7490l58023m01425k41050
$$ plain form
34448 -503454 -602012 -712922 -931551 -1218023 -1439597 -1465379 -1274859 -980231 -722326 -587758
$$ packed form
34448e03454r8558j10910k18629k86472k21574k5782J90520K94628K57905J34568
$$ [...]
##END NTUPLES=NMR SPECTRUM
##END=
