##TITLE=31Pdec_DPA3005-3
 CDCl3, 24 sc
 31.5.2019
##JCAMPDX= 6.0         $$ Bruker NMR JCAMP-DX V2.0
##DATA TYPE= NMR SPECTRUM
##DATA CLASS= NTUPLES
##ORIGIN= UXNMR, Bruker Analytische Messtechnik GmbH
##OWNER= root
$$ XWIN-NMR		Version 3.5
$$ Fri May 31 16:04:22 2019 Russian Standard Time (UT+4h)  she@DPX200
##.OBSERVE FREQUENCY= 81.013821
##.OBSERVE NUCLEUS= ^31P
##.ACQUISITION MODE= SIMULTANEOUS
##.ACQUISITION SCHEME= undefined
##.AVERAGES= 24
##.DIGITISER RES= 17
##SPECTROMETER/DATA SYSTEM= spect
##.PULSE SEQUENCE= zgpg30
##.SOLVENT NAME= CDCl3
##.SHIFT REFERENCE= (INTERNAL, CDCl3, 0, 182.463)
##AUDIT TRAIL= $$ (NUMBER, WHEN, WHO, WHERE, WHAT)
$$ ##TITLE= Audit trail, XWIN-NMR		Version 3.5
$$ ##JCAMPDX= 5.01
$$ ##ORIGIN= Bruker BioSpin GmbH
$$ ##OWNER= she
$$ F:/spectra/data/she/nmr/P31/1/pdata/1/auditp.txt
$$ ##AUDIT TRAIL=  $$ (NUMBER, WHEN, WHO, WHERE, WHAT)
(   1,<2019-05-31 16:03:02.57 +0400>,<she>,<DPX200>,
      <created by zg, POWCHK disabled, PULCHK disabled
       configuration hash MD5:
       00 E9 B6 7A A2 85 ED C7 34 08 36 98 17 FE 4E 26
       data hash MD5: 32K
       7A F5 47 49 AC BB BF F9 86 56 F3 7B 68 FE 1B E5>)
(   2,<2019-05-31 16:03:07.51 +0400>,<she>,<DPX200>,
      <Start of raw data processing
       efp BC_mod = 2 LB = 1 FT_mod = 6 PKNL = 1 PHC0 = -2189.707 PHC1 = 89.9991 SI = 64K 
       data hash MD5: 64K
       85 D5 A8 8A 4D B5 CB 50 A3 91 2A C7 55 A5 EF 82>)
(   3,<2019-05-31 16:03:28.98 +0400>,<she>,<DPX200>,
      <pk PHC0 = -41.43821 PHC1 = 80.60001 
       data hash MD5: 64K
       50 CD CF D2 73 E1 42 6C 4A 52 E8 53 14 45 83 D8>)
$$ ##END=
$$ 
$$ hash MD5
$$ 4D 3F 62 61 B4 18 69 3C 01 21 93 72 07 50 C5 4C
##$RELAX= 
##$RELAX= 
##$RELAX= 
##$RELAX= 
##$RELAX= 
##$RELAX= 
##$RELAX= 
##$RELAX= 
$$ Bruker specific parameters
$$ --------------------------
##$DU= <F:/spectra>
##$EXPNO= 1
##$NAME= <P31>
##$PROCNO= 1
##$TYPE= <nmr>
##$USER= <she>
##$AMP= (0..31)
100 100 100 100 100 100 100 100 100 100 100 100 100 100 100 100 100 100 
100 100 100 100 100 100 100 100 100 100 100 100 100 100 
##$AQSEQ= 0
##$AQ_mod= 1
##$AUNM= <au_zg>
##$AUTOPOS= <>
##$BF1= 81.014009
##$BF2= 200.13
##$BF3= 200.13
##$BF4= 200.13
##$BF5= 200.13
##$BF6= 200.13
##$BF7= 200.13
##$BF8= 200.13
##$BYTORDA= 1
##$CFDGTYP= 0
##$CFRGTYP= 5
##$CHEMSTR= <none>
##$CNST= (0..31)
1 1 145 1 1 1 1 1 1 1 1 1 1 1 1 1 1 1 1 1 1 1 1 1 1 1 1 1 1 1 1 1 
##$CPDPRG= <waltz16>
##$CPDPRG1= <>
##$CPDPRG2= <waltz16>
##$CPDPRG3= <>
##$CPDPRG4= <mlev>
##$CPDPRG5= <mlev>
##$CPDPRG6= <mlev>
##$CPDPRG7= <mlev>
##$CPDPRG8= <mlev>
##$CPDPRGB= <>
##$CPDPRGT= <>
##$D= (0..31)
0 1 0 0 0 0 0 0 0 0 0 0.03 2e-05 3e-06 0 0 0 0 0 0 0 0 0 0 0 0 0 0 0 0 
0 0 
##$DATE= 1559304181
##$DBL= (0..7)
120 120 120 11 120 120 24 19 
##$DBP= (0..7)
150 150 150 150 150 150 150 150 
##$DBP07= 0
##$DBPNAM0= <>
##$DBPNAM1= <>
##$DBPNAM2= <>
##$DBPNAM3= <>
##$DBPNAM4= <>
##$DBPNAM5= <>
##$DBPNAM6= <>
##$DBPNAM7= <>
##$DBPOAL= (0..7)
0.5 0.5 0.5 0.5 0.5 0.5 0.5 0.5 
##$DBPOFFS= (0..7)
$$ [...]
##$SUBNAM2= <"">
##$SUBNAM3= <"">
##$SUBNAM4= <"">
##$SUBNAM5= <"">
##$SUBNAM6= <"">
##$SUBNAM7= <"">
##$SUBNAM8= <"">
##$SUBNAM9= <"">
##$SW= 369.568048894756
##$SWIBOX= (0..15)
0 1 3 0 0 0 0 0 0 0 0 0 0 0 0 0 
##$SW_h= 29940.119760479
##$TD= 32768
##$TD0= 1
##$TE= 0
##$TE2= 300
##$TE3= 300
##$TEG= 300
##$TL= (0..7)
0 120 53 12 22 120 120 120 
##$TP= (0..7)
150 150 150 150 150 150 150 150 
##$TP07= 0
##$TPNAME0= <>
##$TPNAME1= <>
##$TPNAME2= <>
##$TPNAME3= <>
##$TPNAME4= <>
##$TPNAME5= <>
##$TPNAME6= <>
##$TPNAME7= <>
##$TPOAL= (0..7)
0.5 0.5 0.5 0.5 0.5 0.5 0.5 0.5 
##$TPOFFS= (0..7)
0 0 0 0 0 0 0 0 
##$TUNHIN= 0
##$TUNHOUT= 0
##$TUNXOUT= 0
##$USERA1= <user>
##$USERA2= <user>
##$USERA3= <user>
##$USERA4= <user>
##$USERA5= <user>
##$V9= 5
##$VALIST= <valist>
##$VCLIST= <CCCCCCCCCCCCCCC>
##$VD= 0
##$VDLIST= <DDDDDDDDDDDDDDD>
##$VPLIST= <PPPPPPPPPPPPPPP>
##$VTLIST= <TTTTTTTTTTTTTTT>
##$WBST= 1024
##$WBSW= 4
##$XGAIN= (0..3)
0 0 0 0 
##$XL= 0
##$YL= 0
##$YMAX_a= 57266
##$YMIN_a= -71521
##$ZGOPTNS= <>
##$ZL1= 120
##$ZL2= 120
##$ZL3= 120
##$ZL4= 120
##$ABSF1= 0
##$ABSF2= 0
##$ABSG= 0
##$ABSL= 0
##$ALPHA= 0
##$AQORDER= 0
##$ASSFAC= 0
##$ASSFACI= 0
##$ASSFACX= 0
##$ASSWID= 0
##$AUNMP= <proc_1d>
##$AZFE= 0.1
##$AZFW= 0.5
##$BCFW= 0
##$BC_mod= 2
##$BYTORDP= 0
##$COROFFS= 0
##$CY= -3
##$DATMOD= 1
##$DC= 0
##$DFILT= <>
##$DTYPP= 0
##$F1P= 0
##$F2P= 0
##$FCOR= 1
##$FTSIZE= 65536
##$FT_mod= 6
##$GAMMA= 0
##$GB= 0
##$INTBC= 1
##$INTSCL= 5.30512e-09
##$ISEN= 30
##$LB= 1
##$LEV0= 0
##$LPBIN= 0
##$MAXI= 10000
##$MC2= 0
##$MEAN= 0
##$ME_mod= 0
##$MI= 50
##$NCOEF= 0
##$NC_proc= -5
##$NLEV= 6
##$NOISF1= 182.463
##$NOISF2= 159.3651
##$NSP= 0
##$NTH_PI= 0
##$NZP= 0
##$OFFSET= 182.463
##$PC= 4
##$PHC0= -2231.145
##$PHC1= 170.5991
##$PH_mod= 1
##$PKNL= yes
##$PPARMOD= 0
##$PSCAL= 0
##$PSIGN= 0
##$REVERSE= no
##$SF= 81.0140089999434
##$SI= 65536
##$SIGF1= 159.3651
##$SIGF2= -187.1042
##$SINO= 113.3802
##$SIOLD= 16384
##$SREGLST= <1H.CDCl3>
##$SSB= 0
##$STSI= 65536
##$STSR= 0
##$SW_p= 29940.119760479
##$SYMM= 0
##$S_DEV= 0
##$TDeff= 32768
##$TDoff= 0
##$TI= <>
##$TILT= no
##$TM1= 0
##$TM2= 0
##$TOPLEV= 0
##$USERP1= <user>
##$USERP2= <user>
##$USERP3= <user>
##$USERP4= <user>
##$USERP5= <user>
##$WDW= 1
##$XDIM= 65536
##$YMAX_p= 352664226
##$YMIN_p= -17644562
$$ End of Bruker specific parameters
$$ ---------------------------------
##NTUPLES= NMR SPECTRUM
##VAR_NAME=  FREQUENCY,     SPECTRUM/REAL,   SPECTRUM/IMAG
##SYMBOL=    X,             R,               I
##VAR_TYPE=  INDEPENDENT,   DEPENDENT,       DEPENDENT
##VAR_FORM=  AFFN,          ASDF,            ASDF
##VAR_DIM=   65536,         65536,           65536
##UNITS=     HZ,            ARBITRARY UNITS, ARBITRARY UNITS
##FACTOR=    0.456856943014862, 1,           1
##FIRST=     14782.0589164792, 0,            0
##LAST=      -15158.0608439998, 0,           0
##MIN=       -15158.0608439998, -17644562,   0
##MAX=       14782.0589164792, 352664226,    0
$$ Real data points
##PAGE= N=1
##DATA TABLE= (X++(R..R)), XYDATA
$$ [...]
42630D52085j287719j621994l82805J238426J417862J40678p27094k7102J104632
42621C06969Q70492p12620j843884j218444M86560J563135J230752K76631j33072
42612H26519J44377L03047j41840o99466o87195j83589K00023J68981r1211l46894
42602e07248m15326n3254O79226J104378O33313k71117n37499O9478O83102O46023
42592B031076K82728N4733k23720p55197j040214n63756K34028M81265J47595
42583F48538K6885N08603J069161J069371M85674k74402q05514q39204l92476
42574A496636Q9566J44978n2339J01665O59319Q82670K84363n74864p75103k02386
42564B054505M39400N71127K34768k28372n47801n93936m37070l25868l37840
$$ y = [452085, -835634, -2457628, -2840433, -1602007, -184145, -43467, -770561, -797663, 306969, 1177461, 464841, -1379043, -2597487, -2110927, -547792, 682960, 959591, 826519, 970896, 1273943, 1132103, 432637, -254558, -438147, -238124, -69143, -160354, -507248, -922574, -975828, -296602, 807776, 1441089, 1169972, 632473, 701951, 1385053, 2031076, 2313804, 2368537, 2144817, 1389620, 349406, -214350, 19678, 500943, 648538, 675423, 1184026, 2253187, 3322558, 3808232, 3533830, 2728316, 1889112, 1496636, 1586202, 1731180, 1678841, 1780506, 2439825, 3322495, 3606858, 3031994, 2256891, 2054505, 2493905, 3065032, 3299800, 3071428, 2523627, 1929691, 1492621, 1166753, 828913]
42555H28913j82300L04202O78649M51971j8036O2010N79857M94610m91280j174593
42545A534003n06736P57376J104510M60998Q5067M16600M57468l63349j057953
42536B887984o28379K80186L51560m33527r55494p17721k72575P397M00649Q98646
42526A818726Q88392J99665m33826m83049l91748o25620p32685j86013M67261
42517E21103L43853k60294k51466M50896P01468k1943p23275m36145L11886M30456
42507A066539p2580l79481l39162n11550q93098p69585j8437N01094K70758q3656
42497a229158J21937N26550M32506N813p2195K40354L91699K16702O2206N0366
42487G46780j3325o3494J21305K64357j41777q58210j044849n30500m7895M0420
$$ y = [828913, 646613, 950815, 1629464, 2081435, 2063399, 2125409, 2705266, 3199876, 2708596, 1534003, 1027267, 1784643, 2889153, 3350151, 3435218, 3851818, 4309286, 3945937, 2887984, 2259605, 2539791, 2891351, 2457824, 1502330, 784609, 512034, 519431, 920080, 1818726, 2707118, 2906783, 2472957, 1989908, 1598160, 972540, 239855, 53842, 521103, 864956, 604662, 353196, 804092, 1505560, 1483617, 760342, 324197, 636083, 1066539, 993959, 614478, 275316, -236234, -1129332, -1898917, -1917354, -1416260, -1145502, -1229158, -1107221, -580671, -148165, -142352, -214547, 25807, 417506, 634208, 696414, 746780, 733455, 669961, 791266, 1055623, 913846, 55636, -989213, -1519713, -1567608, -1527188]
42477a527188K71058Q89272J129275M22822m94671n88877l9417J88815j53064
42468I8025m79374m60415k97868p8915K70935M99436L21245R9816L94526R11209
42458A278620Q15862J02516l01438O8925O29963P76464O16516L98904N4387l38874
42448D101845m11274j82526j46907l68756l08638J11995K04234k63121n21967
42439B214885j28233J68838k83461q17675n40812J48311K95946p587j7751J96059
42429A228520J8267l36095j25674M20067L53422k65652l77758J88231L54040k93315
42419A164053p18598k19706L75309J53865m20214m87533k40923l05661m71575
42410a170983j76420L39367M52676K72528L17423M99464M29451L10975M61909
$$ y = [-1527188, -1256130, -366858, 762417, 1185239, 690568, 101691, 62274, 251089, 98025, -381349, -841764, -1139632, -1218547, -947612, -448176, -126931, -27115, 367411, 1278620, 2094482, 2196998, 1895560, 1964485, 2594448, 3370912, 3987428, 4386332, 4440719, 4101845, 3690571, 3508045, 3361138, 2992382, 2683744, 2795739, 2999973, 2736852, 2214885, 2086652, 2255490, 1972029, 1154354, 613542, 761853, 1057799, 1050212, 1032461, 1228520, 1246787, 910692, 785018, 1205085, 1558507, 1292855, 915097, 1103328, 1457368, 1164053, 445455, 225749, 601058, 754923, 334709, -152824, -393747, -699408, -1170983, -1347403, -1008036, -555360, -282832, 34591, 534055, 963506, 1274481, 1736390]
42401A736390L55743o16746j685527j396115J87958J343839J045073J79125r0258
42392A059482K4106k83399q95366j020291m70198J59104L61894J68694j11905
42383a007879j52205K12868P23374Q30963L69209j77296k95885m150M07320P45545
42373A651864P94117L68895j72163r7203N48499O44359m39325j602933j331258
42364C64852J35538J066245N86421l74549o81219m53500m02293n45667l52253
42355f56425K56991P48957P01157K20062l04951n37802l39555J39166M88904L49711
42345A066215k39533q33264r40522m48658K58634O69694O72749N67348M95961
42336A268624J88390m71019r67756p33425j2821L88000J67363j85242j84169Q8353
$$ y = [1736390, 2092133, 1475387, -210140, -1606255, -1418297, -74458, 970615, 1149740, 1059482, 1083588, 800189, -95177, -1115468, -1585666, -1426562, -1064668, -895974, -1007879, -1160084, -947216, -223842, 607121, 976330, 799034, 503149, 498999, 906319, 1651864, 2445981, 2814876, 2642713, 2545510, 3094009, 3738368, 3299043, 1696110, 364852, 500390, 1566635, 2153056, 1778507, 1097288, 643788, 241495, -304172, -656425, -399434, 349523, 1050680, 1270742, 965791, 427989, 88434, 227600, 716504, 1066215, 826682, -6582, -947104, -1395762, -1137128, -467434, 205315, 772663, 1268624, 1457014, 985995, 18239, -715186, -728007, -340007, -172644, -357886, -542055, -453702]
42326d53702L04160L15697J45858o9368q1863J62353K87178R509k59008K3721
42316C84535N04195L38041l63249n14240K52402R26245O47467r1363m32082m26477
42306A225474n16166n45300k21879Q8936l1368k43462j57529j94884o96865q79304
42296b172347l420R91437O26789o45126q83527L60756J314947P05463m59455o33214
42286g97697J30243P47918P29728K70461l86684q03768m05106M98406O41238l57371
42276B67368j079448l42721Q41163P86146j92863m03021L32172M00325p82561
42267a73440j602217p01775Q85924J226926J77009o39650j30410J045024J529374
42258A616765Q13984m07071j031385n84499L70602Q44805M53297l09936p74929
$$ y = [-453702, -149542, 166155, 312013, 242645, 160782, 323135, 610313, 619822, 360814, 384535, 888730, 1226771, 863522, 349282, 601684, 1527929, 2175396, 2084033, 1651951, 1225474, 709308, 164008, -57871, 31065, -303, -243765, -401294, -596178, -1293043, -2172347, -2175767, -1184330, -557541, -1202667, -2086194, -1725438, -410491, 294972, -164483, -797697, -667454, 80464, 810192, 1080653, 693969, -109799, -514905, -16499, 624739, 267368, -812080, -1154801, -313638, 472508, 279645, -123376, 208796, 609121, -173440, -1775657, -2477432, -1591508, -364582, -187573, -827223, -957633, 87391, 1616765, 2430749, 2023678, 992293, 407794, 778396, 1623201, 2076498, 1766562, 991633]
42249I91633p28119l03922K94515P50989P27865L01559l9787j16749l51929r28476
42239E97579j127798k37872J102133J374194J76385j080414r68709J00099N75715
42230E11312l1914o28391l09892L05192J25813o77007q92506n4387R03325R88126
42220B39671M08220K4745N8113j5561m46952p14610k26654P93382J388932Q61989
42210B371275l92483j188884q17268J39243N44580J44013k43307m080M50448M79861
42200A483398K26099K41807N02156M69339k2475n62175p91408p29877n19755l06034
42190h925k89230m33296k61445M98715J209880R80017J2048n04760l6879N58099
42180A724224L24529m60883q04818l45501L97521P91193N77315j48346r31529
$$ y = [991633, 263514, -40408, 254107, 1005096, 1732961, 2034520, 1994733, 1877984, 1526055, 597579, -530219, -768091, 334042, 1708236, 1884621, 804207, -164502, -64403, 511312, 479398, -148993, -458885, -153693, -27880, -704887, -1597393, -1651780, -748455, 239671, 647891, 672636, 730749, 715188, 268236, -446374, -673028, 120354, 1509286, 2371275, 1978792, 789908, -27360, 111883, 656463, 800476, 557169, 553089, 1003537, 1483398, 1709497, 1951304, 2453460, 2922799, 2900324, 2338149, 1546741, 816864, 297109, -8925, -298155, -731451, -992896, -494181, 715699, 1695716, 1707764, 1203004, 1166125, 1724224, 2048753, 1587870, 783052, 437551, 835072, 1626265, 2203580, 2055234, 1123705]
42171A123705j118262n11052K41361L46613j34654m32028j34201L77666O14301
42162C73449O01151N92898N52576K89407o0308j10416J52310J77899m26207j167607
42152I75152j106578j04604Q15729O88955j65141o37301l38348N4108j8428j90128
42142b6584J08730O88291Q77854M70312j09985m51780n42910n33299m46908k05205
42132a71484K13038O56939Q25457N35894K1159k45984j22094M4299o7492l49243
42122A340489n45183o10535n40024j70052M78698R10846O46951j06806o63340
42113G41044o64768l50177q0406M6980J06238J77986L14505M48506L60725k8544
42103A072089l88402k88108K14284N79356M52616Q6075k3957K36335M76553K79388
$$ y = [1123705, 5443, -505609, -264248, 82365, -52289, -484317, -618518, -240852, 373449, 974600, 1567498, 2120074, 2409481, 2349173, 2238757, 2391067, 2568966, 2142759, 975152, -131426, -236030, 579699, 1268654, 1103513, 466212, 127864, 181972, 163544, -26584, 82146, 770437, 1648291, 2118603, 2008618, 1556838, 1013928, 480629, 33721, -171484, 41554, 698493, 1523950, 2059844, 2081003, 1835019, 1712925, 1757224, 1689732, 1340489, 795306, 184771, -355253, -525305, -46607, 864239, 1511190, 1404384, 741044, 76276, -273901, -354307, -307327, -201089, -23103, 291402, 739908, 1100633, 1072089, 683687, 395579, 609863, 1189219, 1641835, 1727910, 1703953, 1940288, 2416841, 2696229]
42093B696229k86955p19042o79471m04508l14524l66553j91113J71124K31272
42084A36459r6589k31529J21510L69564m1287o27235n59858J9368K73344O2866
42074e73387O9597M78177N57620q7918p24401n14802K71448O84055L23569m03525
42064H0433r56736j055853o17340J63076P27089O16062O4487k12236R6385N06954
42054e87679L98655j35971l82894J5741M88955K91490l21440k98180O32930J308343
42044A409950O72496n93676r30205q9645O53988N04931J40452L22436O54090M38854
42034C183671j14281m00680m60521o19197o29850j29189M29390K74353m56719
42025A076977q95722p22254l95086j99222L5810K60883J56885j24818l8351L55537
$$ y = [2696229, 2409274, 1690232, 1010761, 606253, 291729, -74824, -265937, -94813, 136459, 39870, -191659, -70149, 299415, 258128, -369107, -928965, -909597, -636253, -573387, -503790, -25613, 532007, 444089, -280312, -795114, -523666, 160389, 483958, 80433, -876303, -1932156, -2549496, -2386420, -1659331, -1043269, -978782, -1191018, -1094633, -587679, -189024, -324995, -707889, -692148, -203193, 88297, -233143, -531323, 101607, 1409950, 2082446, 1488770, 558565, 468920, 1122908, 1627839, 1768291, 2090727, 2744817, 3183671, 3069390, 2668710, 2208189, 1588992, 959142, 829953, 1259343, 1533696, 1076977, 181255, -540999, -936085, -1135307, -1099497, -838614, -681729, -806547, -844898, -489361]
42015d89361L25092l07896p14919k58953N74461R33294O83109K49620p5060j65485
42005G53902J06113N55427O37735K13832p0864K92719Q08571O51581j30994p48738
41995C069284p46167l20567K07123N85151M97357o4280m49538j13849M01323J17362
41985C183199p83142j034201j97418N76235K68419m73622m11479L57685O47409
41976B133085O0919n00484k90796L01414N73898N29210N51026O11599M11240Q633
41966D389744k61265l57571n09002o78821n60861j62242Q9638j0210j15109R7046
41956A921347L65016K16926l15798p26749o69519k45292K57646N93309N87752
41947A984638K65507p6849k12030l11896n79177o87875j59370O98496R33360K80937
$$ y = [-489361, -164269, -472165, -1187084, -1446037, -871576, 61718, 744827, 994447, 919387, 753902, 860015, 1415442, 2053177, 2267009, 2196145, 2488864, 3297435, 3949016, 3818022, 3069284, 2323117, 2002550, 2209673, 2794824, 3292181, 3227901, 2778363, 2664514, 3065837, 3183199, 2400057, 1365856, 1168438, 1744673, 2013092, 1539470, 1127991, 1485676, 2133085, 2194004, 1693520, 1402724, 1704138, 2278036, 2807246, 3358272, 3969871, 4381111, 4389744, 4128479, 3770908, 3261906, 2583085, 2022224, 1859982, 1949620, 1939410, 1824301, 1921347, 2286363, 2503289, 2187491, 1460742, 791223, 545931, 803577, 1396886, 1984638, 2250145, 2173296, 1961266, 1649370, 1070193, 382318, 222948, 921444, 1854804, 2135741]
41937B135741l41645j48288L38717J24853o96610j095600o40243J7738K67840
41928c7497L11205N11267O84280N13331J81019O8174J26282N7152n5217J89439
41918B549435P91184J145529P75423J6709l47435j01753J25995j55342m05942
41909D393803K21027J337717J454027J16612j031375l49453J297519J569438J582
41900I010897j324404q53073L33400M66450j91770p5883J005586J591033Q57380
41891A0819616k42827m43378K57134Q78818O48747l85913j451051j641195q53100
41882G586851l6690L716k15412L06505J289370J410539L84183m98206l67929o3204
41872I799723n78744j290693r04359M57209J351186R79607q906o50896o77809
$$ y = [2135741, 1794096, 1645808, 1984525, 2109378, 1412768, 317168, -323075, -305337, -37497, 273708, 784975, 1469255, 1982586, 2163605, 2231779, 2358061, 2415213, 2359996, 2549435, 3340619, 4486148, 5261571, 5278280, 4930845, 4829092, 4955087, 4799745, 4393803, 4614830, 5952547, 7406574, 7523186, 6491811, 6142358, 7439877, 9009315, 9010897, 7686493, 6833420, 7166820, 7633270, 7441500, 7365617, 8371203, 9962236, 10819616, 10576789, 10133411, 10390545, 11269363, 11918110, 11532197, 10081146, 8439951, 7586851, 7550161, 7553877, 7338465, 7644970, 8934340, 10344879, 10729062, 10230856, 9862927, 9799723, 9220979, 7930286, 7025927, 7483136, 8834322, 9813929, 9805023, 9154127, 8476318]
41863H476318k98963K21098N45411M29316J16066J00519L72666L74107j54255
41854A0182283p57269q90768n45995m7757L80551O08309M91932N9581m18599p37313
41844H324955r02089q40055l37529M50526Q04044K46398o35171p53980M7460O87236
41834G091795K34630q22388j171969l50425P14645R01809J71891o13988q22470
41825E333530o03181m40825n39015p13321o67619l05582J24037K34937k1585k24854
41815B176522m2864K53307J81872j82277l15767j00419k696k50653l93725j5274
41805A308026N54359O53112J44594m91004p11442k95287N55372J207659R93643
41796C919032l7017j007967j175236p10414k17050J17523L92912M14886n7699
$$ y = [8476318, 8177355, 8398453, 8943864, 9373180, 9489246, 9589765, 9962431, 10336538, 10182283, 9425014, 8534246, 7988251, 7940494, 8321045, 8929354, 9421286, 9480867, 9062268, 8324955, 7422866, 6582811, 6245282, 6695808, 7499852, 7746250, 7111079, 6357099, 6404559, 7091795, 7326425, 6504037, 5332068, 4981643, 5696288, 6598097, 6769988, 6156000, 5333530, 4730349, 4289524, 3750509, 3037188, 2369569, 2063987, 2188024, 2422961, 2401376, 2176522, 2133658, 2386965, 2568837, 2386560, 2070793, 1970374, 1967678, 1717025, 1323300, 1308026, 1862385, 2515497, 2660091, 2169087, 1457645, 1162358, 1717730, 2925389, 3919032, 3882015, 2874048, 1698812, 988398, 771348, 888871, 1281783, 1696669, 1638970]
41787A638970o78262q31830n21289k64305j53521K20212Q24747R89933M58507
41778A683162j13934j75018j30240n41511r93538o12313M84374J143076P21799
41769A465857p3892k72815M8286J24433j97050k80107J99314P18007P22797L54559
41759B809389l4023m72020q93150o62433N06595J547636J103970m86031j497447
41750A922486j244486q12019r25475o56457P21551J975426J538245l0374q84037
41741A604860o04515l21202m37234j45047O70187Q94367P1801p48618p16062l34178
41731f5641k09433m220M97879N70779j55218p04302k43825M25745J71294n28826
41721b45768m18209L54843M96152k16136n46280K04862J153882J180617L25650
$$ y = [1638970, 960708, 128878, -392411, -656716, -810237, -590025, 234722, 1224655, 1683162, 1569228, 1394210, 1263970, 722459, -271079, -883392, -399018, 744058, 1465857, 1391965, 1119150, 1167436, 1291869, 1094819, 814712, 1014026, 1732033, 2454830, 2809389, 2775366, 2303346, 1410196, 747763, 1254358, 2801994, 3905964, 3419933, 1922486, 678000, -134019, -1059494, -1715951, -994400, 981026, 2519271, 2488897, 1604860, 1000345, 679143, 241909, 96862, 767049, 1661416, 1733217, 984599, 268537, -65641, -275074, -279294, 218585, 789364, 634146, -70156, -313981, 111764, 283058, -245768, -663977, -309134, 187018, -29118, -575398, -370536, 783346, 1963963, 2289613]
41712B289613n70069q87038n70668l4549R8082l35270o38340j42141O39812O06607
41702D56039k01335n41304J00917O48054J32763p08267n05900O70517J396524
41693A448008Q80874j02386m25841P891M64928M61700J51138j77744m81318p20393
41683A506857n99636Q2374Q93419R93663J15097r46666j133832l07363O66727
41674A270640R42050M80678j78542n75852n96613l47667l3078J12476k1514k60943
41664G91635k36847K25130P74153P65127J7672p65168o69109L03165J131888R64658
41654C302304P0391o24617o39943k36740J64170M22631N46526M57233M7749n70953
41644B938751r43546n67860M44000J149666P01488m85731j071667m87490L36841
$$ y = [2289613, 1719544, 832506, 261838, 227289, 325371, -9899, -648239, -790380, -150568, 456039, 254704, -286600, -185683, 462371, 595134, -113133, -619033, 51484, 1448008, 2328882, 2226496, 1800655, 1808546, 2273474, 2735174, 2886312, 2708568, 2227250, 1506857, 907221, 989595, 1883014, 2876677, 2991774, 2045108, 911276, 603913, 1270640, 2212690, 2693368, 2514826, 1938974, 1342361, 994694, 961616, 1074092, 1052578, 791635, 554788, 779918, 1554071, 2319198, 2336870, 1571702, 902593, 1205758, 2337646, 3302304, 3372695, 2748078, 2108135, 1871395, 2035565, 2458196, 3004722, 3461955, 3509704, 2938751, 1995205, 1427345, 1871345, 3021011, 3722499, 3236768, 2165101, 1677611, 2014452]
41635B014452L18650l38857o56816l27240J10952K70169L18249M34985N01770
41626B646314M00017J88586l2154j44108k6016J97766J89169l8036P466M76727
41616C865731P72877N09237K64760N98465R04730L25943n89161l95343J169950
41607G427189K824540L520720L402685K820096J649165P3799j036856j175734
41599A9505604q48227o76691o04958m46762m14938n32342k40468P71070J920709
41590A8432997K474065K384686J921353J092040L0840o09829l24697N52237J302644
41581B7256336J551741J165000M7021j385150k121197j669732q38261p30163j315751
41572B1959844j653353j226133l97883K72484N97132P38085R86038J384616J386153
$$ y = [2014452, 2333102, 1994245, 1337429, 1010189, 1121141, 1391310, 1709559, 2144544, 2646314, 3046331, 3234917, 3202763, 3058655, 3032639, 3230405, 3419574, 3381538, 3389004, 3865731, 4638608, 5147845, 5412605, 6011070, 6915800, 7241743, 6652582, 6257239, 7427189, 10251729, 13772449, 17175134, 19995230, 21644395, 21718194, 20681338, 19505604, 18657377, 17980686, 17375728, 16928966, 16514028, 15981686, 15741218, 16512288, 18432997, 20907062, 23291748, 25213101, 26305141, 26335981, 25726152, 25401455, 25953692, 27256336, 28808077, 29973077, 30020098, 28634948, 26513751, 24844019, 24005758, 23275595, 21959844, 20306491, 19080358, 18682475, 18954959, 19552091, 20290176, 21276214, 22660830, 24046983]
41563B4046983L22660j506191k797400k722957j867598j229859r65580p52413
41555A2527645p12649j110164j601117j637266j277366q83693m46840L7905N3749
41546D950204o45849j196377o47527M88099Q32976J09044o27704o54581l49526
41537B258759k04989j46726n9442p7937j25734N2799K78603J44450j37620J82
41527A982345L37384M2099q38132j199764n62478J91164K81215J52567M12891
41518G99291O40467K05996m53284m43069J38108L78765p227l47851j36579K88454
41508A063071L80115J34644p1142o4783j2785q1529j91485j82043r5646q4475
41498G93942n0967K57427O41826M26076n37689j300383r22532J74983P58575M60318
$$ y = [24046983, 24369643, 22863452, 20066052, 17343095, 15475497, 14245638, 13280058, 12527645, 11814996, 10704832, 9103715, 7466449, 6189083, 5305390, 4858550, 4896455, 4950204, 4304355, 3107978, 2460451, 2948550, 3781526, 3890570, 3262866, 2608285, 2258759, 2053770, 1907044, 1847602, 1769665, 1643931, 1696730, 1975333, 2119783, 1982163, 1982345, 2319729, 2361828, 1523696, 323932, -238546, -47382, 233833, 386400, 799291, 1439758, 1645754, 1192470, 749401, 887509, 1266274, 1259047, 911196, 774617, 1063071, 1443186, 1577830, 1506688, 1441905, 1429120, 1347591, 1156106, 974063, 878417, 793942, 742975, 1000402, 1642228, 2068304, 1530615, 230232, -692300, -517317, 241258, 701576]
41488G01576Q713r9370j21213j92187j0998L31448K44515k63647l84183J48315
41478C62969N31716K57286p3908J5290m9983o45298q46661J46473J325399J104426
41468B127709k44109r30268k62150N86050N64372R8427j2636J07507q2981n07377
41458A444544o50034l73759k1138J16881J13568K51663O23814Q48451M15495m80926
41448B288559q81345l08606L82087J45263o42047p04977J60510P96026M89344
41439A724814p3286p2122K41204J94327k53658p20397r90551q48255j5734J134725
41429C21067J522718P51375j05838L3541O26800L83576o73534j260769q10715
41420G88221j47904j4384o8430K03667N12067L06966l36700r30597j202514j081630
$$ y = [701576, 710289, 610919, 489706, 297519, 286521, 617969, 862484, 598837, 214654, 362969, 894685, 1151971, 1078063, 1093353, 1043370, 398072, -448589, -302116, 1023283, 2127709, 1883600, 953332, 691182, 1277232, 1841604, 1940031, 1927395, 2034902, 1951921, 1444544, 794510, 420751, 399613, 516494, 630062, 881725, 1505539, 2353990, 2769485, 2288559, 1407214, 1098608, 1480695, 1625958, 983911, 278934, 439444, 1235470, 1724814, 1651528, 1579406, 1820610, 2014937, 1761279, 1040882, 50331, -797924, -813658, 321067, 1843785, 2595160, 2489322, 2522863, 3149663, 3533239, 2859705, 1598936, 788221, 640317, 625933, 557503, 761170, 1273237, 1580203, 1243503, 312906, -889608, -1971238]
41410a971238n16139K69748P56193P43191N60354L72827r5121p18145o48491L86146
41400h60675J180439N43423p84380j011988Q3952Q72286L95192l03768l3755O67463
41390G48189N67486k53832o45460j73351M39932M89796K1511n13660o41770q5721
41380d6880P65107R18764L6658p82587m04668N56720N76769l78924p81671l6018
41370D23270N45792p4925r50892p07418K69147N41061j10557n07566P746O98167
41360A33825O56111R911m27557j86899M51462Q05189M44604l38155p81367n12975
41350B54149M4212K79796Q7324k58701n03221m06786J63184P55791N23949n67229
41340C72468j305418p35917M22698P70372K21720o8398M07487Q57117N54164j69597
$$ y = [-1971238, -2487377, -2217629, -1461436, -718245, -157891, 214936, 119815, -598330, -1246821, -860675, 319764, 863187, 78807, -933181, -849229, 23057, 418249, 114481, 80726, 748189, 1315675, 1061843, 416383, 243032, 682964, 1172760, 1194271, 680611, 38841, -46880, 718227, 1636991, 1673649, 891062, 486394, 1043114, 1619883, 1240959, 459288, 423270, 969062, 894137, -56755, -764173, -495026, 46035, -64522, -572088, -564342, 133825, 789936, 799847, 372290, 185391, 636853, 1442042, 1886646, 1548491, 767124, 254149, 298361, 578157, 665481, 406780, -96441, -503227, -340043, 415748, 939697, 372468, -932950, -1668867, -1246169, -475797, -254077, -322475, 85012, 942129, 1496293, 1326696]
41330A326696o08411n43869j15493M54163P12582K21931p45364j337005j173000
41321a807770o78702k28855K94135Q48950R62131N10142L4138j49779l88395p65071
41311a369076o12556L28539J078526O99963k07099l63152K66429N79902J85266
41302E86742r3176K99316P63876N69719q0411n11909n00264k51557P0963L36404
41292A189703L08175m5191l19261j14249M23576P47018M87277k37494r17764r75232
41282E46558k50367P09997J118653Q16347L74218K36437J90787r0101m54709n97514
41272B600306n69533n09217k40674L01752N84645J23908n74069n31445K60880
41263A446553P76907M78529R811j465N1363l90457r10450p18153L8971M91863
$$ y = [1326696, 718285, 174416, 58923, 513086, 1225668, 1447599, 702235, -634770, -1807770, -2486472, -2715327, -2421192, -1572242, -610111, -99969, -65831, -215610, -604005, -1369076, -1981632, -1653093, -574567, 125396, -81703, -444855, -178426, 401476, 586742, 493566, 792882, 1556758, 2126477, 2046066, 1534157, 1033893, 782336, 853299, 1189703, 1497878, 1452687, 1133426, 1019177, 1442753, 2189771, 2677048, 2439554, 1521790, 546558, 296191, 1006188, 2124841, 2941188, 3315406, 3551843, 3742630, 3652529, 3197820, 2600306, 2030773, 1521556, 1280882, 1582634, 2167279, 2291187, 1717118, 1185673, 1446553, 2223460, 2701989, 2711800, 2710335, 2761698, 2371241, 1460791, 742638, 781609, 1273472]
41253A273472L73492K19065K85051J76805k72240n59471k88712K34869N30388
41244A972719N37258L60361o5084o58810r82797p76194l80578k51519l33950k69959
41234h48553M2525M12967O16537M43539j65188p83735p42240k4516N70060N54341
41224G5737M48946P77844J007569L69607p02791j019123l56364L10121L39869
41215A251415J66653K69731L59356L8038m60842o94807o36373m55568j46218K54764
41205e3851M90730M44795K85368N0206l98204p88776m90988M55866J047989O16536
41195A659671j91030l95146p7703K4111j56771q2185K61912L47365J67140K73858
41185A831222O29152M64206l72520r38265o23490j35082k81621n85993j52232
$$ y = [1273472, 1646964, 1866029, 2151080, 2327885, 2055645, 1496174, 1207462, 1442331, 1972719, 2509977, 2870338, 2805254, 2146444, 1163647, 387453, 6875, -244644, -578594, -848553, -806028, -393061, 223476, 667015, 501827, -281908, -1024148, -1048664, -478604, 75737, 524683, 1302527, 2310096, 2679703, 1976912, 957789, 601425, 911546, 1251415, 1418068, 1687799, 2047155, 2085193, 1624351, 929544, 293171, -162397, -308615, -53851, 436879, 881674, 1167042, 1217248, 819044, 30268, -460720, -4854, 1043135, 1659671, 1468641, 1073495, 995792, 1019903, 863132, 780947, 1042859, 1390224, 1557364, 1831222, 2460374, 2924580, 2552060, 1613795, 990305, 855223, 573602, -12391, -164623]
41176a64623O48643O29851k54095p27868j78273M40708K24319k88431j88980K37402
41166C78653J29452l68507l85615J04701K78709R300J22996Q49414J252009P28667
41156C099779j3170j56252K4037n9750k20622j08859j07003n67776q66846m01087
41146F22451Q3407m53391j390203j129923L55642J311509P93548q7819q8858M07164
41136D23527L92351j25611m52484l66309m7047M93137J063727R75164m9381j093888
41126A213186j056968j36550M96699K96193j57885j71677K28017N60431N49828
41117A821274L84792M40130O96932N56643l58345j325140j206764j46684L80099
41108A242937l58223j225714r03749K16728Q14425N72460J99037N4645k9168Q7738
$$ y = [-164623, 484020, 1113871, 859776, 131908, -46365, 394343, 618662, 330231, 141251, 378653, 508105, 139598, -246017, -141316, 137393, 146693, 269689, 1119103, 2371112, 3099779, 3086609, 2930357, 2954394, 2894644, 2674022, 2565163, 2458160, 1890384, 1023538, 622451, 705858, 252467, -1137736, -2267659, -1912017, -600508, 193040, 105221, 16363, 423527, 815878, 690267, 237783, -128526, -175573, 317564, 1381291, 2356455, 2307074, 1213186, 156218, 19668, 516367, 812560, 654675, 482998, 711015, 1271446, 1821274, 2206066, 2646196, 3343128, 3899771, 3541426, 2216286, 1009522, 862838, 1242937, 884714, -341000, -1244749, -1028021, -213596, 358864, 557901, 612546, 583378, 671116]
41098F71116O33616J051334N72786l85021o12058M7965M71715P5800l89013k79386
41088A858854j01280m37580q17200m90634L36086Q33667O61634J06042m80414
41079A469175p92043n28934J57849N24398J28970m36274l11394M06916Q68197
41070A486860P00784L12215K1250l13886o41010m74499K45346O76406J31612p52055
41060A393023p16939K96255R09356K05381r24780j007938n453Q15092P70155M51673
41050B185825M31468L75938p1460m79883m30336l61836p44638j021188m17388
41041e33498N79756P23370j02456o45599j35254O62376O63119p0760o25805m51291
41031F3958K16415P76679P36157N9063o73459p39792j18970M55542M42787J11990
$$ y = [671116, 1304732, 2356066, 2928852, 2543831, 1931773, 1979738, 2451453, 2527253, 2138240, 1858854, 1757574, 1319994, 502794, 12160, 348246, 1181913, 1843547, 1949589, 1469175, 677132, 148198, 306047, 830445, 959415, 523141, 211747, 618663, 1486860, 2187644, 2499859, 2521109, 2207223, 1566213, 1091714, 1337060, 2013466, 2145078, 1393023, 676084, 972339, 1881695, 2087076, 1162296, 154358, 148905, 963997, 1734152, 2185825, 2617293, 2993231, 2921771, 2441888, 2011552, 1649716, 905078, -116110, -533498, 46258, 769628, 667172, 21573, -113681, 548695, 1211814, 1141054, 515249, 63958, 280373, 1057052, 1793209, 1852272, 1178813, 439021, 320051, 775593, 1218380, 1330370]
41021A330370N731J93346L71017L88180L30663K75168K40990K51681K53149J17304
41011C757599j17761j77661J03394M79186M87907o4589q41761j178736o63868
41002A783710L50670R52127N77278l85644j063305r73632k56260O36914J121285
40993B743143O92477m88316j412807j202865j78921N61174N03946R8950r8239
40984A218542m231K58182N64585O59371L67890k8403j26331m0425j50026l42690
40974B376464j94468J98095L29759J69441J23780J78063k5239k84273m8686M08074
40964C231010J84606o52052q76662N7686J143834J322643P74041J35226m36302
40955D884030p29537j87385R52158J308729J96063j159420j329513o61656l12758
$$ y = [1330370, 1336101, 1529447, 1900464, 2288644, 2619307, 2894475, 3135465, 3387146, 3640295, 3757599, 3639838, 3462177, 3565571, 4044757, 4532664, 4468075, 3626314, 2447578, 1783710, 2134380, 3086507, 3663785, 3278141, 2214836, 1241204, 984944, 1621858, 2743143, 3435620, 2947304, 1534497, 331632, 152711, 713885, 1217831, 1316781, 1218542, 1214311, 1472493, 2037078, 2696449, 3064339, 3035936, 2909605, 2869180, 2719154, 2376464, 2181996, 2380091, 2709850, 2879291, 3003071, 3181134, 3155895, 2871622, 2822936, 3231010, 3415616, 2763564, 1886902, 1944588, 3088422, 4411065, 5185106, 5320332, 4884030, 4154493, 3967108, 4919266, 6227995, 6424058, 5264638, 3935125, 3273469, 2960711]
40946B960711k48090K62644Q56745N42813l46973m13194N53011J176933O64937
40937F009537q8101p9814L42481L09011k05911n81777n07340j23062L55586O73506
40927F104116N47991M9495k94929r3390M07365O19034K63456l78321p45632n32512
40917E946673o1698J4663m30149o95374j42809Q40687J220792N58803n19914j057051
40907E674623o67003K12441P63585O10963K72607M62968R39782P28763k81046
40898H717683q84573l03206N26876L40798n31362p92647k10658K74681K23115
40889G360707J68414M16019N54156L36104N8527j13894l39974n21503l62586n0438
40879G505532m8394k32815j07071K10672J86795n0251O3736L15631k312o01096
$$ y = [2960711, 2712621, 2975265, 3832010, 4374823, 4027850, 3614656, 4167667, 5344600, 6009537, 5921436, 5841622, 6184103, 6493114, 6287203, 5705426, 5198086, 5075024, 5430610, 6104116, 6652107, 6701602, 6406673, 6313283, 6720648, 7339682, 7603138, 7224817, 6479185, 5946673, 5884975, 5899638, 5469489, 4774115, 4631306, 5471993, 6692785, 7251588, 6731674, 5674623, 5007620, 5220061, 5983646, 6594609, 6867216, 7330184, 8269966, 8998729, 8717683, 7833110, 7529904, 8056780, 8397578, 7866216, 7073569, 6862911, 7137592, 7360707, 7529121, 7945140, 8499296, 8835400, 8893927, 8780033, 8440059, 7918556, 7555970, 7505532, 7457138, 7224323, 7117252, 7327924, 7514719, 7464468, 7528204, 7843835, 7841523, 7240427]
40869G240427m34444L90371N20511l82946r18949k22666N92018K96869n28557
40860F552634o76067k41372j5832Q1771M88846O68550j18991j165687j021807
40851D552045K84609J195371Q65678J26264o4970P0972j12286n47462p10442m71525
40841E188254j47873n902p8562k69930l83029j89702L31905Q77382J019698N60295
40831F902536k48336q23046p51459k36324J07353p9417n98507r87178q51578p2518
40821B361526Q80919J031474l2827j248539j114117K66209J177426O34875l72402
40812C584544n62962j66325j02671l01396p4132M13494L39558l36475p84420n92934
40802A416281j63826J54379M04561M77880J21001m17274n43842k34997n2436j61038
$$ y = [7240427, 6805983, 7196354, 7716865, 7333919, 6414970, 6192304, 6784322, 7081191, 6552634, 5876567, 5635195, 5619363, 5701134, 6189980, 6858530, 6739539, 5573852, 4552045, 4836654, 6032025, 6897703, 7023967, 6958997, 7029969, 6917683, 6370221, 5659779, 5188254, 5040381, 5034479, 4955917, 4685987, 4302958, 4113256, 4445161, 5322543, 6342241, 6902536, 6654200, 5831154, 5079695, 4843371, 4950724, 4871307, 4272800, 3285622, 2434044, 2361526, 3242445, 4273919, 4241092, 2992553, 1878436, 2144645, 3322071, 3956946, 3584544, 3021582, 2855257, 2752586, 2451190, 2377058, 2790552, 3130110, 2793635, 2009215, 1416281, 1252455, 1406834, 1811395, 2289275, 2410276, 1993002, 1449160, 1214163, 1161727, 1000689]
40792A000689j11627K36790L82790R1977p1439M01228J073688J052775J44225
40783D201096q75605j105327m52006K93254L17289k81822o14382j43885O12192
40774A950804P89789K63350l55333n41997k80215J18240K37579j46866o55882
40765A379469n49526K31209P62040M10579j69067q6053L15581R2013n84402o20276
40755A181567J54371O43855K32626l24923k28311J90438K41981J1110M93K21364
40745B324571L23749K63484K62466L35552K92139N4396k97556o40580q31408q10216
40735A276597p04480n81148k19360M52123Q75111M67605l72312o41101j45193
40726D07842L04729K54133K12375N67934Q54968O49638L41812L39831K66159k70277
$$ y = [1000689, 889062, 1125852, 1508642, 1600619, 1529180, 1930408, 3004096, 4056871, 4201096, 3325491, 2220164, 1768158, 2061412, 2378701, 2096879, 1482497, 1338612, 1950804, 2740593, 3003943, 2648610, 2106613, 1826398, 1944638, 2182217, 2035351, 1379469, 829943, 1061152, 1823192, 2233771, 2064704, 1978651, 2294232, 2386245, 1801843, 1181567, 1335938, 1979793, 2212419, 1887496, 1659185, 1849623, 2091604, 2102714, 2103207, 2324571, 2648320, 2911804, 3174270, 3509822, 3801961, 3856357, 3558801, 2918221, 2086813, 1276597, 572117, -9031, -228391, 223732, 1098843, 1566448, 1194136, 553035, 407842, 712571, 966704, 1179079, 1747013, 2601981, 3251619, 3593431, 3933262, 4199421, 3929144]
40716C929144p51944m99740J42049L13742J3777j1890L78724M67418r6920o61124
40706C223236n03856J74819N97286L90948j28072m60101l96822l6422M15331P29869
40696D006216O64739J44517m80075o06501n1704O40644Q37121N41461J67614p3464
40686E790568o4657N01192J474397J697364L05313j508528j495301N33401K119452
40677I353201J465845j45206m76270L86414N81683m46038j314938j035997k60216
40668H108478J05847J46164K90581M60577L97533J33954k32386o61775r01353
40659G847620o95833l34715l25230n31031m09478n7784p9722l95549k83554K39708
40649D974432K92850k83761m92926J19824O17388K81373j95642j07506q3795p71105
$$ y = [3929144, 3177200, 2677460, 2819509, 3133251, 3147028, 3135138, 3513862, 3981280, 3884360, 3223236, 2719380, 2894199, 3491485, 3882433, 3754361, 3294260, 2897438, 2861016, 3276347, 4006216, 4670955, 4815472, 4335397, 3728896, 3677192, 4317836, 5154957, 5696418, 5864032, 5790568, 5725911, 6227103, 7701500, 9398864, 9704177, 8195649, 6700348, 7233749, 9353201, 10819046, 10673840, 10197570, 10583984, 11165667, 10719629, 9404691, 8368694, 8108478, 8214325, 8360489, 8651070, 9111647, 9509180, 9643134, 9410748, 8748973, 7847620, 7151787, 6817072, 6491842, 5960811, 5551333, 5493549, 5413827, 5018278, 4734724, 4974432, 5267282, 4983521, 4490595, 4610419, 5227807, 5509180, 5313538, 5206032, 5122237, 4351132]
40639D351132j282792n52461O11745O32377k08706k10686Q41701J284065L94832
40630E861207l79805J92398J222212J261553M48907j00017l3820K89821P95057
40621I557513J441951J612339Q82533o3788l22386p4086L0878K19765J052732
40612A4337451J939536J647015K05252j049846j387492j321181j224889p30498
40604A2415348J16774M59256j1635m62107l25035j82059n19954p36903l11911
40595A0441774N5514m26398j203073j239983o64969l22540k22610K45766Q74319
40586G537800P72327r0529o94505m42224K12511P21071J032333J066805N67389
40577A0682978k40169o54600m38061m2170K53229O35678J023252R12532K88756
$$ y = [4351132, 3068340, 2515879, 3127624, 3760001, 3551295, 3340609, 4182310, 5466375, 5861207, 5481402, 5673800, 6896012, 8157565, 8606472, 8506455, 8472635, 8762456, 9557513, 10999464, 12611803, 13494336, 13430548, 13108162, 13034076, 13064954, 13284719, 14337451, 16276987, 17924002, 18129254, 17079408, 15691916, 14370735, 13145846, 12415348, 12532122, 12991378, 12979743, 12517636, 12192601, 12010542, 11490588, 10753685, 10441774, 10497288, 10070890, 8867817, 7627834, 6962865, 6640325, 6417715, 6663481, 7537800, 8310127, 8219598, 7525093, 7082869, 7295380, 8016451, 9048784, 10115589, 10682978, 10442809, 9788209, 9350148, 9307978, 9561207, 10196885, 11220137, 12132669, 12421425]
40568A2421425j26596O8107M00415M35969M78188Q27358J056595P15300K30068
40559A6506829L79137J202314K096378K747887L308177L805185M169923M981236
40551C9197066P316890J1054294J3659989J1951493N809225p01193l156192j259719
40543H3871853K108407N839311J1458963J7794614J8415888Q484173p256437j7902073
40535A22814699j8149547j2614755p655801l766926J006182M390828J903919n826383
40527H2102216j2585637j3822238j0880779p472999n236287m003917l661515l827062
40519B0611782l397013k046770r91012j039017j167170l26912N53029k9932j590327
40510A0576658k200673j232557J1943L70300J22808k3078o7702l06256n78467
$$ y = [12421425, 12294829, 12362936, 12763351, 13199320, 13677508, 14504866, 15561461, 16276761, 16506829, 16885966, 18088280, 20184658, 22932545, 26240722, 30045907, 34215830, 39197066, 46513956, 57568250, 71228239, 83179732, 88988957, 88287764, 85131572, 83871853, 85980260, 91819571, 103278534, 121073148, 139489036, 147973209, 140716772, 122814699, 104665152, 92050397, 84394596, 80627670, 81633852, 86024680, 87928599, 82102216, 69516579, 55694341, 44813562, 37340563, 32104276, 28100359, 24438844, 20611782, 17214769, 15167999, 14176987, 13137970, 11970800, 11643888, 12196917, 12166985, 10576658, 8375985, 7143428, 7155371, 7525671, 7648479, 7625401, 7557699, 7251443, 6672976]
40501F672976n25170j66606K06917M25906M14615P4186m65688p10488k99712M64039
40491F090975R26584Q53489N30744J47569m17508j050146j181072n13609M21380
40482E808406R13295R47151Q96669P03010J15706m81032m05274J86395M48240
40473I132566K07114J49444M63568M59019n4067k36024K71425N25771j05586o56726
40463A0156504n1141J094747J478128J111050Q85257Q20229L34274k05812J04957
40454A5728193R58355J155863O58410O71078J528841K117461J783647J344532
40446B5946380J659703K463669L160626L669317M011885M122461M454255N693882
40438E5182178P522723Q793537R228476R633368J0069230R370869P208490N147244
$$ y = [6672976, 6147806, 5981200, 6188117, 6614023, 7028638, 7102824, 6637136, 5926648, 5626936, 6090975, 7017559, 7871048, 8401792, 8549361, 8131853, 7081707, 5900635, 5387026, 5808406, 6721701, 7668852, 8565521, 9268531, 9384237, 8903205, 8497931, 8684326, 9132566, 9339680, 9489124, 9952692, 10411711, 10357644, 10121620, 10393045, 10918816, 10813230, 10156504, 10105363, 11200110, 12678238, 13789288, 14674545, 15494774, 15829048, 15623236, 15728193, 16686548, 17842411, 18500821, 19171899, 20700740, 22818201, 24601848, 25946380, 27606083, 30069752, 33230378, 36899695, 40911580, 45034041, 49488296, 55182178, 62704901, 71498438, 80726914, 90360282, 100429512, 109800381, 117008871, 122156115]
40430A22156115M679477N465665O488709P605889Q698137Q473364N700985J023544
40422A70291885l699224p256841r251383r284614p478073n335809m636167n572470
40414A17777304p022416q299601r473938j0279613j0051748q800915p291432n987650
40406E0569991m802757l835364l412906l362312l089518k463192j905387j613223
40398B6085332j389002j186239j104662r05479k83631L94713L83817l35595r05914
40389B0753340o65445J54292Q55400R33740L19896o03083j228406j277270j007708
40380A8234756o99447l27767j6821k09620q99203j329611j085923q14182j113477
40371A1738705j443046j086476n06138n69589r81863p75980L1525N94901P40112
$$ y = [122156115, 126835592, 132301257, 138789966, 146395855, 155093992, 163567356, 169268341, 170291885, 166592661, 159335820, 150084437, 140799823, 133321750, 127985941, 123349774, 117777304, 110754888, 102455287, 92981349, 82701736, 72649988, 63849073, 56557641, 50569991, 45767234, 41931870, 38518964, 35156652, 32067134, 29603942, 27698555, 26085332, 24696330, 23510091, 22405429, 21499950, 21216319, 21611032, 21994849, 21659254, 20753340, 20087895, 20242187, 21097587, 22031327, 22351223, 21748140, 20519734, 19242464, 18234756, 17535309, 17207542, 17190721, 16981101, 16081898, 14752287, 13666364, 12852182, 11738705, 10295659, 9209183, 8703045, 8133456, 7151593, 6375613, 6407138, 7002039, 7742151]
40362G742151R47547J074442N57471j98344j29864P20845J200401R12458O21397
40353A3448504O30896L34901k95903m06489N0000p7555j129461j789603j153445
40344I611845k20290k63087r48151j204759r00256n30105j91141O3708k28204
40335E189560r79653j098098j14521P14956J94577q89638j063285m65315j95195
40326A293388j31483O41535J642164J343172k05184j112865m77061L23489q9362
40317C227793j066877j190712l63524M60464Q07947Q88135P94343M53945R0946
40308D102460l26L4385j43487m99443p15237o19667k24576L47600O86823K93680
40298C262212o45830j150136o31933K15749L42680k07881n27224k94908j06155
$$ y = [7742151, 8689698, 9764140, 10321611, 10123267, 9993403, 10714248, 11914649, 12827107, 13448504, 14079400, 14414301, 14118398, 13711909, 13761909, 13684354, 12554893, 10765290, 9611845, 9391555, 9128468, 8180317, 6975558, 6075302, 5545197, 5354056, 5417764, 5189560, 4209907, 3111809, 2997288, 3712244, 3906821, 3017183, 1953898, 1488583, 1293388, 1161905, 1803440, 3445604, 4788776, 4583592, 3470727, 2993666, 3317155, 3227793, 2160916, 970204, 606680, 1067144, 1875091, 2763226, 3557569, 4011514, 4102460, 4102134, 4136519, 3993032, 3493589, 2778352, 2158685, 1934109, 2281709, 2968532, 3262212, 2616382, 1466246, 834313, 1050062, 1392742, 1184861, 657637, 362729, 256574]
40289B56574k96831l49656J52329P04739N98162J671l00883k3679L84529N45828
40279A672783N99575P27304P34347L81227j73982n37406n07579j55811L33513
40270C073971P05309O89789K48935l23299p05587q40027p99048n64146j44469
40261A341428K55115M17730L45630J47437r9246j95731J44415P86824J024708
40252D168310L99996n62168r63066o91359l82394l30922j38945M68382J119809
40243C087643J332684J107482P63983N29580M34886L33412M660m59186m98932
40234F636212K17433J099410J250313O78452J68006l39l10538q95192j145111
40225G698646p73191l58812l63796m21377j25029K27626K23734k8338l43342p80666
$$ y = [256574, -40257, -389913, -237584, 467155, 1065317, 1066988, 766105, 742426, 1126955, 1672783, 2272358, 2999662, 3734009, 4115236, 3941254, 3403848, 2896269, 2740458, 3073971, 3779280, 4469069, 4718004, 4394705, 3689118, 2849091, 2050043, 1485897, 1341428, 1596543, 2014273, 2359903, 2507340, 2408094, 2212363, 2356778, 3143602, 4168310, 4568306, 4006138, 3043072, 2351713, 1969319, 1638397, 1499452, 1967834, 3087643, 4420327, 5527809, 6291792, 6821372, 7256258, 7589670, 7594330, 7135144, 6636212, 6853645, 7953055, 9203368, 9881820, 10049826, 10049487, 9738949, 8843757, 7698646, 6925455, 6566643, 6202847, 5781470, 5656441, 5884067, 6107801, 6079463, 5736121, 4955455]
40215D955455j037228m51843P16268J026940j85720j535738j405388k13423M61904
40206B331227L13844K85478N60376L30960m42158p22174j56429L38067K02252
40197C041443P9334M31524N84800m1767q20035r38407o76219o80562o82071l8785
40187B59255Q66533R33171J0042p28473l25916P27345J186456N74789l85510p33159
40177B384533l09084K73876M85203L84714K59579J40403n4475j93965j40571p4461
40167C155752k00735l29219k13163j06367l97222q11191o52132J39857Q16444
40158A402024Q11813L39846q4379j69439J49997O36979O49707k02135j237599
40149B296814j311472l78305L82735K27085k77688l87126k30120j59645L9197
$$ y = [4955455, 3918227, 3466384, 4182652, 5209592, 5023872, 3488134, 2082746, 1869323, 2331227, 2645071, 2930549, 3490925, 3821885, 3379727, 2657553, 2501124, 2839191, 3041443, 3120777, 3552301, 4137101, 4095334, 3275299, 2336892, 1660673, 980111, 298040, 259255, 1125788, 2058959, 2069001, 1340528, 1014612, 1741957, 2928413, 3503202, 3117692, 2384533, 2075449, 2349325, 2834528, 3219242, 3478821, 3619224, 3564749, 3370784, 3230213, 3155752, 2955017, 2625798, 2412635, 2306268, 1909046, 1097855, 445723, 585580, 1402024, 2213837, 2553683, 2469304, 2299865, 2449862, 3086841, 3736548, 3534413, 2296814, 985342, 607037, 989772, 1216857, 939169, 552043, 321923, 162278, 201475]
40140B01475N33257P83585L54696k05464j54572K59386K71682j42198l74487k53248
40130A274112j24202p3526Q8149K23565P3373o2042L22741R66039J052711M16547
40120D157467k46731m06395j98663J09787L85646L36274k07918o55472k21256
40111C052739P14862Q38066j76935j024672o17596M08033Q01047M47859P4064
40102D517467j11108l72193m96200n0202N74687M73873l80504j029823r25796
40093B200201n30658l48872k72417j87671l37615o24245l74299N93903J362234
40084A480561J070534J42537l61907j66638J98582M06344N26996M66543O9898
40075C833450l15123j80776K68642L40986q4598m85664o20925o66433m74487K66079
$$ y = [201475, 734732, 1518317, 1873013, 1667549, 1512977, 1772363, 2044045, 1901847, 1527360, 1274112, 1149910, 1076384, 1164533, 1388098, 1461471, 1399429, 1722170, 2688209, 3740920, 4157467, 3910736, 3504341, 3305678, 3415465, 3801111, 4137385, 3929467, 3273995, 3052739, 3767601, 4605667, 4428732, 3404060, 2786464, 3194497, 3995544, 4443403, 4517467, 4406359, 4034166, 3537966, 3487764, 4062451, 4536324, 4155820, 3125997, 2200201, 1669543, 1320671, 1048254, 860583, 522968, -101277, -475576, 118327, 1480561, 2551095, 2693632, 2331725, 2165087, 2363669, 2770013, 3297009, 3763552, 3833450, 3518327, 3337551, 3606193, 3947179, 3862581, 3376917, 2755992, 2089559, 1615072, 1881151]
40065A881151J025698P62082l98254r87959k71306O54508N65897j95235o57615
40056B378967p66547q47269n23545M26844R63931J45359j013342q12399L88188
40047C40187O68549k82440o48950M41123J437128Q82599m12460r45257p51345
40038G29134o47349m84235K42032R07078N43195l79375m99436L38012R38006O55581
40028B342643J49294J09300L58305M92176N17392N33589M46658K43916N9681j24938
40018E128016l95250n58861l82138o4069O2092J34971M46539O96325L28397m47667
40008D948355p76380l68194J57609K68706J38072P7581L6224o1319m5663J39495
39998D514486K58091J70784N327j71992m13036n36572k17597M46194R13512Q51081
$$ y = [1881151, 2906849, 3668931, 3270677, 2282718, 2011412, 2665920, 3231817, 3036582, 2378967, 1612420, 765151, 241606, 668450, 1632381, 1777740, 764398, -48001, 340187, 1008736, 726296, 77346, 518469, 1955597, 2838196, 2425736, 1480479, 729134, 81785, -402450, -160418, 746660, 1289855, 910480, 411044, 749056, 1687062, 2342643, 2491937, 2601237, 2959542, 3451718, 3969110, 4502699, 4949357, 5193273, 5252954, 5128016, 4732766, 4173905, 3791767, 3727698, 3789790, 3924761, 4371300, 5067625, 5396022, 4948355, 4171975, 3803781, 3961390, 4230096, 4368168, 4445749, 4481973, 4420654, 4374991, 4514486, 4772577, 4943361, 4948688, 4776696, 4363660, 3827088, 3609491, 4055685, 4969197, 5820278]
39988E820278M05199j48321n27547l23615N52785J323558J040713o5592p64635
39979G312823n16273p2584j05037k41241p788K16849n5357m97991o05078n90502
39969D837821p90004p73781o0762P32619N59172m60545j156986r42371l13791
39960A631372K49843Q01221J148137O70977n63819j373159q23959N13849J295520
39951C549982R95489K27546k26456j81541o170k04004q95212j476643j113371
39942F69620J27717J067903Q34086N9910m3783N08989N91809j37760n85235R0356
39932C183612J123311J286500O86914L99166O89107P39558J40282m40616l91863
39923G415971n4009J6475o2447N6221K20452J89756K95272R04492J553042J473686
$$ y = [5820278, 6225477, 6077156, 5549609, 5225994, 5778779, 7102337, 8143050, 8077458, 7312823, 6796550, 6723966, 6618929, 6377688, 6369900, 6586749, 6531392, 6033401, 5428323, 4837821, 4047817, 3274036, 3213274, 3945893, 4505065, 4044520, 2887534, 1945163, 1631372, 1881215, 2682436, 3830573, 4501550, 3937731, 2564572, 1740613, 2254462, 3549982, 4545471, 4773017, 4546561, 4365020, 4358850, 4154846, 3259634, 1782991, 669620, 797337, 1865240, 2699326, 2759236, 2715453, 3224442, 3816251, 3678491, 3093256, 3183612, 4306923, 5593423, 6280337, 6679503, 7368610, 8108168, 8248450, 7807834, 7415971, 7361962, 7378437, 7315990, 7372211, 7592663, 7782419, 8077691, 8982183, 10535225, 12008911]
39913A2008911Q55599O81908J239325J669406J317237P53887R07949J712198K283250
39904B3429670K210363K017492K311161K986238L517975L742351M004314M579543
39896D8799107N268408N724421N963529O238253O492652O348795N738480N180938
39888I5754583N218667N841185O633644P210851P396588P412318Q066827J0162641
39880A53697304J3329324J6050722J7358203J7817686J8129311J7547031J4906166
39873B68835747J0765463P085035M806811L152356J528259O91674J428012L277232
39865C01570589N356540P471624R536451J0660996R759969O618797J689260m574067
39857C48090159j1378209j7150215k0459107k1285509k0706936j9492569j7637232
$$ y = [12008911, 12864510, 13546418, 14785743, 16455149, 17772386, 18526273, 19434222, 21146420, 23429670, 25640033, 27657525, 29968686, 32954924, 36472899, 40215250, 44219564, 48799107, 54067515, 59791936, 65755465, 71993718, 78486370, 84835165, 90573645, 95754583, 100973250, 106814435, 113448079, 120658930, 128055518, 135467836, 143534663, 153697304, 167026628, 183077350, 200435553, 218253239, 236382550, 253929581, 268835747, 279601210, 286686245, 291493056, 294645412, 296173671, 296865345, 298293357, 301570589, 306927129, 314398753, 323935204, 334596200, 344356169, 350974966, 352664226, 348090159, 336711950, 319561735, 299102628, 277817119, 257110183, 237617614, 219980382]
39850B19980382j5135477j2554220j0706831j0001623j0059840r950631r162672
39843A42409088q372940q649232r798829j0389115r728857q779639q474823q252894
39835F9962759p268205o051250n602304n544172m735395l365593k824283l458003
39827C1113554l947663l238155j863334r37561q34418j275703j866515k133839
39819A5016366j737022r61805m40388k94619k08229k65541p96360j384404j134019
39810G793979j35223M56062J45574k30154n3498L2675n99539j285846j072162
39801E051868k58556R5149k63303o52410n87456j90675L21010P92828Q83833L30416
39791E522704n38410j032725q51834k89269K08289M07741L49943K79067L82616
$$ y = [219980382, 204844905, 192290685, 181583854, 171582231, 161522391, 151571760, 142409088, 134036148, 125386916, 115588087, 105198972, 95470115, 86690476, 78215653, 69962759, 62694554, 56643304, 51041000, 45496828, 40761433, 37395840, 34571557, 31113554, 27165891, 23927736, 22064402, 21126841, 20292423, 19016720, 17150205, 15016366, 13279344, 12317539, 11877151, 11582532, 11374303, 11108762, 10312402, 8927998, 7793979, 7658756, 8114818, 8260392, 8030238, 7976740, 8009415, 7409876, 6124030, 5051868, 4793312, 4888461, 4625158, 3972748, 3385292, 3194617, 3515627, 4308455, 5192288, 5522704, 4984294, 3951569, 3099735, 2810466, 3018755, 3426496, 3776439, 4055506, 4438122]
39782D438122M88400K42129l60608r29110j163118r92395l49509N75469R76449
39773B925829K38683q43478p54842N55168J392342P61088k09288j68908L63596
39764D260190R0096q45288j212637o92250n2577L16811O56201Q35434M62930q5183
39754C733727l1418M29497L83231j71878k75320K76334N31088L9567l97535j50293
39744D367000K54950J88934q2477j11808n2094o9959J36258N49104M46603m07738
39734E218773j018846n25691L85373M52419l05919p82248m93336j3645J82538
39725C099418K76368M08405L25931k3202k49978j79539j85219n31364q28499n51168
39715A561153J57807O04541M04044r6633l30692k11245r5998j44619n9353L77750
$$ y = [4438122, 4926522, 5168651, 4808043, 3878933, 2715815, 1723420, 1373911, 1949380, 2925829, 3164512, 2321034, 1566192, 2121360, 3513702, 4274790, 4065502, 3896594, 4260190, 4350286, 3504998, 2292361, 1600111, 1547534, 1864345, 2520546, 3355980, 3818910, 3733727, 3702309, 4131806, 4515037, 4343159, 4067839, 4344173, 4875261, 4914828, 4517293, 4367000, 4621950, 4810884, 4728407, 4616599, 4564505, 4494546, 4630804, 5179908, 5626511, 5218773, 4199927, 3674236, 4059609, 4512028, 4206109, 3423861, 2930525, 2916880, 3099418, 3375786, 3784191, 4110122, 4086920, 3836942, 3657403, 3472184, 2940820, 2112321, 1561153, 1718960, 2323501, 2727545, 2630912, 2300220, 2088975, 1992977, 1848358, 1789005, 2166755]
39705B166755Q22174P65925K37010k90289n58473o65081o35316l70508q901J83863
39695A647159K85791N19909O08422M8618q64905j116776l66710N18708P30409
39686B010625N29135M77613M51637J31996j76613m6818K36208J60839q3487J3716
39676C704851L02086K14514k27596m70330l44140j65578m7828J58100L46805K93955
39666C764839J84751L04779L80672J0552m35445k59721L21112L99892j14033k97466
39656D259932K32936O39108K09604n25369o47669j34728L33880L58296O9380k23435
39646D571935k25861J50222N04798K65530m92366j029493r42940n82387k37589
39637A981849L23750J073519J280357N56963k74028k10109M36350M70601m17423
$$ y = [2166755, 2988929, 3754854, 3991864, 3701575, 3143102, 2478021, 1842705, 1472197, 1463296, 1647159, 1932950, 2452859, 3061281, 3109899, 2244994, 1128218, 761508, 1280216, 2010625, 2539760, 3017373, 3469010, 3601006, 3424393, 3377575, 3613783, 3774622, 3691135, 3704851, 4006937, 4221451, 3993855, 3523525, 3179385, 3013807, 2965979, 3124079, 3470884, 3764839, 3949590, 4254369, 4635041, 4645593, 4210148, 3950427, 4271539, 4671431, 4557398, 4259932, 4492868, 5131976, 5341580, 4816211, 4168542, 4033814, 4367694, 4725990, 4795370, 4571935, 4346074, 4496296, 5001094, 5266624, 4774258, 3744765, 2801825, 2219438, 1981849, 2305599, 3379118, 4659475, 5216438, 4942410, 4732301, 5168651, 5639252, 5221829]
39628E221829j195439r38713o1196K76981l15876r57743o21477M51297R36732
39619B796395K13923o63804m66167L02452J80349p92034r68573K21826J166894
39610A991261N46371n88656n64580K75975L47958n37609j090687p34051j65407
39601e19425J74368N73441R02108N42725k71987m84548P5339L76661j0207k09821
39591A148654K73905N62590p4898r22165j000262n27774k08144R212L96574N19605
39581A77297Q847m28461R133P70740P55920J27392n3922K46373j6146r97916j435738
39570h36481n80339N73318P38539J06843j91607K09344O41007N51217J28368k07365
39560A132844l18359k23263R5063N11251O41195K06356n10777q12911l23764N24890
$$ y = [5221829, 4026390, 3087677, 3026481, 3303462, 2987586, 2029843, 1408366, 1859663, 2796395, 3010318, 2346514, 1880347, 2182799, 2363148, 1571114, 602541, 824367, 1991261, 2537632, 1948976, 1384396, 1660371, 2008329, 1470720, 380033, -354018, -519425, -345057, 228384, 1130492, 1673217, 1401230, 916682, 992021, 1368682, 1358475, 1148654, 1422559, 1985149, 1910251, 988086, -12176, -539950, -748094, -738882, -342308, 177297, 186144, -242317, -233184, 537556, 1293476, 1420868, 1366946, 1613319, 1597173, 599257, -836481, -1416820, -843502, -104963, 1880, -189727, 19617, 660624, 1211841, 1340209, 1132844, 814485, 591222, 686285, 1197536, 1838731, 2045087, 1534310, 721399, 397635, 922525]
39550I22525R02193M44460m24174r80644q30403j28651N45568N86574k0547n14552
39540E02349k16964M71665N46236r3671m48764k9662L16931j29473o11126q9617
39530B17904Q86010Q88342j11037o70783j69048L49528Q3523k18743K32700O63152
39520B151548n6006j327804j453627j45034J008420Q31953P5489p626M02468K08773
39510A688554o55300j018052l15036M48861J83076o23320o52873K10840P33121
39501a29K77609k48298O6433O45978M09900m18031o38403N2904O91721N89885
39491A429569J58038q2729k88259n98373n50812J09791O98127M54043k86101n65001
39481D78293j85722J62155O8949n9145K19632O48889O26417k665p46008r49271
$$ y = [922525, 1824718, 2269178, 1845004, 864360, 33957, -94694, 450874, 1037448, 1016901, 502349, 285385, 757050, 1303286, 1209615, 760851, 731189, 1048120, 918647, 307521, 217904, 1103914, 1992256, 1881219, 1210436, 1041388, 1390916, 1474439, 1255696, 1488396, 2151548, 2095542, 767738, -685889, -830923, 177497, 1009450, 1084939, 1077313, 1479781, 1688554, 1033254, 15202, -299834, 149027, 332103, -291217, -944090, -733250, -129, 277480, 29182, 95615, 741593, 1151493, 733462, 95059, 147963, 839684, 1429569, 1587607, 1504878, 1216619, 618246, 67434, 177225, 875352, 1329395, 1043294, 478293, 292571, 454726, 523675, 464530, 684162, 1333051, 1959468, 1956803, 1210795, 261524]
39471B61524m01731M50367Q89155O09242k0282m27633m23572j97664O0962K79486
39461A079854L55961J99863p4854k18572j35897N1382K19116L30033K89267o4296
39451B031857o68651j070729q01608P626N97082M04333j84606k74942L06943P01187
39441A048492K14574o35428q13481j89782M06098M19462J23583q7718k09038k40932
39431C5830q687L40381L04400j61495m25267j65033P2145j87361m76271j47032
39421h18390M98721O25953J03035m36305n81886m89873l43366j27030Q8678J84908
39411a295555K71775M72223N81680M26619L18368N52212P22830K93889l54978
39402A989063l61728J84615K59998m53536r62559m66854M02560N26510j39910
$$ y = [261524, -140207, 310160, 1199315, 1808557, 1788275, 1360642, 937070, 739406, 800368, 1079854, 1435815, 1635678, 1560824, 1342252, 1206355, 1257737, 1476853, 1806886, 2096153, 2031857, 1363206, 292477, -509131, -501505, 95577, 499910, 315304, 40362, 347305, 1048492, 1263066, 627638, -185843, -375625, 30473, 449935, 573518, 485800, 276762, 35830, 27143, 367524, 671924, 510429, 85162, -79871, -7726, -195087, -671358, -818390, -319669, 306284, 409319, -26986, -608872, -1098745, -1442111, -1569141, -1480463, -1295555, -1023780, -551557, 30123, 456742, 775110, 1327322, 2050152, 2344041, 1989063, 1627335, 1811950, 2071948, 1618412, 655853, 188999, 591559, 1118069, 978159]
39393I78159o95024o16077k34007p585O5591K17589M51843M91228J31956l93019
39383C90654n43188j46073K36739J3266n03399m57817K33393O65619L05866j80927
39373A4133P598N46395N18792j51574o12203l31896K83105O14334N78665M38014
39363A905363L06965J46993P836M324J26866K23667J53185q7465l45546m14127
39353B028061k04322J58614M17331L63656j1100m72847o90549n33832k00850M9892
39343I04054K11310M04298N53407M67427K03431K6166k3877j94240n76534r07656
39333A067786r10900n62079K1873O21583Q21511L37920m38601p22287l49603P766
39323a05031r0207j88950J93473O35277M55085j21615k72724J19845L32873J2069
$$ y = [978159, 283135, -332942, -566949, -574534, -508943, -291354, 160489, 651717, 783673, 390654, -152534, -298607, -61868, -48602, -552001, -1009818, -776425, -110806, 195060, 14133, 21731, 568126, 1086918, 935344, 323141, -8755, 274350, 888684, 1467349, 1905363, 2212328, 2359321, 2367157, 2371481, 2498347, 2722014, 2875199, 2787734, 2442188, 2028061, 1823739, 1982353, 2399684, 2763340, 2752240, 2279393, 1588844, 1055012, 854162, 904054, 1115364, 1519662, 2073069, 2540496, 2743927, 2770093, 2746216, 2551976, 1975442, 1067786, 156886, -405193, -383320, 238263, 1059774, 1397694, 959093, 236806, -112797, -105031, -195238, -384188, -190715, 444562, 899647, 778032, 505308, 625153, 958026, 970095]
39313I70095k84414k1297M82853N72152J69901k56765m00981l83806m11965m91657
39303e5884n18019m64935m01233l52638j99733K01769P41713J003883O63486q2902
39293E35507o49288o54972k69348O0418R6562n1200j85335k64405l17873k28682
39283a928616J62163O66650P55536K28612l43415k65544L15489O02279K73854
39274D67008j82314l52580m12388m87909k35177M45597R20212O86465J91828P4106
39264A114848R7227k86233p34420m42854M17207Q10811M25974M5826J34970J58169
39254A741525k81708o64478n15006k46970l32273m14344o3495K72253J1822m09067
39244i01741j77922M78502O42160K75370K35766O70134O55896j67168p87490l61156
$$ y = [970095, 685681, 664384, 1147237, 1719389, 1889290, 1632525, 1231544, 847738, 435773, -55884, -573903, -1038838, -1440071, -1792709, -1992442, -1790673, -1048960, -45077, 618409, 535507, -113781, -768753, -1038101, -977683, -881121, -932321, -1117656, -1382061, -1699934, -1928616, -1766453, -1099803, -344267, -115655, -459070, -724614, -409125, 193154, 467008, 284694, -67886, -480274, -968183, -1203360, -757763, 162449, 848914, 1040742, 1114848, 1212075, 925842, 191422, -251432, 165775, 976586, 1402560, 1448386, 1583356, 1741525, 1459817, 795339, 280333, 33363, -298910, -713254, -776749, -504496, -492674, -901741, -1079663, -601161, 40999, 316369, 552135, 1222269, 1878165, 1710997, 923507, 562351]
39234E62351L94759K99218m79399q07921m13276j34329l74603m76700K0842N18242
39224h90816L58755q2930q1919K45201L17306K66057O88262J313666J048200l45179
39214B836603j591856j513631n36423J17242J39781J71005M91369O71993M98913
39205A284996L43769L97997K69097l11848r27477j009684n62651j0817L77172
39196a49446O02061P10159P37761P14696N52384J47850k68246k14201L88935R81835
39186D203788J084182R21917R54539J074177P88210M6259o47257r16431q30909
39177F678475n58360k27117j73786o98531j358217j167383M3176J066909Q14002
39168D419168p5752l3305J193719K171313J862019R92307P27048Q99725N21170
$$ y = [562351, 957110, 1256328, 776929, -30992, -444268, -578597, -953200, -1429900, -1409058, -890816, -532061, -614991, -696910, -451709, -134403, 131654, 819916, 2133582, 3181782, 2836603, 1244747, -268884, -805307, -688065, -548284, -377279, 114090, 786083, 1284996, 1628765, 2026762, 2295859, 1984011, 1056534, 46850, -515801, -526618, -149446, 452615, 1162774, 1900535, 2615231, 3167615, 3315465, 3047219, 2833018, 3221953, 4203788, 5287970, 6209887, 7164426, 8238603, 9026813, 9073072, 8425815, 7509384, 6678475, 6120115, 5892998, 5719212, 5020681, 3662464, 2495081, 2538257, 3605166, 4419168, 4343416, 4310111, 5503830, 7675143, 9537162, 10529469, 11256517, 12156242, 12677412]
39159A2677412n40733j486333j890694j976571j709411q09564K37748M20258k23953
39150D698159m90923K8969J97578o35485j184508j24960J625459K153521J372722
39141G640532P89740Q22727L52997r28929j726067j305280p20546r48287j294019
39132B682868p93558M1305J86274j35954l8557L62935K55483l20292n49093k50448
39122A440963n7L0111K06375M64235L21794j16828k58719j79482n37923j170706
39112A99763j015518J36434J009488O53975j51645j95719L18388L02175l82180
39103H75161p89655m38830O8068J03946j40213j58013J16229L71620L71654J13062
39093D93029k06227k75790m473K09106r3817o80237p69586j05051O08999O54997
$$ y = [12677412, 12136679, 10650346, 8759652, 6783081, 5073670, 4264106, 4501854, 4922112, 4698159, 4207236, 4236205, 4433783, 3798298, 2613790, 2488830, 4114289, 6267810, 7640532, 8430272, 9252999, 9605996, 8677067, 6951000, 5645720, 4925174, 3976887, 2682868, 1889310, 1930615, 2116889, 1980935, 1942378, 2305313, 2560796, 2240504, 1691411, 1440963, 1440906, 1471017, 1677392, 2141627, 2463421, 2346593, 2087874, 1908392, 1370469, 199763, -815755, -679321, 330167, 984142, 832497, 636778, 955166, 1257341, 875161, 85506, -353324, -285256, -181310, -321523, -479536, -363307, 8313, 379967, 493029, 286802, 11012, 6539, 215645, 121828, -558409, -1327995, -1433046, -824047, -169050]
39083a69050K18497j02301k69312o06002q81901m59077N61690J158768P00311
39074A51623k14123o58590n46032l40399j31334K66281O20069N00749P8368n8710
39064c32098J43559J71695r5443j64222J66402M16362K29535r0025j79403j63052
39054A03310k51271l32189k84028j66790J33569P82579J257306O18427r59215
39045I01698j861977j050436M21370Q86346L40719L2477L17590L75707q8095l21648
39035d6249O1330M04466J86796j42708l0869K90412L08794P220k98458l83649
39025C57085r1968N60205J051986P83429M0842k19887J86381L46399k13619o58841
39015B142012k41874L55237J07146o06470n73977K59756O69731O1594o74791n83004
$$ y = [-169050, 49447, -52854, -322166, -928168, -1810069, -2269146, -1707456, -548688, 151623, -62500, -721090, -1267122, -1607521, -1738855, -1472574, -852505, -351756, -273388, -332098, -188539, -16844, -112287, -276509, -110107, 306255, 535790, 445765, 266362, 103310, -147961, -480150, -764178, -930968, -797399, -14820, 1242486, 1860913, 901698, -960279, -2010715, -1589345, -702999, -362280, -329803, -12213, 363494, 275399, -46249, 15081, 419547, 606343, 463635, 432766, 723178, 1031972, 1039192, 740734, 357085, 265117, 825322, 1877308, 2660737, 2701579, 2481692, 2668073, 3014472, 2800853, 2142012, 1900138, 2255375, 2362521, 1756051, 1182074, 1441830, 2111561, 2173155, 1498364, 915360]
39005I15360M4949L38014J41940m1402k7141j57490n94100r45601p62612j20243
38995a208326M54295N05780K2235n87185p92558l58151L80100P43841M27781p7704
38985d89892o4347M14577N63701q075o40197n02328K58685P86934O99145M03099
38975A421302L22535M00002M22181L28729R9842k43965m73294l68108r2903N0153
38965A866474J36197L62029M19455j48715r78113j102574l22926M48056M90139
38956A170022J48725M9345K04070L49539M66850M69630M2416o90019r81382m89089
38946G40107J63237L70614L53939L80629M8612p86335j185348l45706R52886J309558
38936B002193O65332Q4283n1958k55857n19720j94156N56489O14852l15949j046829
$$ y = [915360, 960309, 1298323, 1440263, 1398861, 1371720, 1214230, 620130, -325471, -1088083, -1208326, -754031, -248251, -226016, -813201, -1605759, -1963910, -1583810, -839969, -412188, -489892, -554239, -139662, 424039, 415964, -224233, -726561, -467876, 319058, 1018203, 1421302, 1743837, 2143839, 2566020, 2894749, 2994591, 2750626, 2277332, 1909224, 1816321, 1866474, 2002671, 2364700, 2784155, 2635440, 1657327, 554753, 231827, 679883, 1170022, 1318747, 1368092, 1572162, 1921701, 2388551, 2858181, 2900597, 2210578, 1229196, 740107, 903344, 1273958, 1627897, 2008526, 2057138, 1270803, 85455, -260251, 692635, 2002193, 2667525, 2751808, 2699850, 2443993, 1924273, 1730117, 2286606, 2901458, 2585509, 1538680]
38926A538680o41783K29289M22939n2658l89430l29107k63168l15698j59362K86848
38916C26550N91828M01961j7620m3877M96729R19403L94883q26658j416665o33252
38906A93282N54332P76641K32030K15424Q95955R96447l8014r88073p04285J92154
38896B325893M35265O414k31951j14503j47534k87118J2990O09763O56157o2561
38886C202815p02188n40970J31852N81742M94122L1773m45433m89063J10813Q65620
38876C241083R36931K18909m05167k33008L02102L33399j74164n19750m38511
38867C261824m01432o28325n71654J42066Q32438N76940l36388o21108K29224
38858B483585J183533J103538K49801k96000k29778j98609n57762q41650o15415
$$ y = [1538680, 896897, 1126186, 1549125, 1496467, 1107037, 777930, 514762, 199064, 39702, 326550, 918378, 1320339, 1302719, 1258842, 1755571, 2674974, 3069857, 2243199, 826534, 193282, 747614, 1524255, 1756285, 1971709, 2867664, 3864111, 3826097, 2838024, 2133739, 2325893, 2761158, 2767572, 2535621, 2421118, 2273584, 1986466, 1999456, 2609219, 3265376, 3202815, 2500627, 1959657, 2091509, 2673251, 3167373, 3199146, 2753713, 2264650, 2375463, 3241083, 4178014, 4396923, 3991756, 3758748, 4060850, 4394249, 4220085, 3700335, 3261824, 2860392, 2232067, 1660413, 1802479, 2634917, 3211857, 2875469, 2254361, 2483585, 3667118, 4770656, 5020457, 4724457, 4494679, 4296070, 3738308, 2896658, 2281243]
38849B281243j30488J58382J93308J38181M0448n8591n1703l1523k42555n57648
38839A739054m60976J37225N32710J41066n47229m82091N60697J575104J416165
38830D611725P4085j260480j396390l85130N73901N71875M0657N798O03709J014884
38820D454634P59920K40805j19542m19420o63077m56210J98628N70535K63527
38811D829800p0699K48956Q32623Q99098N14753L23336M61625N73308N51042M57881
38801I621723O7202o66071j030212m04781O00353Q71786M32642K38953M69588
38792A0201183K87356n72690j247579j148876p81581o66116m86553O2488M99647
38783F147279L55844N802k7035M3453j89191m58526k89389J03599J59105r5231
$$ y = [2281243, 2150755, 2309137, 2502445, 2640626, 2681074, 2622483, 2570780, 2539257, 2296702, 1739054, 1278078, 1415303, 1948013, 2089079, 1541850, 1059759, 1620456, 3195560, 4611725, 4685810, 3425330, 2028940, 1643810, 2217711, 2789586, 2830243, 2836041, 3439750, 4454634, 5214554, 5455359, 5335817, 4916397, 4253320, 3797110, 3995738, 4566273, 4829800, 4759101, 5008057, 5840680, 6739778, 7254531, 7577867, 8039492, 8612800, 9163842, 9621723, 9688925, 9022854, 7992642, 7587861, 8188214, 9060000, 9492642, 9731595, 10201183, 10488539, 9915849, 8668270, 7519394, 6737813, 6071697, 5585144, 5647632, 6147279, 6503123, 6508925, 6481890, 6525343, 6336152, 5877626, 5588237, 5691836, 5850941, 5755710]
38773E755710j80295k5027j0553k75019n48485n96440l74858J00684O07957O61559
38763E115233Q9243n49789o38115l73338l87652o93019p13514l21597p9061k70010
38753A178381l80687P6822P12378P22111r993p21535o94815o2704M63449N11283
38743A794690L92772M44160L87517j92264r19154q94379m0035N97877L26136j67614
38733A729706J4039M47374R4733q34474j019197p4678Q03595O45437J2770j63299
38723A656006m7684k60901n34612j85357M51837L17471o19738j061422k07511
38714d91911J039514J301071N08555k50871l02699k8158J1286j09018j5122K38729
38704A901376K20007j80731m66665j40725N65839Q59133L30028n27173r32636
$$ y = [5755710, 5575415, 5550388, 5539835, 5264816, 4716331, 4119891, 3745033, 3845717, 4453674, 5115233, 5204476, 4654687, 4016572, 3643234, 3255582, 2562563, 1849049, 1527452, 1448391, 1178381, 797694, 874516, 1586894, 2309005, 2299012, 1577477, 882662, 819958, 1283407, 1794690, 2187462, 2631622, 3019139, 2826875, 1907721, 1013342, 973307, 1571184, 1897320, 1729706, 1743745, 2191119, 2285852, 1451378, 432181, 357503, 1161098, 1806535, 1819305, 1656006, 1608322, 1347421, 812809, 627452, 1079289, 1396760, 777022, -284400, -491911, 547603, 1848674, 2357229, 2106358, 1803659, 1775501, 1786787, 1677769, 1662647, 1901376, 2121383, 1940652, 1473987, 1333262, 1899101, 2758234, 3088262, 2561089, 1628453]
38695A628453p28279l51691q4404J89797M87357N44364L21434J70959K05920K8149
38685B412059m86244o86781r9933N89438M15954k85856k91287N20862Q43699J6799
38675B948710q17479m66039M39074M82492l24258p42510l78551r8112l14593k96191
38665D32543L58180Q00253K70612n81512o49229p915L65586J35155j05433L8060
38655A056300K45059K09285J46828L09760N14219M56029J69922o4442o1670J56398
38645C137688L86019L17868j65649p09402p88358l85009m7937j24563k91915j32495
38635A196247J55556Q2092k75495k95122K50060Q01642Q12273N04222M60758P69104
38625D461337J009314Q91192M45817k32738q99042r81506k02970O91037O99707
$$ y = [1628453, 900174, 548483, 464079, 653876, 1141233, 1685597, 2007031, 2177990, 2383910, 2412059, 1925815, 1239034, 1139101, 1728539, 2144493, 1858637, 1567350, 2088212, 2931911, 2948710, 2131231, 1665192, 2104266, 2586758, 2262500, 1519990, 1141439, 1043327, 728734, 432543, 790723, 1590976, 1861588, 1280076, 630847, 622932, 988518, 1123673, 1018240, 1056300, 1301359, 1510644, 1657472, 1967232, 2481451, 2937480, 3107402, 3042960, 2981290, 3137688, 3523707, 3841575, 3675926, 2966524, 2178166, 1793157, 1745220, 1620657, 1328742, 1196247, 1351803, 1433895, 1158400, 863278, 1113338, 1914980, 2727253, 3231475, 3692233, 4461337, 5470651, 6361843, 6807660, 6574922, 5675880, 4694374, 4491404, 5182441, 5882148]
38616E882148J42619L71429J540771J980091O79420q90348r02488q4354n09827
38607H209461k030214k317031o56058P95178M63402k61785L09418J131409K75057
38598E918837j558240j962909o48581K75649j70376n44848K08154R46909M43398
38589B907993n14052n35125J61463L97809p372l05998k31682j13237k1462J30030
38579A868367N8969l16576k88598N59799J191970L60434j309759j938826j008292
38570h22512J52905N98648Q21428J129090P16636o28731j397047l83980J195878
38561A382315J263459q7519q38374j05791Q08448O68392k0701k46654p7743r7015
38551B648817k11727l7647J68761n4428m15548k55029L55826P13653N18356P8762
$$ y = [5882148, 6024767, 6396196, 7936967, 9917058, 10596478, 9706130, 8803642, 8719288, 8209461, 6179247, 3862216, 3206158, 4001336, 4464738, 4202953, 4512371, 5643780, 5918837, 4360597, 2397688, 1749107, 2024756, 1854380, 1309532, 1517686, 2464595, 2907993, 2393941, 1858816, 2020279, 2418088, 2410716, 2104718, 1873036, 1759799, 1738337, 1868367, 1927336, 1610760, 1322162, 1881961, 3073931, 3434365, 2124606, 185780, -822512, -669607, -70959, 750469, 1879559, 2596195, 1967464, 570417, 186437, 1382315, 2645774, 2558255, 1719881, 1614090, 2422538, 3090930, 3070229, 2823575, 2745832, 2648817, 2437090, 2399443, 2568204, 2513776, 2098228, 1843199, 2199025, 2912678, 3431034, 3509796]
38541C509796l66183p92064r50194n47876J06725L31727J6252k77393j94387N6669
38531H93072K56000M05633L55157q3382n50332m37905R0405K28504j29701j64769
38521H62682L79376N74441j48626q67153n39871L22393N00996k1336k51802N6834
38511H67934J47192k74438n08789l9983O89571R75579O35409q2267p51397q49087
38501H09724k19013M91971M98296l1682k57520O82Q3771k70496m68023j17461
38491E20249L31365L99398K60409K09832J63711P9180J77312L70185K04741k24690
38481B491692j36037O49495J142027O12852k08712k32049L61648N46127K1921
38472E248964o18406r49365r79078o14753J72685P86976N42615k61923o48477
$$ y = [3509796, 3143613, 2351549, 1401355, 853479, 960204, 1291931, 1308183, 1030790, 836403, 893072, 1149072, 1554705, 1909862, 1826480, 1276148, 838243, 928648, 1157152, 1027451, 862682, 1242058, 1816499, 1667873, 800720, 260849, 583242, 1084238, 1062902, 811100, 867934, 1015126, 740688, 231899, 191916, 881487, 1857066, 2492475, 2410208, 1658811, 809724, 590711, 1082682, 1580978, 1549296, 1291776, 1292458, 1376229, 1105733, 637710, 520249, 851614, 1251012, 1511421, 1721253, 1884964, 1964144, 2141456, 2511641, 2716382, 2491692, 2355655, 3005150, 4147177, 4760029, 4551317, 4319268, 4680916, 5227043, 5248964, 4630558, 3681193, 2702115, 2087362, 2260047, 3047023, 3589638, 3327715, 2679238]
38463B679238l30076L9361K580j51126p8585J72715N67028J153337J543347J114855
38453F712674N1691n63243j12180P38904J028325P04916L28901J13674q1052j65268
38443H757342P5185M34640M57329J37058m8886J39847L56171J51106m69284j080214
38433H910294j246547q41825j30410M10308M68955J37292k84272o24288q32419
38424E967088p63732k97786K99398M94438J56780k06103j85629j45580o53419
38415D665455j399275j395903m18579M79779L56309l30823n09998j06259N5673
38406A396379k57796l62637M9801L32728K8266k94755J7520N96329O10202p060
38396B108977n66513n75507j25784M09914O17759K87458j97742j36852M47922
$$ y = [2679238, 2349162, 2388523, 2391103, 2239977, 2161392, 2334107, 2901135, 4054472, 5597819, 6712674, 6764365, 6201122, 6088942, 6827846, 7856171, 8561087, 8889988, 9003662, 8922610, 8757342, 8832527, 9267167, 9724496, 9861554, 9812668, 9952515, 10308686, 10459792, 9990508, 8910294, 7663747, 6821922, 6691512, 7101820, 7570775, 7708067, 7423795, 6799507, 5967088, 5203356, 4905570, 5204968, 5699406, 5856186, 5650083, 5464454, 5318874, 4665455, 3266180, 1870277, 1451698, 1931477, 2287786, 1956963, 1446965, 1340706, 1396379, 1138583, 775946, 825747, 1158475, 1186741, 891986, 909506, 1505835, 2116037, 2108977, 1542464, 966957, 841173, 1251087, 1868846, 2156304, 1958562, 1821710, 2269632]
38387B269632O55097R5674l37951J10517O84494K99399n58950n62254K27865M92560
38377C376083n4699k71340K28719L00208n86096j123260k89787P15070K25463
38368B520361j148838j318124J16457J242626O07399q40386j229766k37962P60250
38359D72017O33354j69205l70055M09418J119372O72235n10419r99403l57534
38350H99780K67941o6613o51385k94294P48321J139854M60600l32936m61346k25838
38340A484084r1302J21051N95817Q62661M50689k83461o13219m10858j03133Q2921
38330B095250K52870L70085K38635k2737r340L38222N64333L55666p474j33022
38320D042488j27188l17889n60893l41809L78681R04207O47716q3968m77502j96763
$$ y = [2269632, 2924729, 3020403, 2682452, 2792969, 3477463, 3776862, 3217912, 2655658, 2883523, 3376083, 3321384, 3050044, 3278763, 3578971, 2992875, 1869615, 1579828, 2294898, 2520361, 1371523, 53399, 169856, 1412482, 2019881, 1179495, -50271, -288233, 472017, 1105371, 936166, 566111, 975529, 2094901, 2767136, 2256717, 1257314, 899780, 1167721, 1101108, 449723, 155429, 903750, 2043604, 2504204, 2171268, 1709922, 1484084, 1392782, 1513833, 2109650, 2972311, 3423000, 3139539, 2526320, 2115462, 2012329, 2095250, 2348120, 2718205, 2956840, 2934103, 2924763, 3262985, 3827318, 4182984, 4175510, 4042488, 3915300, 3597411, 3036518, 2694709, 3073390, 3977597, 4625313, 4541345, 4063843, 3867080]
38310C867080L44979N86843L80929k58j38433K19667Q78632J266235J030315M82903
38300H918892J78692J84195J46146k4620m6441J39606K10455M7255j3865K49623
38290I989938N62242O17728N56239O48747P89293O41328J46259l44749l79890
38281A3227135J80929R07343J066165M83581j8791M05737J341615J570340Q71385
38272B0035439M18392J029749J972262K132861J562124J046591Q01364N16720
38264B9515502K59497L71560O93050P20233M03575J05911k7201Q703M73750J399978
38254C3924558J969597J312680j45246j036251p98270k41922k69115q12921j244993
38245C2658117j175154o56496j33889k58919j207982k191610k247024j479583
$$ y = [3867080, 4212059, 4798902, 5179831, 5179573, 5041140, 5260807, 6139439, 7405674, 8435989, 8918892, 9097584, 9281779, 9427925, 9403305, 9356864, 9496470, 9706925, 9754180, 9740315, 9989938, 10552180, 11169908, 11726147, 12374894, 13164187, 13805515, 13951774, 13607025, 13227135, 13408064, 14315407, 15381572, 15865153, 15846362, 16252099, 17593714, 19164054, 20035439, 20453831, 21483580, 23455842, 25588703, 27150827, 28197418, 28998782, 29515502, 29774999, 30146559, 30839609, 31559842, 31963417, 32069328, 32042127, 32050830, 32524580, 33924558, 35894155, 37206835, 37061589, 36025338, 35227068, 34985146, 34716031, 33903110, 32658117, 31482963, 30826467, 30692578, 30433659, 29225677, 27034067, 24787043, 23307460]
38237B3307460q52501q20400r68758r89324j087286j266718j130548o88662n41583
38228A4961680r19025j282990j215619r68890q04826n50092j97416k09842p64897
38219H048083j331783j410201j085770n46935K19571R09281R04096K50171j92630
38210E763883o4569o4893o13802r75060n54238q3574l94316q29502k34981R89492
38200B938440J300261L34898n56134l05668M83390N71145k89037j212120j253064
38191B012111l47661O17660O92945k6993m86092j07983L99629J89578m11966n43753
38181A987475k22706j11103k45141j17251J69123N79n11290n63354o0624J53448
38171D79156k60483n43442j07564N46357O78984K95886j83190n30218n57342m9900
$$ y = [23307460, 22454959, 21634559, 20665801, 19676477, 18589191, 17322473, 16191925, 15503263, 14961680, 14042655, 12759665, 11544046, 10575156, 9770330, 9220238, 9022822, 8812980, 8048083, 6716300, 5306099, 4220329, 3673394, 3892965, 4802246, 5706342, 5956513, 5763883, 5699314, 5634421, 5020619, 4045559, 3491321, 3407747, 3013431, 2183929, 1948948, 2938440, 4238701, 4573599, 4017465, 3711797, 4195187, 4766332, 4477295, 3265175, 2012111, 1664450, 2282110, 2975055, 2948062, 2461970, 2353987, 2753616, 2943194, 2531228, 1987475, 1764769, 1653666, 1408525, 1291274, 1460397, 1460976, 949686, 386332, 325708, 479156, 218673, -324769, -432333, 114024, 793008, 1088894, 905704, 375486, -181856, -231756]
38161b31756P02447R33333L86893k79242m14748j20298J95355L32885J20570n11129
38151A114310r80247m74851O77650J068189K10522n79170j32909P71961O77059
38142B352514l32218r58020o76912p3710M34099Q74336R33784K30061o61278p26287
38132A396369j22177J483n66282p21478L575N04494j10155r67176p00448N24752
38122g57043J353189J139141M81382P7657l6545q8892j31671j78259l44851o78802
38112H35306j002274r59216k64507Q38240J424757P48440o14895j178045m52232
38103f24426L24086k3785q67351p86158K56768R68581P36204L11019L65176N43423
38093A203537L42254m5878k73985m39252o32504n64524j25272K99435M88072O91349
$$ y = [-231756, 470691, 1404024, 1790917, 1511675, 1096927, 976629, 1171984, 1504869, 1625439, 1114310, 134063, -340788, 336862, 1405051, 1615573, 1036403, 903494, 1675455, 2352514, 2020296, 1062276, 385364, 311654, 745753, 1620089, 2553873, 2783934, 2122656, 1396369, 1274192, 1275675, 709393, -12085, -8510, 495984, 385829, -581347, -1281795, -757043, 596146, 1735287, 2216669, 2294326, 2257781, 2168889, 2037218, 1858959, 1514108, 835306, -166968, -1126184, -1390691, -552451, 872306, 1620746, 1005851, -172194, -624426, -300340, -324125, -1191476, -1977634, -1720866, -752285, -16081, 294938, 660114, 1203537, 1545791, 1499913, 1225928, 786676, 154172, -410352, -535624, -236189, 251883, 943232]
38083I43232Q83115N41641k61155n03068K14443O77428j87272j377184j149149
38074b17969K00781O65880l81599j263477o50721N35226Q06776L30333K23992
38065B49222N79220N62836L0101k56026M9980L58301R9620n05473q14888m83268
38055a30375K54037P58975N49127j24253n01110k97502m2531j64415l15555p6002
38045h9604K55355K11774o417L0792J55790j3292k67349k00178j3998o4575l3398
38034c5100M36609P13634K6976r52209q15876L52855R79930M08632k58527j57896
38024F99028O6446k68950n88821k19346L45959M02344K35563K99340J58068n85345
38014E44286j180849q13607m7157J20568m8069K95900Q23261N46858k66918m07364
$$ y = [943232, 1826347, 2367988, 2106833, 1603765, 1818208, 2495636, 2308364, 931180, -217969, -17188, 648692, 267093, -996384, -1647105, -1111879, -305103, 25230, 249222, 828442, 1391278, 1421379, 1165353, 1215333, 1573634, 1673254, 1167781, 352893, -130375, 123662, 882637, 1431764, 1307511, 806401, 508899, 466368, 301953, -13602, -89604, 165751, 377525, 371108, 401900, 557690, 544398, 277049, 76871, 62873, -1702, -35100, 401509, 1115143, 1142119, 189910, -625966, -273111, 706819, 1115451, 856924, 699028, 765474, 496524, -92297, -311643, 34316, 436660, 672223, 971563, 1129631, 544286, -636563, -1450170, -1497327, -1376759, -1424828, -1128928, -305667, 241191, -25727, -433091]
38004d33091J88269L76971p0929p4021O58959R00032K6688p18633j69322Q51720
37994A536643Q32806j36342p12141l66878J76426L31231L29678M92048O73985
37985C157456N83202J15813o39080j346023j519220j055228m48438j04809K05547
37976a050780P37029J050973O09940k30965o37828n25609n12515p04984m79264
37967a744003L32438R36900O88839J490l57126l12730k62566k50317k3169L21891
37957f68353M03360K35435K75928O71543R03662M50804m33707q97610m39639M77557
37947I78980Q78105L42438n02478p15111j72503L31385J70697l16748l96220J3723
37937F12268L20667J84972l5077J07533M70494N03326n9112q60876j222656p55192
$$ y = [-433091, -244822, 132149, 61220, -12801, 646158, 1546190, 1572878, 854245, 684923, 1536643, 2369449, 2233107, 1520966, 1154088, 1330514, 1661745, 1991423, 2483471, 3157456, 3740658, 3856471, 3217391, 1871368, 352148, -703080, -1151518, -1256327, -1050780, -313751, 737222, 1347162, 1116197, 478369, -47240, -559755, -1264739, -1744003, -1411565, -474665, 214174, 215664, -141462, -454192, -716758, -967075, -990244, -668353, -264993, -29558, 246370, 917913, 1821575, 2272379, 1838672, 941062, 501423, 978980, 1857085, 2199523, 1697045, 981934, 809431, 1140816, 1311513, 994765, 598545, 612268, 932935, 1117907, 1082830, 1190363, 1660857, 2164183, 2105071, 1244195, 21539, -733653]
37927g33653J97842P71998M66072k21550l68013J62498N50126K15970l56503l94373
37917B90414L0555K30423o779k14063n8439K60640M61428M73142K13735l63778
37907A317278q80191p59490n6641M90577M78695L23001L93118L11915l04490r19938
37897C93834o60188L84030J140472Q46551j54299r30992q95605k33326L00238
37888A90715J13220m57414m17338M98983J189564O02936o18935r01000P738P01193
37878I09662K59607m64783l44122K58595K33463l89645m91569L26854J074386
37869A372448P71628k72032j008201r41659l99399J48338N06278N94177L55841
37860A127419l7398j98587M3674L71403L33391r6096n00578n29536k36976P4447
$$ y = [-733653, -535811, 236187, 702259, 480709, 112696, 275194, 825320, 1041290, 684787, 290414, 320969, 551392, 544613, 330550, 272111, 532751, 994179, 1467321, 1681056, 1317278, 437087, -322403, -379044, 111533, 590228, 913229, 1306347, 1618262, 1313772, 393834, -266354, 117676, 1258148, 2104699, 1950400, 1019408, 123803, -109523, 190715, 303935, -153479, -570817, -71834, 1117730, 1720666, 1101731, 200731, 208469, 909662, 1169269, 704486, 360364, 618959, 852422, 462777, -28792, 298062, 1372448, 2144076, 1872044, 863843, -77816, -477215, -328877, 177401, 771578, 1127419, 1090021, 891434, 935108, 1306511, 1639902, 1543806, 1043228, 513692, 276716, 351163]
37850C51163J45779r9370m70028n50261j23302M06529L99381j00911l12030J69507
37840a83543P25535O32235J19748j08978k1620j40894n07365n96658k39180J63629
37830a57091L86165N77551O27063J40652p22046j135749o53415K44872Q79242
37821A87244J028440O99498j8437o42663o25178k47656l37656q46841p75892P9698
37811a499443N64051M8002m28728N4482O39965K28083m34670L3761J132210J148778
37801A486491m0819q84553p74257o61275q32197k40917J248935J985634R91603
37792B278645m03395o59303k56535l84278p16627k23032P21566Q41655O1119n66845
37782F92970o90657q05464p85672J1509J083027R26049o56256j847043j166589
$$ y = [351163, 496942, 397572, -72456, -622717, -746019, -339490, 59891, -41020, -353050, -183543, 541992, 1174227, 1293975, 1184997, 1163377, 1022483, 515118, -81540, -320720, -157091, 229074, 806625, 1433688, 1574340, 852294, -283455, -936870, -691998, 187244, 1215684, 1915182, 1896745, 1254082, 628904, 381248, 43592, -803249, -1579141, -1499443, -935392, -887390, -1316118, -1261636, -621671, -393588, -828258, -794497, 337713, 1486491, 1445672, 561119, -213138, -874413, -1706610, -1947527, -698592, 1287042, 2278645, 1875250, 1215947, 959412, 575134, -141493, -364525, 357041, 1198696, 1259815, 692970, 2313, -803151, -1588823, -1577314, -494287, 431762, -224494, -2071537, -3238126]
37773c238126N75047J488126R27114k14353r18347r21209m79460O3104M88452
37764b229652P61979Q37709N04232k06280o28755j81591N64298M32422n76787
37755g22425j077860l12259O76147O11975j90109n46679k29361N5728M1964Q2043
37745a610836J82458j0713l11269j30072M31118O15766K73431J12717M63770P34450
37735G50820M60789L5947n9421O300o4870j28015m7532r0708l47266l60865R5282
37724B50461M52504J90670k63231j77779L38779N41523J28882m92145q01783n48314
37714c80433J65863P53344N29376l12375o73686m2701O97722O66558L40719M88174
37704B232561O18080p0847q78788n09208N76832O72742l34239p29582R7324O80177
$$ y = [-3238126, -2663079, -1174953, -247839, -462192, -1380539, -2301748, -2781208, -2718104, -2229652, -1467673, -629964, -125732, -332012, -960767, -1142358, -578060, -145638, -722425, -1800285, -2112544, -1436397, -824422, -1014531, -1561210, -1790571, -1734843, -1692879, -1610836, -1428378, -1439091, -1750360, -1880432, -1449314, -833548, -560117, -447400, 16370, 750820, 1211609, 1247556, 1188135, 1194435, 1129565, 1001550, 954018, 863310, 516044, 155179, 250461, 702965, 893635, 630404, 452625, 791404, 1332927, 1461809, 969664, 167881, -380433, -214570, 538774, 1068150, 755775, 82089, 39388, 737110, 1403668, 1744387, 2232561, 2850641, 2779794, 1901006, 1391798, 1968630, 2641372, 2307133, 1577551, 1674875, 2355052]
37694B355052J73177j94281M21123O73543n77860j879954j348208J40989L21889
37685H5470p96622j177453k35668N05003K82803J34000N88289O48886r4193m22777
37675d82262L23301Q55820Q0120r34510o63799M38394Q68190M96392L36470M99738
37665A817854J60296o34078p81137M6489P38111L12467q20514j524547j136201
37656a821260K02514J700761K241465J273098l81208j232724q43718k07153k29816
37647G01959n86969m95696L4852L46492J51221j90388k67438m6963K41468L36634
37637B25172J13232k47977l38955O256M08100L52052j32708m51844j56934N03328
37627B79722Q51958N16945k12268p42321p83753n37481l40605k75969j96916k3409
$$ y = [2355052, 2528229, 2333948, 2755071, 3428614, 2850754, 970800, -377408, -236419, 85470, -711152, -1888605, -2124273, -1619270, -1336467, -1202467, -614178, 34708, -59485, -482262, -158961, 696859, 776979, -157531, -821330, -382936, 485254, 981646, 1318116, 1817854, 1978150, 1344072, 562935, 609424, 1347535, 1660002, 839488, -685059, -1821260, -1618746, 82015, 2323480, 3596578, 3215370, 1982646, 1138928, 931775, 701959, 114990, -380706, -345854, 638, 151859, -38529, -305967, -352930, -111462, 225172, 338404, 90427, -248528, -242272, 165828, 517880, 385172, -66672, -223606, 279722, 1131680, 1648625, 1436357, 694036, -89717, -627198, -967803, -1243772, -1440688, -1464097]
37617a464097J45194K17875K74449M30673N76925M13069j23681n65972l42972
37608d38537M14193Q28682L28827n40499q15142m23709j58998l49177l59089K49099
37598a264350Q14184N07252l31969o25738j37280K31665j67100p76238o48293
37589b397867K39803R44045P06037j53459n72310N0906J071837J245592K46835
37580A381419q34556q78535k30528j21930p63799r66829L9737J289319J305234
37571B19532J30941p55938m34872M12858O65071K50901l6511J65676L23325j34187
37561H06796r36968j209525m50421Q75440J706135J338614J07172q85539q29278
37552E22426q20O34710N57598J32862j08758j71389k92974l71045j98841l612
$$ y = [-1464097, -1318903, -1101028, -826579, -395906, 181019, 594088, 470407, -95565, -438537, -24344, 804338, 1133165, 592666, -222476, -646185, -805183, -1154360, -1513449, -1264350, -450166, 57086, -274883, -900621, -1037901, -806236, -973336, -1749574, -2397867, -2158064, -1214019, -507982, -661441, -1233751, -1182845, -111008, 1134584, 1381419, 546863, -331672, -562200, -684130, -1447929, -2414758, -2375021, -1085702, 219532, 350473, -405465, -840337, -427479, 237592, 488493, 451982, 617658, 940983, 806796, -130172, -1339697, -1790118, -914678, 791457, 2130071, 2237243, 1351704, 522426, 521606, 1156316, 1713914, 1846776, 1738018, 1566629, 1273655, 902610, 703769, 700157]
37542G00157j34215l42180o2524N71194P27644Q6073o58875q16638n56628l28705
37532h14697r1251L02359N19264K58428p5778M7870L59931K13083l09257n27054
37522a17102k81791q4905j48448q7681K72017N28557L69713Q868k40908l03840
37512h5520j41623K21350L92962k7570o74902p13412r3028K63755j53158o44009
37502a655155l59757N05962J119869J054620M38744l93418r02040n53564M17377
37493c27362R91635O45712L9011j56531l20548q98748j149753j73931J270697
37484g9818J469838K15122q74776p10764k9119J33404n5873j9611L1111l05535
37474b26021o08754k80361L06674L28310j53424l64351j36677n7742l06299k98901
$$ y = [700157, 565942, 223762, 161238, 732432, 1460076, 1546149, 887274, 70636, -485992, -814697, -905948, -603589, -84325, 174103, 98325, 146195, 506126, 719209, 409952, -117102, -398893, -483798, -632246, -719927, -447910, 80647, 450360, 459228, 218320, -85520, -227143, -5793, 387169, 359599, -315303, -1028715, -1121743, -857988, -1011146, -1655155, -2014912, -1508950, -389081, 665539, 1104283, 710865, -191175, -744739, -327362, 664273, 1309985, 1348996, 1192465, 871917, -26831, -1176584, -1350515, -79818, 1390020, 1605142, 730366, 19602, -9517, 123887, 68014, 48403, 79514, -226021, -834775, -1115136, -808462, -480152, -633576, -997927, -1134604, -1192346, -1498645, -1797546]
37464a797546K79004Q73045Q30192K10137m53142p31764m42581K95262R10169
37455b7224P80418N0819m30819k51804M0046j08140l96556l18607r5217k09235
37445i66319m04251k9031P85460J177629Q06957K41977k2665j58363l95866n66229
37435D69299n60645n90969o61288m16172J44895M79113M12229M76831Q26753O77202
37425A257248l68652j233964p22337N75715R86639J14758p86533p90981l42570
37416a310677n8696K55554P91920R36923J29786j026321j278605j84052J359602
37407c84566J949463R65856p35207j515722p44317L58852L14112n52015p24526
37398a068070L4053L55512l58594r02704l36360M95213N93333M94294R16941J044748
$$ y = [-1797546, -1518542, -645497, 184695, 394832, -58310, -790074, -1232655, -937393, -27224, 753194, 804013, 373194, 121390, 161436, 53296, -343260, -661867, -757084, -966319, -1370570, -1399601, -614141, 563488, 1370445, 1612422, 1589757, 1431394, 1035528, 469299, -91346, -682315, -1343603, -1759775, -1614880, -1135767, -723538, -246707, 580046, 1257248, 888596, -345368, -1067705, -491990, 494649, 609407, -177126, -968107, -1310677, -1369373, -1113819, -321899, 615024, 744810, -281511, -1560116, -1744168, -384566, 1564897, 2530753, 1795546, 279824, -464493, -105641, 208471, -343544, -1068070, -1034017, -678505, -1037099, -1939803, -2276163, -1780950, -1187617, -693323, 223618, 1268366]
37388A268366m5821j248506q11418P12960J118805l889p41587p2421O27313R0612
37378H94414q19042p98334k17551j33520m00915k52508J15313K9903j84461L01594
37368a465107J181119J277859L97144l76092l72677j73338m03480o94933m34170
37359a063675J34023K34849k92186p44648m64139L35235Q10861N07424o7986r0714
37349g00956M76058Q35595M84060j30525l40526j33846J28202L78343O41250N71902
37339B209557p0339p38900o85080j11237Q4349k82638m12658J39318P27182O40783
37329A500337J31561j60122k17701m02882n89638l01591M05221Q56335O14818
37320A836338n1926o27117q64087p71002m41966m2234K86109N72919Q40061Q00559
$$ y = [1268366, 1222545, -25961, -837379, -124419, 994386, 990497, 248910, 176489, 803802, 894414, 75372, -722962, -940513, -1074033, -1474948, -1727456, -1612143, -1582240, -1766701, -1465107, -283988, 993871, 1391015, 1014923, 642246, 468908, 65428, -629505, -1063675, -929652, -694803, -986989, -1731637, -2195776, -1860541, -1049680, -542256, -610242, -700956, -224898, 610697, 1094757, 964232, 623706, 489860, 618062, 996405, 1637655, 2209557, 2139218, 1400318, 715238, 604001, 688350, 405712, -6946, 132372, 859554, 1500337, 1631898, 1471776, 1254075, 851193, 261555, -40036, 365185, 1221520, 1836338, 1784412, 1157295, 293208, -477794, -919760, -961994, -675885, -102966, 737095, 1537654]
37310A537654J37326q28507j229211p12147o377J0872m97252o47469j75424K53680
37300b156855J51393r9529P929K83279K83216J06105J16459K19926J21122O3544
37290i03411M85177J023735Q09882j03093n97763j87964J34103n21618j372088
37281a233040j040453L09297J142177P31133l1377j86054M4084M7051o1082J42594
37271a35670M47211L00962k37936n60195m13191j41168k4858O6501K49368L16569
37261a32407R0528k08464k09569J22529M50943M82166K87443J80010L17826M89603
37251A870608L63822n5551l50764j65631L21466N39914J49814n60424r31795n85620
37241E95839J69817O12527L52202k40261m69160j26465L41710M63064K26062j47359
$$ y = [1537654, 1674980, 846473, -382738, -1094885, -1101262, -1090390, -1587642, -2235111, -2410535, -2156855, -2005462, -2104991, -2097062, -1813783, -1530567, -1424462, -1308003, -1088077, -966955, -903411, -418234, 605501, 1415383, 1312290, 714527, 526563, 660666, 139048, -1233040, -2273493, -1964196, -822019, -90886, -122263, -308317, -264233, -217182, -278264, -135670, 311541, 612503, 374567, -185628, -598819, -739987, -764845, -698344, -448976, -132407, -41879, -250343, -459912, -337383, 113560, 595726, 883169, 1063179, 1381005, 1870608, 2234430, 2178879, 1828115, 1662484, 1983950, 2523864, 2673678, 2113254, 1181459, 595839, 765656, 1378183, 1730385, 1490124, 1020964, 894499, 1236209, 1699273, 1925335, 1777976]
37231A777976n53251q86785q89895m78788j1646J46010J37156K73342L72195J4105
37221i9581n94709o92277n9818N74431N45826J32841K0416L28632O39162O39287
37211A434210K79097l86297j025700j033580k65253N22988N79946J96381J02725
37202D04517J61317l15362j059166r10578L20806J267823Q95238o5060l76318
37193C23217p9380m463k34676k40883p8076k08929l89951R912O56352N05855m46391
37182a87413r49553l87704L18287K50980j82280k17234l3148j47212k91469M2254
37172a784492M73566K52143l95004n03138J41429P37499P43745N12909M56178
37163F34835L68362n6449n96385p67292m09475K00800N95732M22596k23715p88812
$$ y = [1777976, 1224725, 337940, -551955, -1030743, -1042389, -896379, -759223, -485881, -113686, -99581, -694290, -1386567, -1446385, -871954, -326128, -193287, -172871, 155761, 794923, 1434210, 1713307, 1327010, 301310, -732270, -997523, -474535, 105411, 301792, 404517, 565834, 250472, -808694, -1719272, -1398466, -130643, 764595, 699535, 323217, 243837, 239374, 4698, -236185, -314261, -523190, -913141, -903229, -246877, 258978, -187413, -1136966, -1524670, -1206383, -955403, -1137683, -1354917, -1388065, -1535277, -1826746, -1784492, -1310926, -1058783, -1453787, -1956925, -1815496, -1077997, -334252, 178657, 634835, 1003197, 946748, 350363, -416929, -826404, -625604, -29872, 392724, 169009, -619803]
37153f19803q49990n94748l82691j09076M29523P98016L82531m58412o37210Q2055
37143a959805O85951M73122P1576K66810O66302M41341j87087k55321M02782R22979
37133A528650P14822J40998k24764k78180j37868J28982L00527Q9270l28758m21645
37123A512034j70663k04764p03115q41789K1465J134969J189474J39629p31004
37114A346236o20649j75450k85777p13128o02767J07073O04318M22051j00j07175
37104b5368L0980P7625P1083K71636N93365O25072K06372l12255m52151j14509
37094I71850L13908L16261k21572q05987q31837l42287j9775k47192n10899j09025
37084a486555P79626J227541P16900k69494q49674n79461L06043J098702J062427
$$ y = [-619803, -1469793, -2064541, -2447232, -2556308, -2126785, -1328769, -946238, -1404650, -2041860, -1959805, -1273854, -800732, -729156, -462346, 203956, 645297, 458210, 202889, 605671, 1528650, 2243472, 2384470, 2159706, 1881526, 1743658, 1872640, 2173167, 2262437, 1933679, 1512034, 1341371, 1136607, 433492, -408297, -386832, 748137, 1937611, 2077240, 1346236, 725587, 550137, 264360, -448768, -1051535, -944462, -340144, 81907, 81807, -25368, 5612, 83237, 154320, 425956, 1019321, 1644393, 1850765, 1538510, 1086359, 971850, 1285758, 1602019, 1380447, 574460, -257377, -599664, -619439, -866631, -1377530, -1486555, -706929, 520612, 1237512, 968018, 118344, -461117, -155074, 943628, 2006055]
37075B006055J08582r21698j082188m54783N0111L0585M213K94579L81941j00149
37065C17248n02653r1874P22905R83989O00042K18649k41m01584p72158m69813
37055F04510K58318L09989n25183j009584k84019P81802R07515K20427k25015
37046A038760q8602J61379L25619N30042M94125j25462p88384o02357J81151L45625
37036A471896m37639j076421p48910m1388J65762l1264j20068j52548l13173j95813
37026a479566N30752J219876R93863R6574m43895l13341j23573k01829j57347
37017A21514J95579L86625J00658k75476l14999j87296k02152j74891K53994R02483
37007H06039J103352M81740n36346j055790n87023L74829Q10253L47607l06129
$$ y = [2006055, 2114637, 1192939, 110751, -344032, -293921, -263336, -259123, 35456, 417397, 317248, -185405, -277279, 445626, 1429615, 2029657, 2248306, 2248065, 1846481, 1074323, 604510, 862828, 1172817, 647634, -361950, -645969, 135833, 1043348, 1263775, 1038760, 950158, 1111537, 1437156, 1967198, 2461323, 2335861, 1547477, 945120, 1126271, 1471896, 1034257, -42164, -791074, -832462, -666700, -697964, -818032, -970580, -1283753, -1479566, -948814, 271062, 1264925, 1361499, 917604, 604263, 480690, 278861, 121514, 317093, 703718, 804376, 528900, 213901, 26605, -175547, -350438, -96444, 806039, 1909391, 2391131, 1854785, 798995, 211972, 586801, 1397054, 1744661, 1438532]
$$ [...]
##END NTUPLES=NMR SPECTRUM
##END=
