##TITLE=31Pdec_DPA3005-1
 CDCl3, 24 sc
 31.5.2019
##JCAMPDX= 6.0         $$ Bruker NMR JCAMP-DX V2.0
##DATA TYPE= NMR SPECTRUM
##DATA CLASS= NTUPLES
##ORIGIN= UXNMR, Bruker Analytische Messtechnik GmbH
##OWNER= root
$$ XWIN-NMR		Version 3.5
$$ Fri May 31 14:40:22 2019 Russian Standard Time (UT+4h)  she@DPX200
##.OBSERVE FREQUENCY= 81.013821
##.OBSERVE NUCLEUS= ^31P
##.ACQUISITION MODE= SIMULTANEOUS
##.ACQUISITION SCHEME= undefined
##.AVERAGES= 24
##.DIGITISER RES= 17
##SPECTROMETER/DATA SYSTEM= spect
##.PULSE SEQUENCE= zgpg30
##.SOLVENT NAME= CDCl3
##.SHIFT REFERENCE= (INTERNAL, CDCl3, 0, 182.463)
##AUDIT TRAIL= $$ (NUMBER, WHEN, WHO, WHERE, WHAT)
$$ ##TITLE= Audit trail, XWIN-NMR		Version 3.5
$$ ##JCAMPDX= 5.01
$$ ##ORIGIN= Bruker BioSpin GmbH
$$ ##OWNER= she
$$ F:/spectra/data/she/nmr/P31/1/pdata/1/auditp.txt
$$ ##AUDIT TRAIL=  $$ (NUMBER, WHEN, WHO, WHERE, WHAT)
(   1,<2019-05-31 14:39:16.46 +0400>,<she>,<DPX200>,
      <created by zg, POWCHK disabled, PULCHK disabled
       configuration hash MD5:
       00 E9 B6 7A A2 85 ED C7 34 08 36 98 17 FE 4E 26
       data hash MD5: 32K
       F9 98 2A 26 0E 56 2C 3D 6F E8 BE EC 40 46 45 D6>)
(   2,<2019-05-31 14:39:19.03 +0400>,<she>,<DPX200>,
      <Start of raw data processing
       efp BC_mod = 2 LB = 1 FT_mod = 6 PKNL = 1 PHC0 = -2194.27 PHC1 = 88.39909 SI = 64K 
       data hash MD5: 64K
       FE F9 10 BB EF C7 7B C4 2C 1D A5 9F 12 69 1D BB>)
(   3,<2019-05-31 14:39:40.56 +0400>,<she>,<DPX200>,
      <pk PHC0 = -5.388697 PHC1 = 25.4 
       data hash MD5: 64K
       DE 0B 44 70 0E 52 37 20 64 73 58 BF CE C8 59 28>)
$$ ##END=
$$ 
$$ hash MD5
$$ 3E 2E 2C 18 D1 14 36 D5 38 39 69 C6 68 F0 2F 5A
##$RELAX= 
##$RELAX= 
##$RELAX= 
##$RELAX= 
##$RELAX= 
##$RELAX= 
##$RELAX= 
##$RELAX= 
$$ Bruker specific parameters
$$ --------------------------
##$DU= <F:/spectra>
##$EXPNO= 1
##$NAME= <P31>
##$PROCNO= 1
##$TYPE= <nmr>
##$USER= <she>
##$AMP= (0..31)
100 100 100 100 100 100 100 100 100 100 100 100 100 100 100 100 100 100 
100 100 100 100 100 100 100 100 100 100 100 100 100 100 
##$AQSEQ= 0
##$AQ_mod= 1
##$AUNM= <au_zg>
##$AUTOPOS= <>
##$BF1= 81.014009
##$BF2= 200.13
##$BF3= 200.13
##$BF4= 200.13
##$BF5= 200.13
##$BF6= 200.13
##$BF7= 200.13
##$BF8= 200.13
##$BYTORDA= 1
##$CFDGTYP= 0
##$CFRGTYP= 5
##$CHEMSTR= <none>
##$CNST= (0..31)
1 1 145 1 1 1 1 1 1 1 1 1 1 1 1 1 1 1 1 1 1 1 1 1 1 1 1 1 1 1 1 1 
##$CPDPRG= <waltz16>
##$CPDPRG1= <>
##$CPDPRG2= <waltz16>
##$CPDPRG3= <>
##$CPDPRG4= <mlev>
##$CPDPRG5= <mlev>
##$CPDPRG6= <mlev>
##$CPDPRG7= <mlev>
##$CPDPRG8= <mlev>
##$CPDPRGB= <>
##$CPDPRGT= <>
##$D= (0..31)
0 1 0 0 0 0 0 0 0 0 0 0.03 2e-05 3e-06 0 0 0 0 0 0 0 0 0 0 0 0 0 0 0 0 
0 0 
##$DATE= 1559299155
##$DBL= (0..7)
120 120 120 11 120 120 24 19 
##$DBP= (0..7)
150 150 150 150 150 150 150 150 
##$DBP07= 0
##$DBPNAM0= <>
##$DBPNAM1= <>
##$DBPNAM2= <>
##$DBPNAM3= <>
##$DBPNAM4= <>
##$DBPNAM5= <>
##$DBPNAM6= <>
##$DBPNAM7= <>
##$DBPOAL= (0..7)
0.5 0.5 0.5 0.5 0.5 0.5 0.5 0.5 
##$DBPOFFS= (0..7)
$$ [...]
##$SUBNAM2= <"">
##$SUBNAM3= <"">
##$SUBNAM4= <"">
##$SUBNAM5= <"">
##$SUBNAM6= <"">
##$SUBNAM7= <"">
##$SUBNAM8= <"">
##$SUBNAM9= <"">
##$SW= 369.568048894756
##$SWIBOX= (0..15)
0 1 3 0 0 0 0 0 0 0 0 0 0 0 0 0 
##$SW_h= 29940.119760479
##$TD= 32768
##$TD0= 1
##$TE= 0
##$TE2= 300
##$TE3= 300
##$TEG= 300
##$TL= (0..7)
0 120 53 12 22 120 120 120 
##$TP= (0..7)
150 150 150 150 150 150 150 150 
##$TP07= 0
##$TPNAME0= <>
##$TPNAME1= <>
##$TPNAME2= <>
##$TPNAME3= <>
##$TPNAME4= <>
##$TPNAME5= <>
##$TPNAME6= <>
##$TPNAME7= <>
##$TPOAL= (0..7)
0.5 0.5 0.5 0.5 0.5 0.5 0.5 0.5 
##$TPOFFS= (0..7)
0 0 0 0 0 0 0 0 
##$TUNHIN= 0
##$TUNHOUT= 0
##$TUNXOUT= 0
##$USERA1= <user>
##$USERA2= <user>
##$USERA3= <user>
##$USERA4= <user>
##$USERA5= <user>
##$V9= 5
##$VALIST= <valist>
##$VCLIST= <CCCCCCCCCCCCCCC>
##$VD= 0
##$VDLIST= <DDDDDDDDDDDDDDD>
##$VPLIST= <PPPPPPPPPPPPPPP>
##$VTLIST= <TTTTTTTTTTTTTTT>
##$WBST= 1024
##$WBSW= 4
##$XGAIN= (0..3)
0 0 0 0 
##$XL= 0
##$YL= 0
##$YMAX_a= 41341
##$YMIN_a= -82419
##$ZGOPTNS= <>
##$ZL1= 120
##$ZL2= 120
##$ZL3= 120
##$ZL4= 120
##$ABSF1= 0
##$ABSF2= 0
##$ABSG= 0
##$ABSL= 0
##$ALPHA= 0
##$AQORDER= 0
##$ASSFAC= 0
##$ASSFACI= 0
##$ASSFACX= 0
##$ASSWID= 0
##$AUNMP= <proc_1d>
##$AZFE= 0.1
##$AZFW= 0.5
##$BCFW= 0
##$BC_mod= 2
##$BYTORDP= 0
##$COROFFS= 0
##$CY= -3
##$DATMOD= 1
##$DC= 0
##$DFILT= <>
##$DTYPP= 0
##$F1P= 0
##$F2P= 0
##$FCOR= 1
##$FTSIZE= 65536
##$FT_mod= 6
##$GAMMA= 0
##$GB= 0
##$INTBC= 1
##$INTSCL= 5.30512e-09
##$ISEN= 30
##$LB= 1
##$LEV0= 0
##$LPBIN= 0
##$MAXI= 10000
##$MC2= 0
##$MEAN= 0
##$ME_mod= 0
##$MI= 50
##$NCOEF= 0
##$NC_proc= -6
##$NLEV= 6
##$NOISF1= 182.463
##$NOISF2= 159.3651
##$NSP= 0
##$NTH_PI= 0
##$NZP= 0
##$OFFSET= 182.463
##$PC= 4
##$PHC0= -2199.659
##$PHC1= 113.7991
##$PH_mod= 1
##$PKNL= yes
##$PPARMOD= 0
##$PSCAL= 0
##$PSIGN= 0
##$REVERSE= no
##$SF= 81.0140089999434
##$SI= 65536
##$SIGF1= 159.3651
##$SIGF2= -187.1042
##$SINO= 113.3802
##$SIOLD= 16384
##$SREGLST= <1H.CDCl3>
##$SSB= 0
##$STSI= 65536
##$STSR= 0
##$SW_p= 29940.119760479
##$SYMM= 0
##$S_DEV= 0
##$TDeff= 32768
##$TDoff= 0
##$TI= <>
##$TILT= no
##$TM1= 0
##$TM2= 0
##$TOPLEV= 0
##$USERP1= <user>
##$USERP2= <user>
##$USERP3= <user>
##$USERP4= <user>
##$USERP5= <user>
##$WDW= 1
##$XDIM= 65536
##$YMAX_p= 337066364
##$YMIN_p= -37509622
$$ End of Bruker specific parameters
$$ ---------------------------------
##NTUPLES= NMR SPECTRUM
##VAR_NAME=  FREQUENCY,     SPECTRUM/REAL,   SPECTRUM/IMAG
##SYMBOL=    X,             R,               I
##VAR_TYPE=  INDEPENDENT,   DEPENDENT,       DEPENDENT
##VAR_FORM=  AFFN,          ASDF,            ASDF
##VAR_DIM=   65536,         65536,           65536
##UNITS=     HZ,            ARBITRARY UNITS, ARBITRARY UNITS
##FACTOR=    0.456856943014862, 1,           1
##FIRST=     14782.0589164792, 0,            0
##LAST=      -15158.0608439998, 0,           0
##MIN=       -15158.0608439998, -37509622,   0
##MAX=       14782.0589164792, 337066364,    0
$$ Real data points
##PAGE= N=1
##DATA TABLE= (X++(R..R)), XYDATA
$$ [...]
44669 -1618870 -1197534 -876832 -2183492 -4303228 -4627356 -2221640 1026706 2815298 2502707
44660 2502707 764212 -1251771 -2161545 -1270722 189957 47925 -1986721 -3693119 -3215409
44651 -3215409 -1320335 143241 819154 1523230 2230893 2069550 1074485 388133 515799
44642 515799 682051 335036 166822 955254 2189964 2662870 2022567 1039269 487738
44633 487738 315746 -81881 -1091925 -2381539 -3017727 -2249451 -378179 1305110 1659939
44624 1659939 662725 -824539 -1888556 -1921798 -618852 1730071 4039222 5144839 4879302
44615 4879302 4058205 3387137 2876385 2398066 2122440 1987981 1337922 -195684 -1719017
44606 -1719017 -1792994 -227794 1462790 1691584 491640 -719224 -802956 3555 586313
44597 586313 282837 -440037 -696337 -468504 -791544 -2353697 -4265324 -4830387 -3429048
44588 -3429048 -953074 1584894 3914671 5680451 5881977 4129041 1789349 683948
44580 683948 847699 735524 -322838 -1104010 -372477 1277878 2285882 2156903 1668406
44571 1668406 1320874 600011 -958012 -2657300 -3180833 -2109529 -458650 478869 570719
44562 570719 758516 1586438 2382591 2252117 1394829 780124 784094 960784 1101720 1577956
44552 1577956 2395477 2838484 2546953 2130092 2039619 1577554 -54404 -2229390 -3481788
44543 -3481788 -3401098 -2890122 -2572241 -2082960 -1260429 -945794 -1805677 -3010562 -3034241 -1599979
44533 -1599979 -14982 536605 313592 239980 403619 181747 -208671 639319 3353910
44524 3353910 6075934 5952594 2510784 -1477280 -3017264 -2011185 -720087 -818394 -1916207
44515 -1916207 -2646294 -2219300 -884226 402981 679046 -99537 -824305 -431896 776672
44506 776672 1597423 1559484 1361678 1677001 2271965 2461264 1836348 480050 -925025
44497 -925025 -1216763 240059 2550073 4031394 4064986 3425906 2776443 1949680 1013661
44488 1013661 777146 1505378 2196927 2080696 1953897 2897066 4276305 4311864 2474902
44479 2474902 233567 -687990 -44171 1021909 1265438 520092 -82703 699530 2521637
44470 2521637 3478550 2388331 419898 -436713 -11087 89257 -1045521 -2440157 -2728636
44461 -2728636 -1834356 -784315 -532535 -1248318 -2255894 -2570174 -1944338 -1219771 -1019842
44452 -1019842 -532111 1245143 3281445 3195943 576899 -2017784 -2351813 -1426888 -1723423
44443 -1723423 -3506852 -4584865 -3394096 -745002 1541690 2333867 1303515 -1230618
44435 -1230618 -3891213 -4783706 -3431724 -1550666 -994634 -1402014 -894507 1095515 2859231
44426 2859231 2589613 619863 -1149793 -1526025 -1008097 -752096 -1286645 -2304275 -3104808
44417 -3104808 -2990618 -1660666 419861 2215498 2934748 2595374 1758278 940700 391245
44408 391245 171686 249166 608407 1294686 2164874 2719831 2613799 2250485 2219624 2100652
44398 2100652 765339 -1696416 -3340083 -2551678 -171678 1631135 2087938 2138912 2261925
44389 2261925 1570141 -471083 -2682174 -3357290 -2108057 162751 2507914 4343096
44381 4343096 4997953 3861836 1231719 -1544479 -3236616 -3947006 -4755077 -5994990 -6383073
44372 -6383073 -4575910 -1400386 635860 465559 -172921 519050 1508299 494204 -2362220
44363 -2362220 -4448946 -4450076 -3866128 -4160216 -4478971 -3472767 -1732720 -809425 -913706
44354 -913706 -1210560 -1632241 -2770452 -4369841 -5400313 -5433819 -4697908 -3031054 -193717
44345 -193717 2814318 4204095 3556912 2442908 2436868 3374505 4004053 3620170 2568915
44336 2568915 1690872 1707594 2728577 3942722 4079837 2550399 46880 -2110454 -3068502
44327 -3068502 -2811986 -1707374 -33458 1854889 3076235 2560399 364863 -1726841
44319 -1726841 -1798042 47300 1994475 2874494 2930677 2168090 -123108 -3228024 -4335958
44310 -4335958 -1913427 1548127 2375450 487232 -1089092 -1007501 -1063611 -2482981 -3575815
44301 -3575815 -2458337 -22688 1491544 1483533 960455 591654 361732 443762 982178
44292 982178 1469249 1519658 1768131 2829558 3870306 3534724 2008578 813172 582621
44283 582621 339791 -791406 -2293737 -3124869 -3005771 -2306776 -1281469 -18832 1150307
44274 1150307 1704371 1375617 394315 -602414 -864921 9286 1695661 3282626 3919935
44265 3919935 3376662 2031990 456201 -906471 -1708432 -1635882 -708278 406827 878035
44256 878035 723178 781585 1246866 934078 -1056995 -3452651 -3946460 -2242966 -540011
44247 -540011 -548371 -1414128 -1452988 -748121 -742329 -1935438 -3328142 -3943954 -3787122 -3267822
44237 -3267822 -2570862 -1786657 -1116068 -800789 -1063274 -1890124 -2624677 -2281288 -779428
44228 -779428 654469 1008103 906733 1610696 2956415 3431916 2317104 666404 -185927
44219 -185927 -254698 -485071 -1198440 -1582298 -740985 1061535 2491149 2599651 1884439
44210 1884439 1376414 945022 -403138 -2386168 -3098142 -1718912 -191086 -635391 -2118276
44201 -2118276 -2027515 -156142 937393 -190370 -2002834 -2800596 -3167209 -4122642 -4663658
44192 -4663658 -3252600 -778726 169415 -1178632 -2808221 -2661745 -834603 1345932
44184 1345932 3054273 4043297 4009718 2870388 1262058 33939 -602301 -1018591 -1551725
44175 -1551725 -2338109 -3437123 -4600753 -5149928 -4652677 -3599994 -2815070 -2283903 -1316722
44166 -1316722 69544 858197 537638 -6043 145511 472005 -15841 -915326 -934782
44157 -934782 -61449 307215 -402049 -1105136 -974326 -669298 -826665 -782353 23968 673349
44147 673349 253025 -376700 52319 1027987 1301195 1286263 2167592 3141913 2253283 91236
44137 91236 -232216 2294779 4666547 4092655 1818138 704839 958248 827465 262684
44128 262684 923044 2850312 3893349 2924580 1431984 1127454 1768566 2335494 2857591
44119 2857591 3780665 4515598 3988091 2223990 327103 -908952 -1505312 -1577185 -1015107
44110 -1015107 -66154 435501 -157750 -1496749 -2428343 -2004922 -361821 1306154 1763325
44101 1763325 918597 -128882 -463359 -555333 -1574455 -3536747 -4897035 -4428045 -2883471
44092 -2883471 -2005086 -2212908 -2277365 -1297881 84277 872332 1132956 1470744 1808662
44083 1808662 1630735 1024898 579553 485701 533217 713923 976291 682641 -668870 -2350293
44073 -2350293 -3113616 -2908808 -2716407 -2669586 -1756377 230855 1823543 1692107 290177
44064 290177 -1038504 -1653599 -1593622 -933538 -108089 -105997 -1334574 -2822638 -3421531 -3252222
44054 -3252222 -3062798 -2715763 -1451612 581934 2169215 2501699 2026585 1633890 1513300
44045 1513300 1018022 -530497 -2912789 -4884907 -5261203 -4146518 -2680209 -1602784
44037 -1602784 -734046 119558 638073 597338 149341 -680199 -1788214 -2212421 -957134
44028 -957134 1066601 1592422 180688 -924972 -133882 1185321 1161208 281998 -106715
44019 -106715 -415193 -1556171 -2520472 -1887296 -656381 -697631 -1267038 -311600 1277289
44010 1277289 413435 -2935272 -5000530 -3747548 -1687183 -1604178 -2693427 -3059655 -3210217
44001 -3210217 -4339735 -5262174 -4070817 -1652146 -776066 -2263029 -4331971 -5354256
43993 -5354256 -5260504 -4526388 -3610135 -3255713 -3767866 -4116886 -3167140 -1590763 -1169844
43984 -1169844 -2327088 -3629094 -3637990 -2142725 172856 2086499 2186052 247933 -1838299
43975 -1838299 -1832757 174801 2003937 2147802 1009379 -433641 -1561940 -1535894 439984
43966 439984 3475172 5005325 3565946 741957 -628448 381018 2297283 3418425
43958 3418425 3385538 2650509 1446451 -120563 -1424150 -1535597 -308633 1158809 1565533
43949 1565533 792909 -125858 -313562 190680 969235 1834761 2601450 2798954 2048928
43940 2048928 458026 -1533093 -3323217 -4155512 -3597742 -2189567 -955369 -154573 664011
43931 664011 1290367 764215 -907014 -2289280 -2588012 -2857242 -4020267 -4941588 -4039803
43922 -4039803 -1943079 -777031 -1241379 -2081844 -2312380 -2340160 -2716221 -3152310 -3182640
43913 -3182640 -2873778 -2605805 -2762759 -3546249 -4456655 -4318502 -2657591 -637798 312893
43904 312893 302364 310326 358215 -182420 -886924 -601148 602071 1440215 1475997 1527267
43894 1527267 1834838 1516629 294789 -839190 -1317979 -1875587 -2937059 -3463668 -2417769
43885 -2417769 -418261 1054204 1485478 1573707 2048158 2784018 2901522 1668579 -412160
43876 -412160 -1757592 -1555589 -904189 -1125122 -1635423 -981567 575389 1419477 1256241
43867 1256241 1275698 1617508 1038142 -505023 -1403280 -1247848 -1576897 -2691000 -2418558
43858 -2418558 197103 2436269 1440123 -1680818 -3723997 -3839040 -3484070 -3150101 -2032781
43849 -2032781 -478841 -29248 -945918 -1914898 -2338328 -2884049 -3544773 -3162963 -1460622
43840 -1460622 106128 242367 -624085 -1231008 -934077 175716 1695278 2932682 3113296
43831 3113296 1990988 38673 -1948208 -3226092 -3430065 -2894929 -2248482 -1450703 7969
43822 7969 1670656 2119115 1143409 495409 1279560 1995438 839176 -1271934 -2032113
43813 -2032113 -1227377 -621484 -882777 -1000364 -637184 -699374 -1304230 -1375922 -775842 -839555
43803 -839555 -2094867 -3198864 -2941256 -1827509 -944111 -602863 -804440 -1769995 -3236026
43794 -3236026 -4201812 -3978841 -2757318 -1020902 613831 1074827 -275163 -2351475 -3344797
43785 -3344797 -3027353 -2557011 -2121249 -768162 1247403 2181305 1476573 636320 710406
43776 710406 1033449 1272574 2362419 4163631 4553892 2556570 287412 -141132 249351
43767 249351 -571765 -2104807 -2422583 -1583949 -1325213 -2016163 -2313124 -1486103 -33756
43758 -33756 1663407 3378494 4126443 3159985 1556426 927384 919957 16945 -1505768
43749 -1505768 -1708824 -118538 1532697 2050793 2149882 2520712 2533021 1692827 685520
43740 685520 68259 -619394 -1608097 -2144865 -1840077 -1475094 -1594362 -1536385 -800424 -171115
43730 -171115 -409132 -901452 -795638 -539962 -974965 -1587414 -1082753 608882 2122258
43721 2122258 2340330 1314406 -324736 -1866461 -2499421 -1839036 -664418 -256536 -732627
43712 -732627 -836412 232152 1555468 1727513 790923 42413 62653 -71851 -1285305
43703 -1285305 -3031942 -4035398 -4012418 -3767310 -3723402 -3338409 -2187431 -741149 381883
43694 381883 1200304 1847840 1928460 1116012 -73668 -851147 -1157593 -1434029 -1760093 -1959789
43684 -1959789 -2199690 -2611715 -2587971 -1449436 224424 894285 -172268 -2217964 -4156033
43675 -4156033 -5555823 -6281882 -6049428 -4816911 -3027476 -1052691 1110302 3243578
43667 3243578 4546350 4394637 3194734 2024754 1510159 1347966 897062 -28880 -1089230
43658 -1089230 -2034411 -3092336 -4474595 -5724774 -6123891 -5744360 -5397633 -5342002 -4876945
43649 -4876945 -3678952 -2648315 -2603799 -2833811 -1996496 -108343 1346606 1173108 -377822
43640 -377822 -2015677 -2431707 -1314850 116046 210209 -892222 -1076123 784817 2809882
43631 2809882 2529462 383892 -1049208 -739026 -102955 -483923 -1743468 -3334417 -4791993
43622 -4791993 -5090695 -3556189 -1617761 -1559935 -3235688 -4228487 -3646815 -3207346 -3788402
43613 -3788402 -3713391 -1945069 -403127 -1039689 -2657517 -2880710 -1667444 -599382 -31187
43604 -31187 737119 1520788 1765069 2115950 3228293 3788679 2105968 -825851 -2219310
43595 -2219310 -1204608 575459 1860103 2872798 3454116 2570319 333459 -1542408
43587 -1542408 -2103537 -2282240 -2946849 -3460444 -3053285 -2229409 -1872030 -2047427 -2464195
43578 -2464195 -3069139 -3456309 -2723348 -771114 1054218 1400240 386342 -914352 -1803923
43569 -1803923 -2213684 -2265640 -2192682 -2285655 -2512296 -2559079 -2430703 -2457409 -2506669 -1824253
43559 -1824253 -15220 2252179 3778227 3799953 2500464 986466 581245 1555985 2720987
43550 2720987 2817546 1951077 982115 129558 -731687 -976325 85200 1710428 2452686
43541 2452686 2214363 1968695 1661856 405520 -1180273 -1156390 587962 1659052 629554
43532 629554 -981113 -1468397 -1531499 -2389374 -3252384 -2818142 -1803810 -1693439 -2075862
43523 -2075862 -1598223 -758057 -1237039 -2789566 -3226984 -1635075 456076 1354513 838928
43514 838928 -674633 -2738774 -4273502 -4120695 -2764537 -2007736 -2475062 -2934015 -2531449
43505 -2531449 -2062911 -2370573 -3093401 -3808571 -4806949 -5763118 -5297348 -3205814 -1635732
43496 -1635732 -2374820 -4151882 -4472532 -3217638 -2361641 -2676149 -2959769 -2525200 -2263967
43487 -2263967 -2744132 -3137411 -2784502 -2186776 -1592747 -223912 1919235 2981545 1600481
43478 1600481 -717834 -1334801 62175 1505070 1778997 1424786 805391 -644626 -2695154
43469 -2695154 -3842040 -3539668 -3219443 -3882982 -4269876 -3006743 -1223350 -988706 -1968906
43460 -1968906 -1900151 -190564 1142853 479854 -1363108 -2774161 -3432246 -3826741 -3886298
43451 -3886298 -3121574 -1508078 404431 1777741 1750546 295826 -1076259 -641123 1259937
43442 1259937 2578594 2500023 2323701 2709512 2052291 -834705 -4012776 -4494918 -2204737
43433 -2204737 122385 561503 -308831 -1127676 -1393452 -1224663 -880405 -758196 -913967
43424 -913967 -727645 5146 187550 -1023795 -2377750 -2071994 -785279 -932894 -2733597
43415 -2733597 -3449576 -1424943 1308261 1859667 187224 -1638160 -2481220 -2583913 -1895585
43406 -1895585 -68689 2017103 2540558 1021571 -818954 -1035737 325931 1412960
43398 1412960 660026 -1568405 -3389047 -3381107 -1988727 -755733 -513501 -955012 -1694984
43389 -1694984 -2627335 -3133218 -2249954 -212373 1317726 1327162 713641 620340 644553 -68276
43379 -68276 -924640 -684245 339696 509369 -789851 -2433008 -3251457 -3179460 -2546846
43370 -2546846 -1433606 -108000 819029 1063746 868169 438037 -131611 -418793 -5060
43361 -5060 757661 1143257 1105264 985215 442026 -933792 -2007124 -910278 2005564
43352 2005564 3823482 2723810 487400 -21055 1365579 2487858 2146780 1186909 632048
43343 632048 498902 607236 1119763 1866571 2162497 1682249 817625 44119 -392345 -251212
43333 -251212 384986 677578 -70852 -1131992 -1122882 -130934 243273 -751001 -2004747 -2415333
43323 -2415333 -2290062 -2057396 -1091781 834602 2153382 1272151 -953804 -2218809 -1824038
43314 -1824038 -1075022 -910894 -999630 -1289695 -2512026 -4475421 -5500280 -4505386 -2428457
43305 -2428457 -694876 514332 1468687 1631871 666850 -157175 759989 2953521 4226495
43296 4226495 3305109 869116 -2011938 -4986719 -7594336 -8721078 -7808901 -5880676
43288 -5880676 -4550452 -4376941 -4721959 -4843541 -4550459 -3975607 -3202677 -2156213 -728024
43279 -728024 865826 1860294 1461120 -222005 -2089256 -3106585 -3154171 -2671588 -1917750
43270 -1917750 -995504 -298824 -345835 -1079626 -1688236 -1371059 -266901 541206 146072
43261 146072 -1052341 -1670637 -1003813 76966 393579 179862 590210 1623096 1771002
43252 1771002 187140 -1904986 -2815611 -2587810 -2549164 -3233473 -3991933 -4471991 -5160721
43243 -5160721 -6196512 -6759068 -6191073 -4928237 -3748153 -2771692 -1844221 -1303783 -1537058
43234 -1537058 -2092362 -2067889 -1307898 -544955 -438515 -1150295 -2745143 -5069705 -7071145
43225 -7071145 -7267125 -5460996 -3188805 -1814371 -1018657 -114378 13010 -2098737 -5748131
43216 -5748131 -8115120 -7612896 -5756317 -4793242 -4692590 -3774411 -1548669 577149 1230543
43207 1230543 437001 -1006974 -2411456 -3189195 -2916998 -1881748 -1039872 -1106592 -1983670
43198 -1983670 -3073470 -3695451 -3300966 -1957703 -647656 -368049 -812797 -655155 659217
43189 659217 2084624 2231515 910859 -792187 -1495110 -502493 1538967 2866121 2206088
43180 2206088 318537 -816329 -469719 127953 -169932 -783853 -478062 800228 1952816
43171 1952816 2051444 1049892 -274431 -698239 366981 1767378 1579141 -223463 -1253237
43162 -1253237 203008 2750878 3819258 3015035 1993801 1760384 1921899 2259526 3119343
43153 3119343 4084003 3929051 2378768 695081 171340 1060237 3069008 5635186 7469518
43144 7469518 7190068 4983670 2618305 1403175 1166421 1510896 2669656 4393926 5277407
43135 5277407 4296407 2274591 903680 865392 1572631 2076199 1547095 -391284 -2989553
43126 -2989553 -4636412 -4566980 -3738647 -3316749 -3031043 -1957403 -254743 1020425 1424695
43117 1424695 1340133 959511 194858 -513515 -414122 438262 1228187 1625777 2032784 2439828
43107 2439828 2109166 884085 -66854 453868 2106102 3347700 3019289 1131213 -1511687
43098 -1511687 -3771157 -4462684 -3069056 -512310 1335708 1434040 631586 474142 1153387
43089 1153387 1367956 354337 -793254 -495679 1154893 2515482 2498741 1653704 1091840
43080 1091840 1238585 1916772 2802954 3301438 2672874 936359 -800316 -1456937 -1056436
43071 -1056436 -263767 613013 1524918 2021324 1498960 20188 -1705742 -3078247 -3855271
43062 -3855271 -3805244 -2727946 -927682 725067 1375500 797120 -418414 -1231680 -1059756
43053 -1059756 -449281 -433968 -1109204 -1485746 -998970 -285651 95861 734398 2147898
43044 2147898 3325642 2921753 1516821 1090531 2140870 2892772 1948788 362529 10705
43035 10705 752453 538570 -1734965 -4565973 -5533503 -4146007 -2321001 -1956254 -2682580
43026 -2682580 -2677098 -1334929 12768 276227 218750 986197 2054531 2033629 977523
43017 977523 347432 733916 1050853 240586 -1437282 -3138774 -4332997 -4584486 -3533693
43008 -3533693 -1662060 -219948 134764 -50439 -54693 173133 409693 417024 -412790 -2459972
42998 -2459972 -4544925 -4637942 -2649785 -1052858 -1614470 -2907636 -2589466 -982530 -418431
42989 -418431 -1601239 -2691061 -2067653 -245036 1372552 2241196 2610896 2730957 2711619
42980 2711619 2578401 2169115 1434691 788794 549282 243227 -713437 -1874371 -2301344
42971 -2301344 -2044698 -1897726 -1814750 -1067287 -123263 -630597 -2797317 -4348456 -3283805
42962 -3283805 -594644 1012148 360792 -1354297 -2349797 -1730967 332760 2732671 3937138
42953 3937138 3376181 2174271 1722849 1860262 1413918 248199 -390292 375620 1940690
42944 1940690 3068466 3177434 2718959 2869971 4757685 8396441 12649893 16818071 21478234
42935 21478234 26511729 29156276 26313520 18967235 11990558 8677008 7558368 5908330
42927 5908330 4143172 4392793 6179671 6499419 4024615 717465 -1090755 -1129171 -184781
42918 -184781 1319352 2819514 3336239 2820928 2523616 3038269 3273398 2499082 2064438
42909 2064438 3459905 5660376 6328993 5234002 4495301 5307873 6226119 5348081 2846513
42900 2846513 460905 -637695 -614000 -132345 457345 1192792 2121751 2855139 2667123
42891 2667123 1481012 556514 1342558 3483955 4845133 3972273 1825631 487714 697409
42882 697409 1325441 971350 -538124 -2130107 -2557560 -1576604 -259055 57247 -793896
42873 -793896 -1787170 -2140369 -2074034 -1883314 -1144916 416938 1949093 2364566 1929536
42864 1929536 1960604 2945360 3854529 3546775 2173366 845937 355161 594110 1084126
42855 1084126 1760795 3016632 4832336 6181200 6017522 4904774 4621006 5598898 5912359
42846 5912359 3960936 1167124 233425 1200761 1411568 -356874 -1974084 -1232065 858925
42837 858925 1732318 946953 244603 549958 894847 335345 -771167 -1764417 -2551286
42828 -2551286 -2956736 -2416923 -1022378 108343 294564 338458 1208081 2327029 2311235
42819 2311235 1138067 361844 947992 1916796 1713984 198831 -1516949 -2743571 -3683244
42810 -3683244 -4247985 -3597703 -1540211 442296 662942 -578495 -1408328 -986143 -469745
42801 -469745 -974931 -1787774 -1500125 -65655 1314348 1780991 1321106 279461 -511779
42792 -511779 270049 2838432 5073476 4645255 2334142 1304676 2695277 4027293 2986948
42783 2986948 768303 -27173 720644 963803 -185835 -1580464 -2170636 -2064090 -1430576
42774 -1430576 -92785 1524914 2488505 2672172 2743391 2751162 2112805 1097200 741564
42765 741564 1041240 942406 559279 1408573 3527626 4411188 2411509 -439469 -967336
42756 -967336 918101 2590958 2501582 1361851 -73473 -1931934 -3526436 -3005060 83403
42747 83403 3327133 3953681 2094808 400744 738924 2303955 3078463 2369275 1347231
42738 1347231 1266986 1808209 1665938 463828 -770167 -1154924 -1067069 -1249585 -1657307
42729 -1657307 -1838335 -1716027 -1311501 -491733 287723 18676 -1118198 -1287267 297882
42720 297882 1472864 -44212 -2884166 -3582927 -1426301 969476 1857011 2195140 2784185
42711 2784185 2584292 1104523 -198745 -440249 -826818 -2005225 -2294581 -616340 1061423
42702 1061423 648792 -683818 -782554 -360210 -1335698 -2696418 -1750922 1035470 2255202
42693 2255202 819624 -585819 -81992 739259 79984 -1115818 -1321871 -1158850 -1904117
42684 -1904117 -3014424 -3112661 -2188624 -1148815 -331737 -86 -1084196 -3683458 -5781655
42675 -5781655 -5278473 -2738748 -544956 175560 235470 412947 428057 -45427 -558810
42666 -558810 -304240 1193820 3504806 5000081 4048005 1307291 -327605 670293 2148539
42657 2148539 1371269 -716632 -872221 1308771 2643409 1200986 -1018214 -1508720 -816107
42648 -816107 -738625 -991293 -183499 1031222 521403 -1768110 -3231067 -2087344 368784
42639 368784 1760467 1446343 450407 -330057 -782756 -1049217 -1251128 -1487740 -1580478 -1179403
42629 -1179403 -479018 -180513 -221127 603322 2796586 4711847 4355639 2273222 985271
42620 985271 1460699 1913458 715757 -1225787 -2178337 -2195965 -2368934 -2495421 -1526362
42611 -1526362 61099 409302 -986047 -2490762 -2770279 -2362980 -2089528 -1479023 46448
42602 46448 1619696 1952243 1199098 535720 375403 217125 -85267 -142888 -25436 -303595
42592 -303595 -990806 -1385950 -1151608 -732567 -470698 -45420 845341 1792189 2068165 1459371
42582 1459371 494953 10488 460494 1396332 1726769 900845 -222952 -175535 1379510
42573 1379510 3145595 3587025 2454318 755981 -412251 -692612 -348596 219567 668294
42564 668294 647018 -45476 -1034759 -1374133 -400552 1447103 3018703 3578433 3114233
42555 3114233 1739772 -372235 -2345533 -2844579 -1503515 493948 1660068 1416469
42547 1416469 -124367 -2491910 -4385345 -4130557 -1764403 306368 94160 -1299471
42539 -1299471 -1342228 258710 1430807 1006430 23485 -498876 -1001900 -1786584 -1772341
42530 -1772341 -117069 2176197 3547002 3834982 3732826 3140530 1546627 -367815 -1028335
42521 -1028335 -3227 1429398 2089730 2327133 3069627 4112897 4237088 2962990 1389161
42512 1389161 835735 1170253 1250592 803762 752214 1406500 1604278 540987 -609724
42503 -609724 -213684 1429578 2673928 2904642 2630791 1691067 -475247 -2760773 -2960088
42494 -2960088 -1030265 423325 -110502 -919501 19669 1977364 2993760 2773381 2174879
42485 2174879 1271432 5759 -433436 835058 2356242 2197887 1126538 1422619 2990166
42476 2990166 3438950 2120995 1239061 2236443 3694567 3985513 3715785 3977760 4079392
42467 4079392 2926596 1357733 1085701 1988337 2294951 1271663 139799 145014 977354
42458 977354 1634478 2048852 3057351 4811401 5860970 4491679 1024122 -2026937 -2691951
42449 -2691951 -1744943 -1238111 -1550045 -1363831 -206769 863335 1307896 1937158 3000943
42440 3000943 3199501 1676798 -411535 -1493107 -1544922 -1309513 -739447 408870 1412537
42431 1412537 1461538 967463 701626 428498 -236318 -478592 541009 1821741 1639741
42422 1639741 145393 -971861 -1201318 -1686339 -2882978 -3612297 -2941255 -1497266 -345553
42413 -345553 235704 420145 345160 267516 258883 -251533 -1533393 -2435588 -1747164 -400931
42403 -400931 -297592 -1004442 -209346 2038216 2539763 -140228 -2829381 -2144959 590430
42394 590430 1718018 766009 238111 918012 1103148 471338 1031913 3268669 4526208
42385 4526208 2926069 439716 33812 1501389 2284656 1366907 250469 492546 2032798
42376 2032798 3971079 5682117 6929357 7680204 7978287 7645770 6354675 4369436 2778089
42367 2778089 2465182 3209735 4169620 4741097 4610566 3731826 2750298 2572946 2943715
42358 2943715 2575178 1503946 1811529 4458192 6813175 5708076 2195138 475678
42350 475678 2057471 3871130 3022475 651408 -566954 -447258 -552083 -1014406 -690535
42341 -690535 240469 307598 -668482 -1099694 -27155 1670919 2791847 3061919 2571609
42332 2571609 1431682 459360 812887 2306805 3299619 2872676 1916321 1421640 1082640
42323 1082640 544037 621804 1853392 2934284 2319305 704734 116675 874136 1344015
42314 1344015 765380 417739 1431323 3072322 4065429 4314861 4332053 4025565 3142421
42305 3142421 2093976 1286611 356138 -833395 -1165366 341984 2560835 3258978 2060672
42296 2060672 834361 834007 1086044 448125 -192039 752442 2816251 3736534 2474200
42287 2474200 595168 131383 1044118 1624534 941105 -18327 233271 1719717 2913959
42278 2913959 2492662 771432 -781419 -1186724 -759008 -387474 -499950 -892379 -1166072
42269 -1166072 -1017788 -386013 327966 392824 -499205 -1720781 -2317886 -2039584 -1396365
42260 -1396365 -822968 -311765 78422 -74802 -1019017 -2305125 -3119471 -3010038 -2130547
42251 -2130547 -928524 263233 1427482 2674794 3711824 3681430 2065118 -177719
42243 -177719 -1024962 592157 3551768 5739426 6150774 5363201 4332652 3459397 2716098
42234 2716098 1960530 1047460 227586 409478 2191884 4434649 4793377 2397385 -717604
42225 -717604 -1819560 -728982 266612 -285743 -1070075 -36011 2502628 3909109 2295252
42216 2295252 -1248419 -3756559 -3296735 -520894 2359685 3692717 3413387 2351511
42208 2351511 1097087 -146692 -968094 -773124 358260 1415544 1519941 879138 226625
42199 226625 -265161 -814739 -1097705 -450056 982424 2282271 3179669 4416765 6212490
42190 6212490 7405274 6996902 5730295 5013597 4819188 3931301 2073420 466704 94374
42181 94374 525100 805777 622148 231968 54826 628347 2142027 3707547 3995719
42172 3995719 2985230 2117678 2250937 2568213 2229528 1919752 2648780 4002178 4899212
42163 4899212 5252044 5347673 4321165 1241471 -2458122 -3766717 -1831834 843456 1675496
42154 1675496 905597 291795 366908 359930 -143840 -885883 -1671476 -2165543 -1494467 595352
42144 595352 2539819 2409954 584151 -459372 611270 2214028 2056530 177821 -1206467
42135 -1206467 -554065 1197352 1852353 546374 -1285637 -1668120 -578333 -61649 -1569935
42126 -1569935 -3900521 -4631960 -3160140 -1130139 31506 562221 943514 563694 -1071757
42117 -1071757 -2845265 -3211601 -2404065 -2024275 -2571113 -2834112 -2008789 -1049220 -1189337
42108 -1189337 -2084285 -2333826 -1329165 245946 1487255 2128600 2376107 2398223 2105259
42099 2105259 1327556 275134 -325873 -23621 515547 263124 -431802 28454 2027946
42090 2027946 3596624 2878727 797947 -240817 341841 1065645 1124615 1263900 1692076
42081 1692076 1263041 -421806 -1991752 -2552603 -3220003 -4898539 -6104328 -5013585 -2592976
42072 -2592976 -1421552 -1954749 -2307530 -1670856 -1520726 -2830610 -4202468 -3900346 -2222840
42063 -2222840 -659421 164027 497330 326245 -466596 -1237124 -1021207 213896 1478818
42054 1478818 1878703 1378960 615841 296496 615921 1063938 1053868 789853 1059068 2109256
42044 2109256 3330141 4148975 4533117 4449356 3664622 2399831 1374066 860652 513767
42035 513767 381426 1024922 2239312 2906997 2740310 2778470 3269510 2667267 231012
42026 231012 -1836088 -993143 1709870 2657290 483871 -2304726 -2829060 -1058716 1031250
42017 1031250 1923206 1431346 341644 -128771 571737 1394771 826278 -870007 -1804713
42008 -1804713 -1139668 -160929 -181396 -932116 -1797532 -2976114 -4198463 -3873021 -1287591
41999 -1287591 1399496 1367771 -1130791 -3099911 -2691255 -944086 513529 1633160 3048177
41990 3048177 4484562 5274161 5654236 6356556 7180089 7001379 5335852 3174020 1917729
41981 1917729 1871194 2182008 2091914 1732858 1548552 1431687 955141 257992 88675 904703
41971 904703 2408087 3982273 5004385 4727203 2768690 128272 -1173942 -267841 1318089
41962 1318089 1417012 -159227 -1644843 -1704772 -798434 -109060 -44267 -207731 -293422 -513468
41952 -513468 -1250009 -2461580 -3444124 -3334120 -2004910 -270343 944876 1301621 782752
41943 782752 -574134 -2147578 -2650022 -1521631 15412 327203 -496456 -1020085 -779226
41934 -779226 -808343 -1683887 -2506131 -2397177 -1692675 -835616 702430 3291640 5881232
41925 5881232 7126617 7154133 7019372 7008331 6826980 6997787 8417525 10571234 11851675
41916 11851675 12005153 12737731 15302435 18916275 22380259 25819003 29527180 32279312
41908 32279312 32560247 30985620 29816257 30169747 31258072 32465309 34549464 38298873
41900 38298873 43507503 50097552 58851650 69680924 79982758 86145664 86483377 81846723
41892 81846723 74033645 65008822 57297959 53192255 52800385 54052689 55448613 58003713
41884 58003713 63706250 72654101 82461703 89988759 92906538 90172403 82348713 71836868
41876 71836868 61961338 55044988 51235003 49149623 47467431 45969600 45428660 46644398
41868 46644398 49394541 52242263 53546006 52723534 50393676 47360914 43862153 39967413
41860 39967413 36238589 33376362 31262469 28988405 26137976 23561588 22367796 22438400
41852 22438400 22553783 21845410 20462298 18909642 17606944 17170748 18033052 19352140 19443384
41843 19443384 18036792 16978897 17659528 18906518 18904262 18109145 18211961 18927086 18354799
41834 18354799 16443783 15330839 15664489 15382556 13367441 11630217 11974692 12875281 12142068
41825 12142068 10757856 11110721 12736756 13079684 11847777 11263015 11931846 11735815 9541410
41816 9541410 7103788 6164953 6166212 6078767 6128729 6224765 4941903 1945328 -492554 -454058
41806 -454058 782975 1038188 796921 1832798 3400118 2934578 326159 -1543476 -1024134
41797 -1024134 259789 585406 907850 2805311 5401921 6358757 5115972 3382335 2670716
41788 2670716 2783645 2802656 2433647 2002702 1804938 1890897 2252276 2933053 3883499 4709599
41778 4709599 4798590 4044368 3283800 3397093 3985471 3775989 2572890 1779601 2302530
41769 2302530 2924017 1936456 -256614 -1660977 -1588762 -1343546 -1685719 -1372684 698152
41760 698152 3273548 4294737 3923344 4204526 5839188 7124184 6599913 5129749 4321952
41751 4321952 4105280 3271554 1765576 922246 1489016 2692768 3535177 3981856 4399694
41742 4399694 4618661 4220081 3350036 2644606 2452102 2508741 2381615 2022392 1816939 2085637
41732 2085637 2564794 2585929 1907555 1114210 934863 1463723 2432584 3874407 5822454
41723 5822454 7495767 7594236 5643647 2605699 71512 -795021 280158 2565183 4659288
41714 4659288 5626905 5861126 6230205 6540572 5804409 4042991 2651458 2601692 3346828
41705 3346828 3995192 4500409 5032023 5238955 5070057 5448155 7046174 9008840 9937903
41696 9937903 9665867 9047602 8445511 7543762 6436772 5807976 5966729 6452311 6576951
41687 6576951 5854921 4224514 2478707 2024275 3382287 5286480 6085489 5618885 4860866
41678 4860866 4353691 4213192 5076330 7333035 9536762 9404402 6829647 4360367 4034681
41669 4034681 5062968 5412047 4492087 3264482 2529211 2182573 1801911 1202373 607552
41660 607552 651248 1875332 3966798 5893653 6908031 6898577 5863654 4002743 2402883
41651 2402883 2342339 3376452 3343905 1136067 -1566884 -2343389 -981885 725760 1485263
41642 1485263 1562580 1677967 1995557 2234034 2061885 1459108 1086663 1795508 3268775
41633 3268775 3995704 3447464 3257151 4835413 6732825 6421272 4311015 3510913 5142626
41624 5142626 6423420 4787274 1791871 804388 2193207 3345756 2876183 2137083 2307500
41615 2307500 2562806 2194041 2343177 3947628 5622022 5647029 4894361 5416355 6870613
41606 6870613 7127196 6356122 7395795 11159480 14700463 15645762 15916550 18598215 23458141
41597 23458141 28835610 36123793 47930132 62025916 71619947 72927549 68959846 64354804
41589 64354804 60014618 55148405 51271590 50572230 52161207 53497788 54638008 57938142
41581 57938142 64134103 71753413 80042092 89141990 97030875 99728561 96180504 90703594
41573 90703594 88849263 92093653 97598019 101616134 101808665 97628963 90357373 82491299
41565 82491299 75909532 70667548 66070838 62367204 60636622 61383157 63978537 67485044
41557 67485044 71666139 77016376 83456955 88764675 89141856 82624308 71710406 61233943
41549 61233943 53576275 47391288 41093222 35565634 32469706 31602580 31437481 31199043
41541 31199043 30917402 30155508 28168222 25072898 21799509 19091015 17259891 16402137
41533 16402137 16017773 14989635 12883226 10783808 9937804 10101545 10214541 10122258 10432263
41524 10432263 11075060 11303957 10968475 10618554 10430400 10110943 9763911 9746306 9738988 9088015
41514 9088015 8006811 7221411 6453342 4716870 2399497 1478950 2888116 4943651 5452182
41505 5452182 4453073 3689199 3964227 4367176 4062193 3633167 4117877 5369927 6140773
41496 6140773 5771322 5184242 5713767 7203652 8016390 7101722 5259419 3854457 3122584
41487 3122584 2669490 2914955 4597871 7013001 8218927 7322269 5427918 4042585 3652121
41478 3652121 4127619 5182416 5876976 5063237 3183366 2324516 3393143 4501497 3604636
41469 3604636 1614089 989271 1940600 2290854 1096316 130356 1053974 3021844 4270246
41460 4270246 4628344 5029050 5542507 5483501 4962560 4788344 4926660 4441482 3152172
41451 3152172 2121452 2072144 2348821 2037168 1288952 882301 1148016 1990466 3270481
41442 3270481 4358026 4068520 2278903 1098126 2814468 6643978 9184823 8579123
41434 8579123 6568955 5549545 5354834 4632773 3961998 5064444 7314732 7712854 4982873
41425 4982873 1499970 -9860 136247 34193 -416989 342412 2641642 4918840 6024933
41416 6024933 6423940 6656202 6180775 4662265 3257803 3356125 4519359 4890225 3682519
41407 3682519 2271316 2363586 3733732 4488405 3390589 1176508 -631093 -1519782 -1995459
41398 -1995459 -2279590 -1994868 -1208849 -812640 -1342719 -2080833 -1957808 -953151 -11997
41389 -11997 154366 -331400 -898245 -1091845 -946191 -1003771 -1532167 -1589487 169773 3160615
41379 3160615 4534697 2528575 -723430 -1561241 383052 1875437 830396 -924616
41371 -924616 -723688 1088557 2199805 1944506 1739828 2371767 2882589 2385286 1372159
41362 1372159 670668 294344 -21384 -47782 448280 1042069 1169609 975256 1076633 1677040
41352 1677040 2393677 2903682 3327297 3797009 3867921 2757122 459545 -1599844 -1725800
41343 -1725800 -20668 1436816 1105288 -26803 -7326 1058214 1140243 -473296 -1836441
41334 -1836441 -1113423 750985 1480889 630793 -260727 -155794 476262 991995 1267266
41325 1267266 865905 -800439 -2829795 -2918205 -261839 2776430 3323009 1602241 399359
41316 399359 1315982 3182494 4254597 4363856 4272004 4195759 3947542 3708863 3640091 3214477
41306 3214477 1928135 422771 -65277 589548 1070033 245404 -1440360 -2517082 -2043279
41297 -2043279 -329776 1588140 2830592 3109984 2658729 1971203 1567178 1695331 1996992
41288 1996992 1640347 236925 -1408869 -2057490 -1688854 -1661331 -2751728 -3794097 -3166969
41279 -3166969 -1159233 289078 117366 -775846 -1265413 -1657943 -2833422 -4442748 -4960504
41270 -4960504 -3470870 -779249 1360308 1826250 899656 -318915 -1058782 -1296685 -1139519
41261 -1139519 -410721 679296 1065991 59886 -1199313 -807287 1200854 2564721 1782617
41252 1782617 42687 -769928 -707425 -946180 -1315617 -608203 853805 943841 -1401990
41243 -1401990 -4446067 -5542262 -3856403 -635527 2315959 3730013 3258795 1720379
41235 1720379 640399 839074 1627283 1822431 1239281 686066 778520 1321012 1728620
41226 1728620 1581922 833723 -116115 -561469 -50545 1130036 2202495 2608087 2367960
41217 2367960 1872273 1482467 1249747 909298 278867 -264970 48187 1547533 3623122
41208 3623122 5233413 5743627 5152563 3830722 2379219 1511188 1578140 2192962 2705729
41199 2705729 3107609 4012268 5490125 6404914 5609804 3727162 2815273 3708112 4447314
41190 4447314 2521611 -1535600 -4227869 -3300023 -584417 427767 -1059922 -2677625
41182 -2677625 -2370454 -751329 280818 -746 -690149 -537420 760906 2183051 2250412
41173 2250412 716106 -887147 -1089304 -400251 -259700 -560036 94388 1780581 2953573
41164 2953573 3136857 3763160 5456543 6623684 6104550 5199659 5282317 5252305 3594495
41155 3594495 1424587 865467 1478897 1136377 -217906 -633841 257933 768102 461471
41146 461471 889868 2366833 3057737 2445996 2754657 5137234 7028963 5570094 1730333
41137 1730333 -1323378 -2433570 -2665679 -2646969 -2313514 -2478098 -3962045 -5457308 -4777527
41128 -4777527 -2308366 -828114 -1480105 -2187280 -959918 1159720 1814778 723768 -149195
41119 -149195 656488 2361644 3066647 2010887 357126 -354362 -226595 -697053 -2024273
41110 -2024273 -2322883 -153488 2970351 4295428 3444948 2435339 2338042 2126212 1209919
41101 1209919 879570 2120034 3742422 4101544 3420511 3014531 3208463 3459428 3772480
41092 3772480 4504741 5248701 5338893 5186373 5722197 6592232 6281695 4313763 2210182
41083 2210182 1760407 3033457 4530616 4835270 3771759 2236526 1177434 747503 515323
41074 515323 404946 889164 2024317 2991819 3185761 3129808 3512684 3883109 3373179 2349138
41064 2349138 2060674 2652239 2775767 1499130 -402173 -1419959 -765530 1350206 3952199
41055 3952199 5595214 5510905 4847125 5607539 7817213 9042512 7627253 5133959 4251984
41046 4251984 5287909 6318847 6133835 5248387 4337978 3544921 3403421 4594172 6343655
41037 6343655 6793524 5652915 4843428 5553702 6271109 5177251 3179319 2673974 4004082
41028 4004082 5143900 4838234 4224725 4844253 6397311 7239398 6385592 4510008 3370415
41019 3370415 4333690 6913585 8813719 8150319 5613721 3650002 3630630 4870071 6348006
41010 6348006 7935310 9514288 10376219 10368237 10441406 11042066 11013023 9294632 6852249
41001 6852249 5546550 5686119 6103238 6229768 6562892 7181070 7358015 6967380 6980929
40992 6980929 8027771 9380080 9878257 9191552 7821600 6495772 5834649 6001808 6438765
40983 6438765 6517442 6560984 7483424 9244316 10532831 10437349 9725575 9892913 11365789
40974 11365789 13112665 13785903 13010656 11778724 11592522 12908859 14614714 15521922 15941186
40965 15941186 16834830 17835372 17635638 16403976 16012990 17176409 18067740 17037422 15357336
40956 15357336 15648566 18369195 21449513 22985399 22817733 21660677 20156280 19026705
40948 19026705 19049132 20413932 22544230 24548249 25542916 25026588 23590037 22763164 23395860
40939 23395860 24728315 25844872 27191394 29394388 31391923 31529036 30175640 29376221
40931 29376221 29920994 30703997 31219399 32562137 35138185 37320281 37671778 37080610 37371560
40922 37371560 38950577 41088335 43439250 45825356 47341392 47177983 45861071 44499308
40914 44499308 43445547 42911730 43996146 47286265 50918903 52078784 50558991 49031401
40906 49031401 49450249 50935020 51800820 51941743 52164264 52602024 53124670 54277017 56370624
40897 56370624 58316710 58797770 58225822 58184249 59148565 60157925 60716022 61467884 62571230
40888 62571230 62866676 61559180 59598601 58274024 57315444 55799249 54421611 55117742
40880 55117742 58154057 61147658 61846683 60850318 60482608 61578533 62605229 61870502 59521958
40871 59521958 57073891 55741173 55705061 56511809 57589547 58450504 58806242 58671803 58300366
40862 58300366 57937048 57623220 57317742 57231149 57744824 58646153 58755127 57137502 54748361
40853 54748361 53817031 55055671 56484311 55930479 53767895 51899041 50819732 49482472
40845 49482472 47747516 46866713 47169305 47266259 46402423 45770310 46203749 46144610 43656357
40836 43656357 39479717 36302916 35523381 36312163 37420186 38203191 38064936 36693214 35100882
40827 35100882 34878307 35976734 36572662 35594633 34045098 33157040 32553039 31278868 29686232
40818 29686232 28990962 29376313 29699222 29063882 27810245 26768150 26173901 25691091 25211974
40809 25211974 25193050 25995601 27058906 27207552 26053157 24672048 24354401 24981400 25346455
40800 25346455 24875213 24099785 23404627 22379262 20822291 19426914 18792855 18483118 17833977
40791 17833977 17135898 17110824 17543972 17426237 16514936 15906043 16654782 18297858 19243220
40782 19243220 18559684 17023777 16221218 16804293 17987768 18745281 18936684 18920889 18658939
40773 18658939 17936151 17084376 16563151 16054051 15066007 14342562 15237078 17321821 18131447
40764 18131447 16221839 13264131 11875087 12328943 12895430 12751588 12724515 13177116 12973702
40755 12973702 11248671 8938660 7592023 7380767 7246854 6669481 6342767 6982153 8136972
40746 8136972 8631167 7946304 6730747 5924042 5801287 6088413 6564647 7064905 7240413
40737 7240413 6997263 6926399 7465261 7829389 6891149 5134881 4392070 5286763 6379894
40728 6379894 6500459 6421162 7211027 8407669 9188657 9957046 11054174 11209865 9462068
40719 9462068 7634663 8322490 10864818 12009541 10513930 8297387 6779587 5185896
40711 5185896 3428982 3475592 5955539 8075399 7331623 5250700 4803221 5768852 5675234
40702 5675234 4251230 3646028 4484348 4936414 4223444 4147777 5983408 8192808 8776821
40693 8776821 8164813 8079440 8696038 8661226 7393793 5883657 5264307 5581091 6014498
40684 6014498 5720905 4512703 3102326 2472358 2707782 2837316 2188586 1390380 1482592
40675 1482592 2489926 3567678 4216235 4552586 4583372 4147951 3668987 4014569 5186785
40666 5186785 5915235 5223063 3870420 3427107 4208192 5076693 5249181 5176388 5240993 4721867
40656 4721867 3020152 1143052 688688 1654027 2530891 2535566 2409494 2792024 3203359
40647 3203359 3225877 3380221 3926867 3926130 2638339 997604 421294 745988 643667 -269714
40637 -269714 -1009744 -773355 208263 1383361 2571626 3941365 5875797 8532908 10978441
40628 10978441 11519872 9871266 8171448 8565267 10526677 12019806 12387970 12221042 11438881
40619 11438881 10286340 11596074 18315655 28021617 33529930 30901120 24051934 19306840
40611 19306840 18032450 17396597 16086359 15574526 16678659 18349459 19833070 21238246
40603 21238246 21868066 20562311 17981775 16178000 15466525 13973886 10881930 7985432
40595 7985432 7196493 8342908 10240981 12173790 13465969 13416690 12753019 13493088 16110486
40586 16110486 18274519 17682394 14808044 11569021 8722880 6227280 4889589 5559509
40578 5559509 7302315 8305062 8317929 8512907 9173784 9297594 8529071 7795960 7676888
40569 7676888 7576945 6987547 6331274 6029302 5775828 5269645 4778604 4512760 4260131 4035393
40559 4035393 4218743 4642961 4494739 3666835 3267045 4115105 5631417 6948718 8129860
40550 8129860 9292384 9558943 8357675 7085726 7734590 10107350 12213105 13457238
40542 13457238 15349214 18386073 20383671 19424774 16819801 15122228 14302617 12308593
40534 12308593 9024781 7006285 7676677 9104284 8823237 7121294 5935219 5720072
40526 5720072 5232795 3808720 2137021 920576 170357 -152333 29151 364616 359542
40517 359542 180122 253218 271086 -252507 -610450 473668 2729594 4347028 4465333
40508 4465333 4135408 4191684 3776810 2091205 263214 -2862 1180530 2275459 2577365
40499 2577365 2724962 3252363 3918282 4436036 4808953 4885870 4415914 3556523 2671257 1791120
40489 1791120 928275 566856 991644 1475007 1122892 225511 -355910 -844759 -2143221
40480 -2143221 -3786682 -3985095 -2241566 -390191 -67976 -408621 466792 2516821 3835314
40471 3835314 3361683 2125544 1546636 1606165 1342089 513395 -68142 189530 772234
40462 772234 874846 702945 1201159 2453150 3284855 3015766 2725945 3706068 5236271
40453 5236271 5385283 3913068 2723726 3007792 3577653 3011997 2030618 2261492 3562447
40444 3562447 4255782 3659144 2757502 2331334 1934894 1136556 473512 444269 467978 -303260
40434 -303260 -1636581 -2402040 -1829078 -51267 2313845 4520449 5741183 5426102 3939031
40425 3939031 2567298 2492651 3610811 4563146 4220199 3072031 2724244 3927255 5702981
40416 5702981 6795518 7286133 7968834 8713396 8710803 8156968 8159453 8623365 7832648 5112497
40406 5112497 2552101 2580303 4681855 6219613 6064947 5545050 5813746 6339891 6663161
40397 6663161 7731766 10147240 12448698 12789541 11504888 10366061 9831483 8866904 7357727
40388 7357727 6700267 7461151 8223621 7798966 7167810 7801160 9021806 8785668 6827049
40379 6827049 5337119 6122717 8374334 9956180 9990643 9264744 8660695 8310721 8276969
40370 8276969 8980519 10390408 11465683 11255889 10330745 10203951 11218182 11967384 11347741
40361 11347741 10285371 10444269 11804087 12773612 12490492 11651191 10992979 10448289 10254672
40352 10254672 11339524 13610571 15152926 14442335 12458768 11286775 11426450 11962419
40344 11962419 12647517 13933310 15222668 15130380 13781214 13064712 14022433 15509240 16116233
40335 16116233 15961359 15708573 15169167 14022361 12881434 12399456 12021796 10795671 8944930
40326 8944930 7609334 7343812 7710449 8038268 7893701 7185839 6410144 6280587 6580506
40317 6580506 6167077 4838245 4154744 5197748 6448274 5577065 2840106 855686 1089997
40308 1089997 2394677 3259943 3631006 3773108 3063105 1173472 -679522 -1032499 -129714
40299 -129714 540676 303042 -35725 683473 2911333 6148782 9018471 9879034 8227368
40290 8227368 5429606 3390651 2618856 2260900 1766938 1465851 1427040 970301 -74458
40281 -74458 -605710 250867 1498654 1382682 7911 -498517 1166819 3680614 4931555
40272 4931555 4639516 3957396 3259509 2023798 694675 670509 1839270 1939429 -376741
40263 -376741 -3197075 -3633300 -1542667 725397 1693196 1971062 2307500 2453242 2364392
40254 2364392 2721504 3468391 3332321 1744265 -20197 -614604 -368821 -149453 349800
40245 349800 1660438 2745934 2017492 -66989 -1137756 126045 2574254 4471444
40237 4471444 5488701 6212015 6812579 7139183 7469781 8298157 9711353 11591859 14022460
40228 14022460 16777265 18764877 18953463 17962009 17885615 20043713 23359092 25516052 25488799
40219 25488799 24291777 23219178 22145870 20205125 17703048 16295522 16933768 18421215
40211 18421215 18703184 17144565 14724335 12259272 9576410 6712394 4770847 4608240
40203 4608240 5253663 4832859 3062378 1736498 2349585 4166187 5368095 5405565 5186965
40194 5186965 5305388 5323659 4929222 4549195 4262694 3219997 1104792 -681208 -587046
40185 -587046 779987 1338542 456318 -284816 451075 1995343 3084999 3685493 4277500
40176 4277500 4389130 3342158 1923632 1756992 3059464 4348433 4480300 3764197 2887391
40167 2887391 2040747 1525952 1932128 2980247 3299874 2218862 793671 157494 -40270
40158 -40270 -313029 321208 2697025 4958346 4256687 1170494 -257078 2017459 4972319
40149 4972319 4774159 2077067 464342 900571 962274 -566615 -1638243 -508960 1349749
40140 1349749 1638209 550150 -263807 -571762 -1176702 -1597692 -555553 1425140 2132973
40131 2132973 762534 -901354 -970773 342529 1656267 2234313 2054377 1129956 -253318
40122 -253318 -1251522 -1216935 -377487 669718 1635207 2354917 2593771 2511450 2720900 3393186
40112 3393186 3887633 3762424 3533927 3843870 4432939 4604801 4270575 3869889 3573361
40103 3573361 3167095 2521215 1722118 939807 444294 436779 668314 677677 538828 708392
40093 708392 985126 581790 -387405 -625837 417820 1452392 1183491 250587 96879
40084 96879 766864 1264951 1432580 1844389 2233446 1738896 661074 334036 1070974 1700276
40074 1700276 1397712 615962 -47393 -488163 -301741 1094411 2990895 3590085 2502408
40065 2502408 1588327 2269727 3389028 3128516 1884126 1441697 1963031 1797249 334541
40056 334541 -827108 -321568 731742 167322 -2040453 -3307353 -1520489 2153999 4349633
40047 4349633 3321196 869502 -14278 1241847 2468578 1774469 -284262 -1836876
40039 -1836876 -1984345 -1303276 -736096 -733979 -1202868 -1693505 -1726422 -1251515 -686475 -404669
40029 -404669 -454851 -799191 -1347371 -1661878 -1214152 -146110 780752 1201155 1514828 2054380
40019 2054380 2596985 2951199 3214730 3132047 2192561 920775 956832 2874182 4827592
40010 4827592 4651292 2771538 1699651 2817105 4917743 6047603 5723700 4981029 4935752
40001 4935752 5681840 6309499 5954326 5001489 4892045 6285270 7880562 7844093 6133866
39992 6133866 4527263 4398571 5307032 5887966 5417012 4274268 3368215 3288951 3755174
39983 3755174 3933840 3497559 3007971 2913911 2785502 2229419 1899402 2489108 3161882 2399370
39973 2399370 413827 -711965 294707 2247596 3092753 2185413 391001 -1172043
39965 -1172043 -1704545 -740322 1448399 3657211 4637682 4196703 3159204 2442010 2396259
39956 2396259 2799222 3206169 3419555 3674782 4173171 4536277 4156962 3082547 2053631
39947 2053631 1599033 1559190 1536355 1287402 631761 -421564 -1332855 -1418560 -756891 -173648
39937 -173648 -192157 -521688 -643329 -308245 543611 1632441 2114934 1422391 412974
39928 412974 610381 2005056 2802916 1962000 841576 1397950 3583054 5577266 6096863
39919 6096863 5545280 5190911 5929652 7590030 8939976 8770905 7426406 6726291 7890954
39910 7890954 10146353 11876550 12415475 12125141 11613107 11701036 13263273 16047283 18446191
39901 18446191 19557261 20616091 23036630 25913228 27333768 27699406 29574964 34068177
39893 34068177 39418905 43872683 48161644 54025249 61651579 70021432 79039161 89810435
39885 89810435 102675723 115784586 125997833 131209274 131969936 130923339 130502868 131304367
39877 131304367 132937686 135967484 142124393 152646487 167284464 185131957 205688513
39870 205688513 228727439 253432452 277656999 297737072 309586688 311090336 303605619
39863 303605619 290612929 275259459 259968121 247515804 240441106 239114530 242043858
39856 242043858 248576439 259814263 276253881 295867854 315057033 330068579 337066364
39849 337066364 333015381 318220546 296871767 273694933 250890016 229099680 209591117
39842 209591117 193699515 181378654 172241505 167079072 166358456 168004047 168797640 167472323
39834 167472323 164367154 158652831 148583669 134682342 120211284 107811258 97570746
39827 97570746 88804664 81526531 75350415 69063448 62515457 57231893 53966273 51262310
39819 51262310 47714884 44056067 41478054 39355113 36462297 33328798 31379946 30448049
39811 30448049 29106977 27095531 25521946 24800277 24191680 23477122 23346526 23796724 23752874
39802 23752874 22820284 21950071 21670767 21072238 19565650 18421674 19097994 20712188 20785083
39793 20785083 18466363 15605749 14219978 14124136 13936822 13507753 13916070 15190485 15564065
39784 15564065 13769202 11090678 10017427 11288335 13338272 14412057 14070498 12710366
39776 12710366 10987564 10014542 10722423 12336900 12717743 11093719 9313674 9281703 10238095
39767 10238095 10051182 8413255 7031244 6988584 7645375 8194526 8701222 9243665 9370890
39758 9370890 8913459 8305457 7771107 7219127 7178505 8582555 11115267 12974674 13009797
39749 13009797 12104253 11727733 12099730 12605161 13058242 13519861 13637251 13270628 13144113
39740 13144113 13715687 13958214 12631474 10482889 9678302 10884494 12307040 12158735 10928976
39731 10928976 10345667 10842060 11097509 9903709 7641806 5744936 5225877 6031039 7560608
39722 7560608 9388180 11328066 13031986 13912307 13648377 12594335 11440741 10506458 9584022
39713 9584022 8521417 7714341 7770196 8701358 9742533 10214083 10397940 11112950 12381752
39704 12381752 13113468 12509995 11291146 10857734 11506145 12217073 12091595 11177425 9873787
39695 9873787 8492812 7710775 8471053 10740970 13010540 13797948 13286870 12800658 12964655
39686 12964655 13154264 12711712 11997749 11936832 12821907 13885824 14137429 13498805 12760275
39677 12760275 12234553 11044533 8508219 5840334 5255813 7246638 9969255 11749788
39669 11749788 12931633 14500629 16152556 16952704 17025565 17223584 17662069 17853700 17822142
39660 17822142 17777252 17164749 15600764 14458886 15633260 18448695 19672186 17478110
39652 17478110 13946047 12456789 13654758 15310979 15546136 14735100 14260519 14670181 15628280
39643 15628280 16969722 19012503 21875500 25041625 27867143 30188858 31966337 32524846
39635 32524846 30947369 27489396 23880761 21650479 20649431 19786410 18644005 17571944
39627 17571944 16668831 15703663 14876897 14689573 15049477 15322087 15285099 15324589 15771619 16794596
39617 16794596 18802721 22047618 25784773 28609854 29679278 29046155 27114108 24557066
39609 24557066 22344307 20777145 18887651 15986078 13295149 12457075 12817828 12219379
39601 12219379 10454068 9604091 10452027 10989099 9651392 7873357 7797518 9174713 10376645
39592 10376645 11134385 12254689 13473213 13599628 12527055 11516787 11513943 12243363 12827357
39583 12827357 12549921 11362378 10153585 9855709 9900922 8722640 6329508 4754490 4943512
39574 4943512 5070511 3562133 1963565 2549893 4561362 5474697 5026626 5121704 6256922
39565 6256922 6913669 6398203 5550376 4587419 3033865 2004223 3501703 6697554 7937910
39556 7937910 5760931 3122734 2896362 3714357 2637942 43358 -914765 1145032 4225255
39547 4225255 5719472 5022310 3342704 2202092 2306573 3238377 4199323 5048833 5981551
39538 5981551 6357421 5302371 3754379 4050365 6534061 8390099 7272405 4462502
39530 4462502 2672925 2205776 1512533 478225 523603 1770337 2634503 2516313 2687709
39521 2687709 3843683 4639749 3684030 1668419 447773 819714 2108412 3357274 4064161
39512 4064161 3987750 3015314 1483097 337970 541587 2044791 3628555 4298526 4586976
39503 4586976 5548283 6615831 5982991 3564808 1819108 2425022 3699798 3045017 778025
39494 778025 -522438 272517 1962747 3429652 4642908 5271746 4546249 2913628 1876794
39485 1876794 1714294 1212704 102749 -298292 387585 538842 -852348 -2424728 -2727553
39476 -2727553 -2516500 -3037397 -3463871 -2115490 611956 2533981 2551863 1614920 1046026
39467 1046026 1313200 2262393 3289547 3449971 2509436 1590119 1692748 2103531 1630315
39458 1630315 883421 1537553 3459508 4492175 3448062 1588908 541114 330512 288221
39449 288221 447115 948300 1172932 604091 -251615 -762750 -1156881 -1608920 -1263577 500666
39439 500666 2496383 2954141 2062075 1773409 3033822 4616726 5013217 4168573 2818750
39430 2818750 1313309 -77019 -630606 -5939 912520 973635 299824 2473 500842
39421 500842 1000102 747973 51120 -283734 -9361 443040 617973 463493 208971 58260
39411 58260 34978 75953 246611 741548 1549105 2249395 2393772 2043250 1677477 1592468
39401 1592468 1698540 1949597 2543128 3379563 3627911 2433056 224094 -1173139 -300114
39392 -300114 2136381 3871728 3723972 2930631 3214699 4190695 3966525 2190716 909559
39383 909559 1763764 3740896 4861201 4987155 5404751 6294320 6439704 5375454 4130672
39374 4130672 3544139 3301584 3071882 3231330 3876489 4349548 4395260 4645863 5294067 5459701
39364 5459701 4642277 3617148 3011469 2235602 916596 121197 740859 1784293 1935502
39355 1935502 1840954 2878798 4335059 4111304 2171812 1011214 2186167 4302165 5201496
39346 5201496 4519888 3190191 1874965 1017089 1303873 2786129 4173829 4129516 2942014
39337 2942014 2082663 2349158 3138733 3397658 2720886 1546766 635841 402138 625783
39328 625783 741985 241362 -1162130 -3142222 -4276921 -2949782 355670 2622433 1666540
39319 1666540 -701162 -780430 1984587 4275328 3539745 1136876 -40111 931465 3092406
39310 3092406 5357576 6615207 5598234 2506419 -241148 -578571 647288 1176895
39302 1176895 504199 -136188 -160511 -102363 -99063 245593 634733 367304 -213325 -44226
39292 -44226 1018388 2319142 3836937 5789120 7073123 6175661 3777507 2324575 2528456
39283 2528456 2448112 903490 -382569 459373 2314288 2639873 1073399 -496867 -965288
39274 -965288 -1223736 -2225490 -3317762 -3064413 -983629 1896339 3795925 3427351 980817
39265 980817 -1906560 -3394573 -2830903 -1019169 644773 1254858 969959 725859 1188691
39256 1188691 1982490 2288705 2138617 2456888 3587433 4406257 3430990 566208 -2618645
39247 -2618645 -4246950 -3667158 -1864704 -468771 -235728 -595199 -740876 -621732 -411916
39238 -411916 255552 1534834 2427746 1954309 935805 1004327 1924261 1810818 341849
39229 341849 -357054 1062890 3069839 3734700 3520038 3830663 4292000 3619640 2222466
39220 2222466 1718499 2330608 2739924 2224303 1188253 10703 -779908 231475 3579248
39211 3579248 6702256 6191189 2547127 -9576 785271 2508266 2271606 952029 1103480
39202 1103480 2835691 4450899 5818475 8254526 11583274 14032288 15199374 16766369
39194 16766369 19598797 22004275 21890649 19456598 16778440 15458106 15446159 15716049 15445147
39185 15445147 14674245 14149487 14534363 15818203 17566907 19480417 21511901 23866353
39177 23866353 27205228 32351841 39450768 48080990 58420021 70826635 83179703 90289564
39169 90289564 88352903 79508857 69699484 62162125 55425802 47784327 40679526 36362839
39161 36362839 34769534 34595079 35526285 37445829 39209361 40530483 43670674 50815519
39153 50815519 61074248 72848992 87724621 107756734 128715382 140524959 136752378
39146 136752378 121106297 102664132 87123609 74873116 64958347 57173923 51010888
39139 51010888 45842253 42394849 41731842 42760945 43068113 42387571 42875152 45608754 49544741
39130 49544741 54906136 64510798 79137182 93385787 99282586 93848282 81085676 66918271
39122 66918271 54545943 44777262 37936189 33653622 30317817 26608899 23065949 20914358
39114 20914358 19929455 18826293 17460175 17147182 18578059 20697705 22254341 23477133
39106 23477133 25305660 27462533 28305688 26704569 23440881 20436628 18828809 18054840
39098 18054840 16801582 14635143 12441825 11216307 10788635 10188326 9086252 8202049
39090 8202049 8134319 8473251 8512019 8269160 8160550 8066378 7545805 6825436 6690667 7263686
39080 7263686 7697354 7421753 6995375 7188572 7737567 7667325 6580536 4956433 3248335
39071 3248335 1399329 -468891 -1413066 -350010 2524802 5385435 6249418 4871766
39063 4871766 2930885 2226650 3001530 4275619 5354563 6254326 6791292 6324168 4911549
39054 4911549 3918063 4568318 6223083 6991177 6040933 4484628 3760803 3895504 3867212
39045 3867212 3178406 2378394 2176584 2653896 3431193 4124017 4440440 4261211 3934206
39036 3934206 4114562 4859072 5181447 4157178 2344438 1288369 1472648 1687705 929562
39027 929562 4236 287017 1515478 2078235 1320420 252610 -258322 -773414 -2127134
39018 -2127134 -3881566 -4734273 -3992177 -2009273 460620 2728388 4194208 4466120 3575570
39009 3575570 2037011 784817 779318 2096846 3511320 3731651 3070042 3000325 3978179
39000 3978179 4836340 4717673 4379471 4844687 5849059 6559737 6905978 7161427 6991224
38991 6991224 6002863 4627749 3482731 2492828 1520108 997974 934672 356670 -951848
38982 -951848 -1344556 300702 2201508 1921214 205039 -69049 1565794 2599762 1809497
38973 1809497 1088632 2022980 3365231 3458542 2905069 3022241 3493072 3455353 3396593 3989489
38963 3989489 4305519 3259718 1893604 2110566 3709099 4699857 4352666 4101836 5327989
38954 5327989 7650632 9555966 9738382 7997719 5688926 4796599 5577446 5857166 3927510
38945 3927510 1257750 593668 2075755 3388279 3429589 3404923 4054915 4317987 3664936
38936 3664936 3538791 5011023 6681286 6605120 5182200 4389090 4766526 4828719 3363478
38927 3363478 1014946 -604330 -534363 912034 2500072 2962524 2068210 911425 787868
38918 787868 1760443 2636089 2356932 1129651 97142 39601 542721 584834 -51678 -339003
38908 -339003 649259 2307049 3158422 2877057 2733047 3736397 5198030 5746085 5130954
38899 5130954 4248417 3773045 3635492 3730561 4244184 5011053 5213354 4232617 2528711
38890 2528711 1228390 928250 1279709 1728161 2164263 2587583 2592280 1813266 757457
38881 757457 481049 1271322 2302135 2918046 3558593 4785608 5983616 5985588 4807276
38872 4807276 3771153 3697643 3764913 2652471 414935 -1285287 -847870 1484836 3601433
38863 3601433 3478066 1248273 -971017 -1438493 -456763 623053 1291609 1921114 2475926
38854 2475926 2441055 2001988 2072210 2811627 3153886 2337058 1047889 384866 363269 213747
38844 213747 -306873 -734378 -811981 -787906 -748501 -318970 689612 1747319 2096331 1647116
38834 1647116 1094316 1151134 1918098 3040590 4117830 4689378 4227469 2806368 1670878
38825 1670878 2314483 4703178 7046474 7675422 6586775 4851890 3279130 2213456
38817 2213456 1916254 2345303 3017624 3719091 4802568 6185504 6842475 6181719 5165039
38808 5165039 4970332 5237937 4908289 4159236 3985668 4256261 3843099 2592575 1616542
38799 1616542 1596247 2239708 3377687 5011333 6231664 5846015 4390420 3826745 4789784
38790 4789784 5772257 5570913 4882916 4769518 5087814 5244427 5114242 4506486 3117366
38781 3117366 1634878 1370785 2192384 2528988 2069560 2413172 4112532 5359603 5020271
38772 5020271 4664776 5678090 6532335 5329440 3217481 2560455 3166838 3238015 2904533
38763 2904533 3651277 4940157 4740870 3259070 2835694 3822859 3773684 1554435 -701881
38754 -701881 -953305 83866 1066370 2360165 4372074 5589397 4549703 2467835 1720889
38745 1720889 2523714 3152617 3009694 3397691 5084114 6844296 7166740 6348570 6004149
38736 6004149 6901132 8075623 8223147 7422128 6874007 7004522 6680483 4872913 2394734
38727 2394734 978997 983035 1220474 1097046 1616688 3711578 6533973 8256447 8194409
38718 8194409 7472555 7592278 8657172 9209396 7957025 5491945 3702131 3425799 3684433
38709 3684433 3714190 4430529 6614049 8729752 8420657 5746345 3095451 1996045 1817341
38700 1817341 1679189 1728832 2129445 2575550 3375364 5311651 7769015 8730323 7531901
38691 7531901 5998999 5777426 6073298 5336158 3845823 3127367 3753771 5128811 6673446
38682 6673446 7925069 8162133 7226107 6161729 5865107 5645235 4284805 1994167 107175
38673 107175 -735726 -930618 -821247 -443663 -76036 81872 558252 1881323 3434606
38664 3434606 4110555 3894087 3684848 3739011 3548304 3246808 3744243 5090582 5956142
38655 5956142 5438385 4479778 4657495 6119303 7556144 7965910 7621713 7186921 6576736
38646 6576736 5265383 3512192 2592575 3453230 5479637 7046108 7143195 6105162 4978619
38637 4978619 4659128 5357749 6246233 5916087 4094124 2687633 3906580 7234102 9573723
38628 9573723 8858419 6300357 4438679 4175040 4688489 5270733 5987898 6948195 7895271
38619 7895271 8403721 8042182 6728715 5180441 4361372 4288859 4295917 4591775 6109418
38610 6109418 8339217 9188259 8183358 7970816 10688382 14196684 14331023 10334105 5733482
38601 5733482 3886919 4778109 6503394 7920713 8959744 9660281 9904932 9592031 8718007
38592 8718007 7689834 7365559 8051429 8742587 8307754 7155331 6623173 6952622 7150506
38583 7150506 6778019 6473585 6519439 6239783 5246185 4163746 3661942 3691080 4042649 4755024
38573 4755024 5584817 5938162 5745780 5668768 6070046 6453480 6243902 5509286 4637986 3855981
38563 3855981 3278630 2971229 2871263 3041014 3785032 4923292 5312677 4048422 1979007
38554 1979007 963945 1586973 2621456 2882799 2584295 2573181 3130960 3941428 4601438
38545 4601438 4815647 4492494 3805788 2977649 2255572 2275358 3636381 5535123 5933213
38536 5933213 4262455 2912388 4360291 7612199 9463257 8774838 7314777 6607693
38528 6607693 6377045 6271595 6639817 6995804 6086649 4338906 3954462 5490497 6606988
38519 6606988 5666485 4475901 5568634 8410497 10368077 10319543 9342695 8588168 8286371
38510 8286371 8423917 8866820 9030564 8527394 7813382 7360444 6756540 5448485 3714824
38501 3714824 2130567 859569 228258 969814 2885308 4233367 3636859 1892161 892931
38492 892931 1471416 3103604 4781382 5305018 3867684 1423559 317376 1416923 2878418
38483 2878418 3021906 2942110 4519259 7168039 8722297 8722809 8702841 9697678 11370510 13186719
38473 13186719 14695118 15106890 14316631 13832010 15005796 17043135 18618529 20575654
38465 20575654 24609123 29788514 33007731 32813468 30371850 26779357 22164746 17699315
38457 17699315 15586275 16137930 17260942 17704165 18438996 19860788 20178995 18122623 15083368
38448 15083368 12839081 10988895 8498064 6186689 5558759 6179788 6260321 5362173 4849100
38439 4849100 5813688 7733899 9085641 8672300 6795394 5466302 6527105 9101718
38431 9101718 10189935 8520168 6321200 6147102 7475496 8067004 7418353 6873655 7092183
38422 7092183 7453836 7638355 7898415 7841402 6680219 4811505 3589473 3336867 3037621
38413 3037621 2263128 1933389 2689433 3883991 4878544 6102288 7867510 9124587 8643159
38404 8643159 6958879 5899844 6182625 6590676 5967497 5136710 5893003 8334826 10277407
38395 10277407 9786365 7588497 6186759 6897822 8586494 9255660 8086383 5851188
38387 5851188 4128732 4307453 6555257 9380450 10793484 10198389 8665867 7390882
38379 7390882 6764045 7001965 8401503 10404978 11573783 11316491 10722642 10899774 11481164
38370 11481164 11747580 12207284 13718274 15707464 16693113 16309958 15618827 15557076 16062419
38361 16062419 16540713 16368143 15272297 14004222 14041126 15661293 17080596 16782326 15897263
38352 15897263 16559035 18526600 19584714 19113937 18880488 19890340 20818279 20479251 19690447
38343 19690447 19320513 18379994 15832949 12929808 11807702 12616955 13795133 14527494 15170166
38334 15170166 15690161 15513834 14838506 14491111 14489815 14243894 14106101 14982922 16227786
38325 16227786 15875962 13697956 12222535 13556982 16633840 18968455 19905618 20474596
38317 20474596 20969816 20701564 19882479 19803333 20829174 21811569 21981306 22016493 22553897
38308 22553897 22903170 22182103 20800464 19841721 19672754 20101170 21280293 23418730 26031361
38299 26031361 28504143 31050169 34026874 36587047 37304278 36230825 35118795 35250375
38291 35250375 36125447 36803736 37505508 39015248 41195142 43147109 44664323 46614171
38283 46614171 49697570 53434102 56761319 59392223 62143841 65798904 70002341 73822263
38275 73822263 77382201 82131597 88934491 96520579 102781397 107316584 111595288 116575897
38267 116575897 121390891 124886284 127441190 130439670 134587392 139636469 145432932 152364152
38259 152364152 160791461 170730577 182250975 195636730 210677524 225852450 238636243
38252 238636243 247086084 251280962 252926174 253404391 252642219 250165870 246604205 243391061
38244 243391061 241440949 241081385 242992739 247993330 255762338 264813342 273939620 282710685
38236 282710685 290334456 295141066 295720577 291802814 283740240 272097155 258183402 244021052
38228 244021052 231104258 219705575 209589269 200624820 192611954 185535413 180099947
38221 180099947 176776109 174198384 170054146 163861220 157117727 150309870 142014553 131921461
38213 131921461 122280787 114620453 107234995 98201036 89035986 82637007 78851729 74959546
38205 74959546 69833626 64874129 61182019 58383528 56051350 53854970 50538050 45325849
38197 45325849 40254997 38356605 39303420 39616086 37639773 35455719 35004740 35173397 34149754
38188 34149754 32219121 30530288 29094957 27738641 27337147 28355999 29504105 29405342
38180 29405342 28431639 27553029 26680151 25545450 24894589 25201564 25304453 23925290 21663979
38171 21663979 20042508 19442486 19352916 19703053 20464661 20803114 20150590 19367626 19384797
38162 19384797 19501723 18586334 17170155 16632563 16925793 16887748 16349575 16117055 16159044
38153 16159044 15668665 14853579 14851975 15697868 16046813 15291629 14475414 14609329 15332209 15800282
38143 15800282 15907304 16052594 16390611 16710045 16574222 15479451 13409891 11246997 10119333
38134 10119333 10390309 11595434 12955047 13540772 12701427 11071533 10321377 10952642 11333493
38125 11333493 10231828 9213163 10584167 13671919 15454701 14716759 13234891 12631850
38117 12631850 12437216 11934846 11641295 11790806 11274578 9481164 7639554 6888209 6366971
38108 6366971 4843602 3169855 3310502 5435741 7597402 8181864 7430652 6528567 6207070
38099 6207070 6390541 6544348 6239855 5654239 5330696 5316384 5110383 4712528 4854504 5636656
38089 5636656 5909943 4934438 3769266 3771439 4401104 4097783 3050858 3257716 5386990
38080 5386990 7220125 6313293 3235755 916680 1205295 3260641 5259544 6451310
38072 6451310 7052721 7151820 6737117 6359443 6655030 7244738 7160762 6529233 6648506 7888965
38062 7888965 8766076 8073316 6811895 6620149 7198318 7067406 6295711 6318829 7121504
38053 7121504 6976362 5588258 5177897 7155293 9651009 10072486 8661508 7578672 7465190
38044 7465190 7009152 5490858 3799969 2902938 2877672 3562653 4762780 5687198 5532635
38035 5532635 4851099 5053597 6238940 6804339 5759400 4255958 4010624 5074279 6088337
38026 6088337 6223694 5927314 5896089 6134599 6307343 6572523 7481547 8852928 9239957
38017 9239957 7378737 4258344 2683295 4049798 6423125 6891013 5161436 3465612
38009 3465612 3315224 4014418 4414180 4403949 4130843 3263524 1882900 934337 930218 1165497
37999 1165497 960194 655782 625572 490634 299912 1182911 3424695 5077501 4330063
37990 4330063 2440699 2214390 3957585 5170366 4281235 2418017 1050788 196968 -120933
37981 -120933 1068284 3595339 5030713 3728684 1684406 2112873 5009456 7471833
37973 7471833 8019227 8018509 8556272 8471415 6667691 4438335 3862250 5004399 6202175
37964 6202175 6438991 6064193 5541764 4768069 3658929 2524097 1724634 1435924 1656246
37955 1656246 2076263 2247100 2339637 3333609 5788869 8664931 10023854 8866117 5901759
37946 5901759 2777084 967550 1033110 2290941 3344937 3374130 2711736 1987485 1400890
37937 1400890 1304959 2516173 4990736 6963264 6781290 5168746 4224629 4427935 4244485
37928 4244485 2775501 1156348 867346 2035045 3934425 5886337 7047570 6570190
37920 6570190 4795944 3316366 3115560 3538555 3672321 3667406 3963800 4321709 4530220
37911 4530220 5055793 6013126 6495841 6000890 5505092 5872102 6158658 5023087 3066699
37902 3066699 2084131 2439508 2913795 2953272 3310361 4334484 5276942 5684729 6061228
37893 6061228 6633755 6728898 6019625 5362087 5681105 6749066 7623765 7688076 6867137 5481317
37883 5481317 4304632 4177807 5151506 6440208 7389455 7942198 8108300 7784601 7299159
37874 7299159 7247183 7442969 6950386 5653352 4853578 5526452 6748729 6849287 5672674
37865 5672674 4682035 4966638 6076895 6899915 6837484 5788875 3680270 740431 -1915957
37856 -1915957 -2720876 -1109344 1695915 3804199 4513011 4609488 4887520 5109434 4727896
37847 4727896 3865745 2995744 2315270 2125087 3049543 4834512 5636607 3996337 1193037
37838 1193037 -32186 873118 1686449 884284 -198800 281162 1840915 2789326 3064074
37829 3064074 4016533 5726357 6404026 4875153 2342273 946411 1285902 2056803 1861419
37820 1861419 777729 31422 422072 1407850 1818708 1173760 -4214 -950066 -1284921
37811 -1284921 -1026663 -503973 -246044 -517558 -1047509 -1589274 -2333054 -3086057 -2658462
37802 -2658462 -349631 2271093 2724114 946658 -383078 678166 3160911 5127423
37794 5127423 6027073 6060704 4944154 2878839 1418131 1647283 2488228 2413169 1804488
37785 1804488 1820099 1934951 829100 -876027 -1134922 374303 1805074 1960731 1502265
37776 1502265 1128223 639230 253560 776819 1752679 1417762 -556651 -2095244 -1603186
37767 -1603186 -149953 495071 441894 772571 1392285 1569019 1710811 2762820 4270336
37758 4270336 4694653 3531449 1783233 439935 -284493 -304666 446972 1291002 1053487
37749 1053487 -561312 -2546896 -3748219 -3813229 -2912503 -1302184 470037 1512900 1273440
37740 1273440 99954 -1157208 -1998482 -2539514 -2996677 -3154305 -2551305 -1173726 339226
37731 339226 1355266 1815040 1906044 1657052 1345213 1701383 2827952 3445731 2453947
37722 2453947 855460 536692 1275796 950526 -964687 -2354705 -1805669 -681298 -372365
37713 -372365 224901 2208046 3598184 1832480 -1733277 -3081890 -1057702 1440353
37705 1440353 1975091 1238604 548169 -299134 -1339877 -1259900 317515 1494010 983799
37696 983799 504449 2088439 4446149 4478163 1666657 -1326226 -2147740 -918694 877074
37687 877074 1868679 1251970 -553873 -1696359 -859762 661394 528022 -1082393 -1487365
37678 -1487365 580567 3164233 4061540 3648582 3356370 3024259 1717863 157451 115740
37669 115740 1559402 2372037 1382431 104852 588702 2580929 3939586 3450150 2181271
37660 2181271 1902861 2890218 3812114 3554928 2549288 2010020 2253995 2418597 1895897
37651 1895897 1327119 1658821 2702152 3427053 3528023 3763948 4517679 4959337 4316859
37642 4316859 3258561 2979933 3281087 2843740 1524842 926273 1909588 2810770 1538930
37633 1538930 -1266300 -2871667 -2092603 -546420 46845 14649 305353 586769 276327
37624 276327 273436 1793592 4071326 5135737 4731024 4602065 5649643 6600582 6123185
37615 6123185 4670875 3324837 2160623 888288 63157 412083 1620254 2856153
37607 2856153 3918314 4883855 5278917 4737857 3941977 3687710 3497451 2520064 1435339
37598 1435339 1793371 3401306 4083055 2591624 295344 -851404 -779683 -714400 -1094143
37589 -1094143 -1346074 -1194910 -941565 -598542 153163 1058835 1266945 496442 -445695
37580 -445695 -648182 -110659 538091 917871 1102399 1239928 1433131 1892041 2728857 3507947
37570 3507947 3456557 2475518 1660771 2285815 4246343 5999315 6199171 4923610 3051906
37561 3051906 1074553 -840460 -2090136 -1987626 -939687 -348143 -923121 -1755701 -1581180
37552 -1581180 -438541 597448 1023550 1405206 2139792 2479868 1439189 -547933 -1645728
37543 -1645728 -679475 1291638 2133221 1199263 -103780 -445923 -251942 -629401 -1521795
37534 -1521795 -1977012 -1698365 -1136580 -346689 947889 2215452 2401785 1565373 936418
37525 936418 1005668 878177 53371 -528789 -58374 765365 972201 873823 1194993 1567858
37515 1567858 1232479 554926 450684 769339 655851 223592 453009 1475821 2245533
37506 2245533 2036318 1222655 476489 91855 103996 244858 -83318 -954214 -1368120 -562352
37496 -562352 564153 598992 -237872 -644402 -607347 -1330601 -2786760 -3410398 -2640739 -1705935
37486 -1705935 -1187709 64974 2485516 4283550 3924638 2432630 1540032 1052359 -51571
37477 -51571 -1203353 -1107085 -137041 301494 206724 630637 1337782 1054350 -119316 -816121
37467 -816121 -985489 -2023345 -3913601 -4617099 -3222356 -1584887 -1574915 -2463590 -2460608 -1370335
37457 -1370335 -197324 685374 1411781 1645137 1283598 1326581 2446006 3374295 2402468
37448 2402468 12027 -1694961 -1836515 -1188843 -20580 2277534 4997300 5818921 3917663
37439 3917663 1648858 1614983 3281715 4156758 3443067 2631072 2773540 3070369 2513076
37430 2513076 1450149 848358 1001839 1607499 2337430 2728059 2173877 709868 -649395
37421 -649395 -935692 -256452 615351 1219708 1508138 1496995 1470729 2093680 3568294 4971600
37411 4971600 5168960 4184050 3009717 2379424 2474134 3376564 4673100 4888640 2802119
37402 2802119 -462357 -2077650 -781535 1723186 3214381 3458212 3393319 3180062 2477361
37393 2477361 1711970 1461957 1122484 -208433 -1817936 -2003818 -586187 841140 1369079
37384 1369079 1796205 2665365 2992130 2025817 882471 952019 1584217 1018187 -763565
37375 -763565 -1807758 -1033069 162840 -134682 -1761119 -2788411 -1998097 -147478 1183152
37366 1183152 1273523 578453 -79792 -157956 539683 1860031 3151221 3442770 2234292
37357 2234292 236031 -953846 -309931 1376981 2076262 747618 -1199062 -1343287 752299
37348 752299 2855036 2910330 1666640 1320201 2184553 2449131 1330594 525271 1559287
37339 1559287 3258404 3392238 1877885 622696 588584 735383 6556 -1113722 -1529814
37330 -1529814 -982104 3976 946118 1702961 2322806 2851751 3103981 2753494 1961140
37321 1961140 1528746 1890427 2432189 2548106 2751307 3632993 4309736 3458230 1630007
37312 1630007 738828 1122896 1036336 -388976 -1617482 -1196791 -41971 264063 140432
37303 140432 1188758 3426793 5110178 5163224 4364179 3975614 4216784 4305057 3394355
37294 3394355 1434534 -510949 -1055761 -39846 1073479 829440 -611249 -1973186
37286 -1973186 -2399184 -1839085 -498068 1225107 2561929 2910947 2390450 1382931 -79510
37277 -79510 -1989969 -3946954 -5579130 -6758617 -6871188 -4842717 -882100 2628181 3284845
37268 3284845 1328859 -884581 -1644477 -1113938 -383415 -484007 -1831801 -3405423 -3042118
37259 -3042118 -25527 3128220 3237866 598104 -1328276 -450371 1631382 2268001 901808
37250 901808 -1159921 -2497453 -2189408 -56814 2631150 3730436 2502660 560410
37242 560410 -167047 487395 1566460 2589326 3418710 3357100 1721584 -846815 -2588510
37233 -2588510 -2248710 -173514 2027594 2773928 1895922 840849 994752 1897155 1970783
37224 1970783 885586 -143437 -592544 -1484749 -3248858 -4370912 -3529628 -1841571 -1374552
37215 -1374552 -2216931 -2660301 -1856045 -691144 -109961 10509 126257 305119 553706
37206 553706 1046841 1727942 2212405 2257590 1989270 1682710 1559780 1584334 1274053 196995
37196 196995 -1080128 -1261687 -40571 1230976 1251369 326848 -593530 -1492134 -2712926
37187 -2712926 -3643853 -3473080 -2774808 -2779401 -3326574 -3150209 -2134399 -1609950 -2174695 -2825738
37177 -2825738 -2729683 -2360871 -2211737 -1747600 -539712 696419 1189400 1327355 1766711
37168 1766711 2108800 1631038 834474 1016809 2384975 3646217 3664799 2736537 1905489
37159 1905489 1594966 1373428 814186 111773 -237425 -60509 467999 1287967 2464071
37150 2464071 3590336 3730287 2463924 658711 -448020 -770684 -1252225 -2193840 -2498112
37141 -2498112 -977757 2045327 4883057 6048044 5431356 4059505 2937561 2243509
37133 2243509 1636104 1043794 657321 227013 -791108 -2048008 -2196469 -758932 716684
37124 716684 506683 -865496 -1427653 -643666 109019 3655 -23028 863707 1816359 1608555
37114 1608555 476070 -427242 -716373 -902366 -1312402 -1827013 -2389255 -2897754 -2723801
37105 -2723801 -1142535 1617188 4259055 5556382 5399723 4609565 3796277 2616982 505142
37096 505142 -1883479 -2769744 -1446096 370538 529571 -705989 -1291682 -625956 -221073
37087 -221073 -854272 -1182131 -243045 588807 -190836 -1508732 -1216638 577801 1769815
37078 1769815 1484312 1025789 1484976 2171386 1941824 770147 -593234 -1592862 -2034696
37069 -2034696 -1991424 -1844347 -1861275 -1700795 -975547 -153125 1268 -209658 318680 1755549
37059 1755549 2944598 2993341 2214002 1191879 41957 -918136 -867457 392385 1876588
37050 1876588 2724721 3255244 3927217 4140056 3216787 1967210 1885096 2932823 3473937
37041 3473937 2690967 1909413 2840692 5247639 7182839 7261611 5958878 4627375 3870720
37032 3870720 3274905 2441088 1707124 1658744 2288908 3055828 3660118 4250514 4703572 4239372
37022 4239372 2330913 -167591 -1478551 -750081 1006562 2231274 2694052 3378829 4600626
37013 4600626 5206575 4182570 2323046 1366240 1776199 2413495 2386619 2087157 2032113
37004 2032113 1812478 983902 138327 73030 475281 540050 496477 1236697 2509349 2877233
36994 2877233 1863927 903856 1367571 2554901 2722106 1671385 1173341 2658151 5309220
36985 5309220 6930004 6325191 4321088 2518457 1576905 1026671 374927 -290534 -852863
36976 -852863 -1601901 -2668734 -3522593 -3611415 -3148296 -2625676 -1887201 -528076 964691
36967 964691 1528669 1138382 1022908 1781025 2303551 1485539 251221 543663 2437014
36958 2437014 3639348 2414656 -46558 -1167940 -322935 669080 441361 81793 1340778
36949 1340778 3758251 4982769 3791123 1462650 -111549 -488565 -326909 -123350 -146424
36940 -146424 -707721 -1462985 -1175459 638310 2382433 2058138 -14575 -1577580 -1508440
36931 -1508440 -1001039 -1320442 -1851880 -1269991 365618 1780480 2290751 2456639 2937903
36922 2937903 3374388 2762720 866711 -1049905 -1354866 -17417 1193329 942887 22951
36913 22951 -80369 375938 -215398 -2207969 -4000525 -4120588 -2668097 -451634 1860300
36904 1860300 3275055 2722937 692704 -588892 373381 2626585 4380353 5278813 5983721
36895 5983721 6463298 6099773 5011066 4004095 3431457 3065454 2841724 2797306 2488990
36886 2488990 1395763 -116675 -902141 -131012 2004450 4378373 5507649 4680084 2932190
36877 2932190 2227449 3208748 4543214 4917668 4571540 4152708 3378511 2018210 1025037
36868 1025037 1206710 1719074 1455782 1033046 1601959 2517639 2331190 1549789 1967014
36859 1967014 3342589 3347775 1306024 -492776 -204231 1021228 1222058 504647 135381
36850 135381 189087 -134548 -787624 -1157872 -1500461 -2531387 -3868769 -4251561 -3285664
36841 -3285664 -1891839 -993248 -661692 -607000 -678919 -706529 -486992 -176055 -250802 -840777
36831 -840777 -1346533 -965985 374545 1674600 1633502 -9226 -2020573 -2859667 -2206221
36822 -2206221 -955960 92586 930079 1755170 2390873 2485138 1864959 666197 -455777
36813 -455777 -439788 1129822 3166884 4098759 3722417 3148566 2898565 2209865 567559
36804 567559 -1177989 -1858796 -1416658 -777022 -872287 -2024654 -3591766 -4117987 -2773640
36795 -2773640 -765723 -156313 -1064559 -1478382 -353290 703298 -175236 -2426682 -3994314
36786 -3994314 -3861899 -2455972 -551665 919306 898989 -535509 -1643514 -1066835 289247
36777 289247 688290 35496 -570400 -920986 -1511447 -1850829 -1023029 188099 -213876
36768 -213876 -2461661 -4241057 -3474346 -647699 2070005 2988986 1969460 409995 312351
36759 312351 2286406 4451246 4471025 2589014 1213956 1519423 2206812 1968537 1283688
36750 1283688 941729 506520 -516461 -1307094 -918732 51531 317683 -133151 -135977 889910
36740 889910 2255432 2960602 2655755 1753745 1030705 958312 1215425 1181658 976710 1407711
36730 1407711 2741626 4252166 5187910 5381460 4685920 2843334 400384 -1243101 -1374785
36721 -1374785 -754290 -287924 176929 1072269 2071682 2655952 2877309 2751437 1811674
36712 1811674 241366 -489743 623459 2435874 3050902 2391314 1987244 2515074 2992945
36703 2992945 2455397 1187981 90531 -240483 337088 1438684 2153808 1895765 1281904
36694 1281904 1414218 2295116 2761293 2057990 727212 -188333 -189905 503417 1263576 1512465
36684 1512465 1329707 1454802 2218625 2844485 2496219 1597053 1183484 1304348 1205349 916874
36674 916874 1303284 2339166 2654233 1397523 -393130 -985400 48440 1573724 2275264
36665 2275264 1919485 1418127 1728747 2586655 2662668 1336884 -270944 -779269 -431324
36656 -431324 -404019 -759515 -551795 246997 556170 9780 -644742 -1191765 -2256382 -3511657
36646 -3511657 -3417605 -1598208 206635 596438 330234 541961 772096 253592 -353621
36637 -353621 -271520 -312216 -1283265 -1873361 -508359 1500120 1367538 -833117 -2044003
36628 -2044003 -799536 791658 653909 -131302 502783 2135398 2625124 1361702 -218340
36619 -218340 -988846 -1291393 -1689331 -1999234 -1991353 -2043596 -2468699 -2728750 -1941909 -49940
36609 -49940 1942990 2985462 3004827 2789859 3078864 4073484 5640235 7328106 8106889
36600 8106889 6970123 4347272 2171684 1778177 2380762 2514294 2213759 2445828 3002480
36591 3002480 2757561 1897131 1937991 3124482 3681286 2454830 599029 -413805 -852430
36582 -852430 -1451730 -1584718 -533923 470365 -403292 -2613035 -3599795 -2139087 394568
36573 394568 2310768 3469066 4317034 4549679 3699157 2181164 856992 20581 -567011
36564 -567011 -1036831 -1353700 -1639815 -2087413 -2600739 -2781051 -2335201 -1513946 -1044215 -1277173
36554 -1277173 -1392261 -167434 2068617 3149352 1654530 -944146 -2012628 -1188849
36546 -1188849 -531624 -1293652 -2260142 -1812574 -167872 1264777 1628059 890558 -597510
36537 -597510 -1915963 -1880305 -587799 108871 -1186022 -3323462 -3946924 -2480729 -456205
36528 -456205 930304 2048263 3268214 3567281 1756776 -1461987 -3701786 -3296709 -1032707
36519 -1032707 728917 423022 -1455287 -3292313 -4030673 -3617839 -2333702 -546558 900438
36510 900438 1050304 32233 -836089 -721105 -404139 -992524 -2013541 -1799553 281048
36501 281048 2826337 3853387 2744976 611481 -849180 -678904 775837 2280017
36493 2280017 2709199 1835572 365118 -646875 -582876 229023 872714 962152 1100359
36484 1100359 1737771 2077509 1188514 -30769 481594 2974083 5102677 4941996 3417906
36475 3417906 2648636 3075919 3591588 3501337 2831437 1494308 -184178 -744518 744842
36466 744842 2642495 2283193 -414498 -2732249 -2781414 -1571018 -969954 -1289417 -1724300
36457 -1724300 -1898994 -2023209 -2283183 -2690970 -2974965 -2491249 -1035195 332127 340207
36448 340207 -692835 -1354500 -1258435 -1137507 -997968 -151777 842683 598964 -298340 481328
36438 481328 3041743 4290618 2555824 459767 887683 2526535 2413379 1050710 1415156
36429 1415156 3824868 5461062 4947590 4038028 4157229 4207698 2902867 984696 -99566
36420 -99566 -70873 547813 1237527 1281011 196944 -1117192 -1184626 -282880 -224701 -1325115
36410 -1325115 -1649985 -197870 1289691 1124654 385164 961693 2342007 2511521 1257304
36401 1257304 464178 1328531 3000577 4050261 3951272 3034580 2057670 1872852 2612756
36392 2612756 3221864 2607798 1150312 248163 500929 1221483 1701221 2036014 2525861
36383 2525861 3010725 3121058 2767342 2189663 1735635 1556703 1371581 778177 -31825
36374 -31825 -352298 -74367 -75920 -936966 -1937208 -2136373 -1818914 -1796251 -1773775 -791493
36364 -791493 824380 1419989 272387 -1357584 -2006373 -1789329 -1652280 -1711908 -1333239
36355 -1333239 -408732 405957 647469 509604 321986 151041 66121 367335 1296897 2707284
36345 2707284 4172330 5333854 6038900 6178715 5511287 3823271 1450954 -443345 -558758
36336 -558758 1212655 3320816 3912706 2754739 1391238 1174105 1613181 1232650 -241825
36327 -241825 -1418290 -1116469 111861 865672 702943 364527 546276 1196728 1894033
36318 1894033 2247736 1984086 1212157 506403 180484 -258428 -1214798 -1924786 -1344160
36309 -1344160 65822 768586 473259 544224 1645766 2543811 2156781 1359460 1434940
36300 1434940 1886180 1397544 212537 -212570 373357 656456 -88049 -998530 -1169086
36291 -1169086 -942216 -1091642 -1624752 -1988268 -1863037 -1295892 -479816 266608 631854
36282 631854 638288 624333 876593 1440375 2082243 2227545 1391801 64626 -468154 161503
36272 161503 564312 -589972 -2570131 -3594674 -3277010 -2599077 -1871617 -519950 1127463
36263 1127463 1742127 1069489 346118 139727 -412358 -1478553 -1587159 -10778 1666515
36254 1666515 1924614 1721062 2653398 3940135 3474742 1260666 -450242 -339920 656949
36245 656949 1324470 1536467 1266010 46765 -1794359 -2819431 -2297414 -1207661 -602060
36236 -602060 -80687 1094644 2363387 2638498 2117638 1980235 2507838 2778098 2277119
36227 2277119 1613393 1306367 977540 363611 155486 869731 1615690 1289267 650387
36218 650387 1578460 3955927 5022420 2963841 -201906 -1017242 936594 2961051 3363778
36209 3363778 3324850 4094844 4623232 3449276 1327482 160451 313404 746148 1075742
36200 1075742 1618330 1762818 299091 -2464613 -4603124 -4967401 -4267820 -3447500 -2457613
36191 -2457613 -1218134 -405106 -428976 -656719 -422799 62448 430779 796571 1022523
36182 1022523 476251 -578099 -514140 1429491 3377524 2863510 137615 -2217557 -2784812
36173 -2784812 -2688649 -3238236 -3957027 -3877234 -3474631 -3923072 -4980057 -4994148 -3146821 -691349
36163 -691349 523377 197845 -343079 14233 929978 1351197 911957 131424 -412075
36154 -412075 -479626 38437 927796 1224912 -91115 -2621996 -4581279 -4828409 -4135241
36145 -4135241 -3800331 -3801425 -3275083 -2200960 -1382869 -1015784 -503766 289508 767156 748668
36135 748668 797941 1094153 1043794 517489 473621 1592667 3023775 3346271 2369037 1250248
36125 1250248 1090628 1979852 3184455 3750111 3136540 1763439 787667 931031 1669647
36116 1669647 1922037 1352725 627141 482936 850768 911120 10250 -1383976 -1938108
36107 -1938108 -1176113 -570650 -1822722 -4108132 -4581228 -2223315 396048 427170 -1538827
36098 -1538827 -2768640 -2425011 -2158077 -2996886 -3912263 -3864987 -3340166 -3034867 -2530282
36089 -2530282 -1231233 449945 1679709 2133161 1772315 613150 -790573 -1634800 -2081780
36080 -2081780 -2996440 -3986176 -3266425 -437034 2177619 2393177 1091880 658640 1569075
36071 1569075 2372667 2244674 1527980 246074 -1778639 -3444560 -3108434 -1053296 590875
36062 590875 655501 -82237 -914778 -2162656 -3552168 -3719934 -2370955 -1137524 -1119238
36053 -1119238 -1260243 -525154 1136 -1012718 -2524484 -2474600 -904810 437733 1145609
36044 1145609 2553858 5001958 6759147 6318282 4227044 1907984 -121607 -2015302
36036 -2015302 -3451993 -3636930 -2200001 294681 2559056 3353257 2505155 1083020 85569
36027 85569 -717219 -1914667 -2919173 -2571122 -1143262 -261118 -574813 -997302 -764317
36018 -764317 -663806 -1265546 -1431904 -67732 1721412 1943051 586364 -552637 -597342
36009 -597342 -309382 -43078 1036482 3002806 4197279 3475629 2194035 2418552 3849105
36000 3849105 4172501 2359124 76215 -582015 396330 1346541 1040998 -306933 -1625868
35991 -1625868 -1887321 -764905 942190 1711477 702039 -1303007 -2780997 -3105348 -2766036
35982 -2766036 -2186495 -1158595 408767 1968635 2971894 3454514 3552827 2966287 1517782
35973 1517782 -99100 -857434 -638051 -346723 -720267 -1518238 -2091408 -2355565 -2855743
35964 -2855743 -3957749 -5206665 -5589751 -4486798 -2366815 -432335 476055 463999 34937
35955 34937 -674306 -1744971 -2778844 -2911872 -1703475 291637 2035751 2912824 2968098
35946 2968098 2452310 1487228 303124 -444985 -17368 1553114 3168321 3596577 2733337
35937 2733337 1672328 1454088 1976840 2250272 1555309 279556 -291854 881508 3400326
35928 3400326 5490415 5651068 4155445 2475759 1440044 746179 214699 336615 1113700
35919 1113700 1476807 751890 -112009 178619 1336382 1957598 1523890 781192 321296
35910 321296 -26915 -370780 -447728 -352673 -594082 -1165777 -1461653 -1407103 -1779364 -2958557
35900 -2958557 -4116889 -4186688 -3132051 -1859588 -1267407 -1600029 -2301136 -2398314 -1544781
35891 -1544781 -652656 -792089 -1553211 -1525073 -471930 260975 -90591 -567089 -313784
35882 -313784 -130194 -860239 -1378612 5886 2651028 3964009 2766394 655432 -366213
35873 -366213 -156319 330442 764906 1317608 1629025 1143137 217850 -137528 323407 778085
35863 778085 639981 390123 639868 995272 666188 -29377 233618 1852576 3300143
35854 3300143 2850534 879935 -512894 -152094 926304 1170217 601951 441644 1150564
35845 1150564 1838195 1669906 1043871 908901 1364888 1600659 1220423 980934 1749145
35836 1749145 3123622 3854228 3566978 3119252 2938272 2136570 199212 -1398759 -756309
35827 -756309 1634519 3238618 2760146 1562004 1404080 2211171 2793053 2515614 1395654
35818 1395654 -335226 -1809814 -1769340 -364426 316274 -1108732 -3033278 -2902438 -930859
35809 -930859 183623 -800337 -2048789 -1575453 -46544 486839 -459853 -1451596 -1265057
35800 -1265057 -209600 683241 960820 985385 1299261 1993799 2543075 2195272 747163
35791 747163 -945185 -1501576 -450728 973909 1053477 -259017 -1159249 -465987 630390
35782 630390 376689 -754838 -817888 291105 367414 -1720997 -4189605 -4902537 -3961055
35773 -3961055 -2413881 -253877 2361495 3480823 1523252 -1730428 -2869532 -1235424
35765 -1235424 869691 2122063 3510591 5324015 5716683 3661965 1105250 412928
35757 412928 1197393 1421198 592739 111673 922366 2277537 2803817 1977391 631873
35748 631873 336996 1786202 3550043 3293075 703861 -1777702 -1896375 -302997 632015
35739 632015 -43096 -1084207 -1013375 280422 1895117 3039647 3598650 3936747 4261332
35730 4261332 4255801 3624325 2792087 2355489 1930615 586310 -1403084 -2450983 -1823285
35721 -1823285 -739991 -556852 -942827 -865304 -460360 -700695 -1753088 -2811160 -3286037
35712 -3286037 -3256350 -2936853 -2410808 -1739820 -959709 -322960 -648546 -2527614 -4872718
35703 -4872718 -5542625 -4187782 -3138520 -4258231 -6139354 -6054459 -3817394 -1837040 -1725450
35694 -1725450 -2669607 -3171346 -2795314 -1915723 -1002643 -523374 -668847 -1003119 -1044876 -1027886
35684 -1027886 -1337225 -1560143 -1051307 -87918 554190 779284 847540 404590 -820740
35675 -820740 -1830740 -1477137 -489452 -644123 -1964864 -2589179 -1653147 -483373 -380076
35666 -380076 -863278 -884553 -460012 -334808 -979422 -2310283 -3460434 -2883088 -114022
35657 -114022 2632681 2538310 71580 -1411941 -535657 201619 -1336710 -3395204 -3176749
35648 -3176749 -1158563 83089 -15246 120358 957423 1294366 824874 725466 1379971
35639 1379971 1712996 1294942 1156982 1843143 2405138 2167462 1937348 2434827 2798445
35630 2798445 1846899 -18619 -1283993 -1182917 -217723 762856 1234854 1035657 384295
35621 384295 -249175 -605368 -670121 -90134 1738532 4444640 6210772 5480646 2930834
35612 2930834 844966 464404 768147 166361 -1335133 -2315378 -1927419 -907003 -443654
35603 -443654 -654307 -652107 147860 1339813 2124819 2111301 1413317 413533 -339472 -415240
35593 -415240 -46889 -108787 -1161505 -2682774 -3566157 -3237032 -2020375 -636114 325775
35584 325775 614484 380347 -32445 -517283 -1171105 -1693182 -1404409 -349734 233988
35575 233988 -609621 -2040083 -2420407 -1616667 -1062792 -1451032 -1748824 -1070240 -227687
35566 -227687 -409648 -1267979 -1557862 -1084038 -698772 -684021 -519241 -241049 -625752 -1695777
35556 -1695777 -2358247 -2118617 -1944786 -2587270 -3140282 -2419786 -908913 44983 380854
35547 380854 1099764 2131284 2116515 560011 -1304877 -2243419 -2253137 -1605445 -166791
35538 -166791 1541805 2109192 1184065 342381 746061 1277072 579408 -389262 19410
35529 19410 989052 326296 -1692339 -2371012 -758500 965493 1047273 511641 698921
35520 698921 833336 -174525 -1410305 -1459842 -791157 -621459 -623417 95803 685567 -435589
35510 -435589 -2725525 -3920678 -3194934 -1919430 -1266054 -998736 -818169 -986493 -1178222
35501 -1178222 -430991 1223522 2619723 3384428 4304608 5158963 4101659 471709 -3328457
35492 -3328457 -4419311 -3005535 -1779809 -2320208 -3647672 -4263035 -4156273 -4278575 -4866496
35483 -4866496 -5031858 -3967837 -2177362 -1099440 -1350359 -1818334 -1131038 383546 1253108
35474 1253108 1207021 1527026 2729635 3474677 2693598 1403166 1045836 1131628 251218
35465 251218 -1242977 -1553172 -375759 407307 -498803 -1956581 -2221442 -1366768 -741278
35456 -741278 -825079 -900141 -544502 -294787 -703833 -1545781 -2199816 -2313964 -1910327 -1219052
35446 -1219052 -531604 83500 892359 1896442 2200535 732072 -2119983 -4332987 -4363980
35437 -4363980 -2944636 -2019655 -2265241 -2607568 -2084445 -1076157 -355000 152576 1003661
35428 1003661 2158471 2849256 2328149 547266 -1569023 -2546443 -1728972 -283621 44781
35419 44781 -716595 -882914 135923 867540 416773 192383 1425283 2847109 3302797
35410 3302797 5088566 11052646 18700642 21281444 16058302 8104858 3785388 3342219
35402 3342219 2815246 1040505 769854 3343624 6082669 6131090 4323369 3562668 4817600
35393 4817600 6392227 6553481 5450343 4338608 3833315 3441516 2558104 1408004 778480
35384 778480 1126024 2360399 4232697 6207749 7089858 5890183 3421378 1939193 2489398
35375 2489398 3507531 2882956 603888 -1596161 -2473377 -2043021 -741950 879340 1926256
35366 1926256 1832331 1185475 967061 1216758 1374059 1508570 1996479 2289722 1433183 -196394
35356 -196394 -1028703 -343100 1048001 2285934 3304750 3913417 3473677 2134077 1191763
35347 1191763 1436518 2046765 1857745 913266 33908 -420696 -586311 -484053 -151889
35338 -151889 17733 -243712 -519655 -168773 781970 1511878 1080129 -737337 -2933536
35329 -2933536 -3761749 -2396363 -8502 1605159 2300856 3329912 4792150 4961682 2879348
35320 2879348 194713 -794598 -37253 557968 -295344 -2107320 -3652423 -4135321 -3528217
35311 -3528217 -2532634 -1985809 -1777223 -885320 926600 2314322 2241925 1773549 2474106
35302 2474106 3600679 2835408 -43160 -2159165 -1121633 1779107 3225413 1965831
35294 1965831 -66189 -537817 601258 1645723 1555859 1015325 1144631 1933851 2484818
35285 2484818 2463880 2558452 3361298 4400395 4621619 3532241 1706197 462135 977455
35276 977455 3096859 4986029 4796577 2866613 1309433 1121573 955785 -529727 -2457397
35267 -2457397 -3111453 -2459120 -1755021 -1381194 -763271 19125 285478 228531 630578 1177761
35257 1177761 857912 152540 839638 3045476 4428811 3349875 1252731 579925 1526797
35248 1526797 2290795 1717953 283411 -1102936 -1967851 -2053998 -1246539 80405 1104775
35239 1104775 1053440 -287864 -2172818 -3119034 -2322737 -864982 -489707 -1100391 -856089
35230 -856089 878416 2382210 2269541 1595459 1837167 2339707 1725636 665657 891624
35221 891624 2043303 1976037 233203 -1121424 -651816 487916 553866 -481654 -1580865
35212 -1580865 -2277623 -2670994 -2761422 -2633913 -2515687 -2088885 -691484 1237778 2041151
35203 2041151 997552 -411382 -365606 1007852 2238867 2634470 2581220 2224385 1171811
35194 1171811 -466718 -1733815 -1780310 -701856 646353 1462900 1809462 2661692 4618442
35185 4618442 6482700 6099240 3105042 -168650 -1356099 -702172 -80567 -322614 -848674
35176 -848674 -1214040 -1441916 -1222734 -379536 78607 -1007503 -2914865 -3711494 -3022472
35167 -3022472 -2302971 -2093547 -1111343 1097190 2684504 2163507 916622 1259759 3139650
35158 3139650 4606569 4745666 4181808 3169760 1288440 -908013 -1858447 -1100474 68779
35149 68779 502966 431525 325271 -1731 -402253 101546 1679971 2608559 1198569 -1743096
35139 -1743096 -3696433 -3451612 -2172629 -1425447 -1248353 -604741 931010 2499295 2833920
35130 2833920 1590088 -257992 -1442820 -1740694 -1859660 -1996557 -1388471 147953 1171056
35121 1171056 328021 -1352698 -1405710 703581 2656939 2390532 826523 346561 1406674
35112 1406674 2198539 1508789 374822 315577 1032696 974797 -190214 -830318 566258
35103 566258 3290885 5064926 4529801 2466635 627561 66787 765122 2085973 3048653
35094 3048653 2765823 1392307 331209 780464 2307564 3521652 3786457 3410117 2567314
35085 2567314 1293325 384754 800597 1944972 2079385 940311 359178 1453565 2789318
35076 2789318 2557178 1162744 156389 -170991 -398060 -287566 477203 710801 -837853
35067 -837853 -2966076 -3349656 -2161875 -1733263 -2473370 -2048346 554364 2989716 3086088
35058 3086088 1989708 1907428 2711482 2902113 2383419 2087114 1999476 1645865 1542265 2141160
35048 2141160 2304243 971095 -537085 -246367 1097169 957418 -944088 -2115443 -1024759
35039 -1024759 1023784 2154850 1952256 815024 -682565 -1358612 -349773 1130852
35031 1130852 1029413 -223873 -43996 2074641 3406644 2242666 546261 645336 1796805
35022 1796805 2228341 2364984 3379369 4253812 3199949 939072 -224582 61456 189766
$$ [...]
##END NTUPLES=NMR SPECTRUM
##END=
