##TITLE=31Pdec_DPA3005-05
 CDCl3, 24 sc
 31.5.2019
##JCAMPDX= 6.0         $$ Bruker NMR JCAMP-DX V2.0
##DATA TYPE= NMR SPECTRUM
##DATA CLASS= NTUPLES
##ORIGIN= UXNMR, Bruker Analytische Messtechnik GmbH
##OWNER= root
$$ XWIN-NMR		Version 3.5
$$ Fri May 31 12:51:26 2019 Russian Standard Time (UT+4h)  she@DPX200
##.OBSERVE FREQUENCY= 81.013821
##.OBSERVE NUCLEUS= ^31P
##.ACQUISITION MODE= SIMULTANEOUS
##.ACQUISITION SCHEME= undefined
##.AVERAGES= 24
##.DIGITISER RES= 17
##SPECTROMETER/DATA SYSTEM= spect
##.PULSE SEQUENCE= zgpg30
##.SOLVENT NAME= CDCl3
##.SHIFT REFERENCE= (INTERNAL, CDCl3, 0, 182.463)
##AUDIT TRAIL= $$ (NUMBER, WHEN, WHO, WHERE, WHAT)
$$ ##TITLE= Audit trail, XWIN-NMR		Version 3.5
$$ ##JCAMPDX= 5.01
$$ ##ORIGIN= Bruker BioSpin GmbH
$$ ##OWNER= she
$$ F:/spectra/data/she/nmr/P31/1/pdata/1/auditp.txt
$$ ##AUDIT TRAIL=  $$ (NUMBER, WHEN, WHO, WHERE, WHAT)
(   1,<2019-05-31 12:50:10.79 +0400>,<she>,<DPX200>,
      <created by zg, POWCHK disabled, PULCHK disabled
       configuration hash MD5:
       00 E9 B6 7A A2 85 ED C7 34 08 36 98 17 FE 4E 26
       data hash MD5: 32K
       BE B9 CA 43 44 3F 43 7B F2 1C 76 D0 2D 34 B3 D8>)
(   2,<2019-05-31 12:50:13.25 +0400>,<she>,<DPX200>,
      <Start of raw data processing
       efp BC_mod = 2 LB = 1 FT_mod = 6 PKNL = 1 PHC0 = -2190.729 PHC1 = 120.3991 SI = 64K 
       data hash MD5: 64K
       48 BF 89 32 09 B1 86 E5 6F 27 C6 9B 18 C7 ED 63>)
(   3,<2019-05-31 12:50:41.35 +0400>,<she>,<DPX200>,
      <pk PHC0 = -3.540444 PHC1 = -32 
       data hash MD5: 64K
       3F 64 EE AF 0F AB 20 A7 00 9D CB 7A 35 74 8D EA>)
(   4,<2019-05-31 12:50:44.79 +0400>,<she>,<DPX200>,
      <abs ABSG = 5 
       data hash MD5: 64K
       8F 9B AA 61 56 8D 2D D1 4B 52 59 C1 08 F4 EE 03>)
$$ ##END=
$$ 
$$ hash MD5
$$ 4C 2B F2 4A 82 3B 40 99 E7 82 6C 15 D2 74 7A BD
##$RELAX= 
##$RELAX= 
##$RELAX= 
##$RELAX= 
##$RELAX= 
##$RELAX= 
##$RELAX= 
##$RELAX= 
$$ Bruker specific parameters
$$ --------------------------
##$DU= <F:/spectra>
##$EXPNO= 1
##$NAME= <P31>
##$PROCNO= 1
##$TYPE= <nmr>
##$USER= <she>
##$AMP= (0..31)
100 100 100 100 100 100 100 100 100 100 100 100 100 100 100 100 100 100 
100 100 100 100 100 100 100 100 100 100 100 100 100 100 
##$AQSEQ= 0
##$AQ_mod= 1
##$AUNM= <au_zg>
##$AUTOPOS= <>
##$BF1= 81.014009
##$BF2= 200.13
##$BF3= 200.13
##$BF4= 200.13
##$BF5= 200.13
##$BF6= 200.13
##$BF7= 200.13
##$BF8= 200.13
##$BYTORDA= 1
##$CFDGTYP= 0
##$CFRGTYP= 5
##$CHEMSTR= <none>
##$CNST= (0..31)
1 1 145 1 1 1 1 1 1 1 1 1 1 1 1 1 1 1 1 1 1 1 1 1 1 1 1 1 1 1 1 1 
##$CPDPRG= <waltz16>
##$CPDPRG1= <>
##$CPDPRG2= <waltz16>
##$CPDPRG3= <>
##$CPDPRG4= <mlev>
##$CPDPRG5= <mlev>
##$CPDPRG6= <mlev>
##$CPDPRG7= <mlev>
##$CPDPRG8= <mlev>
##$CPDPRGB= <>
##$CPDPRGT= <>
##$D= (0..31)
0 1 0 0 0 0 0 0 0 0 0 0.03 2e-05 3e-06 0 0 0 0 0 0 0 0 0 0 0 0 0 0 0 0 
0 0 
##$DATE= 1559292610
##$DBL= (0..7)
120 120 120 11 120 120 24 19 
##$DBP= (0..7)
150 150 150 150 150 150 150 150 
##$DBP07= 0
##$DBPNAM0= <>
##$DBPNAM1= <>
##$DBPNAM2= <>
$$ [...]
##$SUBNAM3= <"">
##$SUBNAM4= <"">
##$SUBNAM5= <"">
##$SUBNAM6= <"">
##$SUBNAM7= <"">
##$SUBNAM8= <"">
##$SUBNAM9= <"">
##$SW= 369.568048894756
##$SWIBOX= (0..15)
0 1 3 0 0 0 0 0 0 0 0 0 0 0 0 0 
##$SW_h= 29940.119760479
##$TD= 32768
##$TD0= 1
##$TE= 0
##$TE2= 300
##$TE3= 300
##$TEG= 300
##$TL= (0..7)
0 120 53 12 22 120 120 120 
##$TP= (0..7)
150 150 150 150 150 150 150 150 
##$TP07= 0
##$TPNAME0= <>
##$TPNAME1= <>
##$TPNAME2= <>
##$TPNAME3= <>
##$TPNAME4= <>
##$TPNAME5= <>
##$TPNAME6= <>
##$TPNAME7= <>
##$TPOAL= (0..7)
0.5 0.5 0.5 0.5 0.5 0.5 0.5 0.5 
##$TPOFFS= (0..7)
0 0 0 0 0 0 0 0 
##$TUNHIN= 0
##$TUNHOUT= 0
##$TUNXOUT= 0
##$USERA1= <user>
##$USERA2= <user>
##$USERA3= <user>
##$USERA4= <user>
##$USERA5= <user>
##$V9= 5
##$VALIST= <valist>
##$VCLIST= <CCCCCCCCCCCCCCC>
##$VD= 0
##$VDLIST= <DDDDDDDDDDDDDDD>
##$VPLIST= <PPPPPPPPPPPPPPP>
##$VTLIST= <TTTTTTTTTTTTTTT>
##$WBST= 1024
##$WBSW= 4
##$XGAIN= (0..3)
0 0 0 0 
##$XL= 0
##$YL= 0
##$YMAX_a= 52322
##$YMIN_a= -85041
##$ZGOPTNS= <>
##$ZL1= 120
##$ZL2= 120
##$ZL3= 120
##$ZL4= 120
##$ABSF1= 182.463
##$ABSF2= -187.1042
##$ABSG= 5
##$ABSL= 3
##$ALPHA= 0
##$AQORDER= 0
##$ASSFAC= 0
##$ASSFACI= 0
##$ASSFACX= 0
##$ASSWID= 0
##$AUNMP= <proc_1d>
##$AZFE= 0.1
##$AZFW= 0.5
##$BCFW= 0
##$BC_mod= 2
##$BYTORDP= 0
##$COROFFS= 0
##$CY= -3
##$DATMOD= 1
##$DC= 0
##$DFILT= <>
##$DTYPP= 0
##$F1P= 0
##$F2P= 0
##$FCOR= 1
##$FTSIZE= 65536
##$FT_mod= 6
##$GAMMA= 0
##$GB= 0
##$INTBC= 1
##$INTSCL= 5.30512e-09
##$ISEN= 30
##$LB= 1
##$LEV0= 0
##$LPBIN= 0
##$MAXI= 10000
##$MC2= 0
##$MEAN= 0
##$ME_mod= 0
##$MI= 50
##$NCOEF= 0
##$NC_proc= -3
##$NLEV= 6
##$NOISF1= 182.463
##$NOISF2= 159.3651
##$NSP= 0
##$NTH_PI= 0
##$NZP= 0
##$OFFSET= 182.463
##$PC= 4
##$PHC0= -2194.27
##$PHC1= 88.3991
##$PH_mod= 1
##$PKNL= yes
##$PPARMOD= 0
##$PSCAL= 0
##$PSIGN= 0
##$REVERSE= no
##$SF= 81.0140089999434
##$SI= 65536
##$SIGF1= 159.3651
##$SIGF2= -187.1042
##$SINO= 113.3802
##$SIOLD= 16384
##$SREGLST= <1H.CDCl3>
##$SSB= 0
##$STSI= 65536
##$STSR= 0
##$SW_p= 29940.119760479
##$SYMM= 0
##$S_DEV= 0
##$TDeff= 32768
##$TDoff= 0
##$TI= <>
##$TILT= no
##$TM1= 0
##$TM2= 0
##$TOPLEV= 0
##$USERP1= <user>
##$USERP2= <user>
##$USERP3= <user>
##$USERP4= <user>
##$USERP5= <user>
##$WDW= 1
##$XDIM= 65536
##$YMAX_p= 273727376
##$YMIN_p= -7792552
$$ End of Bruker specific parameters
$$ ---------------------------------
##NTUPLES= NMR SPECTRUM
##VAR_NAME=  FREQUENCY,     SPECTRUM/REAL,   SPECTRUM/IMAG
##SYMBOL=    X,             R,               I
##VAR_TYPE=  INDEPENDENT,   DEPENDENT,       DEPENDENT
##VAR_FORM=  AFFN,          ASDF,            ASDF
##VAR_DIM=   65536,         65536,           65536
##UNITS=     HZ,            ARBITRARY UNITS, ARBITRARY UNITS
##FACTOR=    0.456856943014862, 1,           1
##FIRST=     14782.0589164792, 0,            0
##LAST=      -15158.0608439998, 0,           0
##MIN=       -15158.0608439998, -7792552,    0
##MAX=       14782.0589164792, 273727376,    0
$$ Real data points
##PAGE= N=1
##DATA TABLE= (X++(R..R)), XYDATA
$$ [...]
##PAGE= N=2
##DATA TABLE= (X++(I..I)), XYDATA
41359 297463 298648 284662 308453 328682 305374 271138 266995 297082 366361 469374 540830 530008
41347 530008 514735 599807 710613 669066 491996 401916 483553 561914 528195 537245 695239
41336 695239 781211 556243 203809 145608 465241 816920 932153 936883 1065860 1288306
41326 1288306 1377189 1226384 957264 765814 752805 864237 943778 881608 738640 673714
41316 673714 737841 814685 781741 643079 472336 319489 226762 247437 369392 475638
41306 475638 456085 330649 215681 204108 313274 497554 663040 719945 679579 662152
41296 662152 754709 898963 976927 970121 961965 999476 1026345 968313 841882 755123 803109
41285 803109 958924 1081547 1065525 967718 921726 937716 895372 760459 669544 713189 770012
41274 770012 701404 602668 661634 823969 833805 623178 424303 410855 445721 331027 129618
41263 129618 42084 85229 114174 103796 179446 365520 514261 533623 506586 515193 511362
41252 511362 455584 431400 498951 564520 539755 517093 613061 729474 687978 560469 617469
41241 617469 914788 1173680 1169052 1016177 923531 866218 729531 629132 798391 1194623
41231 1194623 1495832 1527097 1442343 1402117 1314623 1057873 771658 707136 869226 1010457
41221 1010457 961630 808240 730383 795978 938154 1044044 1038683 941345 849606 827282 825311
41210 825311 756971 617644 480315 417756 479421 671215 879740 904008 680176 403385
41200 403385 297403 342182 389708 462809 707432 1076327 1316758 1311695 1200017 1102250 972515
41189 972515 816735 802124 986921 1151777 1086646 873804 703819 584974 449031 383441
41179 383441 495349 648775 608725 398870 270409 344809 519408 702430 896123 1041019
41169 1041019 1023596 887248 825274 907467 996549 979486 897138 801135 677815 577467 626573
41158 626573 825255 1002260 1055882 1075045 1134818 1146102 1029288 892754 903588 1074196
41148 1074196 1273599 1364966 1275656 1048521 878003 952922 1194663 1302080 1131751 868752
41138 868752 733976 712727 699204 715771 813810 918865 967547 1062821 1290905 1501270 1488672
41127 1488672 1312034 1213830 1272490 1338335 1284714 1138054 978569 876394 903500 1055940
41117 1055940 1192043 1189730 1119622 1115375 1141563 1076128 967378 988423 1143990 1236801 1155387
41106 1155387 1009993 938809 938459 936230 901909 847006 807842 832060 893959 868384 707179
41095 707179 572474 635369 814837 915229 954641 1105190 1338294 1421000 1302963 1222647
41085 1222647 1335793 1489536 1485922 1353618 1230318 1164165 1155021 1221103 1311919 1318707 1262746
41074 1262746 1288080 1379520 1316023 1036271 810606 861043 1026776 1033653 908778 866607 927823
41063 927823 938468 886614 918937 1063188 1174632 1164627 1086884 998570 915797 897889 992573
41052 992573 1096844 1054080 903468 854144 980513 1119365 1129098 1088472 1139149 1251141 1272313
41041 1272313 1163643 1068788 1120842 1240235 1203960 942766 687229 704024 929209 1041273
41031 1041273 918031 801658 907815 1095278 1112148 983450 908125 906280 847594 744270
41021 744270 716799 709795 562335 375298 471704 896615 1268906 1288646 1117811 1050332 1046531
41010 1046531 879635 595219 501097 714214 985590 1039610 895239 758319 732760 759841
41000 759841 779662 831501 977417 1191161 1365520 1419318 1373675 1323967 1353413 1465745 1570079
40989 1570079 1536009 1316522 1030912 866413 872664 924219 921193 929219 1044015 1213289 1310651
40978 1310651 1319211 1313995 1313201 1281539 1238157 1214441 1139364 932216 693369 622605 736938
40967 736938 851875 870863 896635 991928 1032637 921662 787602 817608 993425 1133361
40957 1133361 1134171 1058941 1028533 1107096 1254451 1343340 1282289 1147392 1099569 1148381 1134792
40946 1134792 1000396 907362 985234 1117615 1129395 1051243 1019437 1019652 938601 811733 802070
40935 802070 933929 1041410 1018299 958607 987770 1075899 1094889 996150 876907 888063 1071787
40924 1071787 1271624 1263090 1033800 853593 955011 1214373 1307865 1151268 998708 1079457
40914 1079457 1314612 1470625 1450184 1325154 1184683 1075388 1045902 1139250 1330660 1523100
40904 1523100 1614500 1568027 1444615 1366989 1403192 1475535 1438539 1261073 1069032 981339 969605
40893 969605 929731 843724 802561 873108 989818 1008383 872919 707749 692819 840445 976642
40882 976642 992441 1006072 1154072 1316154 1252094 990338 837811 932823 1021149 830833
40872 830833 484618 328672 465888 685116 794767 797505 744328 644054 565797 633809
40862 633809 837071 998976 1018701 999317 1047920 1096969 1047167 960796 963656 1046417 1114472
40851 1114472 1158948 1214154 1205265 1031152 787432 714347 883209 1093517 1135313 1014900
40841 1014900 862474 753892 705483 724765 766552 730442 599867 511602 597777 818289
40831 818289 1021039 1097691 1012131 770501 468596 294612 365963 600304 827237 963419
40821 963419 1000922 931038 812355 818220 1041940 1309208 1359916 1180779 980069 865927
40811 865927 760941 641987 636446 804087 1004345 1076153 1017827 915545 817826 747245 721704
40800 721704 710372 676564 683568 813934 970032 947368 753044 635707 716806 823293 807052
40789 807052 780260 849369 861783 682299 525633 685247 1036754 1152727 896309 590284
40779 590284 548970 705364 790222 675541 438231 226928 151320 209255 282778 281364 270884
40768 270884 356656 488087 534263 516216 578620 744928 899907 1016444 1176643 1332530
40758 1332530 1286202 1007417 767390 822217 1102469 1325336 1299039 1043537 739656 620838
40748 620838 771995 982217 962475 753530 697620 927057 1153316 1127809 1037555 1179884
40738 1179884 1457996 1526044 1314800 1084767 1009925 1019464 1040215 1091005 1103461 943060 691006
40727 691006 639279 882689 1145211 1161234 1031252 1016838 1136749 1183035 1064080 927646
40717 927646 943249 1108489 1296094 1397582 1395650 1354288 1354124 1407979 1448001 1416817 1338268
40706 1338268 1263269 1186078 1070120 932748 840501 816805 804445 744037 667066 677161 823265
40695 823265 1013073 1102581 1078296 1072653 1145821 1145394 909883 556632 389904 512187 715277
40684 715277 821762 934797 1202313 1499765 1573261 1427628 1339444 1473060 1681698 1745435
40674 1745435 1645419 1518223 1457752 1455380 1458420 1409528 1283661 1142372 1098459 1186619 1330526
40663 1330526 1465552 1602821 1724799 1729446 1574194 1391133 1343494 1415896 1450989 1356247
40653 1356247 1177782 1008739 927902 994280 1188170 1373299 1422311 1367110 1331682 1352256
40643 1352256 1382586 1437217 1571264 1727439 1776879 1736126 1772515 1948356 2126365 2185796
40633 2185796 2159681 2089064 1938334 1767090 1782758 2049695 2311553 2300988 2091327 1931046
40623 1931046 1857452 1733870 1591601 1639935 1919300 2191589 2232549 2049405 1776529 1537648
40613 1537648 1442273 1530979 1675127 1697762 1627532 1656069 1820283 1942068 1937088 1946453 2058163
40602 2058163 2127524 2022082 1842442 1727888 1623912 1439952 1283954 1316763 1478648 1579379
40592 1579379 1589756 1638640 1767223 1875041 1881527 1782328 1586008 1344275 1183355 1141229
40582 1141229 1047220 755438 422743 318225 406612 402915 248367 223757 494822 827884
40572 827884 926652 833291 792833 874649 943683 917693 852410 808224 796610 842046 955848
40561 955848 1050460 1005366 836658 700474 699017 762772 765598 700526 683197 787858 926838
40550 926838 937235 790937 661307 725691 938019 1078444 1015491 829298 676940 642943
40540 642943 745050 969734 1238518 1427745 1490294 1495373 1508604 1518321 1521141 1565151 1634222
40529 1634222 1608595 1447119 1299061 1299573 1347159 1248505 1022210 877152 913807 1029880 1126554
40518 1126554 1219562 1299355 1262420 1081870 914247 919452 1055163 1150922 1128425 1058519 1038920
40507 1038920 1091652 1161527 1171057 1103670 1051609 1122422 1273725 1327437 1203036 1050263 1069839
40496 1069839 1271613 1494605 1601239 1562820 1426913 1314515 1379003 1619045 1777309 1598725
40486 1598725 1181542 888580 884493 957743 877247 728186 745001 954622 1168860 1253275
40476 1253275 1228772 1148390 1043488 984861 1039473 1142735 1146010 1028152 949394 1052166 1296170
40465 1296170 1524011 1609512 1520964 1332564 1204196 1254328 1412987 1489279 1415598 1316325
40455 1316325 1292109 1273817 1185816 1127766 1242515 1467580 1574887 1453286 1233342 1118631
40445 1118631 1179852 1329111 1431424 1427394 1382534 1408095 1514875 1594651 1583047 1567126 1660061
40434 1660061 1835748 1972860 2000270 1909878 1704546 1452712 1317427 1378267 1479349 1418966
40424 1418966 1242970 1163646 1225944 1277434 1262028 1288963 1368535 1347789 1206749 1158327 1310556
40413 1310556 1475457 1490983 1487333 1601141 1660241 1466421 1218176 1278935 1600629 1757149
40403 1757149 1560163 1284944 1214284 1290192 1345553 1385544 1459216 1486617 1413407 1361433 1436613
40392 1436613 1533022 1510832 1441798 1487965 1630022 1695896 1595079 1377817 1134881 976324
40382 976324 1019384 1239751 1414663 1375143 1237076 1216171 1304382 1331513 1271807 1253317 1299667
40371 1299667 1308096 1281187 1335234 1455613 1489210 1423912 1423062 1511775 1496519 1316921 1215103
40360 1215103 1377619 1637193 1742489 1725177 1748173 1750442 1543869 1189037 976268 1025089
40350 1025089 1152734 1185472 1186487 1292401 1483080 1615559 1604890 1507523 1464265 1565011
40340 1565011 1728991 1760136 1587558 1386083 1362584 1500783 1645730 1753963 1880690 1983298
40330 1983298 1958381 1858265 1841856 1888647 1793979 1510130 1267314 1253764 1374485 1451176
40320 1451176 1481649 1550072 1626348 1624409 1567732 1551308 1603887 1695694 1806832 1891394 1863234
40309 1863234 1720342 1594654 1578458 1601374 1587441 1614756 1768424 1933525 1917487 1732684
40299 1732684 1587356 1608757 1719878 1791125 1789494 1761975 1760616 1794829 1807290 1720616 1543204
40288 1543204 1363103 1198253 970088 706227 623136 858960 1244666 1518501 1662762 1818378
40278 1818378 1956495 1904962 1686567 1555269 1632007 1735451 1674285 1517382 1449070 1498193
40268 1498193 1545412 1516313 1456499 1453577 1544658 1670961 1714882 1639911 1581251 1704558 1979626
40257 1979626 2203662 2253050 2193710 2133330 2098953 2089898 2115071 2127775 2047765 1904437 1841939
40246 1841939 1921389 2026889 2029973 1940935 1829852 1703467 1547095 1408105 1351538 1383849
40236 1383849 1477963 1619507 1782647 1919929 2021423 2130943 2266794 2374247 2382878 2272248
40226 2272248 2079716 1888772 1789144 1787842 1791148 1736598 1677699 1656080 1600537 1494799 1511779
40215 1511779 1751431 1955531 1798252 1421784 1321145 1647745 1995647 2003542 1810836 1722671
40205 1722671 1756182 1782412 1838934 1992948 2102248 2025544 1915422 2002479 2214825 2303421
40195 2303421 2234460 2161337 2101437 1957083 1806974 1857781 2095990 2262175 2203139 2023248
40185 2023248 1868362 1770325 1720558 1706950 1674111 1613078 1648023 1849699 2042984 2037162 1963021
40174 1963021 2080670 2306149 2289123 1982597 1760832 1871005 2117896 2244930 2300666 2417160
40164 2417160 2505801 2431484 2287670 2245259 2273050 2236980 2156279 2139296 2156669 2091185 1955115
40153 1955115 1869208 1862892 1857440 1818873 1786394 1773385 1765146 1795450 1914925 2090447 2212910
40142 2212910 2192917 2015281 1757548 1584765 1621693 1771207 1781208 1575776 1383346 1416787
40132 1416787 1568711 1595156 1483880 1425190 1483993 1536440 1527681 1564146 1693377 1784230 1723880
40121 1723880 1594431 1543249 1574156 1584151 1556037 1598470 1786001 2035187 2181577 2157825 2053171
40110 2053171 1978162 1907203 1721668 1411387 1142941 1067628 1130680 1165677 1143536 1212823 1473307
40099 1473307 1808334 2010265 2027564 2010142 2100726 2242944 2256172 2087267 1904475 1890688
40089 1890688 2007444 2055316 1934868 1734376 1567196 1463069 1457059 1629512 1948205 2185646
40079 2185646 2139947 1882667 1652928 1543990 1444059 1287042 1202872 1345438 1665738 1941547
40069 1941547 2000070 1864941 1709556 1697285 1843395 2006887 2032421 1910634 1778208 1760486
40059 1760486 1853884 1972247 2053471 2082885 2060660 2010117 1991851 2033545 2052749 1939519 1734696
40048 1734696 1619948 1669024 1719269 1609085 1453627 1506567 1782081 2022608 2068180 2037435
40038 2037435 2058102 2046293 1914755 1799708 1853659 1959825 1918568 1825698 1968236 2360943
40028 2360943 2676621 2683186 2494959 2319322 2193512 2074695 1977391 1898264 1782381 1675529
40018 1675529 1728857 1928040 2003187 1771386 1418876 1269741 1393016 1605770 1756982 1827788
40008 1827788 1827721 1772623 1733575 1769277 1836374 1864057 1860328 1852341 1806843 1721832 1706118 1836250
39996 1836250 2016451 2118558 2180084 2310831 2475365 2538884 2482994 2406324 2336741 2208493
39986 2208493 2025096 1899494 1914606 2045979 2215455 2331207 2308999 2158882 2018475 2001799
39976 2001799 2059559 2083719 2078350 2109740 2169746 2228806 2334930 2489224 2512850 2256310 1889979
39965 1889979 1748761 1894210 2058289 2034083 1894348 1791811 1778296 1882765 2130989 2384661
39955 2384661 2381613 2080440 1787929 1788603 1993779 2121089 2097646 2093530 2217174 2360781 2357190
39944 2357190 2174068 1931698 1787867 1806323 1910364 1987729 2044080 2183192 2412292 2561339
39934 2561339 2464000 2157774 1842065 1687979 1740091 1940675 2169514 2290660 2240388 2086730
39924 2086730 1979790 2036783 2258769 2525813 2684221 2684226 2623550 2611006 2619757 2554522 2435893
39913 2435893 2402144 2516524 2683128 2785210 2806300 2775165 2690760 2561845 2445209 2386717
39903 2386717 2379577 2414197 2500380 2607152 2661623 2656655 2685883 2813868 2970912 3031873 2951020
39892 2951020 2775416 2577464 2420051 2341065 2328546 2348511 2418675 2591814 2832304 2987057
39882 2987057 2949841 2802471 2710201 2702990 2652470 2481517 2312281 2333224 2548372 2753988
39872 2753988 2798281 2773655 2857570 3030165 3100985 3001251 2871722 2825176 2811193 2791657 2842322
39861 2842322 2950215 2924869 2705806 2559532 2716367 2980770 3012731 2868545 2892919 3125800
39851 3125800 3218004 2986946 2683434 2582705 2625945 2622874 2548266 2476230 2434650 2462727 2615805
39840 2615805 2801806 2819602 2659823 2545345 2581778 2624569 2595745 2628541 2742530 2702603
39830 2702603 2429651 2240631 2387599 2627957 2590988 2352922 2279524 2455011 2643012 2713859
39820 2713859 2744696 2749607 2658217 2549462 2594442 2763151 2865549 2875318 2932992 3031150 2990754
39809 2990754 2785197 2614291 2597347 2632579 2619530 2602029 2637682 2729908 2926764 3273377
39799 3273377 3623813 3720418 3523920 3265724 3118114 3020190 2898240 2844741 2967817 3223226
39789 3223226 3488983 3675591 3711319 3573196 3387706 3345127 3459738 3563987 3570940 3561635
39779 3561635 3571398 3499472 3315277 3158746 3127548 3135296 3091900 3067456 3159946 3333079 3487560
39768 3487560 3570444 3538505 3361208 3143546 3086802 3228818 3377865 3399147 3391792 3464499 3523483
39757 3523483 3445533 3301676 3231602 3232321 3248825 3337349 3533681 3677085 3601634 3433260 3456024
39746 3456024 3703380 3906396 3866262 3680498 3553098 3550459 3622245 3739711 3916234 4138066
39736 4138066 4332116 4400589 4302101 4121597 4018732 4065570 4184958 4287715 4383373 4483839
39726 4483839 4504947 4389969 4249480 4232101 4320839 4417723 4561736 4843051 5120460 5092573
39716 5092573 4737365 4442886 4535031 4851959 4998812 4909387 4897147 5164808 5524211 5699712
39706 5699712 5710196 5781421 5993068 6208988 6327620 6410254 6520516 6603276 6620658 6683993
39696 6683993 6912128 7220627 7392151 7347321 7237640 7267651 7513156 7910251 8329668 8653810
39686 8653810 8862570 9044687 9240670 9280487 8873569 7859100 6276762 4239014 1924850
39677 1924850 -273401 -1833718 -2512312 -2570503 -2459141 -2357552 -2152921 -1779198 -1369759
39668 -1369759 -1062359 -822197 -536226 -192441 110046 287005 345114 344621 332018 326564 351402
39657 351402 439246 593633 781695 998309 1293016 1666386 1973970 2037029 1860549 1650910
39647 1650910 1592762 1688606 1836499 1964178 2040424 2051482 2039264 2095967 2255513 2445288
39637 2445288 2597062 2741958 2936436 3153068 3307315 3346712 3266986 3096756 2913313 2807975
39627 2807975 2780559 2733681 2627602 2563253 2635653 2777844 2847213 2816562 2779187 2793277 2816851
39616 2816851 2790635 2711350 2622766 2585316 2643881 2781274 2918912 3000310 3050468 3119669 3204423
39605 3204423 3269445 3319200 3397131 3521734 3655033 3737333 3754125 3772916 3876820 4029333
39595 4029333 4073505 3949649 3834816 3912544 4056239 3958323 3589923 3293309 3329890 3562653
39585 3562653 3726468 3800863 3913227 4038810 4044915 3947004 3885204 3881736 3833100 3737963 3738660
39574 3738660 3901452 4102198 4176432 4090035 3940324 3855491 3886552 3945605 3890602 3725971
39564 3725971 3645313 3794364 4073027 4268348 4296067 4204113 4043270 3878704 3838251 3984400
39554 3984400 4199670 4340733 4425895 4526900 4594748 4587554 4648066 4897456 5141781 5087518
39544 5087518 4820550 4751899 5054596 5461766 5697024 5801364 5906423 5968991 5925082 5894458
39534 5894458 6020668 6244444 6408367 6472098 6481105 6445891 6405336 6499029 6809775 7203682
39524 7203682 7468189 7556272 7586554 7673936 7869016 8181592 8532214 8742195 8704526 8523777
39514 8523777 8367291 8219438 7914659 7396428 6809637 6310514 5885011 5404891 4812813
39505 4812813 4209005 3767240 3586815 3635543 3828094 4115022 4461121 4792479 5053270 5292877
39495 5292877 5600251 5961536 6288890 6586969 6962190 7442678 7919481 8311570 8661197
39486 8661197 9002220 9257619 9353790 9329884 9234607 9005964 8576475 8054056 7684197 7622426
39476 7622426 7799269 8021008 8188180 8405898 8845459 9482891 10057085 10349715 10381557 10181681
39466 10181681 9497384 8022035 5907985 3774113 2144962 1132181 712284 964193
39458 964193 1823081 2876538 3695335 4224445 4618164 4826245 4582249 3701467 2173947
39449 2173947 70176 -2396257 -4768836 -6552424 -7533733 -7778742 -7408041 -6563443 -5509129
39440 -5509129 -4523257 -3687451 -2941566 -2299699 -1848973 -1611187 -1602318 -1952328 -2732366 -3706404
39430 -3706404 -4491124 -4947711 -5211898 -5393714 -5501176 -5617409 -5852715 -6108147 -6180852 -6138121
39420 -6138121 -6278598 -6648469 -6906588 -6791074 -6432659 -6062568 -5694578 -5283843 -4940958
39411 -4940958 -4757734 -4620021 -4410047 -4208590 -4081631 -3866928 -3440202 -3025608 -2924263
39402 -2924263 -3025463 -2910136 -2426395 -1874731 -1587294 -1571356 -1637512 -1672074 -1676940 -1673891 -1665820
39391 -1665820 -1630089 -1519276 -1326059 -1132661 -1016404 -937561 -818292 -690700 -642876 -651573
39381 -651573 -607780 -489518 -368343 -263157 -143444 -64582 -117187 -225378 -192152 -2974
39371 -2974 108931 1092 -143895 -60093 249381 548190 672247 659661 628240 654005 751804
39360 751804 873048 925898 866382 758902 702209 729356 822462 968734 1136502 1246544
39350 1246544 1245781 1184191 1163884 1243816 1429073 1685370 1909210 1971248 1878632 1812868 1894981
39339 1894981 1990442 1890512 1629247 1444960 1440694 1465187 1362682 1172606 1011498 891801
39329 891801 745559 537899 290833 67387 -38356 3435 48233 -100012 -404111 -589762
39319 -589762 -516910 -389108 -450044 -620876 -633335 -419435 -149807 58432 242216 412624
39309 412624 503856 540178 647091 826883 905981 794230 633722 588836 638360 689291 748777
39298 748777 837385 860183 743712 615285 656209 824737 915747 876867 866383 974378 1084449
39287 1084449 1088973 1072353 1163052 1325034 1424326 1420556 1372473 1322818 1304374 1399706 1642295
39276 1642295 1886051 1939861 1842904 1835913 2012227 2176837 2153316 2057429 2094016 2212641 2198080
39265 2198080 2052639 2034775 2278044 2594772 2750517 2746663 2710883 2674985 2621867 2625867 2761707
39254 2761707 2947983 3052147 3095200 3184769 3297268 3318258 3276366 3329863 3500282 3621687
39244 3621687 3613039 3612470 3748779 3946322 4077711 4171338 4320400 4484011 4538844 4482224 4438583
39233 4438583 4473575 4525176 4538848 4573883 4725266 4982312 5206440 5245953 5057955 4713188
39223 4713188 4301134 3877119 3511331 3306166 3290300 3360480 3432581 3590933 3939937 4344187
39213 4344187 4516445 4401330 4280032 4408718 4723051 5013897 5231905 5450068 5638460
39204 5638460 5680068 5590355 5564057 5775302 6207665 6683172 7013163 7147375 7211027 7354953
39194 7354953 7562175 7697869 7767956 7970046 8400714 8875065 9189393 9429488 9810322 10269899
39184 10269899 10431809 9990877 9012613 7871646 7017940 6754080 7053752 7562560 7910357
39175 7910357 8068809 8320128 8875901 9639767 10370986 10980074 11601032 12403205 13369878
39166 13369878 14301381 15076818 15809897 16497910 16487890 14698084 10770918 5870043 1906312
39157 1906312 -86811 -538883 -378241 26303 788007 1857492 2943479 3932251 4970580
39148 4970580 6126237 7277956 8378215 9543589 10809689 12049886 13193200 14130029
39140 14130029 14125450 11740387 6068343 -1778418 -8937605 -12990010 -13780340 -12922760 -11881825
39131 -11881825 -10974764 -9955751 -8788532 -7609755 -6454657 -5368103 -4482889 -3731962
39123 -3731962 -2791561 -1569054 -417605 410079 1074951 1431554 431172 -2911769 -7957033
39114 -7957033 -12584593 -15141501 -15740617 -15473006 -14974934 -14209023 -13168776 -12127702 -11257808
39105 -11257808 -10470846 -9695215 -9014434 -8478643 -8004659 -7533469 -7131445 -6864927 -6682067
39096 -6682067 -6510687 -6446096 -6753163 -7592534 -8727809 -9613718 -9880486 -9660937 -9324791
39087 -9324791 -8996215 -8534583 -7916079 -7350570 -6981587 -6715270 -6424263 -6118236 -5842038
39078 -5842038 -5601892 -5461435 -5509422 -5655610 -5660151 -5448458 -5201458 -5063857 -4979635 -4887391
39068 -4887391 -4827856 -4760501 -4549860 -4272082 -4243316 -4544353 -4789610 -4617350 -4177189 -3858133
39058 -3858133 -3736816 -3605692 -3400725 -3269661 -3273369 -3300078 -3263243 -3178008 -3071988 -2989298
39048 -2989298 -3020188 -3161601 -3231149 -3091739 -2870935 -2778978 -2807764 -2804804 -2750614 -2748568 -2808239
39037 -2808239 -2847851 -2864186 -2911675 -2955049 -2909661 -2783601 -2641984 -2501060 -2380103 -2345627
39027 -2345627 -2370200 -2293827 -2081595 -1941563 -1993607 -2026587 -1840146 -1623618 -1668916 -1871024
39017 -1871024 -1889351 -1699220 -1582902 -1616696 -1574544 -1370694 -1221722 -1284231 -1445679 -1565185
39007 -1565185 -1650382 -1713148 -1691897 -1586921 -1464367 -1303372 -1060229 -872259 -929616 -1137611
38997 -1137611 -1187722 -986814 -740578 -603500 -547658 -583724 -762967 -917943 -777165 -432780
38987 -432780 -323722 -619986 -977853 -1058219 -929750 -775168 -565846 -278670 -110388 -183585
38977 -183585 -294497 -228006 -94052 -89739 -156897 -154752 -160207 -298178 -451416 -438921 -337565
38966 -337565 -340750 -429616 -463887 -472655 -565701 -661853 -598389 -432348 -352998 -360680 -305228 -181778
38954 -181778 -106656 -43987 149150 412113 501500 353964 173822 115401 117255 113192 178097
38943 178097 359977 544374 601721 557088 530169 585290 683141 712689 572029 307254 150106
38932 150106 295621 650451 933489 1025242 1069353 1204863 1356000 1359615 1178165 894093
38922 894093 578959 270828 37015 -48571 -9889 16880 -74440 -223718 -266729 -135538
38912 -135538 77061 276442 473644 648264 644768 395603 155063 256225 659194 1014415
38902 1014415 1182772 1368307 1660199 1813248 1674659 1482466 1450843 1342102 807394 -34393
38892 -34393 -713369 -979271 -933809 -723725 -456940 -329666 -455882 -603817 -462769 -152864
38882 -152864 -96061 -375248 -628078 -646619 -661786 -868211 -1048837 -922416 -578806 -301273
38872 -301273 -163160 -57358 27896 14570 -69387 -106689 -62679 -3589 9650 -47034 -162993
38861 -162993 -250079 -188191 18042 228944 365391 478433 570066 526232 333883 186868
38851 186868 232039 362252 413735 421987 507141 635460 690070 681609 698947 735553 753682
38840 753682 835507 1057936 1281838 1299440 1165048 1142076 1309257 1448225 1367989 1128392
38830 1128392 872535 643073 472196 473027 692423 986945 1173657 1218133 1179445 1085839
38820 1085839 987679 1013624 1202926 1363497 1292170 1096299 1083086 1317029 1509286 1428130
38810 1428130 1219032 1169493 1304332 1409323 1384058 1362593 1468711 1621837 1660429 1559584
38800 1559584 1448054 1450778 1564783 1678780 1699527 1658582 1669069 1769598 1878706 1942542
38790 1942542 2025757 2159886 2211158 2066124 1874371 1891087 2099173 2223629 2147699 2065261
38780 2065261 2143023 2285256 2366407 2453244 2605640 2670984 2518532 2318899 2328058 2500805
38770 2500805 2580147 2497056 2416987 2426367 2433006 2381001 2332423 2319659 2325220 2412314 2655085 2925400
38758 2925400 2984682 2831528 2726507 2806827 2910839 2884061 2828618 2894329 3007357 2996534
38748 2996534 2879022 2842604 2989673 3226611 3388918 3400744 3327151 3298566 3356388 3391392
38738 3391392 3300925 3160274 3117192 3163350 3182985 3198524 3342290 3567594 3646410 3536723
38728 3536723 3497220 3700741 3969375 4068364 4043825 4047864 4017537 3801164 3487414 3329246
38718 3329246 3389761 3510148 3599626 3714157 3847067 3884167 3816534 3787090 3851248 3879446 3800559
38707 3800559 3779100 4003857 4397995 4689119 4729637 4622844 4543361 4556702 4649379 4822096
38697 4822096 5052387 5222768 5221957 5129231 5158712 5348110 5435237 5182663 4731965 4453515
38687 4453515 4486199 4618855 4612282 4418971 4062500 3555674 3042266 2784218 2842331 2952635
38677 2952635 2892840 2796948 2896667 3103653 3114161 2858114 2591995 2559195 2763501 3065844
38667 3065844 3311400 3373878 3273850 3254250 3537628 3996536 4273628 4254928 4192147 4287972
38657 4287972 4408255 4352913 4204183 4196262 4365934 4549526 4665300 4794862 4995451 5214433
38647 5214433 5418935 5652628 5902588 6040665 5991563 5871676 5856223 5962729 6077611 6166668
38637 6166668 6323312 6584068 6828213 6939738 6971730 7049412 7188221 7331262 7499957 7739505
38627 7739505 7940989 7922097 7731078 7674015 7933009 8320994 8556895 8645730 8802090 9084023
38617 9084023 9311675 9341893 9256322 9251840 9457837 9866253 10339345 10696095 10893565 11096979
38607 11096979 11456074 11865050 12116541 12257690 12552983 13053511 13471410 13624683 13766042
38598 13766042 14236619 14967071 15617968 16121872 16740613 17568538 18343161 18901507 19506104
38589 19506104 20450160 21568959 22485551 23209063 24092186 25214705 26242957 27028882 27941633
38580 27941633 29339187 31030287 32602516 34040391 35600947 37202303 38333969 38426994
38572 38426994 36750991 31965360 22610745 8718255 -7254904 -21598687 -31615551
38565 -31615551 -36807749 -38315558 -37718355 -36271124 -34665502 -33079787 -31455884 -29819254
38557 -29819254 -28324862 -27060804 -25966783 -24965785 -24044314 -23164849 -22213582 -21106543
38549 -21106543 -19902715 -18770783 -17845904 -17103608 -16374048 -15541041 -14740328 -14252401 -14133934
38540 -14133934 -14068913 -13696199 -12998919 -12250524 -11658718 -11214354 -10845132 -10550617 -10358166
38531 -10358166 -10242421 -10116728 -9879797 -9509718 -9127929 -8871765 -8667715 -8283092 -7689793
38522 -7689793 -7196000 -7058451 -7127953 -7081960 -6861008 -6628722 -6426094 -6168751 -5920361 -5837349
38512 -5837349 -5835772 -5635931 -5201917 -4837397 -4739696 -4736712 -4613879 -4452193 -4442386 -4548885 -4576950
38501 -4576950 -4462852 -4301736 -4152877 -3988563 -3808379 -3665021 -3574576 -3495443 -3405682 -3343449
38491 -3343449 -3358470 -3441296 -3502240 -3440099 -3259449 -3084346 -3005100 -2959533 -2840351 -2662091
38481 -2662091 -2516432 -2414974 -2304614 -2196937 -2141300 -2103102 -2015859 -1919082 -1886554 -1858727
38471 -1858727 -1724206 -1524436 -1378190 -1256033 -1071732 -944398 -1058651 -1272959 -1232520 -935050
38461 -935050 -790713 -972938 -1110309 -867716 -466107 -297108 -330009 -290094 -182497 -196354
38451 -196354 -247020 -91479 156493 106849 -260428 -473029 -230070 194281 409715 444599
38441 444599 558614 766845 864701 802650 738456 746894 729415 641436 602553 705089 867333
38430 867333 978514 1076455 1250640 1434506 1458565 1324945 1269038 1452085 1709396 1754886
38420 1754886 1575686 1439331 1502590 1607527 1545254 1351693 1204913 1153855 1121195 1108509
38410 1108509 1216196 1461919 1730323 1931328 2091012 2251016 2381053 2441332 2453297 2455160
38400 2455160 2447129 2433408 2467142 2586263 2729403 2787195 2745982 2721507 2817017 2992030 3125428
38389 3125428 3181081 3235903 3348935 3498049 3671998 3911722 4186830 4338926 4265254 4078970
38379 4078970 3956355 3901905 3827221 3792851 3953234 4274402 4538349 4666467 4817789 5102039
38369 5102039 5417479 5665278 5894670 6104628 6141381 5995614 5996154 6441113 7160930 7720232
38359 7720232 7983558 8203398 8559523 8894628 8996494 8935143 8976453 9250081 9609039 9800170
38349 9800170 9733124 9571945 9532026 9586343 9464096 8988815 8301948 7652005 7077877 6447117
38339 6447117 5711308 4941292 4174849 3435564 2872931 2657198 2707469 2733310 2608536 2512978
38329 2512978 2614016 2785068 2771984 2506330 2107442 1666350 1180413 652941 113403 -450883
38319 -450883 -1066684 -1679828 -2196841 -2633827 -3113696 -3670110 -4145369 -4350683 -4261748 -3982997
38309 -3982997 -3583969 -3080656 -2545224 -2098951 -1773131 -1486681 -1192327 -937446 -752323
38300 -752323 -617531 -599301 -852260 -1379219 -1950908 -2406963 -2863697 -3434601 -3940877 -4189353
38290 -4189353 -4382485 -4873400 -5579193 -6054858 -6170470 -6279761 -6608416 -6910368 -6935518 -6843451
38280 -6843451 -6880255 -6987992 -7051199 -7234012 -7719480 -8358686 -8945901 -9622864 -10600064 -11645057
38270 -11645057 -12298136 -12514249 -12650460 -12844563 -12853729 -12561741 -12218600 -12029907 -11853731 -11494978
38260 -11494978 -11047742 -10753758 -10683321 -10699686 -10627361 -10377947 -10019881 -9757677 -9719085 -9758543
38250 -9758543 -9616051 -9257221 -8881830 -8610086 -8368538 -8102509 -7888884 -7788441 -7765204 -7793372
38240 -7793372 -7882572 -7979776 -8016125 -8058124 -8232384 -8497304 -8674280 -8698190 -8644691 -8540843
38230 -8540843 -8377859 -8274438 -8348314 -8437916 -8267088 -7912572 -7771726 -7998143 -8313657 -8484381
38220 -8484381 -8625900 -8879345 -9135085 -9286753 -9437051 -9613548 -9588596 -9259570 -8923807 -8857885
38210 -8857885 -8876468 -8669505 -8365798 -8345198 -8615527 -8810996 -8785748 -8795550 -9016515 -9233461
38200 -9233461 -9154849 -8795218 -8393374 -8112268 -7948063 -7828711 -7699552 -7567815 -7510120 -7587428
38190 -7587428 -7746456 -7869239 -7913208 -7930125 -7959692 -7983314 -7973242 -7913009 -7780965 -7583989
38180 -7583989 -7394895 -7294011 -7290491 -7349661 -7455173 -7578052 -7630866 -7540756 -7348154 -7160057
38170 -7160057 -7022138 -6901711 -6780404 -6697104 -6693042 -6749137 -6781935 -6702270 -6503442 -6284153
38160 -6284153 -6145285 -6087932 -6073593 -6135015 -6307576 -6479307 -6468208 -6263023 -6030799 -5865166
38150 -5865166 -5707674 -5559092 -5552515 -5712502 -5839466 -5774615 -5613154 -5508884 -5433391 -5302229
38140 -5302229 -5188230 -5204413 -5286446 -5296288 -5253383 -5258998 -5268213 -5159126 -4987341 -4947155 -5073821
38129 -5073821 -5178438 -5107832 -4911336 -4722292 -4614893 -4608228 -4684773 -4764911 -4760651 -4682217 -4610720
38118 -4610720 -4559253 -4452948 -4262494 -4074365 -4003484 -4090942 -4291580 -4506985 -4631971 -4623643
38108 -4623643 -4532016 -4434877 -4360269 -4298762 -4251415 -4221123 -4192232 -4166538 -4190949 -4305290 -4480054
38097 -4480054 -4632076 -4688210 -4636445 -4543352 -4498197 -4494844 -4419521 -4234145 -4099457 -4182902 -4406451
38086 -4406451 -4555382 -4580798 -4580406 -4528748 -4310348 -4025205 -3933565 -4020527 -3955626 -3628016 -3381292
38075 -3381292 -3500583 -3779138 -3870001 -3800704 -3822338 -3960245 -4051141 -4073777 -4118785 -4146376 -4075765
38064 -4075765 -4009570 -4078314 -4166604 -4085413 -3910905 -3851239 -3884698 -3853238 -3810497 -3914897 -4054956
38053 -4054956 -3978598 -3765893 -3757910 -3989338 -4111074 -3962479 -3809155 -3857110 -3908308 -3723253
38043 -3723253 -3422984 -3276057 -3304094 -3339376 -3314007 -3275826 -3238085 -3205740 -3261714 -3459297 -3691048
38032 -3691048 -3801707 -3781307 -3727591 -3654996 -3463348 -3119056 -2793589 -2743628 -3017564 -3336832
38022 -3336832 -3387590 -3221910 -3186750 -3404254 -3574188 -3457424 -3292329 -3435119 -3782265 -3923435
38012 -3923435 -3762697 -3587474 -3548113 -3477525 -3280410 -3116576 -3078811 -3020608 -2851033 -2719674
38002 -2719674 -2758850 -2883883 -2983563 -3081905 -3184909 -3184918 -3041462 -2860703 -2703965 -2532648 -2418732
37991 -2418732 -2546280 -2882254 -3105397 -3018081 -2799575 -2699043 -2708796 -2711208 -2724652 -2803312 -2874060
37980 -2874060 -2863592 -2836913 -2851501 -2832467 -2742866 -2712006 -2835403 -2998137 -3044690 -2981298 -2885781
37969 -2885781 -2775771 -2683787 -2689191 -2760721 -2753059 -2661879 -2659740 -2770065 -2779623 -2631240 -2597895
37958 -2597895 -2833093 -3039300 -2887575 -2529582 -2352401 -2402544 -2407654 -2254132 -2097917 -2055903
37948 -2055903 -2086878 -2148841 -2226851 -2249122 -2197151 -2226964 -2454917 -2712261 -2757683 -2641781 -2590757
37937 -2590757 -2611571 -2518188 -2309021 -2199984 -2263393 -2320867 -2245895 -2126784 -2071841 -2067692 -2085325
37926 -2085325 -2135865 -2176387 -2137144 -2077780 -2147699 -2358322 -2546161 -2577678 -2450396 -2212306
37916 -2212306 -1951775 -1839538 -1974681 -2191296 -2227999 -2094576 -2045049 -2168440 -2261622 -2175277
37906 -2175277 -2028454 -1958663 -1895766 -1757089 -1674375 -1811515 -2075233 -2220063 -2179457 -2095213
37896 -2095213 -2041725 -1922141 -1686490 -1487831 -1506351 -1699128 -1845131 -1818576 -1712984 -1685430
37886 -1685430 -1783511 -1964924 -2170526 -2291685 -2187117 -1886151 -1683097 -1819317 -2111866 -2140831
37876 -2140831 -1817667 -1502618 -1489310 -1649721 -1723374 -1685908 -1626943 -1501752 -1269105 -1101959
37866 -1101959 -1176548 -1363770 -1401424 -1293797 -1279361 -1458733 -1706076 -1904025 -2013370 -1943903
37856 -1943903 -1629007 -1239757 -1065777 -1137059 -1193534 -1085500 -979863 -1077186 -1315911 -1481486
37846 -1481486 -1485221 -1428050 -1459933 -1636184 -1855573 -1924362 -1754324 -1497002 -1396721 -1515811
37836 -1515811 -1696976 -1789638 -1809171 -1857178 -1970669 -2085604 -2120985 -2093371 -2128750 -2296777
37826 -2296777 -2459812 -2424432 -2241934 -2158099 -2222986 -2210513 -2039339 -1972554 -2181438 -2404262
37816 -2404262 -2358304 -2247335 -2456590 -2898689 -3106122 -2921474 -2668617 -2619996 -2691950 -2740008
37806 -2740008 -2793817 -2877191 -2887415 -2778266 -2637874 -2509529 -2348749 -2193239 -2145860 -2174616
37796 -2174616 -2176483 -2225974 -2461766 -2737413 -2747603 -2541361 -2514759 -2792387 -3019740 -2933612
37786 -2933612 -2742802 -2713425 -2741299 -2625583 -2464193 -2461619 -2578887 -2672676 -2769949 -2904668
37776 -2904668 -2881468 -2537699 -2102086 -1958532 -2129011 -2285970 -2223925 -2045190 -1913622 -1886611
37766 -1886611 -1987896 -2211678 -2428533 -2475412 -2368989 -2289085 -2347997 -2503477 -2681122 -2842813
37756 -2842813 -2936415 -2905121 -2765956 -2602813 -2490524 -2474526 -2565822 -2684374 -2682614 -2522016
37746 -2522016 -2364132 -2388768 -2574007 -2739802 -2749928 -2597006 -2366450 -2199284 -2204898 -2319539
37736 -2319539 -2339706 -2188980 -2049683 -2118101 -2333406 -2484633 -2493849 -2438728 -2365287 -2246640
37726 -2246640 -2096396 -1974055 -1889356 -1820145 -1800812 -1871289 -1958219 -1934938 -1805327 -1718804 -1782332
37715 -1782332 -1938265 -2047513 -2036596 -1951811 -1905610 -1967707 -2088968 -2153232 -2110520 -2009198
37705 -2009198 -1890525 -1739264 -1579795 -1527827 -1664310 -1910014 -2097357 -2136188 -2062834 -1964512
37695 -1964512 -1901362 -1877463 -1859389 -1831818 -1814159 -1789197 -1674210 -1448421 -1248305 -1207645 -1248990
37684 -1248990 -1189197 -1018739 -900782 -921723 -1045279 -1284390 -1659083 -1977101 -1966368 -1705182
37674 -1705182 -1605743 -1832341 -2047966 -1933334 -1652895 -1538381 -1573419 -1521522 -1373230 -1306952
37664 -1306952 -1318115 -1242336 -1106561 -1134100 -1389974 -1691437 -1889631 -1999489 -2034525 -1953768
37654 -1953768 -1815182 -1763705 -1809391 -1807809 -1714852 -1674459 -1781165 -1924606 -1959006 -1885770 -1774070
37643 -1774070 -1624288 -1425551 -1267487 -1271199 -1423097 -1557793 -1526769 -1361110 -1250007 -1342473
37633 -1342473 -1572772 -1721815 -1664991 -1501190 -1401717 -1401258 -1406943 -1359764 -1295079 -1257677 -1233357
37622 -1233357 -1177199 -1072517 -955479 -889628 -903598 -961753 -1024517 -1106709 -1210853 -1239323 -1089226
37611 -1089226 -837181 -700359 -769477 -888125 -858943 -695239 -614551 -819775 -1289788 -1747352
37601 -1747352 -1884475 -1697402 -1521576 -1622592 -1865184 -1961750 -1910744 -1909271 -1929297 -1750179
37591 -1750179 -1411381 -1244743 -1377196 -1569201 -1655942 -1763700 -1928073 -1903563 -1607654 -1390895
37581 -1390895 -1545873 -1840526 -1875585 -1663352 -1509439 -1521126 -1577876 -1632767 -1713472 -1746193
37571 -1746193 -1672962 -1622071 -1689886 -1697213 -1452180 -1117555 -1012381 -1161749 -1336857 -1431466
37561 -1431466 -1501283 -1527123 -1436030 -1287812 -1184195 -1082559 -935220 -877494 -1014125 -1169947
37551 -1169947 -1145270 -1067685 -1173397 -1387264 -1463627 -1410015 -1407962 -1432585 -1332762 -1190792 -1208706
37540 -1208706 -1312295 -1262237 -1094295 -1046740 -1104740 -1039132 -871697 -869310 -1064016 -1202508
37530 -1202508 -1214418 -1323385 -1622118 -1909996 -2032473 -2052148 -2031376 -1962095 -1931541 -2028510
37520 -2028510 -2081584 -1836341 -1389514 -1092850 -1049891 -1088986 -1184224 -1446856 -1714669 -1656522
37510 -1656522 -1339102 -1196377 -1359520 -1510783 -1484859 -1485958 -1582381 -1534598 -1312214 -1249901
37500 -1249901 -1465767 -1633511 -1565242 -1503694 -1580794 -1528206 -1238216 -1068014 -1210100 -1291470
37490 -1291470 -1042801 -855954 -1138236 -1548339 -1486939 -1033395 -772589 -894294 -1061033 -1057153
37480 -1057153 -1014835 -1024124 -993345 -917666 -914618 -984931 -1032417 -1077556 -1182752 -1254474 -1192688
37469 -1192688 -1121251 -1182258 -1233985 -1070546 -817423 -766722 -918153 -1033548 -1067994 -1178466
37459 -1178466 -1339809 -1323973 -1092033 -881810 -839054 -829234 -695494 -494961 -401120 -508141
37449 -508141 -762041 -986677 -1005554 -832441 -674376 -661489 -701322 -705608 -768597 -937344 -1001290
37438 -1001290 -770695 -426380 -315730 -488401 -692619 -759090 -730582 -661031 -544315 -439117
37428 -439117 -451696 -579664 -718598 -800455 -807388 -718236 -569276 -482578 -510309 -557322 -572921
37417 -572921 -664678 -873838 -1017740 -957628 -863468 -980520 -1253459 -1409820 -1325146 -1105719
37407 -1105719 -897380 -786021 -790744 -811988 -713227 -570415 -644025 -961840 -1182961 -1080955
37397 -1080955 -892148 -917580 -1045299 -1000770 -843820 -837322 -984023 -1070408 -1054010 -1054146 -1058455
37386 -1058455 -973615 -870341 -857163 -822234 -630767 -460243 -581896 -904333 -1092928 -1059708
37376 -1059708 -978872 -904140 -754059 -618380 -688330 -900069 -1004824 -974858 -998104 -1099162
37366 -1099162 -1113235 -1013443 -924828 -845730 -698613 -611066 -771945 -1034961 -1052690 -807026
37356 -807026 -630917 -691327 -819008 -867841 -877127 -852342 -738648 -634014 -689698 -804921 -770096
37345 -770096 -674016 -767379 -957357 -896151 -580817 -383043 -431159 -456922 -348982 -350722 -552226
37334 -552226 -671442 -545768 -402178 -423990 -465724 -424501 -490409 -771886 -1035436 -1075201
37324 -1075201 -1013612 -1000348 -943334 -779072 -683982 -761534 -822575 -728941 -662537 -797986 -987998
37313 -987998 -1032469 -1001939 -1048347 -1140611 -1207933 -1284783 -1308655 -1075243 -627335 -366893 -504696
37302 -504696 -714573 -643530 -449044 -463944 -617211 -619801 -514427 -582559 -820704 -940621
37292 -940621 -846730 -735218 -724675 -716929 -641911 -562777 -513104 -456791 -417212 -447020 -481616
37281 -481616 -413012 -290164 -263004 -350616 -443570 -509168 -603345 -683277 -603882 -351382 -134959
37270 -134959 -168878 -435198 -714576 -815319 -731669 -578364 -415491 -219745 -39603 -34852
37260 -34852 -247202 -463316 -483445 -409612 -442125 -508428 -400146 -201177 -201859 -382771 -385149
37249 -385149 -81150 210003 209340 20458 -171189 -375904 -573702 -561542 -283465 -20461
37239 -20461 3474 -63215 -19323 38615 -38156 -126400 -68993 -9405 -156155 -392947 -448582
37228 -448582 -313135 -178603 -88919 49569 200139 219397 94459 -65907 -210669 -334169
37218 -334169 -385876 -371630 -426229 -609342 -764482 -754813 -679467 -670210 -658351 -561907 -511202
37207 -511202 -623558 -719671 -558482 -237246 -70107 -147617 -279010 -310021 -258234 -180531
37197 -180531 -113879 -103330 -127837 -79406 43905 63153 -94806 -206231 -67760 154001
37187 154001 153460 -52028 -168852 -65211 101960 168206 135079 56696 -66320 -254894 -508114
37176 -508114 -771605 -908814 -798041 -498772 -189872 76218 359250 558388 454369 115188
37166 115188 -75842 38610 153099 7029 -217794 -268218 -244916 -330918 -401002 -266633
37156 -266633 -53929 28544 62705 196414 287523 167339 29925 126069 269071 114882
37146 114882 -211303 -253321 87545 456151 595587 574123 483092 314499 156897 160583
37136 160583 283822 359705 385716 466965 538868 445939 228128 40981 -111887 -273286
37126 -273286 -298731 -68836 202337 242650 170327 262811 409722 263402 -132874 -347133
37116 -347133 -189760 94381 275877 360519 336370 119994 -183121 -331703 -311675 -316135
37106 -316135 -361551 -276966 -70373 64790 111496 225051 366882 326892 126412 21719
37096 21719 90837 183467 269361 440063 580762 475180 243430 221774 383790 364518 116003
37085 116003 20917 226788 380260 229128 25381 71077 252588 304659 232865 214098
37075 214098 301778 425408 504269 459593 308038 266921 506830 800201 744866 360976
37065 360976 101552 210473 440066 491151 370244 210357 85458 100153 325397 562364
37055 562364 511764 244205 144736 335696 540323 573789 549622 526770 400039 243894
37045 243894 305975 531833 562731 349145 274986 488930 621903 419988 172155 203704
37035 203704 381001 449703 476959 614404 752690 739931 663290 634545 571313 434172 386211
37024 386211 480698 497678 331525 229553 395170 654058 760775 744054 714829 635545
37014 635545 517836 543751 746346 864124 743419 584502 569209 573313 487567 481876 672201
37003 672201 840329 775806 619317 599166 692345 786934 903851 1029042 1012478 852778
36993 852778 785496 885974 908138 716870 522705 475309 415769 277030 315381 643405
36983 643405 923619 852200 592857 425052 328766 231505 287434 566534 817598 868891
36973 868891 910830 1072486 1113382 872107 610406 551733 500518 301025 226860 483130
36963 483130 765045 778323 753376 936542 1032040 741949 433699 595201 968649 938445
36953 938445 527676 293848 409514 551719 604989 792501 1121711 1304376 1256965 1173498
36943 1173498 1100698 906357 647247 526860 527171 499470 542031 847861 1252982 1388242
36933 1388242 1232109 1088255 1069683 1025139 927933 925133 1027414 1112477 1186216 1314534 1399536
36922 1399536 1350678 1324234 1438437 1447666 1117482 728153 725668 1023489 1155534 1014745
36912 1014745 922012 1017289 1096584 1068255 1111546 1322302 1562951 1696556 1683517 1490807
36902 1490807 1181961 999837 1081880 1232458 1249676 1267583 1461884 1675478 1710015 1714700
36892 1714700 1860971 1919274 1651654 1353371 1449093 1774573 1844454 1652245 1595319 1733812
36882 1733812 1741325 1531774 1357624 1310527 1247158 1180650 1259908 1407066 1429018 1404390 1518883
36871 1518883 1651494 1585108 1456507 1505817 1583256 1447012 1330622 1599553 2032523 2102132
36861 2102132 1825883 1671375 1741364 1742639 1665558 1781078 2016000 2038850 1939132 2118690
36851 2118690 2518581 2660355 2471862 2372828 2502710 2552380 2419109 2359014 2424575 2393999
36841 2393999 2301987 2394162 2529683 2305144 1815306 1611395 1846360 2126530 2248826 2396972
36831 2396972 2568515 2524716 2374228 2492618 2795871 2814291 2544757 2473896 2681729 2713604
36821 2713604 2459045 2357629 2570562 2730272 2694503 2780391 3055218 3148677 2965896 2848238
36811 2848238 2856121 2660093 2315084 2334266 2780397 3089447 3028192 3020462 3283083 3463294
36801 3463294 3401914 3426838 3597298 3489850 3051837 2835893 3046748 3181259 2970288 2845565
36791 2845565 3083188 3303968 3240203 3208384 3405979 3513572 3396978 3423910 3688562 3722409
36781 3722409 3380075 3196309 3444272 3668571 3582873 3574256 3854097 3980930 3730941 3577004
36771 3577004 3778209 3863761 3568024 3393037 3656901 3872614 3695345 3592438 3902090 4121184
36761 4121184 3862437 3650471 3973937 4365716 4256791 3984439 4104323 4403477 4441486 4415441
36751 4415441 4653065 4863766 4708874 4534084 4754301 5074960 5062153 4912409 4950811 4966563
36741 4966563 4742310 4617445 4837772 5001983 4838041 4819621 5291189 5724808 5622551 5411794
36731 5411794 5623365 5921065 5817336 5641570 5895742 6312963 6447888 6554011 6993484
36722 6993484 7423762 7450063 7440904 7830759 8275334 8355481 8418734 8847148 9221978 9122754
36712 9122754 9011296 9400372 9918414 10137053 10487531 11341578 12053519 12029873 11905821 12485896
36702 12485896 13343724 13702460 13886221 14584415 15435139 15685956 15527361 15360790 14422614
36693 14422614 11628701 7298505 2718711 -1444409 -5016977 -7331031 -7880996 -7446501
36685 -7446501 -7146538 -6884544 -6046173 -5045186 -4675802 -4575832 -3921426 -3075734 -2931947
36676 -2931947 -3153251 -2723937 -1783412 -1262806 -1138473 -696150 -99804 -25167 -135921 399090
36666 399090 1255365 1479920 1262707 1511843 2093412 2206901 2073485 2487295 3116976 3052931
36656 3052931 2618402 2810946 3391072 3405831 3142426 3591006 4410377 4465105 3977952 4083001
36646 4083001 4652205 4685551 4432553 4912657 5730854 5660586 5031942 5205930 6040824 6275468
36636 6275468 6036589 6453451 7168913 6884144 6049576 6268059 7303223 7511694 6983631
36627 6983631 7291706 8336518 8541750 8047210 8494352 9701174 9879388 9174786 9549721
36618 9549721 11037263 11645887 11163390 11419989 12548164 12755256 12098658 12560758 14011046
36609 14011046 14173525 13036534 13048729 14462812 14964535 14452612 15374576 17610335 18142832
36600 18142832 16769920 16800057 18920290 19988677 19274037 19933212 22640042 24042588 23525217
36591 23525217 24845486 28669356 30465176 28649935 27622133 29610999 31171232 31141175
36583 31141175 33683262 39507298 43250846 44066018 48503407 57544224 62714682 62054398
36575 62054398 66188662 79176059 89467566 93347836 107831085 136704988 140445422
36568 140445422 75417234 -39444484 -130195169 -149991795 -124041791 -101836244 -95589974
36561 -95589974 -87406983 -72406055 -63731561 -64790511 -64193567 -57149254 -51205308 -49892062
36553 -49892062 -47448455 -41604547 -37577012 -37124588 -35555155 -31808273 -30868843 -33822729
36545 -33822729 -35116927 -32230645 -29443829 -29440764 -29121524 -26509838 -24564663 -25122511 -25422163
36536 -25422163 -23595253 -21968435 -22169947 -22109198 -20409620 -19092438 -19391279 -19298976 -17611691
36527 -17611691 -16309916 -16711447 -17119124 -16367790 -15989330 -16819226 -17033179 -15625911 -14494228
36518 -14494228 -15031749 -15781532 -15402823 -14960901 -15371695 -15453487 -14414964 -13587517 -13874360
36509 -13874360 -14037180 -13212348 -12603624 -13017621 -13211984 -12357544 -11704352 -12126088 -12394041
36500 -12394041 -11598628 -10963566 -11490360 -12024210 -11467965 -10807087 -11095439 -11422376 -10756787
36491 -10756787 -9969594 -10147884 -10579517 -10239488 -9726873 -9957933 -10373434 -10131497 -9726355
36482 -9726355 -9828114 -9839977 -9151632 -8532636 -8773470 -9194956 -8961876 -8623695 -8902026 -9190092
36472 -9190092 -8735597 -8141785 -8227012 -8501506 -8206230 -7790838 -7953936 -8256883 -8070347 -7871525
36462 -7871525 -8232350 -8537953 -8097304 -7539430 -7703247 -8089371 -7836270 -7328278 -7375493 -7621585
36452 -7621585 -7248821 -6565793 -6458048 -6853615 -7066964 -7099875 -7335498 -7500380 -7158997 -6711759
36442 -6711759 -6747781 -6955413 -6781160 -6556251 -6820754 -7146960 -6842569 -6272141 -6266339 -6698254
36432 -6698254 -6823684 -6592148 -6476063 -6422671 -6107474 -5841717 -6121983 -6620248 -6663005 -6364710
36422 -6364710 -6283451 -6334265 -6069816 -5678564 -5671532 -5892166 -5831317 -5617948 -5719294 -5955031
36412 -5955031 -5787152 -5338237 -5189899 -5396442 -5559054 -5620011 -5755055 -5777767 -5479933 -5240359
36402 -5240359 -5464581 -5769115 -5570197 -5108210 -4995466 -5123054 -4971311 -4675467 -4785038
36393 -4785038 -5208717 -5375689 -5260729 -5316478 -5550335 -5575170 -5436791 -5509043 -5679185 -5484043
36383 -5484043 -4971843 -4646719 -4648222 -4704345 -4755371 -4916830 -4999618 -4773415 -4514332 -4606869
36373 -4606869 -4843900 -4812161 -4670173 -4797824 -4999933 -4871124 -4641058 -4793717 -5126583 -5083253
36363 -5083253 -4770796 -4723348 -4875222 -4730053 -4385875 -4409563 -4778987 -4906734 -4679082 -4553304
36353 -4553304 -4639262 -4583966 -4378082 -4400967 -4629906 -4643207 -4443772 -4463561 -4720771 -4782118
36343 -4782118 -4595925 -4561287 -4732074 -4746276 -4583935 -4600522 -4765891 -4671847 -4349278 -4268358
36333 -4268358 -4455253 -4427565 -4110140 -3992465 -4226656 -4371296 -4221928 -4128579 -4264713 -4301424
36323 -4301424 -4056646 -3816605 -3773814 -3734757 -3586945 -3508117 -3556567 -3574056 -3588236 -3787801
36313 -3787801 -4059671 -4093939 -3939801 -3889078 -3881961 -3677352 -3512714 -3832557 -4405060 -4525920
36303 -4525920 -4119647 -3805823 -3822963 -3764749 -3498394 -3441332 -3719984 -3915174 -3879256 -3965511
36293 -3965511 -4199388 -4086657 -3554970 -3239471 -3471162 -3786821 -3812351 -3819483 -3994337 -3974853
36283 -3974853 -3612275 -3423112 -3729246 -4043945 -3885914 -3562146 -3548503 -3679044 -3566510 -3317870
36273 -3317870 -3224604 -3183547 -3001012 -2875190 -3033790 -3259569 -3284439 -3294990 -3547737 -3830182
36263 -3830182 -3812459 -3630256 -3622768 -3747317 -3713598 -3479400 -3207106 -2943239 -2710569 -2702051
36253 -2702051 -3030732 -3470743 -3732188 -3798120 -3772020 -3655343 -3498159 -3477756 -3598348 -3608639
36243 -3608639 -3423963 -3301827 -3396625 -3506056 -3476922 -3469169 -3572599 -3565316 -3323707 -3076601
36233 -3076601 -2981334 -2857912 -2624608 -2556576 -2783760 -2967694 -2845765 -2684300 -2799463 -3022176
36223 -3022176 -3059623 -3027622 -3179590 -3411670 -3471290 -3400972 -3378892 -3357520 -3222636 -3077013
36213 -3077013 -3038171 -3000429 -2897698 -2923040 -3181597 -3418941 -3405405 -3290538 -3270330 -3229944
36203 -3229944 -3046788 -2911333 -2981503 -3030788 -2812491 -2489276 -2353395 -2408256 -2547639 -2817108
36193 -2817108 -3154811 -3229235 -2916200 -2595698 -2598413 -2727101 -2724287 -2793330 -3160405 -3512223
36183 -3512223 -3442190 -3141697 -3060743 -3144421 -3010725 -2685860 -2557793 -2723377 -2931314 -3069418
36173 -3069418 -3199620 -3220445 -2998202 -2739166 -2754184 -2952892 -3027821 -3002485 -3099605 -3200300
36163 -3200300 -2991511 -2588715 -2456673 -2704054 -2963393 -2999035 -2957542 -2971793 -2974024 -2975936 -3120636
36152 -3120636 -3366491 -3473805 -3375434 -3247568 -3182906 -3103770 -3013079 -3023167 -3119576 -3172383 -3167879
36141 -3167879 -3174706 -3152536 -3070704 -3096937 -3333861 -3494921 -3237375 -2724119 -2433031 -2476506
36131 -2476506 -2560302 -2577907 -2744298 -3084886 -3275378 -3132263 -2863156 -2681038 -2526798 -2332387
36121 -2332387 -2234877 -2343550 -2541530 -2672277 -2718965 -2694229 -2564407 -2389292 -2343253 -2487558
36111 -2487558 -2666662 -2702145 -2567888 -2347896 -2151374 -2079701 -2155573 -2289148 -2402093 -2519551
36101 -2519551 -2647192 -2687448 -2615752 -2585213 -2683213 -2754773 -2669628 -2573286 -2630472 -2721203 -2678829
36090 -2678829 -2626098 -2734037 -2830379 -2636815 -2261236 -2058586 -2110907 -2240979 -2427237 -2759187
36080 -2759187 -3052723 -2989312 -2644606 -2432234 -2488209 -2538511 -2424549 -2323479 -2352515 -2369133
36070 -2369133 -2299972 -2298208 -2421970 -2483105 -2370720 -2241554 -2248885 -2334901 -2405942 -2469732 -2499460
36059 -2499460 -2401152 -2211367 -2105887 -2137260 -2178860 -2177336 -2224263 -2324739 -2338259 -2218227 -2088202
36048 -2088202 -2022941 -1969673 -1932736 -2011969 -2194453 -2305798 -2230091 -2027370 -1823568 -1730143
36038 -1730143 -1830203 -2072051 -2242349 -2228941 -2208256 -2363949 -2568099 -2611863 -2588668 -2704283
36028 -2704283 -2845655 -2738009 -2441302 -2277108 -2318607 -2363960 -2357524 -2398782 -2387948 -2155149
36018 -2155149 -1925027 -2111928 -2598312 -2773834 -2424362 -2038005 -2029254 -2184998 -2160118 -2052157
36008 -2052157 -2129364 -2343702 -2467750 -2464075 -2426285 -2360479 -2262694 -2227667 -2296384 -2375992 -2433973
35997 -2433973 -2554040 -2700656 -2687967 -2489882 -2305884 -2214026 -2060574 -1814335 -1705670 -1852428
35987 -1852428 -2050632 -2103630 -2070894 -2034579 -1922535 -1738893 -1677558 -1820155 -1988079 -2054402
35977 -2054402 -2120839 -2231870 -2225394 -2054512 -1953217 -2070561 -2215020 -2168968 -1999649 -1866158
35967 -1866158 -1773038 -1698760 -1716668 -1816864 -1854788 -1816028 -1862546 -2004443 -2049693 -1997705 -2102142
35956 -2102142 -2386826 -2520477 -2383392 -2313146 -2507183 -2631016 -2386045 -2055941 -2051630 -2250781
35946 -2250781 -2261197 -2082537 -2027499 -2161024 -2268804 -2273630 -2286450 -2319546 -2289613 -2242571 -2289789
35935 -2289789 -2391478 -2438391 -2448137 -2477070 -2477115 -2430331 -2444971 -2526905 -2480690 -2252613 -2115216
35924 -2115216 -2257569 -2458852 -2455351 -2358734 -2384970 -2437670 -2332830 -2197455 -2243118 -2344445
35914 -2344445 -2254425 -2071175 -2076793 -2247300 -2325029 -2260960 -2194632 -2109242 -1906619 -1730407 -1813393
35903 -1813393 -2069466 -2215097 -2227601 -2306490 -2449551 -2460534 -2334564 -2250160 -2208759 -2063468
35893 -2063468 -1883117 -1896911 -2073007 -2136622 -2033684 -1999721 -2117390 -2174153 -2046211 -1884933
35883 -1884933 -1810251 -1721039 -1542067 -1409064 -1472011 -1694670 -1940286 -2109187 -2153949 -2105829
35873 -2105829 -2090461 -2170230 -2207714 -2055569 -1819055 -1721900 -1771315 -1793277 -1759996 -1825925 -2034714
35862 -2034714 -2222593 -2245022 -2125454 -1972215 -1888357 -1931007 -2032471 -2034480 -1919729 -1878824
35852 -1878824 -2009047 -2134655 -2115397 -2109036 -2267864 -2400489 -2260779 -1974914 -1819281 -1754263
35842 -1754263 -1580748 -1401425 -1472974 -1702136 -1761259 -1654067 -1691204 -1914219 -2026302 -1934659
35832 -1934659 -1884499 -1960871 -1913910 -1631565 -1386072 -1426291 -1645547 -1814207 -1866344 -1831890
35822 -1831890 -1742174 -1698490 -1794270 -1919707 -1893472 -1789541 -1833319 -1983961 -1979760 -1819193 -1801670
35811 -1801670 -2017107 -2186586 -2121782 -1974651 -1907545 -1869329 -1827168 -1873300 -1967086 -1909108 -1703545
35800 -1703545 -1609276 -1705538 -1759389 -1657497 -1598459 -1700049 -1792452 -1778916 -1819349 -1956224 -1952547
35789 -1952547 -1741620 -1644498 -1849365 -2045030 -1911533 -1648487 -1638465 -1848639 -1958619 -1890683
35779 -1890683 -1834265 -1865964 -1877354 -1805990 -1680455 -1513764 -1354776 -1339160 -1509554 -1708026
35769 -1708026 -1796955 -1825921 -1842248 -1753675 -1554196 -1452330 -1565431 -1714047 -1738186 -1769707
35759 -1769707 -1933812 -2035021 -1859890 -1578785 -1493089 -1546762 -1462920 -1262346 -1266290 -1598808
35749 -1598808 -2002729 -2173458 -2040753 -1724122 -1418528 -1310581 -1424638 -1574293 -1603440 -1587987
35739 -1587987 -1643692 -1672695 -1531855 -1344854 -1373141 -1616726 -1801665 -1772106 -1672684 -1703471
35729 -1703471 -1869028 -2026551 -2070495 -2020469 -1968280 -1946283 -1871493 -1697791 -1576342 -1681095
35719 -1681095 -1886021 -1878710 -1645279 -1524337 -1652888 -1717222 -1485930 -1234980 -1298919 -1494807
35709 -1494807 -1415989 -1095944 -929039 -1050506 -1243515 -1403280 -1643636 -1930861 -2039280 -1945769
35699 -1945769 -1889338 -1939391 -1862181 -1555593 -1289113 -1319157 -1521590 -1609230 -1519457 -1388456
35689 -1388456 -1288552 -1190496 -1108202 -1114449 -1229748 -1388764 -1507696 -1547637 -1536871 -1540917 -1579456
35678 -1579456 -1592793 -1533870 -1445769 -1383930 -1331149 -1281885 -1326703 -1520400 -1739959 -1834044 -1857149
35667 -1857149 -1972538 -2155372 -2195425 -2008831 -1759514 -1628578 -1625019 -1673916 -1736713 -1768948
35657 -1768948 -1685755 -1464188 -1207519 -1039805 -986552 -1001126 -1056795 -1164962 -1324743 -1487166
35647 -1487166 -1582638 -1599370 -1619937 -1725238 -1864504 -1903191 -1811422 -1698455 -1633246 -1562102 -1454959
35636 -1454959 -1382192 -1366270 -1322807 -1263504 -1379206 -1748562 -2115329 -2165391 -1919409 -1643056
35626 -1643056 -1465876 -1326687 -1230589 -1285000 -1456995 -1530183 -1385341 -1168784 -1104793 -1244526
35616 -1244526 -1460118 -1617565 -1705052 -1805900 -1951085 -2025777 -1899662 -1642869 -1481976 -1513716
35606 -1513716 -1616750 -1692021 -1795518 -1944844 -2007714 -1916898 -1792368 -1705632 -1546845 -1294571
35596 -1294571 -1161146 -1246163 -1311723 -1183310 -1103654 -1332468 -1645553 -1670688 -1526672 -1621488
35586 -1621488 -1926074 -1999058 -1729707 -1509412 -1573415 -1686775 -1645038 -1601145 -1659117 -1583817
35576 -1583817 -1235166 -944975 -1094906 -1543505 -1820081 -1751676 -1583372 -1541295 -1557288 -1457220
35566 -1457220 -1239264 -1084322 -1136288 -1317941 -1418692 -1388277 -1420438 -1624992 -1770225 -1592096
35556 -1592096 -1246885 -1129754 -1283575 -1362389 -1221537 -1142013 -1322983 -1521605 -1431938 -1141521
35546 -1141521 -961818 -1011627 -1188468 -1372850 -1461869 -1370600 -1186762 -1159233 -1362807 -1557031
35536 -1557031 -1556430 -1534918 -1732066 -2036402 -2134229 -1965075 -1771942 -1753661 -1878695 -2006628
35526 -2006628 -2025373 -1903370 -1727634 -1628272 -1581624 -1414634 -1103385 -888366 -940270 -1099467
35516 -1099467 -1145369 -1136477 -1233148 -1353086 -1310427 -1179339 -1181229 -1271887 -1198766 -973838 -923681
35505 -923681 -1176610 -1429417 -1385882 -1157542 -1027650 -1034893 -1036962 -1042788 -1202063 -1498221 -1701306
35494 -1701306 -1677953 -1563908 -1543305 -1600340 -1610345 -1573212 -1590940 -1645690 -1578073 -1329096 -1051944
35483 -1051944 -900563 -841097 -786102 -784088 -908414 -1059695 -1092178 -1086373 -1261647 -1616401 -1892235
35472 -1892235 -1941345 -1899292 -1911150 -1910015 -1795785 -1644324 -1584326 -1604635 -1618402 -1596008 -1524612
35461 -1524612 -1377017 -1232773 -1265320 -1467015 -1555783 -1332602 -980138 -808649 -846972 -911138
35451 -911138 -950407 -1051578 -1172507 -1164892 -1063984 -1092121 -1324881 -1567004 -1617338 -1481433
35441 -1481433 -1280042 -1116962 -1074490 -1166654 -1253154 -1168520 -974429 -896683 -966764 -952282 -743553
35430 -743553 -575220 -689863 -972348 -1130506 -1091615 -987959 -874091 -737701 -717772 -985341
35420 -985341 -1383591 -1503419 -1220195 -876910 -793271 -866568 -861914 -833068 -952444 -1112834
35410 -1112834 -1061363 -839554 -720945 -730770 -600898 -253960 29106 44716 -45314 -5534
35400 -5534 172524 398764 636337 802522 831395 941134 1392660 1759849 996559 -1261148
35390 -1261148 -3861301 -5228413 -5065097 -4363697 -3935415 -3682907 -3318658 -2991285 -2906252
35381 -2906252 -2917609 -2850369 -2809767 -2871838 -2838847 -2593273 -2364855 -2358082 -2405828 -2274382 -2052770
35370 -2052770 -1961533 -1996411 -2019476 -2011173 -2006474 -1962388 -1876645 -1845200 -1849802 -1725925 -1492431
35359 -1492431 -1424235 -1607482 -1734834 -1582297 -1378412 -1414702 -1584123 -1630644 -1591420 -1638879
35349 -1638879 -1712253 -1668712 -1604732 -1666482 -1718060 -1561573 -1327996 -1286366 -1410417 -1494021 -1544377
35338 -1544377 -1675516 -1754566 -1580534 -1321221 -1336164 -1606822 -1762013 -1657501 -1522044 -1511290
35328 -1511290 -1515295 -1463895 -1454388 -1494485 -1444467 -1298212 -1231406 -1300836 -1363837 -1341738 -1294814
35317 -1294814 -1210987 -1015941 -830492 -901372 -1198285 -1381186 -1274592 -1102918 -1135901 -1341851
35307 -1341851 -1517347 -1555591 -1470089 -1321870 -1215829 -1232497 -1318834 -1373895 -1422365 -1534652
35297 -1534652 -1627851 -1575077 -1471631 -1522947 -1679528 -1673971 -1447608 -1255282 -1291395 -1470460
35287 -1470460 -1628001 -1687906 -1592208 -1328167 -1073005 -1056182 -1237988 -1375815 -1414253 -1512514
35277 -1512514 -1678555 -1728965 -1665080 -1715802 -1906008 -1954863 -1742920 -1518925 -1478136 -1494497
35267 -1494497 -1461064 -1523289 -1725002 -1780423 -1516285 -1241446 -1320762 -1613009 -1703233 -1528163
35257 -1528163 -1394702 -1465197 -1581889 -1600991 -1607969 -1738840 -1971771 -2152904 -2141342 -1934771
35247 -1934771 -1704874 -1648802 -1759382 -1837589 -1771465 -1662621 -1619808 -1598165 -1535292 -1477448 -1457462
35236 -1457462 -1401680 -1272083 -1158419 -1131846 -1155953 -1221328 -1387198 -1602357 -1692757 -1640648
35226 -1640648 -1660526 -1859969 -2039641 -1991467 -1795493 -1651174 -1603139 -1604284 -1663030 -1751116 -1744421
35215 -1744421 -1627266 -1575671 -1676283 -1763602 -1705578 -1625881 -1647120 -1652741 -1537053 -1452333 -1532013
35204 -1532013 -1590865 -1415495 -1164720 -1138777 -1293737 -1338060 -1216371 -1151126 -1253301 -1409834
35194 -1409834 -1535401 -1652311 -1732414 -1707210 -1615451 -1529255 -1396384 -1174786 -1025595 -1111600
35184 -1111600 -1296459 -1330154 -1246282 -1257631 -1332069 -1243365 -1032027 -1026585 -1333268 -1649465 -1697274
35173 -1697274 -1542586 -1362098 -1182307 -1013476 -993485 -1191523 -1430017 -1486370 -1370604 -1267475
35163 -1267475 -1290606 -1405161 -1518299 -1547698 -1453789 -1283484 -1157023 -1170837 -1324751 -1536886
35153 -1536886 -1702032 -1764372 -1765471 -1772965 -1746383 -1585362 -1356802 -1306909 -1528135 -1781046 -1817132
35142 -1817132 -1721510 -1724624 -1822100 -1842854 -1778418 -1744374 -1686326 -1451876 -1142900 -1064072 -1264533
35131 -1264533 -1426398 -1304278 -1027060 -858716 -874318 -982244 -1087984 -1135178 -1128591 -1181267
35121 -1181267 -1395992 -1662956 -1739573 -1571008 -1364130 -1308517 -1399360 -1563325 -1753726 -1866784
35111 -1866784 -1777594 -1550619 -1426010 -1497836 -1578987 -1488725 -1307477 -1222150 -1256092 -1285246 -1227822
35100 -1227822 -1101886 -952909 -809027 -684343 -601489 -626484 -824434 -1114380 -1270209 -1198623
35090 -1198623 -1102343 -1178918 -1286967 -1185938 -1001464 -1083876 -1424292 -1621139 -1498864 -1343619
35080 -1343619 -1369902 -1367135 -1134192 -903517 -988950 -1271718 -1399925 -1321393 -1263726 -1308280 -1335079
35069 -1335079 -1322897 -1364166 -1397089 -1245994 -970542 -887558 -1148576 -1515494 -1665916 -1554854
35059 -1554854 -1366627 -1243227 -1184104 -1140016 -1094502 -1063655 -1068372 -1108383 -1159016 -1208336 -1280867
35048 -1280867 -1391482 -1496224 -1535012 -1511148 -1483072 -1484640 -1497552 -1502107 -1512147 -1540136 -1549105
35037 -1549105 -1473390 -1309259 -1166930 -1174642 -1311443 -1405313 -1352477 -1266511 -1315667 -1467167 -1518181
35026 -1518181 -1364696 -1120217 -963766 -973123 -1107380 -1249831 -1268566 -1138667 -1001413 -1001780
35016 -1001780 -1090275 -1109033 -1045470 -1041186 -1151191 -1264683 -1292985 -1278754 -1280686 -1294222 -1322654
35005 -1322654 -1391237 -1466118 -1492498 -1511628 -1581868 -1602575 -1425838 -1146432 -1036059 -1149307
34995 -1149307 -1255449 -1231382 -1234926 -1359234 -1404681 -1201046 -926468 -873295 -1063951 -1309208
34985 -1309208 -1494683 -1602681 -1593612 -1483090 -1421678 -1495923 -1559046 -1450520 -1262216 -1175660
34975 -1175660 -1150376 -1014003 -785977 -670838 -762649 -961323 -1153607 -1291598 -1325861 -1243487
34965 -1243487 -1148031 -1139768 -1155115 -1083365 -985412 -1014533 -1165021 -1287731 -1322386 -1328117 -1315351
34954 -1315351 -1247810 -1199161 -1301631 -1517592 -1643659 -1575419 -1417059 -1308605 -1287900 -1332216
34944 -1332216 -1386897 -1340271 -1119355 -831949 -679727 -716558 -817448 -877697 -897516 -877519
34934 -877519 -796101 -705950 -697574 -751340 -777068 -800979 -933014 -1132818 -1212174 -1123272 -1045009
34923 -1045009 -1104491 -1205692 -1232193 -1224456 -1223916 -1129937 -890767 -681794 -681319 -781197 -758270 -668422
34911 -668422 -798483 -1199767 -1525181 -1451198 -1084025 -792757 -750966 -811140 -783623 -670538
34901 -670538 -598237 -639056 -756978 -868291 -920221 -949549 -1063517 -1297932 -1501978 -1469930
34891 -1469930 -1212518 -979215 -957782 -1077839 -1188081 -1272016 -1344512 -1285153 -1006070 -713660
34881 -713660 -745341 -1128239 -1512640 -1583299 -1354447 -1027251 -753825 -605644 -596494 -655661
34871 -655661 -710125 -819784 -1069710 -1328688 -1344814 -1121710 -946597 -972112 -1044469 -1051201 -1127316
34860 -1127316 -1334876 -1446274 -1308728 -1164116 -1296064 -1566459 -1644896 -1544514 -1555312 -1717047
34850 -1717047 -1730664 -1419305 -979913 -717251 -744014 -975388 -1230932 -1325623 -1228419 -1129081
34840 -1129081 -1199146 -1328859 -1272563 -1002823 -725812 -588801 -577605 -668561 -860367 -1058741
34830 -1058741 -1135960 -1119306 -1148756 -1255450 -1352085 -1419452 -1515959 -1614706 -1615526 -1517194 -1413957
34819 -1413957 -1336032 -1249212 -1179620 -1178140 -1200908 -1179131 -1147934 -1156679 -1149937 -1105490 -1151317 -1331886
34807 -1331886 -1421694 -1246325 -1026140 -1065955 -1254526 -1275095 -1191879 -1340563 -1669484 -1720729
34797 -1720729 -1352893 -982763 -943754 -1055448 -1041277 -963517 -986905 -1055488 -1071507 -1111043 -1218750
34786 -1218750 -1246565 -1118538 -1007143 -1040452 -1087192 -1033551 -1007939 -1115874 -1216811 -1191449
34776 -1191449 -1167599 -1243379 -1256313 -1092671 -963114 -1072657 -1249622 -1212422 -999718 -830589
34766 -830589 -737972 -656759 -680661 -890178 -1093063 -1084558 -1017225 -1155843 -1401441 -1440734 -1266192
34755 -1266192 -1151877 -1174295 -1156552 -1067862 -1078915 -1188310 -1171925 -982671 -864725 -966481
34745 -966481 -1132394 -1189669 -1179896 -1189045 -1180437 -1121631 -1082948 -1092039 -1051262 -901893 -739330 -687890
34733 -687890 -767914 -920169 -1048568 -1038512 -870669 -706794 -711092 -814094 -835464 -802324 -904838
34722 -904838 -1134133 -1240030 -1119944 -987911 -1030477 -1119934 -1036734 -809007 -650754 -667739
34712 -667739 -787752 -925997 -1082183 -1276496 -1462894 -1528297 -1400266 -1182464 -1107738 -1254567
34702 -1254567 -1388144 -1245032 -912422 -707904 -715638 -716866 -613678 -607148 -814982 -1002735
34692 -1002735 -931350 -759541 -815489 -1091872 -1266144 -1186126 -1049418 -1050169 -1089158 -963283 -693295
34681 -693295 -509348 -560341 -754866 -895612 -897011 -834202 -809543 -828512 -834716 -826248 -862359
34670 -862359 -946647 -986636 -926395 -859742 -923317 -1096532 -1204139 -1140403 -1005148 -958015 -1000754
34659 -1000754 -995855 -876180 -727552 -646375 -628494 -657043 -783872 -1005496 -1144430 -1024170
34649 -1024170 -743484 -606010 -749189 -998352 -1138272 -1169551 -1202538 -1237324 -1187989 -1050051
34639 -1050051 -920764 -889200 -984124 -1179114 -1379461 -1467969 -1440709 -1433342 -1529662 -1605258 -1460411
34628 -1460411 -1080766 -687127 -530488 -668015 -919673 -1041826 -979960 -916998 -1002810 -1116644
34618 -1116644 -1054061 -876555 -833322 -956855 -1031904 -1000989 -1055572 -1209683 -1157997 -780744
34608 -780744 -444361 -498875 -769093 -882661 -835556 -843673 -871705 -768752 -708235 -993042 -1487420
34597 -1487420 -1721475 -1555117 -1292827 -1136293 -993807 -885567 -1042835 -1446639 -1700943
34588 -1700943 -1571479 -1297736 -1181875 -1202999 -1227620 -1267782 -1308633 -1183433 -859265 -586378
34578 -586378 -540868 -570506 -511289 -490168 -661242 -884999 -949392 -909278 -928212 -955605 -841663
34567 -841663 -639155 -530466 -562318 -672776 -853506 -1064750 -1129702 -958739 -763668 -809898
34557 -809898 -1056762 -1263897 -1334097 -1315924 -1199610 -990158 -880712 -1047579 -1323828 -1370402
34547 -1370402 -1149253 -944097 -917398 -937194 -879757 -823969 -855074 -905167 -899857 -888414 -924361
34536 -924361 -954819 -922297 -873394 -893477 -1006440 -1171536 -1305094 -1302890 -1137413 -936684 -865362
34525 -865362 -922233 -953456 -864594 -713610 -593328 -535879 -550318 -647647 -793981 -916873 -985306
34514 -985306 -1028683 -1073034 -1112436 -1136584 -1136178 -1096805 -1029336 -974654 -943125 -903473 -863263 -870551
34502 -870551 -887861 -791342 -589928 -513858 -743245 -1150118 -1457955 -1560560 -1525945 -1397045
34492 -1397045 -1199482 -1069354 -1132534 -1277355 -1268863 -1085894 -927203 -874877 -789830 -600677
34482 -600677 -470400 -555733 -758596 -843460 -711459 -474203 -325596 -387939 -614771 -819201
34472 -819201 -861368 -795788 -752842 -727270 -625569 -481016 -430717 -477853 -481424 -419094 -448262
34461 -448262 -628339 -790189 -806939 -813994 -992510 -1260373 -1361009 -1201196 -949363 -819528
34451 -819528 -867690 -991148 -1050807 -1000506 -935787 -988440 -1153699 -1279853 -1255415 -1135526 -1047565
34440 -1047565 -1045130 -1093255 -1121841 -1057787 -889743 -738077 -758153 -921016 -1001303 -859599 -629409
34429 -629409 -527214 -577699 -649288 -681547 -732013 -835449 -953919 -1058445 -1144699 -1169953 -1086899
34418 -1086899 -954860 -913096 -1005897 -1113150 -1099931 -981659 -900222 -970635 -1178547 -1398247
34408 -1398247 -1488753 -1402413 -1228349 -1114643 -1129335 -1210933 -1265535 -1285524 -1341661 -1471043 -1613876
34397 -1613876 -1673855 -1612528 -1463745 -1280875 -1106317 -980792 -933673 -947172 -960588 -930922
34387 -930922 -876653 -857419 -925848 -1088344 -1279299 -1383964 -1336619 -1197739 -1085572 -1036429
34377 -1036429 -993463 -922072 -847773 -779763 -709326 -702148 -854053 -1100569 -1219181 -1117883 -981079
34366 -981079 -998110 -1077992 -1008001 -799336 -672463 -740546 -897196 -1004991 -1023107 -953980 -833453
34355 -833453 -782639 -909701 -1143912 -1310288 -1365979 -1405155 -1445097 -1410096 -1345062 -1418973 -1646862
34344 -1646862 -1818404 -1792502 -1655234 -1480174 -1172357 -736144 -477489 -655405 -1044689 -1147293
34334 -1147293 -829738 -484335 -502367 -816870 -1079429 -1106077 -977062 -800482 -586262 -366433
34324 -366433 -264449 -338605 -447496 -406622 -257891 -243224 -474117 -762602 -870960 -813378
34314 -813378 -770506 -788218 -748846 -625222 -565299 -662043 -788988 -760156 -566434 -375353 -350542
34303 -350542 -516011 -744976 -855131 -770557 -602234 -514065 -531304 -570241 -619541 -743841
34293 -743841 -907994 -970826 -901523 -842253 -887996 -958824 -975648 -1006402 -1118156 -1216432 -1172093
34282 -1172093 -1014203 -868253 -784658 -752686 -805580 -970261 -1155906 -1221121 -1141024 -1024343
34272 -1024343 -984680 -1049278 -1152042 -1174242 -1059985 -930487 -985880 -1239251 -1464214 -1478683
34262 -1478683 -1353252 -1252387 -1218342 -1230895 -1319536 -1450863 -1454041 -1260993 -1090268 -1156161
34252 -1156161 -1305092 -1222080 -933887 -788252 -924113 -1085932 -1051017 -944713 -977575 -1111475
34242 -1111475 -1179332 -1159765 -1138581 -1134076 -1153676 -1308968 -1658231 -2002046 -2056829 -1816829 -1542593
34231 -1542593 -1385543 -1242110 -1038421 -927982 -1041668 -1204230 -1130706 -844041 -658660 -730610
34221 -730610 -861646 -848385 -800190 -913643 -1098497 -1104532 -950492 -915147 -1067997 -1121145 -887391
34210 -887391 -615206 -641508 -902263 -1056366 -984349 -880876 -884817 -890838 -776021 -597937 -484626
34199 -484626 -475234 -535112 -612677 -642958 -609734 -622790 -797768 -1037952 -1096821 -909006 -694088
34188 -694088 -650720 -708555 -698086 -621798 -606556 -688847 -800638 -896171 -948726 -890584 -717607
34177 -717607 -600727 -705880 -915669 -931145 -691146 -494576 -604678 -893407 -1026400 -892432
34167 -892432 -681129 -593473 -652581 -792217 -954566 -1050831 -973523 -737174 -510051 -428975
34157 -428975 -469007 -560573 -712712 -904539 -975733 -810441 -570335 -539124 -738152 -897458
34147 -897458 -844405 -720896 -732775 -866775 -980826 -1029577 -1056822 -1072627 -1079258 -1130722 -1230812
34136 -1230812 -1256451 -1124613 -953835 -902129 -921398 -860473 -756661 -799219 -998215 -1117797
34126 -1117797 -1010263 -828228 -798681 -928397 -1048161 -1040392 -904966 -682341 -439035 -288123
34116 -288123 -307543 -439411 -547372 -572376 -569791 -593804 -610478 -555964 -450953 -418235 -566375
34105 -566375 -855953 -1108803 -1183403 -1131006 -1131861 -1268205 -1413430 -1387621 -1189876 -1007530 -978307
34094 -978307 -1006886 -890133 -607175 -383625 -420862 -654343 -876424 -1021059 -1175774 -1349807
34084 -1349807 -1431095 -1410897 -1445801 -1589059 -1642369 -1438085 -1130275 -1008405 -1109330 -1220255
34074 -1220255 -1219602 -1201649 -1258657 -1333169 -1332105 -1241006 -1083104 -886735 -720934 -645508 -606577
34063 -606577 -503935 -377109 -386593 -580098 -817254 -966886 -1033881 -1037050 -925549 -722436
34053 -722436 -613672 -748581 -1025538 -1204621 -1189695 -1090405 -1039387 -1058625 -1101230 -1127111 -1107556
34042 -1107556 -1014529 -851317 -686316 -626231 -720909 -882659 -943678 -842370 -719414 -757954
34032 -757954 -946691 -1087136 -1039270 -875192 -768997 -807921 -937127 -1028159 -980592 -812650
34022 -812650 -665085 -661733 -766903 -844172 -843891 -843717 -905189 -994694 -1065660 -1116304 -1136991 -1104360
34010 -1104360 -1066458 -1124946 -1274094 -1360356 -1279945 -1127209 -1052373 -1044642 -974838 -822971 -740682
33999 -740682 -858451 -1111763 -1314891 -1371749 -1346920 -1318349 -1236309 -1014976 -736149 -628576
33989 -628576 -788966 -1031695 -1104939 -970335 -772649 -629754 -587232 -692126 -928249 -1117841
33979 -1117841 -1079337 -887199 -803290 -932187 -1104155 -1121887 -967666 -743927 -570927 -572285
33969 -572285 -786943 -1039506 -1061115 -811069 -541201 -483465 -609715 -746811 -778956 -684771
33959 -684771 -530750 -481539 -651132 -890050 -906274 -664234 -454506 -471248 -549675 -476026
33949 -476026 -343525 -387079 -613729 -818530 -878218 -836505 -757173 -656426 -548696 -451817
33939 -451817 -390751 -445237 -678575 -962685 -1046106 -896496 -783060 -879768 -998924 -918582
33929 -918582 -769599 -822626 -1031250 -1093973 -913324 -712044 -697456 -843700 -1015682 -1110815
33919 -1110815 -1067889 -904459 -748922 -699602 -684487 -594591 -486012 -482389 -551019 -571196 -562885
33908 -562885 -634353 -747700 -761220 -683378 -663264 -736158 -795724 -818431 -893943 -1017449 -1072975
33897 -1072975 -1056204 -1098103 -1213764 -1232070 -1055914 -827912 -755830 -890891 -1120249 -1268956
33887 -1268956 -1203275 -956254 -738725 -696138 -701497 -558017 -345431 -335062 -583335 -857786
33877 -857786 -977482 -978591 -917689 -776098 -619562 -593526 -672816 -656661 -502071 -417429 -518188
33866 -518188 -635505 -600893 -490869 -437554 -404629 -308128 -174859 -42315 110418 211669
33856 211669 104660 -150458 -241098 -68938 5006 -356491 -961313 -1366885 -1478148 -1525037
33846 -1525037 -1579976 -1488908 -1253263 -1110986 -1174666 -1277039 -1255301 -1153867 -1071201 -1017133
33836 -1017133 -1001474 -1076195 -1206648 -1263007 -1211721 -1161952 -1160932 -1114453 -994378 -947521 -1067815
33825 -1067815 -1207497 -1177629 -1035280 -994743 -1106331 -1203378 -1169200 -1090490 -1090656 -1137759 -1105690
33814 -1105690 -949098 -730802 -528816 -404166 -415124 -551566 -675387 -654492 -563268 -605834
33804 -605834 -805751 -945892 -907661 -881727 -1070196 -1340187 -1414657 -1303022 -1256015 -1329817
33794 -1329817 -1306284 -1089212 -878948 -840521 -859146 -776548 -650889 -612667 -643281 -664545 -690910
33783 -690910 -736019 -724079 -649819 -662133 -820546 -942655 -888072 -816092 -926781 -1111369 -1138849
33772 -1138849 -1058148 -1098685 -1251075 -1282884 -1155957 -1100898 -1233212 -1385218 -1390277 -1279532
33762 -1279532 -1121762 -911621 -706423 -642665 -710370 -723279 -623206 -601074 -779356 -973102
33752 -973102 -936306 -694230 -470534 -415511 -554694 -865723 -1225784 -1394071 -1243250 -946958
33742 -946958 -771474 -743726 -693340 -560546 -460399 -454552 -457666 -409632 -382509 -459645 -628585
33731 -628585 -839968 -1058427 -1205549 -1171203 -964220 -764638 -734543 -832087 -893392 -849578
33721 -849578 -771192 -726525 -699269 -659883 -633021 -648892 -675073 -646073 -547812 -442909 -414619
33710 -414619 -497880 -656641 -815230 -914239 -943960 -930989 -908510 -908309 -954732 -1032311 -1076347
33699 -1076347 -1040315 -962582 -914820 -896325 -851203 -784747 -763478 -782412 -755049 -689641 -740781
33688 -740781 -981870 -1245331 -1324954 -1236050 -1120856 -1001358 -830671 -706951 -776072 -942481
33678 -942481 -951794 -788291 -705129 -789751 -809391 -634875 -511477 -670318 -924764 -957210 -826957
33667 -826957 -849461 -1063568 -1172298 -1017282 -796700 -738189 -806943 -844385 -810105 -778535 -823057
33656 -823057 -977482 -1205369 -1366254 -1330415 -1162767 -1066594 -1106908 -1129293 -1013077 -861731
33646 -861731 -838544 -920334 -943757 -849917 -763953 -819656 -982167 -1095244 -1085560 -1050446 -1086498
33635 -1086498 -1088840 -865355 -468298 -227736 -340767 -591643 -659662 -572675 -615911 -863753
33625 -863753 -1076130 -1070914 -949692 -895026 -953705 -1089178 -1255195 -1340709 -1227328 -992216
33615 -992216 -881756 -987298 -1113911 -1075124 -946908 -898661 -932497 -951038 -954688 -994619 -1019272
33604 -1019272 -941939 -809237 -751133 -797249 -868905 -918030 -955517 -974924 -964379 -970806 -1044803
33593 -1044803 -1138721 -1157071 -1092956 -1023242 -982770 -935310 -866465 -819808 -826216 -857570 -866126 -836649
33581 -836649 -799396 -808459 -886710 -981424 -1015468 -992071 -983421 -995829 -936474 -762506 -568757
33570 -568757 -452972 -383224 -295060 -237011 -291391 -403499 -436733 -391755 -433949 -666779 -978724
33559 -978724 -1167922 -1157394 -1042987 -970649 -1006842 -1106614 -1169733 -1119602 -943222 -683853 -420525
33548 -420525 -240407 -189158 -243082 -356929 -520405 -719599 -875041 -909547 -869443 -869835 -909348
33537 -909348 -865528 -709130 -582051 -591353 -664464 -708671 -775451 -923671 -1036996 -959916 -747280
33526 -747280 -594405 -561189 -557759 -583727 -757136 -1053032 -1219567 -1077158 -767836 -579507
33516 -579507 -610210 -726889 -791544 -795384 -788551 -800034 -851612 -959372 -1073070 -1076169 -915268
33505 -915268 -707288 -641330 -750068 -843058 -731771 -484023 -356366 -463846 -628850 -625189
33495 -625189 -474210 -374296 -389274 -374720 -245580 -159411 -315772 -655432 -899109 -875317
33485 -875317 -690412 -549545 -523223 -561263 -642150 -779138 -905022 -891632 -729418 -585424
33475 -585424 -607477 -734073 -778499 -666374 -517446 -508662 -706880 -1009645 -1202986 -1120783
33465 -1120783 -817192 -551919 -536233 -720770 -894826 -942031 -904177 -841776 -766136 -710377
33455 -710377 -743813 -877606 -1031150 -1112737 -1084391 -968180 -853658 -854761 -966460 -1013394 -856847
33444 -856847 -604761 -481770 -540508 -659484 -773028 -901538 -983120 -910597 -751964 -701990
33434 -701990 -780402 -814435 -761698 -781506 -905973 -926311 -740738 -547864 -532926 -617700 -696913
33423 -696913 -850435 -1096530 -1198748 -995757 -698336 -565755 -504340 -318799 -153990 -278454
33413 -278454 -561549 -606709 -361947 -176151 -239715 -380563 -473461 -643628 -929067 -1098924
33403 -1098924 -994852 -774889 -640672 -564739 -461212 -402352 -474130 -595427 -660259 -711704
33393 -711704 -818063 -918395 -941005 -938599 -956055 -898251 -695654 -490092 -477631 -633626 -751419
33382 -751419 -714940 -603959 -553481 -608951 -707303 -744211 -688594 -650942 -766557 -991044 -1116732
33371 -1116732 -1029492 -829765 -650989 -502090 -372109 -339977 -447804 -576132 -586051 -506003
33361 -506003 -449027 -421541 -356221 -280010 -300963 -445759 -634327 -807225 -965130 -1079453
33351 -1079453 -1071682 -914652 -689152 -516422 -474399 -575291 -763018 -914762 -902076 -703737
33341 -703737 -451773 -325633 -381371 -510759 -595376 -657660 -784299 -935201 -971339 -898666
33331 -898666 -909889 -1081179 -1197100 -1049470 -775290 -679928 -815681 -972338 -1023032 -1022580 -999272
33320 -999272 -928649 -907347 -1049443 -1180543 -968415 -451996 -106085 -221378 -531544 -658944
33310 -658944 -629659 -672524 -761747 -703502 -529389 -464308 -561557 -657628 -667703 -677194 -736793
33299 -736793 -778670 -760618 -733925 -751348 -821722 -937763 -1047891 -1046962 -898087 -704361 -567049
33288 -567049 -463552 -366593 -356416 -472820 -585892 -586483 -583169 -715497 -887947 -914030 -830105
33277 -830105 -818930 -883160 -850715 -682313 -533033 -505113 -551789 -628327 -739771 -841614 -883906
33266 -883906 -942475 -1118228 -1331834 -1412902 -1349320 -1234123 -1035088 -695537 -416546 -497719
33256 -497719 -866401 -1102182 -1007617 -826848 -788761 -776705 -635238 -494691 -544503 -715833
33246 -715833 -832433 -887359 -939475 -914437 -755074 -616779 -654910 -740817 -657330 -483510 -496342
33235 -496342 -724330 -884310 -798460 -632462 -634092 -812093 -975986 -982359 -850687 -697211
33225 -697211 -628325 -689587 -882443 -1185248 -1503199 -1632773 -1418379 -990864 -702236 -726757
33215 -726757 -864210 -856979 -742902 -709528 -743376 -688086 -582165 -642912 -891634 -1070882 -1024822
33204 -1024822 -925227 -982050 -1120509 -1121686 -959159 -812536 -804394 -878994 -923910 -893108 -809989
33193 -809989 -731019 -703843 -709569 -675526 -595741 -584030 -727823 -937803 -1042852 -1003046 -920389
33182 -920389 -861811 -802410 -745333 -744334 -758170 -637337 -361620 -165928 -280451 -617604 -872626
33171 -872626 -895356 -800463 -725940 -671501 -620253 -639432 -753884 -849228 -824623 -755673 -787681
33160 -787681 -928133 -1052372 -1067175 -974864 -826964 -706837 -700309 -784221 -808594 -702584 -625910
33149 -625910 -770702 -1071588 -1284345 -1318237 -1299074 -1307618 -1266339 -1131430 -996522 -917390 -802760
33138 -802760 -585054 -358633 -241235 -225482 -275378 -438917 -729393 -1002516 -1102616 -1060154
33128 -1060154 -1008673 -971218 -869377 -694597 -530474 -434942 -422113 -518961 -702100 -813180
33118 -813180 -699879 -444792 -298261 -355043 -447203 -413262 -331234 -385719 -603246 -834096
33108 -834096 -944537 -924053 -830553 -731659 -703831 -794566 -940481 -983614 -835259 -605068 -505049
33097 -505049 -616965 -809533 -909524 -895604 -868888 -882112 -887070 -836552 -742806 -622314 -476445
33086 -476445 -360023 -375082 -531390 -681401 -670747 -518488 -390971 -426674 -627229 -878411
33076 -878411 -1032699 -1014358 -890158 -795806 -759524 -665683 -442679 -201793 -102683 -152016 -243673
33065 -243673 -343632 -504282 -716799 -883264 -949338 -951268 -908580 -782730 -593037 -479361
33055 -479361 -566033 -798099 -974468 -943577 -745593 -562636 -529446 -597273 -612696 -526525 -446232
33044 -446232 -443010 -414912 -254498 -69305 -67536 -253532 -424587 -487178 -569040 -736200 -810148
33033 -810148 -641063 -410171 -420371 -642112 -724023 -503862 -282116 -438138 -908224 -1238474
33023 -1238474 -1136020 -800330 -645625 -805699 -1029506 -1039249 -865129 -756143 -825394 -903139
33013 -903139 -771850 -458928 -210393 -201087 -358617 -487391 -489007 -417282 -377131 -435782 -596504
33002 -596504 -780070 -844724 -712553 -492603 -393959 -475809 -561137 -460487 -211449 -8681
32992 -8681 46557 5972 -91971 -295388 -596972 -844483 -894077 -789085 -691005 -669979 -660107
32981 -660107 -611089 -580905 -637344 -733021 -744680 -626590 -474612 -416908 -469994 -544688 -586745
32970 -586745 -644637 -760706 -863070 -854375 -772342 -746229 -792793 -786595 -672788 -567964 -557383
32959 -557383 -525662 -344478 -139945 -171161 -457262 -732979 -827000 -885225 -1092276 -1333504
32949 -1333504 -1334776 -1066881 -792392 -697318 -682431 -605259 -543725 -645317 -822131 -819822 -589370
32938 -589370 -383407 -407488 -544662 -554212 -418809 -323628 -352431 -391209 -344292 -282305 -311257
32927 -311257 -409810 -480076 -494690 -519879 -622319 -796966 -964849 -1022485 -925514 -739866 -584005
32916 -584005 -521371 -537782 -594089 -637221 -589427 -424306 -250588 -220114 -343242 -493787 -599300
32905 -599300 -701957 -810998 -843254 -773208 -705001 -706638 -692424 -572161 -411531 -331398 -337005
32894 -337005 -362587 -405123 -491653 -582315 -632734 -697688 -843398 -995272 -998396 -811900 -545605
32883 -545605 -333431 -258551 -350188 -541457 -671728 -645595 -555163 -541045 -588921 -590493 -542971
32872 -542971 -524508 -514723 -432320 -345486 -436328 -707739 -918207 -898708 -774177 -756646 -852737
32861 -852737 -921240 -932998 -1004669 -1179883 -1311928 -1222534 -925029 -639394 -585682 -777085
32851 -777085 -1021220 -1114165 -1013963 -831499 -697091 -660258 -685136 -709252 -714653 -738306 -788032
32840 -788032 -789163 -698686 -632844 -731380 -897202 -873861 -643529 -514820 -671351 -864633 -787631
32829 -787631 -562850 -552308 -793423 -961132 -864102 -652259 -499238 -388011 -298260 -331140
32819 -331140 -518038 -719608 -836846 -938767 -1078160 -1171213 -1175688 -1203086 -1315447 -1371383
32809 -1371383 -1225203 -956673 -764958 -729313 -783804 -837503 -830148 -758956 -714091 -784978 -896218
32798 -896218 -880963 -753202 -716760 -834779 -905719 -783646 -609290 -569110 -619600 -626855 -601112
32787 -601112 -601017 -572854 -494141 -517355 -731669 -915999 -795061 -453090 -227929 -246912 -326916
32776 -326916 -313075 -263587 -276483 -348645 -447016 -547421 -574278 -456971 -273738 -207891 -339346
32765 -339346 -575095 -765930 -798530 -635759 -391582 -293666 -428521 -607430 -642644 -638417
32755 -638417 -787151 -987116 -955277 -673501 -412965 -314967 -269208 -252324 -439793 -843736
32745 -843736 -1144368 -1084769 -811360 -624976 -581617 -546050 -486844 -491352 -571010 -644264 -671861
32734 -671861 -674839 -669357 -690014 -805188 -1000526 -1123513 -1056061 -872499 -722689 -637278 -561305
32723 -561305 -500050 -496290 -514845 -481118 -409226 -385382 -443468 -539688 -621204 -648429 -591940 -481696
32711 -481696 -419206 -476296 -622372 -788351 -923589 -952434 -803983 -569152 -486437 -640211
32701 -640211 -803208 -742307 -559669 -525627 -669690 -784283 -785037 -794355 -856583 -848970 -751109
32690 -751109 -741772 -893668 -996654 -867001 -661359 -670039 -901194 -1082019 -1029751 -836049
32680 -836049 -690997 -682852 -788567 -930587 -1005628 -948505 -800078 -656013 -550386 -453539
32670 -453539 -368218 -341994 -380898 -424961 -416508 -340538 -222223 -152076 -263927 -571986 -860729
32659 -860729 -883698 -674945 -507753 -520036 -558353 -462881 -322773 -314523 -430541 -532938 -578487
32648 -578487 -619536 -646221 -598246 -502543 -448990 -451453 -468353 -527060 -675165 -832299 -859783
32637 -859783 -780536 -762679 -859776 -923985 -817603 -575269 -323025 -164487 -161394 -278995 -339590
32626 -339590 -207364 -43458 -166324 -594681 -956326 -967914 -788735 -736310 -845776 -919173
32616 -919173 -865319 -760968 -660282 -557967 -499241 -548360 -674070 -799330 -911766 -1001740
32606 -1001740 -978234 -800959 -613775 -573753 -615371 -560587 -398162 -267052 -222932 -223167 -291341
32595 -291341 -471548 -645897 -636226 -496098 -468381 -618773 -740668 -687285 -580918 -594418
32585 -594418 -706005 -780712 -754202 -642687 -497834 -433147 -566455 -843578 -1025656 -941014
32575 -941014 -670994 -427533 -331328 -359247 -420323 -429800 -375554 -335646 -365351 -390010 -321886
32564 -321886 -254421 -377480 -690438 -969555 -1053649 -996080 -893085 -741671 -540687 -368481
32554 -368481 -270403 -203185 -159726 -207764 -339232 -434597 -453245 -505190 -649946 -779447 -793986
32543 -793986 -744482 -706910 -668936 -635693 -682937 -798289 -842749 -789407 -810806 -978799 -1081050
32532 -1081050 -948273 -786260 -906079 -1224413 -1329618 -1040015 -634178 -458215 -504280 -501782
32522 -501782 -322432 -154640 -252602 -581864 -816756 -731742 -484895 -382604 -462573 -530905
32512 -530905 -555464 -712469 -998372 -1129233 -968594 -752158 -698654 -690992 -579972 -511691
32502 -511691 -640130 -765705 -631949 -390709 -365574 -489796 -426895 -191006 -171324 -482600
32492 -482600 -731656 -585962 -222015 -15097 -57560 -189054 -297056 -380825 -444202 -487996
32482 -487996 -534783 -575022 -575656 -585197 -703917 -898056 -980104 -843910 -604537 -442944 -412826
32471 -412826 -445303 -443410 -335542 -130298 58017 121194 83081 21081 -87132 -298741 -538397
32460 -538397 -669240 -695499 -713646 -715063 -660346 -692267 -976088 -1329823 -1357408 -1029561 -782432
32449 -782432 -880760 -1022279 -828466 -447312 -327969 -553133 -749951 -641566 -398098 -375537
32439 -375537 -686919 -1110608 -1335664 -1249246 -1008447 -836477 -773050 -695071 -558178 -472818
32429 -472818 -508558 -580719 -605786 -620944 -653713 -619312 -476798 -369895 -468058 -737980 -986128
32418 -986128 -1066434 -962370 -744790 -535482 -435847 -422130 -398334 -394779 -566139 -908916 -1150890
32407 -1150890 -1068069 -780857 -577119 -549992 -578165 -574188 -564185 -559287 -513620 -416099 -324081
32396 -324081 -311814 -431600 -666525 -880725 -917379 -799029 -705380 -701208 -664827 -568490 -591675
32385 -591675 -786307 -874442 -646813 -367992 -448395 -827537 -1048968 -917201 -714203 -712543
32375 -712543 -814563 -807516 -706203 -666597 -737830 -857268 -970769 -1035902 -997148 -844629 -625721
32364 -625721 -369678 -108651 19330 -139638 -500680 -746546 -695272 -523497 -504616 -645658
32354 -645658 -730959 -649917 -524726 -522987 -659515 -809717 -862216 -834293 -844445 -967937 -1137934
32343 -1137934 -1224653 -1184925 -1068987 -908985 -703576 -510055 -433499 -493460 -602742 -706186
32333 -706186 -826758 -933798 -900525 -683110 -436654 -343113 -395254 -452762 -442828 -385339 -275775
32322 -275775 -99247 38060 -50034 -382837 -712395 -777881 -615468 -504284 -605487 -774305
32312 -774305 -792032 -678739 -635218 -712172 -723340 -551186 -367060 -391729 -544011 -535138 -292241
32301 -292241 -76508 -121316 -332049 -458302 -430624 -379010 -398683 -463730 -551478 -689456 -842335
32290 -842335 -888923 -789851 -676470 -670553 -693433 -593196 -422136 -406472 -602847 -770896 -704284
32279 -704284 -529758 -495061 -578045 -551523 -386170 -302299 -382699 -425634 -307339 -222570 -364097
32268 -364097 -581362 -611824 -497310 -491377 -646421 -777615 -794953 -789514 -786721 -686853 -500801
32257 -500801 -401193 -463605 -568773 -635358 -736337 -891838 -962005 -878094 -792024 -843137 -937764
32246 -937764 -926360 -856764 -860213 -891027 -787510 -544254 -337501 -290399 -362981 -467170 -550721
32235 -550721 -563149 -470803 -332751 -259405 -272431 -293941 -289518 -324822 -444990 -584191 -652133
32224 -652133 -656228 -681646 -775766 -890459 -924486 -807799 -575132 -379840 -397026 -660765 -1002928
32213 -1002928 -1198331 -1180900 -1082970 -1054129 -1091491 -1082151 -963523 -777252 -594794 -471832
32203 -471832 -465665 -598373 -780212 -862546 -807662 -726978 -718409 -762523 -819560 -902542 -975422
32192 -975422 -913353 -690406 -494026 -502036 -638255 -711968 -706876 -729230 -741810 -604782 -381002
32181 -381002 -342042 -595044 -911550 -1024058 -920679 -744822 -564634 -378115 -237093 -224373
32171 -224373 -345911 -526246 -682782 -772593 -809435 -842451 -871344 -820753 -680076 -592813 -658902
32160 -658902 -725399 -592494 -381739 -417397 -721233 -937692 -857053 -698653 -704906 -749928 -599469
32149 -599469 -327956 -190976 -240369 -342765 -460462 -636877 -786185 -771611 -651946 -604061
32139 -604061 -632482 -596901 -506112 -527662 -681012 -763300 -651143 -480046 -435620 -516090 -587747
32128 -587747 -565759 -469000 -373411 -353706 -410436 -447889 -391727 -309305 -320885 -410073 -433393
32117 -433393 -320846 -164807 -94738 -142366 -238752 -287229 -254465 -236777 -384929 -698196 -965838
32106 -965838 -1006172 -891270 -825724 -877024 -952762 -973512 -921727 -775302 -545716 -342987 -262276
32095 -262276 -250591 -218803 -213563 -316979 -452705 -485335 -451546 -483769 -557460 -546818 -496076
32084 -496076 -578601 -786686 -920092 -905087 -865804 -842778 -719129 -503319 -407654 -520630
32074 -520630 -644553 -599513 -470151 -404806 -378513 -318605 -277498 -306987 -323757 -270261 -259907
32063 -259907 -392358 -562635 -623764 -610334 -629516 -652710 -596770 -510989 -507012 -585293 -684077
32052 -684077 -804578 -931480 -938239 -757715 -562696 -583902 -803261 -1001379 -1054578 -1011738
32042 -1011738 -928280 -810341 -704391 -675956 -700499 -702192 -679066 -677351 -691505 -710389 -793301
32031 -793301 -957192 -1060843 -967238 -761388 -633931 -604642 -546812 -433693 -354333 -318371
32021 -318371 -263194 -240809 -370722 -597982 -726977 -725160 -762482 -900005 -979170 -908143 -828196
32010 -828196 -867415 -924854 -845516 -649995 -447255 -263161 -104026 -63591 -206139 -429895
32000 -429895 -580256 -619946 -582320 -468230 -316760 -258442 -337655 -385741 -253443 -83672
31990 -83672 -140594 -413171 -614454 -576259 -423806 -320295 -259869 -207356 -241703 -404720 -547690
31979 -547690 -510520 -377659 -376179 -547032 -691024 -658369 -530420 -454168 -441213 -438255 -484380
31968 -484380 -644045 -835343 -893805 -814040 -765968 -820721 -819216 -617470 -328935 -172793 -172701
31957 -172701 -180511 -144032 -151413 -216311 -233466 -201023 -281136 -529261 -740382 -720928 -581558
31946 -581558 -577250 -741936 -877706 -868915 -808325 -797853 -808413 -799890 -830043 -944647 -1054191
31935 -1054191 -1025274 -855817 -683646 -634084 -702098 -776802 -762145 -678727 -636210 -685334 -736411
31924 -736411 -686585 -592629 -616841 -804965 -1026073 -1147124 -1149073 -1040026 -799072 -493958
31914 -493958 -325832 -419610 -639868 -743231 -667568 -552293 -514191 -531651 -532181 -474048 -346472
31903 -346472 -193236 -123322 -196124 -322184 -390952 -451674 -611407 -789807 -784148 -593772 -454301
31892 -454301 -485323 -537074 -501743 -537102 -782657 -1043586 -1012579 -706051 -439610 -421614 -581988
31881 -581988 -760038 -848226 -773099 -547188 -343473 -325953 -406382 -364124 -202688 -161989 -348282
31870 -348282 -583830 -686984 -679669 -633566 -529218 -379740 -294562 -298204 -274058 -206312 -264733
31859 -264733 -493955 -639381 -496297 -245174 -192136 -327498 -415523 -408310 -469227 -639468
31849 -639468 -778744 -832631 -885088 -932024 -876250 -785247 -865582 -1085945 -1105049 -743303 -304728
31838 -304728 -218275 -503062 -799947 -844599 -704104 -580385 -572423 -663829 -804056 -931673
31828 -931673 -985428 -951409 -877848 -812865 -740793 -612567 -447777 -364721 -446361 -586652 -573393
31817 -573393 -372580 -223042 -345993 -648916 -857967 -877934 -842996 -839729 -792840 -668494
31807 -668494 -591462 -655808 -764250 -772967 -692908 -635376 -632621 -615202 -521086 -355171 -185324
31796 -185324 -124488 -248834 -484173 -648008 -656070 -608236 -620083 -668490 -679605 -674124 -723853
31785 -723853 -829762 -937001 -1016866 -1050742 -990752 -826272 -643619 -538599 -514696 -538290
31775 -538290 -628938 -798274 -952244 -967121 -844658 -700622 -612336 -556559 -488712 -415199 -388517
31764 -388517 -465871 -641418 -788692 -737253 -471166 -190023 -93253 -155121 -196306 -127232 -22750
31753 -22750 7958 -78982 -277409 -546252 -797186 -937296 -945831 -882950 -829787 -830433 -858359
31742 -858359 -833526 -727057 -640808 -686045 -786207 -748107 -560254 -438239 -499775 -603014
31732 -603014 -634072 -723610 -968196 -1149202 -1018359 -714109 -573744 -633490 -658685 -601020
31722 -601020 -632152 -720331 -597076 -249748 -50900 -216232 -478117 -515439 -395200 -333736
31712 -333736 -311773 -240317 -265973 -540764 -845560 -828308 -541847 -372313 -450133 -503165 -353390
31701 -353390 -207786 -301787 -524646 -602786 -483958 -340067 -287027 -284604 -283708 -326935 -470281
31690 -470281 -670846 -793771 -744081 -597721 -560611 -740625 -986900 -1033551 -796434 -453183
31680 -453183 -236931 -234599 -387949 -595331 -777929 -910020 -1012794 -1087730 -1081011 -975702
31670 -975702 -873857 -876438 -907693 -802058 -575449 -451021 -557035 -745267 -803275 -723877
31660 -723877 -643936 -611599 -559892 -463770 -380918 -343191 -326652 -338161 -421795 -549579 -603757
31649 -603757 -523903 -405229 -390099 -506938 -675289 -828986 -951961 -1005478 -922026 -714947
$$ [...]
##END NTUPLES=NMR SPECTRUM
##END=
