##TITLE=31Pdec_DPA3005-01
 CDCl3, 24 sc
 31.5.2019
##JCAMPDX= 6.0         $$ Bruker NMR JCAMP-DX V2.0
##DATA TYPE= NMR SPECTRUM
##DATA CLASS= NTUPLES
##ORIGIN= UXNMR, Bruker Analytische Messtechnik GmbH
##OWNER= root
$$ XWIN-NMR		Version 3.5
$$ Fri May 31 15:56:07 2019 Russian Standard Time (UT+4h)  she@DPX200
##.OBSERVE FREQUENCY= 81.013821
##.OBSERVE NUCLEUS= ^31P
##.ACQUISITION MODE= SIMULTANEOUS
##.ACQUISITION SCHEME= undefined
##.AVERAGES= 24
##.DIGITISER RES= 17
##SPECTROMETER/DATA SYSTEM= spect
##.PULSE SEQUENCE= zgpg30
##.SOLVENT NAME= CDCl3
##.SHIFT REFERENCE= (INTERNAL, CDCl3, 0, 182.463)
##AUDIT TRAIL= $$ (NUMBER, WHEN, WHO, WHERE, WHAT)
$$ ##TITLE= Audit trail, XWIN-NMR		Version 3.5
$$ ##JCAMPDX= 5.01
$$ ##ORIGIN= Bruker BioSpin GmbH
$$ ##OWNER= she
$$ F:/spectra/data/she/nmr/P31/1/pdata/1/auditp.txt
$$ ##AUDIT TRAIL=  $$ (NUMBER, WHEN, WHO, WHERE, WHAT)
(   1,<2019-05-31 15:55:06.28 +0400>,<she>,<DPX200>,
      <created by zg, POWCHK disabled, PULCHK disabled
       configuration hash MD5:
       00 E9 B6 7A A2 85 ED C7 34 08 36 98 17 FE 4E 26
       data hash MD5: 32K
       F0 1E 0E C6 69 26 D3 DA B8 70 3C 67 A1 23 54 2E>)
(   2,<2019-05-31 15:55:09.48 +0400>,<she>,<DPX200>,
      <Start of raw data processing
       efp BC_mod = 2 LB = 1 FT_mod = 6 PKNL = 1 PHC0 = -2199.659 PHC1 = 113.7991 SI = 64K 
       data hash MD5: 64K
       96 54 B7 94 0F 77 8F BD F4 58 99 DE 7B 00 DC CD>)
(   3,<2019-05-31 15:55:25.67 +0400>,<she>,<DPX200>,
      <pk PHC0 = 9.95203 PHC1 = -23.8 
       data hash MD5: 64K
       E6 96 9A 31 75 FD 79 0F A1 46 A1 07 D6 D3 F5 91>)
(   4,<2019-05-31 15:55:29.12 +0400>,<she>,<DPX200>,
      <abs ABSG = 5 
       data hash MD5: 64K
       13 96 99 3B 93 96 1D 73 3B 9C 96 CB 67 BD 4A 94>)
$$ ##END=
$$ 
$$ hash MD5
$$ C8 3D 66 B1 9C BC 59 8B 6A 8A 45 67 D6 AC B8 67
##$RELAX= 
##$RELAX= 
##$RELAX= 
##$RELAX= 
##$RELAX= 
##$RELAX= 
##$RELAX= 
##$RELAX= 
$$ Bruker specific parameters
$$ --------------------------
##$DU= <F:/spectra>
##$EXPNO= 1
##$NAME= <P31>
##$PROCNO= 1
##$TYPE= <nmr>
##$USER= <she>
##$AMP= (0..31)
100 100 100 100 100 100 100 100 100 100 100 100 100 100 100 100 100 100 
100 100 100 100 100 100 100 100 100 100 100 100 100 100 
##$AQSEQ= 0
##$AQ_mod= 1
##$AUNM= <au_zg>
##$AUTOPOS= <>
##$BF1= 81.014009
##$BF2= 200.13
##$BF3= 200.13
##$BF4= 200.13
##$BF5= 200.13
##$BF6= 200.13
##$BF7= 200.13
##$BF8= 200.13
##$BYTORDA= 1
##$CFDGTYP= 0
##$CFRGTYP= 5
##$CHEMSTR= <none>
##$CNST= (0..31)
1 1 145 1 1 1 1 1 1 1 1 1 1 1 1 1 1 1 1 1 1 1 1 1 1 1 1 1 1 1 1 1 
##$CPDPRG= <waltz16>
##$CPDPRG1= <>
##$CPDPRG2= <waltz16>
##$CPDPRG3= <>
##$CPDPRG4= <mlev>
##$CPDPRG5= <mlev>
##$CPDPRG6= <mlev>
##$CPDPRG7= <mlev>
##$CPDPRG8= <mlev>
##$CPDPRGB= <>
##$CPDPRGT= <>
##$D= (0..31)
0 1 0 0 0 0 0 0 0 0 0 0.03 2e-05 3e-06 0 0 0 0 0 0 0 0 0 0 0 0 0 0 0 0 
0 0 
##$DATE= 1559303705
##$DBL= (0..7)
120 120 120 11 120 120 24 19 
##$DBP= (0..7)
150 150 150 150 150 150 150 150 
##$DBP07= 0
##$DBPNAM0= <>
##$DBPNAM1= <>
##$DBPNAM2= <>
$$ [...]
##$SUBNAM3= <"">
##$SUBNAM4= <"">
##$SUBNAM5= <"">
##$SUBNAM6= <"">
##$SUBNAM7= <"">
##$SUBNAM8= <"">
##$SUBNAM9= <"">
##$SW= 369.568048894756
##$SWIBOX= (0..15)
0 1 3 0 0 0 0 0 0 0 0 0 0 0 0 0 
##$SW_h= 29940.119760479
##$TD= 32768
##$TD0= 1
##$TE= 0
##$TE2= 300
##$TE3= 300
##$TEG= 300
##$TL= (0..7)
0 120 53 12 22 120 120 120 
##$TP= (0..7)
150 150 150 150 150 150 150 150 
##$TP07= 0
##$TPNAME0= <>
##$TPNAME1= <>
##$TPNAME2= <>
##$TPNAME3= <>
##$TPNAME4= <>
##$TPNAME5= <>
##$TPNAME6= <>
##$TPNAME7= <>
##$TPOAL= (0..7)
0.5 0.5 0.5 0.5 0.5 0.5 0.5 0.5 
##$TPOFFS= (0..7)
0 0 0 0 0 0 0 0 
##$TUNHIN= 0
##$TUNHOUT= 0
##$TUNXOUT= 0
##$USERA1= <user>
##$USERA2= <user>
##$USERA3= <user>
##$USERA4= <user>
##$USERA5= <user>
##$V9= 5
##$VALIST= <valist>
##$VCLIST= <CCCCCCCCCCCCCCC>
##$VD= 0
##$VDLIST= <DDDDDDDDDDDDDDD>
##$VPLIST= <PPPPPPPPPPPPPPP>
##$VTLIST= <TTTTTTTTTTTTTTT>
##$WBST= 1024
##$WBSW= 4
##$XGAIN= (0..3)
0 0 0 0 
##$XL= 0
##$YL= 0
##$YMAX_a= 55076
##$YMIN_a= -83998
##$ZGOPTNS= <>
##$ZL1= 120
##$ZL2= 120
##$ZL3= 120
##$ZL4= 120
##$ABSF1= 182.463
##$ABSF2= -187.1042
##$ABSG= 5
##$ABSL= 3
##$ALPHA= 0
##$AQORDER= 0
##$ASSFAC= 0
##$ASSFACI= 0
##$ASSFACX= 0
##$ASSWID= 0
##$AUNMP= <proc_1d>
##$AZFE= 0.1
##$AZFW= 0.5
##$BCFW= 0
##$BC_mod= 2
##$BYTORDP= 0
##$COROFFS= 0
##$CY= -3
##$DATMOD= 1
##$DC= 0
##$DFILT= <>
##$DTYPP= 0
##$F1P= 0
##$F2P= 0
##$FCOR= 1
##$FTSIZE= 65536
##$FT_mod= 6
##$GAMMA= 0
##$GB= 0
##$INTBC= 1
##$INTSCL= 5.30512e-09
##$ISEN= 30
##$LB= 1
##$LEV0= 0
##$LPBIN= 0
##$MAXI= 10000
##$MC2= 0
##$MEAN= 0
##$ME_mod= 0
##$MI= 50
##$NCOEF= 0
##$NC_proc= -3
##$NLEV= 6
##$NOISF1= 182.463
##$NOISF2= 159.3651
##$NSP= 0
##$NTH_PI= 0
##$NZP= 0
##$OFFSET= 182.463
##$PC= 4
##$PHC0= -2189.707
##$PHC1= 89.9991
##$PH_mod= 1
##$PKNL= yes
##$PPARMOD= 0
##$PSCAL= 0
##$PSIGN= 0
##$REVERSE= no
##$SF= 81.0140089999434
##$SI= 65536
##$SIGF1= 159.3651
##$SIGF2= -187.1042
##$SINO= 113.3802
##$SIOLD= 16384
##$SREGLST= <1H.CDCl3>
##$SSB= 0
##$STSI= 65536
##$STSR= 0
##$SW_p= 29940.119760479
##$SYMM= 0
##$S_DEV= 0
##$TDeff= 32768
##$TDoff= 0
##$TI= <>
##$TILT= no
##$TM1= 0
##$TM2= 0
##$TOPLEV= 0
##$USERP1= <user>
##$USERP2= <user>
##$USERP3= <user>
##$USERP4= <user>
##$USERP5= <user>
##$WDW= 1
##$XDIM= 65536
##$YMAX_p= 355906787
##$YMIN_p= -3503119
$$ End of Bruker specific parameters
$$ ---------------------------------
##NTUPLES= NMR SPECTRUM
##VAR_NAME=  FREQUENCY,     SPECTRUM/REAL,   SPECTRUM/IMAG
##SYMBOL=    X,             R,               I
##VAR_TYPE=  INDEPENDENT,   DEPENDENT,       DEPENDENT
##VAR_FORM=  AFFN,          ASDF,            ASDF
##VAR_DIM=   65536,         65536,           65536
##UNITS=     HZ,            ARBITRARY UNITS, ARBITRARY UNITS
##FACTOR=    0.456856943014862, 1,           1
##FIRST=     14782.0589164792, 0,            0
##LAST=      -15158.0608439998, 0,           0
##MIN=       -15158.0608439998, -3503119,    0
##MAX=       14782.0589164792, 355906787,    0
$$ Real data points
##PAGE= N=1
##DATA TABLE= (X++(R..R)), XYDATA
$$ [...]
$$ plain form
39582 317932 416105 417997 441612 554814 639918 584788 500000 585654 823796 978900 927008
39571 927008 815277 812659 848638 741285 495051 298845 245886 220926 111093 -5335
39561 -5335 21677 177570 280007 208550 46211 -48371 -47963 -59842 -140345 -204944 -167437 -84489
39549 -84489 -69649 -116517 -130331 -117092 -188546 -337569 -360705 -112838 262801 486423 463373
39538 463373 331162 232427 189282 204809 336650 591279 824604 835603 558103 138752
39528 138752 -169778 -207761 -35159 146423 217716 243387 304335 311664 126432 -164443 -280220
39517 -280220 -114739 101328 130885 70666 165259 379210 420365 206064 39226 190861
39507 190861 511523 648420 512395 307262 174450 67022 -14974 72722 361715 606618
$$ packed form
39582C17932R8173J892K3615J13202Q5104n5130q4788Q5654K38142J55104n1892
39571I27008j11731k618L5979j07353k46234j96206n2959k4960j09833j16428
39561e335K7012J55893J02437p1457j62339r4582M08j1879q0503o4599L7507Q2948
39549h4489J4840m6868j3814J3239p1454j49023k3136K47867L75639K23622k3050
39538D63373j32211r8735m3145J5527J31841K54629K33325J0999k77500m19351
39528A38752l08530l7983J72602J81582P1293K5671O0948P329j85232k90875j15777
39517b80220J65481K16067K9557o0219R4593K13951M1155k14301j66838J51635
39507A90861L20662J36897j36025k05133j32812j07428q1996Q7696K88993K44903
$$ plain form
39497 606618 553884 288341 153596 347363 708874 915169 816326 558031 402088 444087
39487 444087 535805 506980 392742 341635 359967 322364 228569 233732 361491 408169 255463
39476 255463 75351 62123 150087 194044 245565 397969 513327 412651 239843 295290
39466 295290 538386 610935 397582 213750 313817 518637 516576 302278 113852 97755
39456 97755 223220 411294 587511 693733 766687 909624 1091273 1102835 839290 501330
39446 501330 370768 478401 637101 720644 755451 791535 837762 911661 1032099 1160652
39436 1160652 1234469 1253220 1276360 1355324 1511819 1740595 1984922 2158919 2250311 2357749
39426 2357749 2573023 2860647 3092087 3164579 3067557 2880392 2716171 2612900 2485574 2257656
$$ packed form
39497F06618n2734k65543j34745J93767L61511K06295r8843k58295j55943M1999
39487D44087R1718k8825j14238n1107J8332l7603r3795N163J27759M6678j52706
39476B55463j80112j3228Q7964M3957N1521J52404J15358j00676j72808N5447
39466B95290K43096P2549k13353j83832J00067K04820k061k14298j88426j6097
39456I7755J25465J88074J76217J06222P2954J42937J81649J1562k63545l37960
39446E01330j30562J07633J58700Q3543L4807L6084M6227P3899J20438J28553
39436A160652P3817J8751K3140P8964J56495K28776K44327J73997R1392J07438
39426B357749K15274K87624K31440P2492r7022j87165j64221j03271j27326k27918
$$ plain form
39416 2257656 2014784 1916331 1974653 2071446 2193646 2470596 2936399 3451826 3949196 4561395
39406 4561395 5363477 6131080 6519190 6399245 5899771 5205777 4450715 3743742 3175044
39397 3175044 2794741 2615778 2586250 2569277 2471351 2392031 2485612 2671840 2713389 2631024 2757722
39386 2757722 3233005 3712856 3803082 3558039 3292048 3085146 2782282 2368326 2031281 1883196
39376 1883196 1865894 1909738 1972726 1959447 1814509 1669875 1702807 1876132 2001050 2011658
39366 2011658 1992741 1999520 2059865 2297882 2826424 3550751 4292454 5058676 5968216 6999570
39356 6999570 8106070 9501046 11413040 13477574 14756425 14574077 13120683 11115192
39348 11115192 9144549 7488377 6275117 5472115 4833278 4132775 3432852 2954132 2732814
$$ packed form
39416B257656k42872r8453N8322R6793J22200K76950M65803N15427M97370O12199
39406D561395Q02082P67603L88110j19945m99474o93994p55062p06973n68698
39397C175044l80303j78963k9528j6973r7926p9320R3581J86228M1549q2365J26698
39386B757722M75283M79851R0226k45043k65991k06902l02864m13956l37045j48085
39376A883196j7302M3844O2988j3279j44938j44634L2932J73325J24918J0608
39366B011658j8917O779O0345K38017N28542P24327P41703P66222R09540J031354
39356F999570J106500J394976J911994K064534J278851j82348j453394k005491
39348A1115192j970643j656172j213260q03002o38837p00503o99923m78720k21318
$$ plain form
39339 2732814 2574787 2318997 1988394 1681073 1449067 1315562 1309520 1420626 1554018 1578219
39329 1578219 1438973 1222364 1070882 1014620 937581 768358 640868 749901 1068873 1342535
39319 1342535 1377722 1222437 1028690 868232 752328 721061 802746 936406 1031969 1091438
39309 1091438 1192768 1349798 1460427 1441073 1374995 1442599 1677890 1881920 1868730 1733345
39299 1733345 1738005 1966920 2276272 2599076 3090989 3909217 5048780 6452276 7986056
39290 7986056 9152779 9185904 7810678 5739351 4036745 3083114 2495762 1941423 1546894
39281 1546894 1469191 1526849 1462623 1268998 1066966 896723 784484 803829 923465 980431
39271 980431 921478 874490 877401 773678 522882 370092 496546 699576 659655 386883
$$ packed form
39339B732814j58027k55790l30603l07321k32006j33505o042J11106J33392K4201
39329A578219j39246k16609j51482n6262p7039j69223j27490J09033L18972K73662
39319A342535L5187j55285j93747j60458j15904l1267Q1685J33660R5563N9469
39309A091438J01330J57030J10629j9354o6078O7604K35291K04030j3190j35385
39299A733345M660K28915L09352L22804M91913Q18228J139563J403496J533780
39290G986056J166723L3125j375226k071327j702606r53631n87352n54339l94529
39281A546894p7703N7658o4226j93625k02032j70243j12239J9345J19636N6966
39271I80431n8953m6988K911j03723k50796j52790J26454K03030l9921k72772
$$ plain form
39261 386883 164986 144468 215926 236043 180231 90070 29680 85491 281534 501114 586716
39250 586716 500288 321157 141488 40337 91372 293464 534273 703938 802762 874231
39240 874231 900534 847064 748045 659251 578574 498674 482167 581979 721279 760233 683666
39229 683666 634887 734268 919912 1020151 980503 964704 1169626 1560683 1901795 2080051
39219 2080051 2253276 2564142 2854295 2858904 2593858 2317847 2153829 1999976 1812280 1697845
39209 1697845 1664103 1540435 1270411 1060695 1094912 1278635 1411550 1455447 1485495 1511604
39199 1511604 1498940 1467470 1447431 1420140 1393330 1436349 1558412 1656145 1655273 1596527 1526382
39188 1526382 1435171 1360220 1400908 1567550 1770410 2009288 2379213 2813506 3041128 2918453
$$ packed form
39261C86883k21897k0518P1458K0117n5812r0161o0390N5811J96043K19580Q5602
39250E86716q6428j79131j79669j01151N1035K02092K40809J69665R8824P1469
39240H74231K6303n3470r9019q8794q0677p9900j6507R9812J39300L8954p6567
39229F83666m8779R9381J85644J00239l9648j5799K04922L91057L41112J78256
39219B080051J73225L10866K90153M609k65046k76011j64018j53853j87696j14435
39209A697845l3742j23668k70024k09716L4217J83723J32915M3897L0048K6109
39199A511604j2664l1470k0039k7291k6810M3019J22063R7733q72n8746p0145
39188A526382r1211p4951M0688J66642K02860K38878L69925M34293K27622j22675
$$ plain form
39178 2918453 2604625 2295798 2008453 1755556 1674835 1777872 1806269 1583282 1317930 1310374
39168 1310374 1533852 1777705 2037325 2451550 2975444 3449827 3935431 4642451 5510138
39159 5510138 6139484 6207973 5760356 5071724 4410540 3947929 3708638 3558601 3356609 3123331
39149 3123331 2969726 2915434 2902465 2923723 3003229 3121525 3298453 3665187 4318049 5207168
39139 5207168 6285815 7557845 8755208 9217770 8499807 7014828 5700556 5069609 4926198
39130 4926198 4933581 4990504 5033721 5022821 5310840 6481402 8413879 9906547 9765948 8138862
39120 8138862 6334411 5406367 5332228 5553475 5782906 6014822 6107022 5794974 5084751 4324308
39110 4324308 3802341 3458210 3083860 2666308 2372565 2256659 2162342 1959744 1745129 1701920
$$ packed form
39178B918453l13828l08827k87345k52897q0721J03037K8397k22987k65352p556
39168A310374K23478K43853K59620M14225N23894M74383M85604P07020Q67687
39159E510138O29346O8489m47617o88632o61184m62611k39291j50037k01992k33278
39149C123331j53605n4292j2969K1258P9506J18296J76928L66734O52862Q89119
39139E207168J078647J272030J197363M62562p17963j484979j314272o30947j43411
39130D926198P383N6923M3217j0900K88019J170562J932477J492668j40599j627086
39120H138862j804451r28044p4139K21247K29431K31916R2200l12048p10223p60443
39110D324308n21967l44131l74350m17552k93743j15906r4317k02598k14615m3209
$$ plain form
39100 1701920 1821510 1873286 1667134 1281855 993856 997316 1232808 1502592 1699971 1844248
39090 1844248 1917009 1823351 1588576 1432423 1490759 1589790 1505357 1347245 1414222 1705542
39080 1705542 1886733 1783465 1609706 1612821 1777807 2008493 2315775 2649345 2802854 2703254
39070 2703254 2589152 2703354 3009773 3409056 4013883 4981765 6271901 7774657 9425177
39061 9425177 10912218 11554091 10885246 9245094 7429670 5879300 4561040 3485195
39053 3485195 2829469 2536724 2255098 1814983 1430750 1305074 1323163 1272595 1125420 967563
39043 967563 833682 727027 670741 672332 736593 903099 1143820 1280579 1184038 998415
39033 998415 961622 1056734 1071166 946083 804538 673586 476014 299236 363992 668481
$$ packed form
39100A701920J19590N1776k06152l85279k87999L460K35492K69784J97379J44277
39090A844248P2761r3658k34775j56153N8336R9031q4433j58112O6977K91320
39080A705542J81191j03268j73759L115J64986K30686L07282L33570J53509r9600
39070B703254j14102J14202L06419L99283O04827R67882J290136J502756J650520
39061I425177J487041O41873o68845j640152j815424j550370j318260j075845
39053C485195o55726k92745k81626m40115l84233j25676J8089n0568j47175j57857
39043I67563j33881j06655n6286J591O4261J66506K40721J36759r6541j85623
39033I98415l6793R5112J4432j25083j41545j30952j97572j76778O4756L04489
$$ plain form
39023 668481 932273 961518 836313 693887 573607 528351 638673 838946 942436 894936
39013 894936 806521 721002 588583 473111 516000 670490 758905 822659 1084823 1492195
39003 1492195 1653887 1387669 1001683 840263 846048 800223 724566 754383 805264 683552
38993 683552 443225 353100 511811 704017 680173 447346 228775 201733 333912 478599
38983 478599 574147 664161 735807 694642 562150 519793 632555 713598 634706 574258 726699
38972 726699 952416 990660 848943 683346 477832 193820 52457 246471 521139 504145
38962 504145 324334 389724 653344 687256 456177 387543 617098 798541 777728 812073
38952 812073 944765 821111 389069 142955 337224 559639 462215 328224 472049 636908
$$ packed form
39023F68481K63792K9245j25205j42426j20280m5256J10322K00273J03490m7500
39013H94936q8415q5519j32419j15472M2889J54490Q8415O3754K62164M07372
39003A492195J61692k66218l85986j61420N785m5825p5657K9817N0881j21712
38993F83552k40327r0125J58711J92206k3844k32827k18571k7042J32179J44687
38983D78599R5548R0014P1646m1165j32492m2357J12762Q1043p8892o0448J52441
38972G26699K25717L8244j41717j65597k05514k84012j41363J94014K74668j6994
38962E04145j79811O5390K63620L3912k31079o8634K29555J81443k0813L4345
38952H12073J32692j23654m32042k46114J94269K22415r7424j33991J43825J64859
$$ plain form
38942 636908 510216 346978 509259 788610 766836 519843 395893 382070 256382 125490
38932 125490 248357 516042 637225 667926 843552 1053750 1009239 790227 706121 727819
38922 727819 584684 332056 283749 424398 417113 201130 85872 210936 367380 410835
38912 410835 436658 492066 505352 546428 774559 1077982 1139653 917456 697664 620076 527653
38901 527653 370293 377337 679769 1073895 1318914 1417681 1468803 1472905 1429017 1441754 1599069
38890 1599069 1854469 2096750 2242188 2249124 2153114 2089331 2199594 2549069 3150321 3893926
38880 3893926 4379638 4104708 3062483 1925348 1345111 1262919 1195193 958944 725860
38871 725860 560880 379067 266505 386873 601646 603114 408399 319144 405330 439660
$$ packed form
38942F36908j26692j63238J62281K79351k1774k46993j23950j3823j25688j30892
38932A25490J22867K67685J21183L0701J75626K10198m4511k19012q4106K1698
38922G27819j43135k52628m8307J40649p285k15983j15258J25064J56444M3455
38912D10835K5823N5408J3286M1076K28131L03423O1671k22197k19792p7588r2423
38901E27653j57360P044L02432L94126K45019R8767N1122M102m3888J2737J57315
38890A599069K55400K42281J45438O936r6010o3783J10263L49475O01252P43605
38880C893926M85712k74930j042225j137135n80237q2192o7726k36249k33084
38871G25860j64980j81813j12562J20368K14773J468j94715q9255Q6186L4330
$$ plain form
38861 439660 348678 311340 372549 365026 275152 296097 443760 498787 415302 414304 567178 648620
38849 648620 530300 383214 351763 341648 274310 255045 333634 366065 273089 201932 275843
38838 275843 378387 326807 112826 -118046 -200399 -36458 303778 576558 612334 522611
38828 522611 493536 487434 386862 297910 384380 504041 389789 138169 111857 361050 551876
38817 551876 506079 408423 408966 411687 360592 372480 465840 481976 384038 336464 406252 480765
38805 480765 536637 675981 847142 858962 722668 647921 665819 609753 490100 486257 528117
38794 528117 329866 -73454 -278222 -131668 43847 3051 -82316 -22072 77771 117011
38784 117011 225200 451350 585409 512332 413217 418143 398607 291114 267035 379664 405728
$$ packed form
38861D39660r0982l7338O1209p523q9874K0945J47663N5027q3485r98J52874Q1442
38849F48620j18320j47086l1451j0115o7338j9265P8589L2431r2976p1157P3911
38838B75843J02544n1580k13981k30872q2353J63941L40236K72780L5776q9723
38828E22611k9075o102j00572q8952Q6470J19661j14252k51620k6312K49193J90826
38817E51876m5797r7656N43K721n1095J1888R3360J6136r7938m7574O9788P4513
38805D80765N5872J39344J71161J1820j36294p4747J7898n6066j19653l843M1860
38794E28117j98251m03320k04768J46554J75515m0796q5367O0244R9843L9240
38784A17011J08189K26150J34059p3077r9115M926j9536j07493k4079J12629K6064
$$ plain form
38773 405728 251890 156616 262868 351487 238977 87349 72725 96848 81969 196313
38763 196313 505095 736616 694384 588984 660995 774726 700043 528832 497012 615071
38753 615071 748758 856259 913046 823194 610655 465317 431737 326300 110470 9856
38743 9856 96866 139807 65439 141982 444081 588851 344135 71612 167564 450886 542318
38732 542318 500526 599851 759156 694341 448514 308874 330951 346195 319895 341960 378512
38721 378512 352100 346550 450327 542427 497657 436512 515781 656831 730955 807432 962569
38710 962569 1059615 978321 847493 806283 771891 679947 680554 838732 936985 860568 869679 1164534
38698 1164534 1478191 1461556 1216631 1091875 1177097 1336431 1517665 1700936 1751022 1632088
$$ packed form
38773D05728j53838r5274J06252Q8619j12510j51628j4624K4123j4879J14344
38763A96313L08782K31521m2232j05400P2011J13731p4683j71211l1820J18059
38753F15071J33687J07501N6787q9852k12539j45338l3580j05437k15830j00614
38743I856Q7010M2941p4368P6543L02099J44770k44716k72523R5952K83322R1432
38732E42318m1792R9325J59305o4815k45827j39640K2077J5244k6300K2065L6552
38721C78512k6412n550J03777R2100m4770o1145P9269J41050P4124P6477J55137
38710I62569R7046q1294j30828m1210l4392r1944O07J58178R8253p6417R111K94855
38698A164534L13657j6635k44925j24756Q5222J59334J81234J83271N0086j18934
$$ plain form
38688 1632088 1583951 1833687 2331291 2940209 3584003 4024062 3889715 3195239 2449287 1991996
38678 1991996 1631997 1192799 919188 992083 1130935 1077821 1012681 1095122 1095619 915047 943218
38667 943218 1402960 1848466 1845711 1648427 1650806 1700145 1561545 1528784 1882912 2233399 2129511
38656 2129511 1883623 2039096 2439884 2604316 2632740 2938931 3422429 3715930 3954489 4513669
38646 4513669 5273218 5903529 6573692 7609634 8787084 9760373 10844701 12545715 14673476
38637 14673476 16797900 19237998 22698806 27229484 32311085 37390019 41311781 41970224
38629 41970224 38121502 31382558 24993653 20593578 17446379 14622453 12285776 10610109
38621 10610109 9037139 7260373 5799483 5029164 4567868 4055223 3658204 3455161 3164360
$$ packed form
38688A632088m8137K49736M97604O08918O43794M40059j34347o94476p45952m57291
38678A991996l59999m39198k73611P2895J38852n3114o5140Q2441M97j80572K8171
38667I43218M59742M45506k755j97284K379M9339j38600l2761L54128L50487j03888
38656B129511k45888J55473M00788J64432K8424L06191M83498K93501K38559N59180
38646D513669P59549O30311O70163J035942J177450R73289J084328J701014K127761
38637A4673476K124424K440098L460808M530678N081601N078934L921762O58443
38629D1970224l848722o738944o388905m400075l147199k823926k336677j675667
38621A0610109j572970j776766j460890p70319m61296n12645l97019k03043k90801
$$ plain form
38612 3164360 2779014 2651615 2724448 2510964 2013067 1786704 1945870 1996160 1783859 1679964
38602 1679964 1711963 1492265 1127142 1183981 1626485 1810634 1645851 1679249 1928964 1803332
38592 1803332 1329068 1239303 1624598 1725426 1322561 1102716 1359628 1558858 1476395 1535139
38582 1535139 1750246 1616503 1283559 1495924 2126446 2202460 1647222 1465921 1897740 2010872
38572 2010872 1522030 1329869 1765963 2025204 1849557 2032375 2715839 2994207 2749362
38563 2749362 2980643 3774458 4003235 3616313 3983350 5297467 6077748 6036468 6789674
38554 6789674 8770969 10312736 10965840 12658689 16122776 19384077 21429177 23904914
38546 23904914 27338864 29540183 30015463 31771732 36091827 40302772 44019118 52113246
$$ packed form
38612C164360l85346j27399P2833k13484m97897k26363J59166N0290k12301j03895
38602A679964L1999k19698l65123N6839M42504J84149j64783L3398K49715j25632
38592A803332m74264q9765L85295J00828m02865k19845K56912J99230q2463N8744
38582A535139K15107j33743l32944K12365O30522P6014n55238j81301M31819J13132
38572B010872m88842j92161M36094K59241j75647J82818O83464K78368k44845
38563B749362K31281P93815K28777l86922L67037J314117P80281m1280P53206
38554F789674J981295J541767O53104J692849L464087L261301K045100K475737
38546B3904914L433950K201319M75280J756269M320095M210945L716346Q094128
$$ plain form
38538 52113246 67386080 87160841 113160359 155522978 214275378 262250377 263866444
38531 263866444 214363013 147376706 98672794 73942993 58179071 43270207 33329277
38524 33329277 30137277 28199938 24220139 20997298 20286351 19370109 16483977 13620455
38516 13620455 12151452 10536978 7995279 6267548 6186838 6071951 4934438 4119450 4477040
38507 4477040 4770932 4133009 3524268 3600993 3468707 2631685 2031936 2157972 2118140 1491604
38497 1491604 1180193 1568669 1705984 1164162 895858 1367345 1591874 953385 343998
38488 343998 517650 841703 663926 489484 803054 1042892 747636 517737 859315 1186359
38478 1186359 924898 569258 701856 929116 725852 460485 659970 1020606 1007125 752545
$$ packed form
38538E2113246J5272834J9774761K5999518M2362619N8752400M7974999J616067
38531B63866444m9503431o6986307m8703912k4729801j5763922j4908864r940930
38524C3329277l192000j937339l979799l222841p10947r16242k886132k863522
38516A3620455j469003j614474k541699j727731q0710j14887j137513q14988L57590
38507D477040K93892o37923o08741P6725j32286q37022n99749J26036l9832o26536
38497A491604l11411L88476J37315n41822k68304M71487K24529o38489o09387
38488C43998J73652L24053j77777j74442L13570K39838k95256k29899L41578L27044
38478A186359k61461l55640J32598K27260k03264k65367J99485L60636j3481k54580
$$ plain form
38468 752545 600133 420834 99278 35004 462287 893602 888137 758623 899954 1049166
38458 1049166 850134 557898 548473 674136 691812 785907 1093604 1255080 1014386 753353
38448 753353 865955 1096560 1041546 819745 713440 628502 440646 397952 639835 772858
38438 772858 464113 30713 -74756 57992 132987 223629 487192 713088 687854 643624
38428 643624 839813 1058065 1001137 831413 822705 833571 625153 365221 319429 356835 244534
38417 244534 125408 225260 381027 330351 189229 192722 245510 167264 89364 173014 241727
38406 241727 134338 94822 343869 600417 538890 395258 557891 842731 779802 410193
38396 410193 196389 283318 418625 501594 662125 854593 881986 799252 850871 1045593
$$ packed form
38468G52545j52412j79299l21556o4274M27283M31315n465j29514J41331J49212
38458A049166j99032k92236r425J25663J7676R4095L07697J61476k40694k61033
38448G53353J12602K30605n5014k21801j06305q4938j87856m2694K41883J33023
38438G72858l08745m33400j05469J32748P4995R0642K63563K25896k5234m4230
38428F43624J96189K18252n6928j69724q708J0866k08418k59932m5792L7406j12301
38417B44534j19126R9852J55767n0676j41122L493N2788p8246p7900Q3650O8713
38406B41727j07389l9516K49047K56548o1527j43632J62633K84840o2929l69609
38396D10193k13804Q6929J35307Q2969J60531J92468K7393q2734N1619J94722
$$ plain form
38386 1045593 1199684 1345513 1698200 2258633 2797122 3155100 3249897 2940422 2266395 1658443
38376 1658443 1484128 1514452 1271807 775990 470285 501449 584758 568300 633919 880276
38366 880276 1146098 1337252 1546519 1749263 1722217 1391183 1001227 836094 943854 1167298
38356 1167298 1291051 1192268 987942 932289 1031050 963092 589391 261944 308979 498975
38346 498975 443819 282470 433169 830833 999563 828852 690833 757053 769574 596091
38336 596091 477769 555638 623056 544211 497511 599016 668080 577519 485970 514810 528370
38325 528370 451500 486125 767487 1075234 1129072 951403 731806 549862 427200 437200
38315 437200 557853 604339 494625 402556 477821 603268 608903 547194 571247 694182 831958
$$ packed form
38386A045593J54091J45829L52687N60433N38489L57978R4797l09475o74027o07952
38376A658443j74315L0324k42645m95817l05705L1164Q3309j6458O5619K46357
38366H80276K65822J91154K09267K02744k7046l31034l89956j65133J07760K23444
38356A167298J23753r8783k04326n5653R8761o7958l73701l27447M7035J89996
38346D98975n5156j61349J50699L97664J68730j70711j38019O6220J2521j73483
38336E96091j18322P7869O7418p8845m6700J01505O9064r0561r1549K8840J3560
38325E28370p6870L4625K81362L07747N3838j77669k19597j81944j22662J0000
38315D37200J20653M6486j09714r2069P5265J25447N635o1709K4053J22935J37776
$$ plain form
38304 831958 932445 924919 725624 443526 376404 619845 879125 875769 745761 791716 1013017
38293 1013017 1162196 1145921 1084752 1054514 1046531 1132294 1385679 1652316 1664458 1408174 1134162
38282 1134162 979939 845766 713524 802600 1232059 1738146 1957502 1880340 1804095 1895687
38272 1895687 2027277 2062976 2094571 2285536 2619060 2941724 3194270 3461921 3803596 4150422
38262 4150422 4412548 4614138 4880843 5332122 5998568 6791296 7533422 8081129 8452550
38253 8452550 8804783 9267152 9832629 10406969 10896168 11239019 11435906 11567563 11706381
38244 11706381 11794122 11703526 11435821 11133023 10865657 10567141 10249332 10106273 10268870 10600765
38234 10600765 10896563 11157549 11487302 11820492 11978487 11946581 11878524 11830399 11684836 11357634
$$ packed form
38304H31958J00487p526j99295k82098o7122K43441K59280l356j30008M5955K21301
38293A013017J49179j6275o1169l0238p983Q5763K53385K66637J2142k56284k74012
38282A134162j54223j34173j32242Q9076M29459N06087K19356p7162p6245R1592
38272A895687J31590L5699L1595J90965L33524L22664K52546K67651L41675L46826
38262D150422K62126K01590K66705M51279O66446P92728P42126N47707L71421
38253H452550L52233M62369N65477N74340M89199L42851J96887J31657J38818
38244A1706381Q7741r0596k67705l02798k67366k98516l17809j43059J62597L31895
38234A0600765K95798K60986L29753L33190J57995l1906o8057m8125j45563l27202
$$ plain form
38224 11357634 10906670 10407157 9878104 9372916 8995478 8764062 8570852 8333473 8100469
38215 8100469 7964549 7947233 8005117 8089018 8171881 8265956 8425171 8699980 9098333 9600713
38205 9600713 10156672 10649103 10971393 11202484 11573758 12143832 12621367 12659188 12237286 11616666
38195 11616666 11026033 10569528 10328896 10315996 10366484 10298750 10160203 10136020 10267539 10458704
38185 10458704 10683110 10935744 11047028 10846987 10493158 10308774 10267654 9979107 9266503
38176 9266503 8426350 7778174 7272034 6723485 6151791 5656711 5187103 4673851 4224476
38167 4224476 3962624 3806453 3599082 3335991 3092741 2858762 2611984 2426673 2339071 2235852
38157 2235852 2034673 1828570 1687893 1495566 1180787 929340 904151 925521 744613 514936
$$ packed form
38224A1357634m50964m99513n29053n05188l77438k31416j93210k37379k33004
38215H100469j35920j7316N7884Q3901Q2863R4075J59215K74809L98353N02380
38205I600713N55959M92431L22290K31091L71274N70074M77535L7821m21902o20620
38195A1616666n90633m56505k40632j2900N0488o7734j38547k4183J31519J91165
38185A0458704K24406K52634J11284k00041l53829j84384m1120k88547p12604
38176I266503q40153o48176n06140n48549n71694m95080m69608n13252m49375
38167D224476k61852j56171k07371k63091k43250k33979k46778j85311q7602j03219
38157B235852k01179k06103j40677j92327l14779k51447k5189K1370j80908k29677
$$ plain form
38147 514936 626293 1096941 1489867 1490842 1260746 1114270 1115835 1134623 1096398 1024044 952170
38136 952170 915324 931361 936378 840763 690186 644109 744958 838328 779893 597433 393889
38125 393889 225750 146917 231876 452294 640477 680030 646032 664945 723423 714493 599239
38114 599239 427692 263013 168021 195966 307342 367323 315610 261856 315240 411907 443429
38103 443429 468878 619307 834547 896288 738261 539531 464275 481643 512123 576581 682228
38092 682228 709807 572160 386383 328152 388190 438249 471830 573603 674994 584037 316020
38081 316020 159998 280466 445017 343928 50580 -71731 126158 403161 479785 358920
38071 358920 219300 161205 176808 250631 347904 368105 244224 66712 159 81613 192107
$$ packed form
38147E14936J11357M70648L92926R75k30096j46476J565J8788l8225p2354p1874
38136I52170l6846J6037N017r5615j50577m6077J00849R3370n8435j82460k03544
38125C93889j68139p8833Q4959K20418J88183L9553l3998J8913N8478q930j15254
38114E99239j71547j64679r4992K7945J11376N9981n1713n3754N3384R6667L1522
38103D43429K5449J50429K15240O1741j58027j98730p5256J7368L0480O4458J05647
38092F82228K7579j37647j85777n8231O0038N0059L3581J01773J01391r0957k68017
38081C16020j56022J20468J64551j01089k93348j22311J97889K77003P6624j20865
38071C58920j39620n8095J5603P3823R7273K0201j23881j77512o6553Q1454J10494
$$ plain form
38060 192107 225829 194599 151183 106469 71272 103103 234199 389026 449425 395028 313036
38049 313036 262167 198398 74847 -43819 -41545 89523 220589 230187 123267 -6221 -72206
38038 -72206 -33066 97417 223028 211207 43693 -118664 -104936 62333 226692 333017
38028 333017 468392 647200 705346 507788 167202 -64961 -83319 2567 57230 58408 35124
38017 35124 -19400 -108784 -169108 -113895 68083 293553 454085 493243 440740 386914 397202
38006 397202 438204 423383 345268 302419 351504 399155 329120 193358 152571 227476 253348
37995 253348 137354 19149 59574 184381 209149 154850 223652 443026 556888 383338
37985 383338 104725 25273 146292 191962 30785 -143176 -109797 71374 180358 155655
$$ packed form
38060A92107L3722l1230m3416m4714l5197L1831J31096J54827O0399n4397q1992
38049C13036n0869o3769j23551j18666K274J31068J31066R598j06920j29488o5985
38038g2206L9140J30483J25611j1821j67514j62357J3728J67269J64359J06325
38028C33017J35375J78808N8146j97558l40586k32163j8358Q5886N4663J178k3284
38017C5124n4524q9384o0324N5213J81978K25470J60532L9158n2503n3826J0288
38006C97202M1002j4821p8115m2849M9085M7651p0035j35762m0787P4905K5872
37995B53348j15994j18205M0425J24807K4768n4299O8802K19374J13862j73550
37985C83338k78613p9452J21019M5670j61177j73961L3379J81171J08984k4703
$$ plain form
37975 155655 138015 223327 321718 306550 194039 89155 13890 -105189 -287352 -435892
37965 -435892 -457964 -370248 -240975 -97770 41714 112580 75745 19443 79943 251338 363848
37954 363848 279486 45962 -164105 -211854 -81172 126853 269911 284806 239983 230363 251195
37943 251195 246711 237100 277662 320101 268533 174989 199278 331336 348059 145750 -62805
37932 -62805 -27996 199543 372773 380426 306377 241570 216040 267610 401806 499268 414525
37921 414525 164508 -101622 -294899 -416779 -428075 -257236 34099 237413 211316 27876
37911 27876 -128406 -141630 -32109 86907 103541 9376 -88312 -89665 -13004 54028 67740
37900 67740 45207 26177 72737 233399 439156 519569 407302 240968 176262 198939 230247
$$ packed form
37975A55655j7640Q5312R8391j5168j12511j04884p5265j19079j82163j48540
37965d35892k2072Q7716J29273J43205J39484P0866l6835n6302O0500J71395J12510
37954C63848q4362k33524k10067m7749J30682K08025J43058J4895m4823r620K0832
37943B51195m484r611M0562M2439n1568r3544K4289J32058J6723k02309k08555
37932f2805L4809K27539J73230P653p4049o4807k5530N1570J34196R7462q4743
37921D14525k50017k66130j93277j21880j1296J70839K91335K03314k6097j83440
37911B7876j56282j3224J09521J19016J6634r4165r7688j353P6661O7032J3712
37900F7740k2533j9030M6560J60662K05757Q0413j12267j66334o4706K2677L1308
$$ plain form
37889 230247 288390 391808 421649 273578 61021 -30176 -15670 -35821 -78256 -12550 142426
37878 142426 232258 230983 246887 268070 156645 -79002 -254408 -292593 -299672 -315181 -237242
37867 -237242 -60552 62634 87980 167706 376894 582306 685606 761325 837379 780339
37857 780339 541907 293422 167122 87498 7558 58146 266258 377789 214319 -5932
37847 -5932 19443 226409 346355 361227 449210 564680 448764 84845 -177642 -53854
37837 -53854 343115 688363 794122 696746 537136 439496 432202 444556 415912 372439 334992
37826 334992 235610 48361 -74881 30371 276790 405341 332673 250401 341831 539228
37816 539228 621937 468533 170578 -52779 -53001 89348 140445 -227 -168302 -178454 -91448
$$ packed form
37889B30247N8143J03418K9841j48071k12557r1197J4506k0151m2435O5706J54976
37878A42426Q9832j275J5904K1183j11425k35647j75406l8185p079j5509P7939
37867b37242J76690J23186K5346P9726K09188K05412J03300P5719P6054n7040
37857G80339k38432k48485j26300p9624p9940N0588K08112J11531j63470k20251
37847e932K5375K06966J19946J4872Q7983J15470j15916l63919k62487J23788
37837e3854L96969L45248J05759r7376j59610r7640p294J2354k8644m3473l7447
37826C34992r9382j87249j23242J05252K46419J28551p2668q2272R1430J97397
37816E39228Q2709j53404k97955k23357k22J42349N1097j40672j68075j0152Q7006
$$ plain form
37805 -91448 -77720 -101025 35383 334272 528115 430797 188725 80459 190767 379833
37795 379833 480733 434695 297775 194302 220447 339019 410760 363585 273175 241326 269888
37784 269888 315566 396251 545334 696842 728371 628411 517981 461757 356866 105973
37774 105973 -169713 -240752 -88264 53827 33061 -12358 100328 293693 355804 266534
37764 266534 180428 144628 72975 -19666 -12741 69165 57887 -55713 -85336 6751 12036 -155102
37752 -155102 -281822 -226631 -176417 -297409 -400910 -263327 -56198 -94697 -307954 -348371
37742 -348371 -153789 -7617 -39485 -47086 105582 247846 200778 58375 13379 87583 173873
37731 173873 206042 176857 107792 86195 213017 432319 525390 360042 58280 -151643
$$ packed form
37805i1448J3728k3305J36408K98889J93843r7318k42072j08266J10308J89066
37795C79833J00900m6038j36920j03473K6145J18572P1741m7175r0410l1849K8562
37784B69888M5678Q0685J49083J51508L1529r9960j10430n6224j04891k50893
37774A05973k75686p1039J52488J42091k0766m5419J12686J93365O2111q9270
37764B66534q6106l5800p1653r2641O925Q1906j1278j13600k9623R2087N285j67138
37752a55102j26720N5191N0214j20992j03501J37583K07129l8499k13257m0417
37742c48371J94582J46172l1868p601J52668J42264m7068j42403m4996P4204Q6290
37731A73873L2169k9185o9065k1597J26822K19302R3071j65348l01762k09923
$$ plain form
37721 -151643 -168040 -42981 137470 318713 458211 498198 374630 84610 -236014 -374677
37711 -374677 -254297 -25207 126402 174673 162747 42823 -208754 -402547 -296822 59886
37701 59886 359125 425572 379061 365008 331841 177254 -39568 -154707 -88003 104067 304809
37690 304809 420384 438211 425002 429319 409883 317553 196653 120316 87895 87077 170246 328496
37678 328496 385179 207982 -42078 -94810 37881 95376 -21697 -136706 -123487 -88826
37668 -88826 -152525 -272723 -380435 -485606 -563164 -530788 -426869 -410968 -493026 -468016 -234029
37657 -234029 27227 121351 99535 95245 88187 12951 -51880 -4497 78339 50766 -64580
37646 -64580 -114991 -39818 81195 147116 94724 -83195 -268269 -262281 -34277 173162 135568
$$ packed form
37721a51643j6397J25059J80451J81243J39498L9987j23568k90020l20624j38663
37711c74677J20380K29090J51609M8271j1926j19924k51577j93793J05725L56708
37701E9886K99239O6447m6511j4053l3167j54587k16822j15139O6704J92070K00742
37690C04809J15575J7827j3209M317j9436r2330j20900p6337l2421q18Q3169J58250
37678C28496N6683j77197k50060n2732J32691N7495j17073j15009J3219L4661
37668h8826o3699j20198j07712j05171p7558L2376J03919J5901q2058K5010K33987
37657b34029K61256R4124k1816m290p058p5236o4831M7383Q2836k7573j15346
37646f4580n0411P5173J21013O5921n2392j77919j85074N988K28004K07439l7594
$$ plain form
37635 135568 -42110 -79336 81800 233069 232896 170336 153248 123707 -3299 -141498 -121980
37624 -121980 52001 168319 64401 -156351 -243731 -107883 88152 164073 148889 195031
37614 195031 342045 476406 490685 376653 186360 9611 -32988 101619 282174 335761
37604 335761 278652 292231 462733 674086 779787 758005 670268 582467 552236 583979 575823
37593 575823 416408 139828 -124734 -337352 -536660 -664412 -589506 -335197 -101580 -11247
37583 -11247 4423 22628 12893 -28267 1950 163979 379393 551497 656244 670775 563287
37572 563287 404569 332423 352663 334873 245861 199497 222920 187171 56173 -9033 92541
37561 92541 239348 302964 332994 395009 412120 314717 179353 79744 -31280 -157264 -163426
$$ packed form
37635A35568j77678l7226J61136J51269j73o2560j7088k9541j27006j38199J9518
37624a21980J73981J16318j03918k20752q7380J35848J96035P5921j5184M6142
37614A95031J47014J34361J4279j14032j90293j76749m2599J34607J80555N3587
37604C35761n7109J3579J70502K11353J05701k1782q7737q7801l0231L1743q156
37593E75823j59415k76580k64562k12618j99308j27752P4906K54309K33617R0333
37583a1247J5670J8205r735m1160L0217J62029K15414J72104J04747J4531j07488
37572E63287j58718p2146K0240j7790q9012m6364K3423l5749j30998o5206J01574
37561I2541J46807O3616L0030O2015J7111r7403j35364r9609j11024j25984o162
$$ plain form
37550 -163426 -4168 139277 129677 114611 299412 617108 816455 766734 515443 175265
37540 175265 -81570 -59247 241266 548245 627367 542369 463698 386099 233575 92862
37530 92862 111158 259929 399810 486863 541635 531267 460295 449740 544966 589638 478574
37519 478574 362705 384597 408725 293412 235688 486707 856384 902710 570739 257174
37509 257174 224217 311734 296433 207222 168986 191595 228940 251092 185573 -28521 -284920
37498 -284920 -399977 -386202 -429671 -565870 -604509 -433651 -181459 -2786 94630 138164
37488 138164 102114 16459 -16645 3249 -40068 -142714 -119612 110978 358579 412371 319110
37477 319110 266879 309878 365411 404282 476099 560585 536412 348119 134957 123122 374572
$$ packed form
37550a63426J59258J43445r600j5066J84801L17696J99347m9721k51291l40178
37540A75265k56835K2323L00513L06979P9122q4998p8671p7599j52524j40713
37530I2862J8296J48771J39881Q7053N4772j0368p0972j0555R5226M4672j11064
37519D78574j15869K1892K4128j15313n7724K51019L69677M6326l31971l13565
37509B57174l2957Q7517j5301q9211l8236K2609L7345K2152o5519k14094k56399
37498b84920j15057J3775m3469j36199l8639J70858K52192J78673R7416M3534
37488A38164l6050q5655l3104J9894m3317j02646K3102K30590K47601N3792r3261
37477C19110n2231M2999N5533L8871P1817Q4486k4173j88293k13162j1835K51450
$$ plain form
37466 374572 678240 748462 535634 268877 169048 218514 271712 275927 270720 262525 238626
37455 238626 246749 330768 435922 493547 534994 596507 592672 444558 268036 251350 376671
37444 376671 440205 338276 170790 62180 28107 22492 -11384 -127477 -299239 -389008 -317409
37433 -317409 -211099 -238748 -355461 -373977 -243924 -86667 9140 44113 -9212 -184510
37423 -184510 -385040 -450501 -371932 -288061 -278201 -311647 -372723 -458569 -475370 -330347 -125484
37412 -125484 -71804 -201569 -341367 -373270 -340086 -284839 -179219 -43318 38051 55847 81790
37401 81790 112929 66160 -52375 -126953 -106842 -60270 -34671 3602 76513 164574 269881
37390 269881 389083 437706 327186 104183 -100002 -230753 -316167 -362922 -353404 -284949 -126246
$$ packed form
37466C74572L03668P0222k12828k66757r9829M9466N3198M215n207q195k3899
37455B38626Q123Q4019J05154N7625M1447O1513l835j48114j76522j6686J25321
37444C76671O3534j01929j67486j08610l4073n615l3876j16093j71762q9769P1599
37433c17409J06310k7649j16713j8516J30053J57257R5807L4973n3325j75298
37423a84510k00530o5461P8569Q3871R860l3446o1076q5846j6801J45023K04863
37412a25484N3680j29765j39798l1903L3184N5247J05620J35901Q1369J7796K5943
37401H1790L1139m6769j18535p4578K0111M6572K5599L8273P2911Q8061J05307
37390B69881J19202M8623j10520k23003k04185j30751q5414m6755R518O8455J58703
$$ plain form
37379 -126246 152904 415214 396593 66326 -244246 -263327 -120291 -41263 45116 278427
37369 278427 475793 374007 99823 -24307 -19470 -154930 -413564 -523591 -466622 -468623
37359 -468623 -509011 -345197 -42893 42442 -116758 -143339 90660 251890 147380 29811
37349 29811 89726 124416 -25654 -141676 -14505 197715 265750 214346 126568 -36970 -209185
37338 -209185 -162299 95361 226466 88229 -30689 67852 140889 -36804 -261180 -276333
37328 -276333 -195730 -197155 -145925 99742 318736 249918 18099 -121631 -195538 -310269 -321734
37317 -321734 -97047 137823 103572 -94610 -195082 -210810 -264299 -242773 -25393 171459
37307 171459 96953 -87716 -79827 53128 63688 20974 145810 323264 277393 101682 105274
$$ packed form
37379a26246K79150K62310j8621l30267l10572j9081J43036P9028Q6379K33311
37369B78427J97366j01786k74184j24130M837j35460k58634j10027N6969k001
37359d68623m0388J63814L02304Q5335j59200k6581K33999J61230j04510j17569
37349B9811N9915L4690j50070j16022J27171K12220O8035n1404q7778j63538j72215
37338b09185M6886K57660J31105j38237j18918R8541P3037j77693k24376j5153
37328b76333Q0603j425N1230K45667K18994o8818k31819j39730p3907j14731j1465
37317c21734K24687K34870l4251j98182j00472j5728n3489K1526K17380J96852
37307A71459p4506j84669P889J32955J0560m2714J24836J77454m5871j75711L592
$$ plain form
37296 105274 218578 75449 -334292 -595839 -487569 -223332 -27982 121368 268312 356663
37286 356663 397918 448242 409238 169805 -72277 17224 410504 731764 771233 649932
37276 649932 488777 283573 121179 143631 248366 167314 -113333 -338467 -400007 -414749
37266 -414749 -382039 -168436 112025 125033 -152766 -314873 -96091 274143 449026 388059
37256 388059 249733 148451 166391 336837 485481 363705 55827 -54735 136736 251166
37246 251166 -1226 -367834 -437554 -203206 60281 258197 476860 656625 611366 354019
37236 354019 123529 51526 12299 -133187 -303376 -309403 -129750 39035 33980 -39374 71643
37225 71643 398387 640118 522472 155673 -112251 -117827 11077 102046 90176 -43202
$$ packed form
37296A05274J13304j43129m09741k61547J08270K64237J95350J49350J46944Q8351
37286C56663M1255N0324l9004k39433k42082Q9501L93280L21260L9469j21301
37276F49932j61155k05204j62394K2452J04735q1052k80647k25134o1540j4742
37266d14749L2710K13603K80461J3008k77799j62107K18782L70234J74883o0967
37256C88059j38326j01282J7940J70446J48644j21776l07878j10562J91471J14430
37246B51166k52392l66608o9720K34348K63487J97916K18663J79765m5259k57347
37236C54019k30490p2003l9227j45486j70189o027J79653J68785n055p3354J11017
37225G1643L26744K41731j17646l66799k67924n576J28904R0969j1870j33378
$$ plain form
37215 -43202 -266753 -421536 -346401 -117447 10630 -63070 -180142 -189951 -150136 -184050 -274286
37204 -274286 -295122 -182227 -7427 90484 44908 -51239 -44427 68434 122741 27270 -110641
37193 -110641 -178505 -212761 -246233 -195269 -67118 -78919 -342749 -609462 -585951 -351881 -185761
37182 -185761 -134949 -76108 -59591 -218858 -416527 -362927 -65835 186346 272158 321358 367312
37171 367312 285117 103536 19858 48171 -12463 -198832 -299214 -216705 -102064 -55416 -8299
37160 -8299 29725 -64456 -226880 -199745 54324 236173 134787 -118345 -335744 -513174
37150 -513174 -640458 -571942 -273744 40113 191172 243616 286129 238929 48600 -130038
37140 -130038 -130893 -3709 103521 153085 188796 229576 292202 401375 506711 508647 407600
$$ packed form
37215d3202k23551j54783P5135K28954J28077p3700j17072r809L9815l3914r0236
37204b74286k0836J12895J74800R7911m5576r6147O812J12861N4307r5471j37911
37193a10641o7864l4256l3472N0964J28151j1801k63830k66713K3511K34070J66120
37182a85761N0812N8841J6517j59267j97669N3600K97092K52181Q5812M9200M5954
37171C67312q2195j81581q3678K8313o0634j86369j00382Q2509J14641M6648M7117
37160h299L8024r4181j62424K7135K54069J81849j01386k53132k17399j77430
37150e13174j27284O8516K98198L13857J51059N2444M2513m7200j90329j78638
37140a30038q55J27184J07230M9564L5711M0780O2626J09173J05336J936j01047
$$ plain form
37129 407600 300696 219442 118522 19545 -3900 26382 34353 44161 106807 140657 71621
37118 71621 43864 209473 396668 329744 114991 106834 303031 317581 25045 -213924 -125034
37107 -125034 76472 59852 -162986 -358331 -390683 -243756 52760 360884 483451 386374
37097 386374 221958 110032 73797 138638 244797 151863 -236849 -547751 -348499 180681
37087 180681 465112 385445 350477 497464 465425 131247 -75017 104888 284183 62584
37077 62584 -339171 -479531 -346097 -212400 -163630 -131908 -138978 -184018 -126246 64840 195096
37066 195096 188903 241921 424756 486150 297870 138338 251962 464325 526936 516058 581529
37055 581529 604726 422567 134212 -85320 -224774 -275636 -131691 141265 264103 176748
$$ packed form
37129D07600j06904q1254j00920r8977k3445L0282P971R808O2646L3850o9036
37118G1621k7757J65609J87195o6924k14753q157J96197J4550k92536k38969Q8890
37107a25034K01506j6620k22838j95345l2352J46927K96516L08124J22567r7077
37097C86374j64416j11926l6235O4841J06159r2934l88712l10902J99252N29180
37087A80681K84431p9667l4968J46987l2039l34178k06264J79905J79295k21599
37077F2584m01755j40360J33434J33697M8770L1722p070m5040N7772J91086J30256
37066A95096o193N3018J82835O1394j88280j59532J13624K12363O2611j0878O5471
37055E81529K3197j82159k88355k19532j39454n0862J43945K72956J22838q7355
$$ plain form
37045 176748 152445 286834 298431 71705 -71084 62436 171880 16601 -140893 -38595
37035 -38595 96892 4936 -99094 56404 262604 203847 13063 -30373 -18146 -144016
37025 -144016 -247920 -120821 49352 23973 -10065 192630 408588 305781 39949 -31827
37015 -31827 40667 -6195 -119862 -105002 -55101 -111943 -93715 124198 193381 -175903 -603183
37004 -603183 -573744 -263382 -165806 -204724 48114 509543 710609 632477 667634 850285
36994 850285 851992 671349 619753 673750 536685 299854 340548 584579 576924 294010 182165
36983 182165 353464 448517 368164 432685 684711 715076 371982 38820 13849 156910
36973 156910 312124 544441 789848 783331 513950 300314 279866 255471 135815 79076
$$ packed form
37045A76748k4303J34389J1597k26726j42789J33520J09444j55279j57494J02298
37035c8595J35487r1956j04030J55498K06200n8757j90784m3436J2227j25870
37025a44016j03904J27099J70173k5379l4038K02695K15958j02807k65832p1776
37015c1827P2494m6862j13667J4860M9901n6842J8228K17913O9183l69284m27280
37004f03183K9439L10362R7576l8918K52838M61429K01066p8132L5157J82651
36994H50285J707j80643n1596N3997j37065k36831M0694K44031p655k82914j11845
36983A82165J71299R5053q0353O4521K52026L0365l43094l33162k4971J43061
36973A56910J55214K32317K45407o517k69381k13636k0448k4395j19656n6739
$$ plain form
36963 79076 128344 157331 225348 514654 880701 958999 752529 604274 566101 351853 -30362
36952 -30362 -182573 36363 311282 427227 499394 555741 439097 239168 274349 511554
36942 511554 538025 241223 -18158 -42792 -63084 -218229 -319615 -304165 -393136 -610382
36932 -610382 -645755 -386120 -107943 18010 137777 295746 306988 193600 245982 495037
36922 495037 609928 454057 250087 87903 -196215 -536601 -598854 -362024 -181062 -141556
36912 -141556 56718 437875 607099 448943 326377 375415 258690 -129746 -378215 -272966
36902 -272966 -155642 -242076 -224498 75637 275133 74681 -207794 -173338 74744 269633
36892 269633 426978 581010 544855 306472 221639 465017 719142 716815 633942 643303 568371
$$ packed form
36963G9076M9268K8987O8017K89306L66047P8298k06470j48255l8173k14248l82215
36952c0362j52211K18936K74919J15945P2167N6347j16644j99929L5181K37205
36942E11554K6471k96802k59381k4634k0292j55145j01386J5450q8971k17246
36932f10382l5373K59635K78177J25953J19767J57969J1242j13388N2382K49055
36922D95037J14891j55871k03970j62184k84118l40386o2253K36830J80962L9506
36912a41556J98274L81157J69224j58156j22566M9038j16725l88436k48469J05249
36902b72966J17324q6434J7578L00135J99496k00452k82475L4456K48082J94889
36892B69633J57345J54032l6155k38383q4833K43378K54125k327q2873R361p4932
$$ plain form
36881 568371 306549 111626 122598 86976 -125927 -223948 -28485 178046 162974 107241
36871 107241 147659 76023 -178938 -301124 -155332 -66873 -197141 -209995 76559 298769
36861 298769 209241 132706 318870 436407 203963 -41820 66723 298983 309678 247600
36851 247600 347267 396556 163221 -85070 -20607 189379 255953 279970 420514 485656 325381
36840 325381 198753 290015 307572 20217 -275291 -279632 -195403 -244319 -198670 110922 343410
36829 343410 222386 50279 133502 229223 94959 22880 249527 404428 170764 -61909
36819 -61909 136063 453044 405762 179700 201944 361354 355060 337268 522148 617068 356644
36808 356644 109941 233664 343234 10812 -336188 -80783 489390 666614 499901 551863
$$ packed form
36881E68371k61822j94923J0972l5622k12903r8021J95463K06531j5072n5733
36871A07241M0418p1636k54961j22186J45792Q8459j30268j2854K86554K22210
36861B98769q9528p6535J86164J17537k32444k45783J08543K32260J0695o2078
36851B47600R9667M9289k33335k48291O4463K09986O6574K4017J40544O5142j60275
36840C25381j26628R1262J7557k87355k95508m341Q4229m8916M5649L09592K32488
36829C43410j21024j72107Q3223R5721j34264p2079K26647J54901k33664k32673
36819f1909J97972L16981m7282k26062K2244J59410o294j7792J84880R4920k60424
36808C56644k46703J23723J09570l32422l47000K55405N70173J77224j66713N1962
$$ plain form
36798 551863 812828 809155 560229 517177 706853 760130 642396 600934 560718 294022 -3852
36787 -3852 3533 167994 175326 193310 507372 834766 741929 433038 374247 453539 284811
36776 284811 24633 84297 325357 338602 231415 347644 512570 362374 114667 197113
36766 197113 424707 364063 178704 271618 443325 284898 50397 219592 537136 431853
36756 431853 62278 -14025 120294 18965 -147589 86392 490375 508270 323678 502262
36746 502262 872567 846964 554066 524509 555322 91050 -525972 -452266 189126 498371
36736 498371 315405 275363 459257 308233 -127550 -152393 292945 530124 396578 422551
36726 422551 689529 676811 336108 203928 367978 386641 250953 363126 602097 498466
$$ packed form
36798E51863K60965l673k48926m3052J89676N3277j17734m1462m0216k66696k97874
36787c852P385J64461P332J7984L14062L27394r2837l08891n8791P9292j68728
36776B84811k60178N9664K41060J3245j07187J16229J64926j50196k47707Q2446
36766A97113K27594o0644j85359R2914J71707j58427k34501J69195L17544j05283
36756D31853l69575p6303J34319j01329j66554K33981M03983J7895j84592J78584
36746E02262L70305k5603k92898k9557L0813m64272o17022P3706O41392L09245
36736D98371j82966m0042J83894j51024m35783k4843M45338K37179j33546K5973
36726D22551K66978j2718l40703j32180J64050J8663j35688J12173K38971j03631
$$ plain form
36716 498466 245894 412839 792017 726146 392448 475392 754051 421976 -320852 -477928
36706 -477928 6399 231038 36518 156775 632820 678280 262166 237800 707446 825986
36696 825986 438339 338425 668240 642993 132084 -62271 226963 257677 -77407 -34785
36686 -34785 407343 406870 -60154 -66464 461781 563463 137838 179612 790148 867707 203201
36675 203201 -51971 502888 878438 671167 704152 1171669 1182836 717393 929371 1901633
36665 1901633 2293099 1862783 2009618 3055779 3480690 2797261 2625324 3759712 4754792
36656 4754792 4731758 4963302 6176451 6980707 6735708 7280580 9815295 12867706 15814054
36647 15814054 21513822 31880611 42666254 46519795 40878194 30107032 20239355 14018710
$$ packed form
36716D98466k52572J66945L79178o5871l33698Q2944K78659l32075p42828j57076
36706d77928M84327K24639j94520J20257M76045M5460m16114k4366M69646J18540
36696H25986l87647r9914L29815k5247n10909j94355K89234L0714l35084M2622
36686c4785M42128m73m67024o310N28245J01682m25625M1774O10536P7559o64506
36675B03201k55172N54859L75550k07271L2985M67517J1167m65443K11978R72262
36665A901633L91466m30316J46835J046161M24911o83429j71937J134388R95080
36656D754792k3034K31544J213149Q04256k44999N44872K534715L052411K946348
36647A5814054N699768J0366789J0785643L853541n641601j0771162r867677o220645
$$ plain form
36639 14018710 10791516 8792584 6911664 5356815 4853931 5068713 4737870 3653405
36631 3653405 3010159 3207117 3092644 2180866 1621118 1963431 2068154 1391620 1150966
36622 1150966 1927602 2395452 1822842 1470977 2041027 2228773 1379103 941059 1616665
36613 1616665 1860054 997364 835153 2189558 3014344 2198480 1854650 3325728 4413739
36604 4413739 3396176 2236430 2730563 3133335 1973797 1425286 3149578 4618391 3605856
36595 3605856 2459012 3591713 4774951 3611339 2513688 4074078 5764738 4895344
36587 4895344 4456537 7801027 11867483 12377677 11348042 12378981 13335517 11522077 10847522
36578 10847522 15031996 19390403 19334746 20608219 29246241 38537961 40577482 43261228
$$ packed form
36639A4018710l227194j998932j880920j554849n02884K14782l30843j084465
36631C653405o43246J96958j14473r11778n59748L42313J04723o76534k40654
36622A150966P76636M67850n72610l51865N70050J87746q49670m38044O75606
36613A616665K43389q62690j62211J354405Q24786q15864l43830J471078J088011
36604D413739j017563j159746M94133M02772j159538n48511J724292J468813j012535
36595C605856j146844J132701J183238j163612j097651J560390J690660q69394
36587D895344m38807L344490M066456N10194j029635J030939R56536j813440o74555
36578A0847522M184474M358407n5657J273473Q638022R291720K039521K683746
$$ plain form
36570 43261228 57646986 76696557 91790131 124250245 203708683 306855633 355906787
36563 355906787 303213736 191793005 104083622 70570469 60130101 44354377 30357395
36556 30357395 29669326 32398799 26300727 16957969 14106014 14515440 11315047 7441197
36548 7441197 8181252 10419026 9504408 8420285 11002196 13402671 10826032 6415670
36540 6415670 5506692 6579220 5371373 3057744 3139049 4347373 3437785 1601124 1885113
36531 1885113 3238291 2837615 1620043 2145293 3423522 2925640 1537042 1769231 3031858
36522 3031858 3104652 2435523 2789237 3411181 2571089 1280902 1618685 2851806 2861730 1977485
36512 1977485 1915247 2324517 1783326 897793 1128282 1781150 1313359 400493 650086 1482276
$$ packed form
36570D3261228J4385758J9049571J5093574L2460114P9458438J03146950M9051154
36563C55906787n2693051j11420731q7709383l3513153j0440368j5775724j3996982
36556C0357395o88069K729473o098072r342758k851955M09426l200393l873850
36548G441197P40055K237774r14618j084123K581911K400475k576639m410362
36540F415670r08978J072528j207847k313629Q1305J208324r09588j836661K83989
36531A885113J353178m00676j217572N25250J278229m97882j388598K32189J262627
36522C031858P2794o69129L53714O21944q40092j290187L37783J233121R924q84245
36512A977485o2238M09270n41191q85533K30489O52868m67791r12866K49593Q32190
$$ plain form
36502 1482276 1306007 608537 874685 1564598 1159552 175543 181708 777820 461241 -388890
36492 -388890 -283768 434936 292131 -398020 -135691 842633 1016522 450232 506407 1115626
36482 1115626 982488 202621 108115 722736 820908 344380 397379 977298 996651 456982
36472 456982 398242 787676 612430 -20180 -3565 610638 667206 99339 16877 575676
36462 575676 759060 366534 283974 649777 621405 124228 41080 492312 639970 348395
36452 348395 364123 716069 608685 58696 -12659 498368 676014 306085 220367 682062
36442 682062 953215 745654 651662 855914 810550 454583 408743 704852 632919 99985
36432 99985 -131315 199923 478845 406911 379444 492577 342892 -17674 -59693 174471
$$ packed form
36502A482276j76269o97470K66148O89913m05046r84009O165N96112l16579q50131
36492c88890J05122P18704j42805o90151K62329R78324J73889n66290N6175O09219
36482A115626j33138p79867r4506O14621R8172m76528N2999N79919J9353n39669
36472D56982n8740L89434j75246o32610J6615O14203N6568n67867q2462N58799
36462E75676J83384l92526q2560L65803k8372m97177q3148M51232J47658k91575
36452C48395J5728L51946j07384n49989p1355N11027J77646l69929q5718M61695
36442F82062K71153k07561r3992K04252m5364l55967m5840K96109p1933n32934
36432I9985k31300L31238K78922p1934k7467J13133j49685l60566m2019K34164
$$ plain form
36422 174471 112548 -210010 -199454 108135 109274 -128646 44080 526346 541623 98575
36412 98575 25023 441678 576360 257799 201400 575403 671300 310903 222061 634738
36402 634738 812481 416030 91939 241553 382455 211737 181898 523126 735783 534972
36392 534972 333687 371961 314166 80031 118251 497987 673182 476771 401739 600274
36382 600274 585785 229316 52005 213638 212021 -98208 -201114 52550 142749 -70543
36372 -70543 -46000 343440 480455 152873 -31587 210450 347706 126964 79421 444414
36362 444414 643704 360926 123558 266778 334194 82123 66176 593826 1050880 925770
36352 925770 606789 531516 439429 110371 -45132 196220 316195 -14042 -284316 -92127
$$ packed form
36422A74471o1923l22558J0556L07589J139k37920J72726M82266J5277m43048
36412I8575p3552M16655J34682l18561n6399L74003R5897l60397q8842M12677
36402F34738J77743l96451l24091J49614J40902j70718k9839L41228K12657k00811
36392E34972k01285L8274n7795k34135L8220L79736J75195j96411p5032J98535
36382F00274j4489l56469j77311J61633j617l10229j02906K53664R0199k13292
36372g0543K4543L89440J37015l27582j84460K42037J37256k20742m7543L64993
36362D44414J99290k82778k37368J43220O7416k52071j5947N27650M57054j25110
36352I25770l18981p5273r2087l29058j55503K41352J19975l30237k70274J92189
$$ plain form
36342 -92127 101422 -142556 -425812 -315323 -166002 -377000 -569463 -287604 158409 303979
36332 303979 329956 519587 574523 227076 -91515 46021 284464 154590 -66850 73751
36322 73751 338700 279274 76302 134108 299642 226767 81459 174614 321373 250574 213019
36311 213019 494313 757745 573898 197349 121963 250225 191092 13808 19347 97196
36301 97196 -26935 -208224 -165132 -39011 -94362 -183262 -61319 109864 114198 150151 399399
36290 399399 540771 281346 -35391 39182 313582 357514 257236 334576 482244 426161
36280 426161 312554 404795 524673 403724 244354 321316 391863 138907 -166528 -108034
36270 -108034 127097 117974 -21630 52071 176660 -9590 -318805 -320745 -145343 -234301 -518820
$$ packed form
36342i2127J93549k43978k83256J10489J49321k10998j92463K81859M46013J45570
36332C03979K5977J89631N4936l47447l18591J37536K38443j29874k21440J40601
36322G3751K64949n9426k02972N7806J65534p2875j45308R3155J46759p0799l7555
36311B13019K81294K63432j83847l76549p5386J28262n9133j77284N539P7849
36301I7196j24131j81289M3092J26121n5351q8900J21943J71183M334L5953K49248
36290C99399J41372k59425l16737P4573K74400M3932j00278P7340J47668n6083
36280D26161j13607R2241J19878j20949j59370P6962P0547k52956l05435N8494
36270a08034K35131r123j39604P3701J24589j86250l09215j940J75402q8958k84519
$$ plain form
36259 -518820 -590328 -488545 -563189 -710255 -503621 6560 334376 327144 245483 165332 -60839
36248 -60839 -326447 -368866 -269248 -286995 -315548 -75534 295653 438376 400030 468788 551905
36237 551905 358845 41558 -16822 90577 -15653 -239962 -170248 98773 70273 -247024
36227 -247024 -308709 24421 252180 74964 -200702 -264911 -218810 -211066 -178755 -104813 -85567
36216 -85567 -56237 121250 289247 188106 -3862 136955 543018 686708 400723 89867
36206 89867 27626 14089 -113989 -174051 -43460 90024 88251 73084 104571 27784 -190605
36195 -190605 -318553 -217183 -52075 -13611 -77303 -134829 -144410 -103854 -55444 -86024 -150799
36184 -150799 -30668 313366 547928 427741 213966 258989 415103 309603 -1973 -160714
$$ packed form
36259e18820p1508J01783p4644j47066K06634N10181L27816p232q1661q0151k26171
36248f0839k65608m2419R9618j7747k8553K40014L71187J42723l8346O8758Q3117
36237E51905j93060l17287n8380J07399j06230k24309O9714K69021k8500l17297
36227b47024o1685L33130K27759j77216k75666o4209M6101P744L2311P3942J9246
36216h5567K9330J77487J67997j01141j91968J40817M06063J43690k85985l10856
36206H9867o2241j3537j28078o0062J30591J33484j773j5167L1487p6787k18389
36195a90605j27948J01370J65108L8464o3692n7526r581M0556M8410l0580o4775
36184a50799J20131L44034K34562j20187k13775M5023J56114j05500l11576j58741
$$ plain form
36174 -160714 -113060 -76505 -46414 124930 288482 197802 39421 189359 529277 594784
36164 594784 334170 112712 17877 -196937 -486999 -496092 -218181 -53557 -122588 -119836 63174
36153 63174 161723 83444 53463 112437 41498 -108050 6978 384927 589762 437674 222549
36142 222549 132528 14360 -142555 -83989 161232 187616 -118748 -358401 -270686 -77006
36132 -77006 23308 149589 311307 235685 -114939 -366562 -330623 -280667 -391536 -422464
36122 -422464 -231957 -93456 -188590 -265983 -122151 28925 -22665 -127933 -146949 -232742
36112 -232742 -433029 -441266 -89313 300084 386229 273669 194347 95463 -131644 -348818
36102 -348818 -411651 -413022 -425681 -321410 -89206 9723 -143838 -294502 -229131 -83886 -22441
$$ packed form
36174a60714M7654L6555L0091J71344J63552r0680j58381J49938L39918O5507
36164E94784k60614k21458r4835k14814k90062r093K77911J64624o9031K752J83010
36153F3174R8549p8279k9981N8974p0939j49548J15028L77949K04835j52088k15125
36142B22549r0021j18168j56915N8566K45221K6384l06364k39653Q7715J93680
36132g7006J00314J26281J61718p5622l50624k51623L5939M9956j10869l0928
36122d22464J90507J38501r5134p7393J43832J51076n1590j05268j9016q5793
36112b32742k00287q237L51953L89397Q6145j12560p9322r8884k27107k17174
36102c48818o2833j371j2659J04271K32204R8929j53561j50664O5371J45245O1445
$$ plain form
36091 -22441 17341 42395 -118290 -416140 -488487 -225093 1559 -51907 -114462 54580 203167
36080 203167 55731 -179348 -190073 -76617 -72596 -95952 9292 108137 64402 88203 379530
36069 379530 709469 766177 652624 642325 700146 644239 536793 519498 495380 354254 271916
36058 271916 399536 501410 307457 -1708 -73652 65649 157241 200091 352340 504672
36048 504672 409791 143962 18311 83162 96376 -47640 -194125 -221991 -182346 -148500 -139138
36037 -139138 -162657 -187311 -142898 -56710 -40242 -50422 105734 404734 526456 314145 19347
36026 19347 -116978 -214204 -432923 -614009 -533080 -262377 -6183 185047 303728 264827
36016 264827 126740 130675 298765 342299 193489 194945 469127 591356 292386 -6084
$$ packed form
36091b2441L9782K5054j60685k97850p2347K63394K26652n3466o2555J69042J48587
36080B03167j47436k35079j0725J13456M021k3356J05244R8845m3735K3801K91327
36069C79530L29939N6708j13553j0299N7821n5907j07446j7295k4118j41126q2338
36058B71916J27620J01874j93953l09165p1944J39301R1592M2850J52249J52332
36048E04672r4881k65829j25651O4851J3214j44016j46485k7866L9645L3846R362
36037a39138k3519k4654M4413Q6188J6468j0180J56156K99000J21722k12311k94798
36026A9347j36325r7226k18719j81086Q0929K70703K56194J91230J18681l8901
36016B64827j38087L935J68090M3534j48810J456K74182J22229k98970k98470
$$ plain form
36006 -6084 134185 411903 304621 -38882 -94502 133537 208628 82776 118290 358712
35996 358712 437820 237545 65202 118379 252711 318523 306634 170149 -85396 -180842
35986 -180842 130310 579894 660840 350470 97800 113501 161194 80248 24922 89405 132219
35975 132219 94693 116775 224240 245207 142848 109993 225208 305884 214302 62837 15826
35964 15826 86395 195947 272386 264954 196578 175865 245042 311002 338419 433565 586507
35953 586507 575729 347108 207948 357026 517590 393758 188380 225479 336119 147365
35943 147365 -223124 -328231 -119003 50748 64535 123182 223552 126330 -129643 -212803
35933 -212803 -54321 72952 82194 190010 434677 555956 459204 359692 360870 302089 120756
$$ packed form
36006f084J40269K77718j07282l43503n5620K28039P5091j25852L5514K40422
35996C58712P9108k00275j72343N3177J34332O5812j1889j36485k55545r5446
35986a80842L11152M49584Q0946l10370k52670J5701M7693q0946n5326O4483M2814
35975A32219l7526K2082J07465K0967j02359l2855J15215Q0676r1582j51465m7011
35964A5826P0569J09552P6439p432o8376k0713O9177O5960K7417R5146J52942
35953E86507j0778k28621j39160J49078J60564j23832k05378L7099J10640j88754
35943A47365l70489j05107K09228J69751J3787N8647J00370r7222k55973q3160
35933b12803J58482J27273R242J07816K44667J21279r6752r9512J178n8781j81333
$$ plain form
35922 120756 -31914 -118230 -262637 -401348 -287927 59970 303351 265597 126052 73093
35912 73093 107410 209165 338347 285995 -69047 -392878 -254879 175643 326110 118508
35902 118508 62052 360554 582116 437126 258188 370569 527166 379138 84325 20421
35892 20421 192654 306270 215787 5546 -199375 -288087 -210631 -114198 -221017 -475279
35882 -475279 -575989 -441100 -321640 -360615 -395355 -326606 -312493 -425667 -470085 -326652
35872 -326652 -160130 -112486 -106362 -100628 -202615 -376309 -394245 -240228 -195126 -352209 -424749
35861 -424749 -226755 29487 115681 94471 47248 -109721 -311915 -249364 152136 516259
35851 516259 538075 366505 234770 107714 -37108 4033 268496 409506 215992 -16310
$$ packed form
35922A20756j52670q6316j44407j38711J13421L47897K43381l7754j39545n2959
35912G3093L4317J01755J29182n2352l55042l23831J37999M30522J50467k07602
35902A18508n6456K98502K21562j44990j78938J12381J56597j48028k94813o3904
35892B0421J72233J13616r0483k10241k04921q8712P7456R6433j06819k54262
35882d75279j00710J34889J19460l8975l4740O8749J4113j13174m4418J43433
35872c26652J66522M7644O124N734j01987j73694j7936J54017M5102j57083p2540
35861d24749J97994K56242Q6194k1210m7223j56969k02194O2551M01500L64123
35851E16259K1816j71570j31735j27056j44822M1141K64463J41010j93514k32302
$$ plain form
35841 -16310 14693 116971 -3331 -196450 -149234 77337 220296 276678 382954 465008
35831 465008 411671 376411 504254 573854 330542 -15593 -56665 196340 380572 342889
35821 342889 230279 117365 -56058 -224367 -231176 -107761 -29838 -37069 -44277 -56898 -131512
35810 -131512 -207840 -208791 -203542 -252753 -223565 6630 290687 387501 278069 107692 -40030
35799 -40030 -126067 -94627 -15432 -76655 -253847 -248062 43124 309437 328378 309341 410314
35788 410314 325119 -174460 -644493 -507743 44420 305442 79674 -162507 -114805 -2399
35778 -2399 -39744 -75950 38092 158196 122134 2909 -71216 -104132 -135234 -168829 -254266
35767 -254266 -431320 -581067 -546602 -398884 -358485 -463104 -539705 -495359 -411764 -358276 -314534
$$ packed form
35841a6310L1003J02278j20302j93119M7216K26571J42959N6382J06276Q2054
35831D65008n3337l5260J27843O9600k43312l46135m1072K53005J84232l7683
35821C42889j12610j12914j73423j68309o809J23415P7923p231p208j2621p4614
35810a31512p6328r51N249m9211K9188K30195K84057R6814j09432j70377j47722
35799d0030q6037L1440P9195o1223j77192N785K91186K66313J8941j9037J00973
35788D10314q5195m99579m70033J36750N52163K61022k25768k42181M7702J12406
35778b399l7345l6206J14042J20104l6062j19225p4125l2916l1102l3595q5437
35767b54266j77054j49747L4465J47718M0399j04619p6601M4346Q3595N3488M3742
$$ plain form
35756 -314534 -262322 -181819 -13205 214322 321856 228261 107992 92492 10768 -294962
35746 -294962 -599210 -587940 -352259 -201465 -131482 85680 386358 468924 342998 354693
35736 354693 612129 812666 731499 503415 320837 198257 136871 199033 310405 277397
35726 277397 99254 2249 94783 244555 339399 393681 360172 139542 -162919 -291960
35716 -291960 -229339 -233031 -407217 -529006 -413778 -179770 -26470 7543 -44574 -172733
35706 -172733 -283723 -224359 -26463 71584 -50463 -240016 -328605 -343035 -359745 -341258 -244327
35695 -244327 -146632 -148674 -241388 -338716 -367183 -304377 -203879 -159757 -169239 -107712 55541
35684 55541 145022 44876 -70006 3220 133227 35768 -269939 -480786 -437485 -252172
$$ packed form
35756c14534N2212Q0503J68614K27527J07534r3595j20269j5500q1724l05730
35746b94962l04248J1270K35681J50794O9983K17162L00678Q2566j25926J1695
35736C54693K57436K00537q1167k28084j82578j22580o1386O2162J11372l3008
35726B77397j78143r7005R2534J49772R4844N4282l3509k20630l02461j29041
35716b91960O2621l692j74186j21789J15228K34008J53300L4013n2117j28159
35706a72733j10990N9364J97896R8047j22047j89553q8589j4430j6710J8487R6931
35695b44327R7695k042r2714r7328k8467O2806J00498M4122r482O1527J63253
35684E5541Q9481j00146j14882P3226J30007r7459l05707k10847M3301J85313
$$ plain form
35674 -252172 -49146 139996 248359 217497 162479 249654 430852 520365 483590 433552 427618
35663 427618 478158 619266 731448 523468 -726 -324070 -80754 327121 294073 -51809
35653 -51809 -109796 170785 270946 60469 -15501 188493 233029 -85199 -339491 -209469
35643 -209469 27963 81351 111424 238309 167779 -240018 -545075 -363189 5620 73849
35633 73849 -93735 -136149 -53046 -83427 -184655 -136583 14660 59816 17884 33281 40809
35622 40809 -98520 -281256 -322651 -272446 -251464 -167198 69368 246881 146502 -47982
35612 -47982 -20601 151188 143301 -61178 -175319 -102521 -39928 -100885 -169686 -143118 -46045
35601 -46045 84923 203457 185683 -16051 -217380 -219593 -101815 -77072 -155559 -182795 -113366
$$ packed form
35674b52172K03026J89142J08363l0862n5018Q7175J81198Q9513l6775n0038n934
35663D27618N0540J41108J12182k07980n24194l23344K43316M07875l3048l45882
35653e1809n7987K80581J00161k10477p5970K03994M4536l18228k54292J30022
35643b09469K37432N3388L0073J26885p0530m07797l05057J81886L68809O8229
35633G3849j67584m2414Q3103l0381j01228M8072J51243M5156m1932J5397P528
35622D0809j39329j82736m1395N0205K0982Q4266K36566J77513j00379j94484
35612d7982K7381J71789p887k04479j14141P2798O2593o0957o8801K6568R7073
35601d6045J30968J18534j7774k01734k01329k213J17778K4743p8487k7236O9429
$$ plain form
35590 -113366 -12439 109480 224739 173245 -113206 -380030 -331016 -58554 96557 50470
35580 50470 38516 194214 360695 360656 222577 81533 11816 -10081 -71565 -227860 -378451
35569 -378451 -344169 -141637 -10087 -48828 -43999 163666 365514 286894 9157 -185690
35559 -185690 -227546 -228292 -190906 -62333 37564 -40917 -181205 -145009 50805 184009 188756
35548 188756 184410 198487 145096 45082 1860 -14180 -113678 -260618 -331013 -347909 -425835
35537 -425835 -540499 -580063 -547375 -485130 -316100 -22109 151486 -5506 -271762 -258248
35527 -258248 2064 117102 -37733 -167958 -78404 59068 69348 43836 79023 47030
35517 47030 -162926 -383503 -358411 -85549 172051 167276 -95029 -355272 -344156 -93366
$$ packed form
35590a13366J00927J21919J15259n1494k86451k66824M9014K72462J55111m6087
35580E0470j1954J55698J66481l9j38079j41044o9717k1897o1484j56295j50591
35569c78451L4282K02532J31550l8741M829K07665K01848p8620k77737j94847
35559a85690m1856p46L7386J28573R9897p8481j40288L6196J95814J33204M747
35548A88756m346J4077n3391j00014m3222j6040r9498j46940p0395j6896p7926
35537d25835j14664l9564L2688O2245J69030K93991J73595j56992k66256J3514
35527b58248K60312J15038j54835j30225Q9554J37472J0280k5512L5187l1993
35517D7030k09956k20577K5092K72862K57600m775k62305k60243J1116K50790
$$ plain form
35507 -93366 71844 -46393 -223440 -112512 266638 560736 536808 282847 10517 -122412
35497 -122412 -39205 191026 352181 325624 256650 292863 295481 67948 -256581 -364855 -216471
35486 -216471 -41168 39631 70400 14890 -196926 -409961 -378376 -149225 7793 23097
35476 23097 46125 86047 9414 -119182 -86429 65271 71080 -93517 -177294 -114747 -116859
35465 -116859 -253107 -361192 -431575 -637017 -895464 -876077 -568885 -367950 -424763 -420185
35455 -420185 -195272 -84557 -308996 -528012 -391921 -123479 -112138 -272665 -262068 -61160
35445 -61160 107348 213331 332006 318419 19929 -329360 -370028 -175503 -121267 -265838
35435 -265838 -300677 -108610 59165 33326 -27256 36418 123771 98767 28816 30081 47607
$$ packed form
35507i3366J65210j18237j77047J10928L79150K94098k3928k53961k72330j32929
35497a22412Q3207K30231J61155k6557o8974L6213K618k27533l24529j08274J48384
35486b16471J75303Q0799L0769n5510k11816k13035L1585K29151J57018J5304
35476B3097K3028L9922p6633j28596L2753J51700N809j64597q3777O2547k112
35465a16859j36248j08085p0383k05442k58447J9387L07192K00935n6813M578
35455d20185K24913J10715k24439k19016J36091K68442J1341j60527J0597K00908
35445f1160J68508J05983J18675j3587k98490l49289m0668J94525N4236j44571
35435b65838l4839J92067J67775k5839o0582O3674Q7353k5004o9951J265J7526
$$ plain form
35424 47607 -45893 -234568 -374027 -368129 -246931 -105249 -19682 -2338 856 59627 192331
35413 192331 342670 415173 347471 174278 6914 -75658 -81322 -26589 107424 268725 303033
35402 303033 169447 78138 224814 484464 594738 548452 521901 495446 307909 73151
35392 73151 132660 515910 843671 890400 842496 832626 651704 200387 -162301 -83972 255182
35381 255182 442093 420014 419634 507487 578454 644082 759999 781865 548939 224193 111859
35370 111859 204027 236284 133434 59616 54311 -32646 -211278 -267660 -83615 200835 404726
35359 404726 483909 458146 355511 260026 241395 229204 129689 51771 207333 569214 835152
35348 835152 786368 516890 258204 127187 105570 139985 180887 181151 106297 -50938 -233708
$$ packed form
35424D7607r3500j88675j39459N898J21198J41682Q5567J7344L194N8771J32704
35413A92331J50339P2503o7702j73193j67364q2572n664N4733J34013J61301L4308
35402C03033j33586r1309J46676K59650J10274m6286k6551k6455j87537k34758
35392G3151N9509L83250L27761M6729m7904r870j80922m51317l62688P8329L39154
35381B55182J86911k2079l80Q7853P0967O5628J15917K1866k32926l24746j12334
35370A11859R2168L2257j02850p3818n305q6957j78632n6382J84045K84450K03891
35359D04726P9183k5763j02635r5485j8631j2191r9515p7918J55562L61881K65938
35348H35152m8784k69478k58686j31017k1617L4415M0902K64p4854j57235j82770
$$ plain form
35337 -233708 -303168 -161070 81267 197519 160390 174810 310480 341609 124254 -112897
35327 -112897 -111578 -7107 -89804 -298684 -314408 -79191 134303 152660 67293 -32548 -164146
35316 -164146 -250234 -129800 146625 302889 210483 43897 -11806 20861 63155 119536 165774
35305 165774 101208 -81271 -248409 -333383 -422296 -562797 -660848 -644356 -558194 -422573 -179508
35294 -179508 125996 290886 205083 19869 -48801 31924 156782 252206 290532 233845 77448
35283 77448 -107491 -247502 -327102 -334777 -231191 -25831 185782 314162 355548 354750 341644
35272 341644 316641 250715 110114 -70604 -183334 -182431 -160524 -196201 -213348 -124716 -23190
35261 -23190 -51492 -154946 -172124 -116877 -132530 -194792 -132373 33400 52315 -164844 -376308
$$ packed form
35337b33708o9460J42098K42337J16252l7129J4420J35670L1129k17355k37151
35327a12897J319J04471q2697k08880j5724K35217K13494J8357q5367r9841j31598
35316a64146q6088J20434K76425J56264r2406j66586n5703L2667M2294N6381M6238
35305A65774o4566j82479j67138q4974q8913j40501r8051J6492Q6162J35621K43065
35294a79508L05504J64890q5803j85214o8670Q0725J24858R5424L8326n6687j56397
35283G7448j84939j40011p9600p675J03586K05360K11613J28380M1386p98j3106
35272C41644k5003o5926j40601j80718j12730R03K1907l5677j7147Q8632J01526
35261b3190k8302j03454j7178N5247j5653o2262O2419J65773J8915k17159k11464
$$ plain form
35250 -376308 -361952 -233876 -236056 -393017 -522389 -498321 -365773 -247525 -223549 -265010 -260432
35239 -260432 -156337 -42669 -6326 33013 178343 309228 209228 -77547 -272619 -266843
35229 -266843 -226255 -241531 -172995 30519 144119 -11428 -280138 -397384 -330860 -222631
35219 -222631 -158313 -161613 -256549 -368724 -323024 -101915 57715 -12810 -175243 -242085 -264791
35208 -264791 -341325 -345083 -136491 114546 139899 2091 -14824 123991 181281 76545 -3987
35197 -3987 34166 45309 -60803 -162637 -183564 -247909 -432731 -580303 -526173 -347208 -221106
35186 -221106 -177790 -146601 -127237 -146621 -138098 -31379 95597 108371 22033 -25489 13993
35175 13993 43566 -22553 -157942 -285952 -351267 -327324 -237072 -163314 -152599 -119863 44946
$$ packed form
35250c76308J4356J28076k180j56961j29372K4068J32548J18248K3976m1461M578
35239b60432J04095J13668L6343L9339J45330J30885j00000k86775j95072N776
35229b66843M0588j5276O8536K03514J13600j55547k68710j17246O6524J08229
35219b22631O4318l300r4936j12175M5700K21109J59630p0525j62433o6842k2706
35208b64791p6534l758K08592K51037K5353j37808j6915J38815N7290j04736q0532
35197c987L8153J1143j06112j01834k0927o4345j84822j47572N4130J78965J26102
35186b21106M3316L1189J9364j9384Q523J06719J26976J2774q6338m7522L9482
35175A3993K9573o6119j35389j28010o5315K3943R0252P3758J0715L2736J64809
$$ plain form
35164 44946 275425 363505 230099 28907 -85151 -154200 -270195 -353873 -265780 -90322
35154 -90322 -102984 -405975 -750658 -813421 -557723 -237211 -95035 -136685 -178708 -69061
35144 -69061 148433 290964 263846 177528 175448 212253 136278 -38031 -115466 -4561 158264
35133 158264 232400 248425 262617 201709 -6760 -272125 -449051 -510861 -495432 -392209 -220872
35122 -220872 -115577 -178041 -325170 -407140 -384704 -285748 -127358 -6885 -87017 -315184
35112 -315184 -365072 -96150 143613 -5950 -328698 -325429 28526 289579 278845 296805
35102 296805 508129 608958 343234 -42076 -151459 27563 225497 307347 318590 269686
35092 269686 123112 -86160 -281353 -415098 -424430 -260566 -46095 -9251 -150640 -186801
$$ packed form
35164D4946K30479Q8080j33406k01192j14058o9049j15995q3678Q8093J75458
35154i0322j2662l02991l44683o2763K55698L20512J42176m1650m2023J09647
35144f9061K17494J42531k7118q6318k080L6805p5975j74309p7435J10905J62825
35133A58264P4136J6025J4192o0908k08469k65365j76926o1810J5429J03223J71337
35122b20872J05295o2464j47129q1970K2436R8956J58390J20473q0132k28167
35112c15184m9888K68922K39763j49563l22748L269L53955K61053j0734J7960
35102B96805K11324J00829k65724l85310j09383J79022J97934Q1850J1243m8904
35092B69686j46574k09272j95193j33745r332J63864K14471L6844j41389l6161
$$ plain form
35082 -186801 33494 274665 253569 34598 -114626 -93840 5512 99545 137992 57344 -111491
35071 -111491 -204696 -145382 -66591 -79458 -95234 -37693 -32530 -181791 -337614 -325518 -215510
35060 -215510 -133712 11262 334363 664120 732478 564141 386941 259497 87497 -83420
35050 -83420 -111956 -42261 -35666 -69677 -7720 83294 18691 -122326 -51358 264050 521970
35039 521970 527546 399776 276146 133977 920 19669 155531 128463 -184345 -523552
35029 -523552 -611381 -520522 -474215 -466096 -320535 -24255 229561 302079 257196 247098 335222
35018 335222 432825 390626 183861 -22818 -79031 -64181 -148424 -284021 -260037 -77884 -11362
35007 -11362 -198193 -414075 -402920 -226670 -106196 -86117 -68310 -56961 -145837 -316972 -445757
$$ packed form
35082a86801K20295K41171k1096k18971j49224K0786R9352R4033L8447q0648j68835
35071a11491r3205N9314P8791j2867j5776N7541N163j49261j55823J2096J10008
35060b15510Q1798J44974L23101L29757O8358j68337j77200j27444j72000j70917
35050h3420k8536O9695O595l4011O1957R1014o4603j41017P0968L15408K57920
35039E21970N576j27770j23630j42169j33057J8749J35862k7068l12808l39207
35029e23552q7829R0859M6307Q119J45561K96280K53816P2518m4883j0098Q8124
35018C35222R7603m2199k06765k06679n6213J4850q4243j35597K3984J82153O6522
35007a1362j86831k15882J1155J76250J20474K0079J7807J1349q8876j71135j28785
$$ plain form
34996 -445757 -485709 -491302 -472321 -372172 -199292 -59580 -33335 -100601 -198781 -283121 -318514
34985 -318514 -274030 -157137 -32173 17949 -32393 -102024 -63699 102499 257884 278900 232130
34974 232130 260967 341714 324948 220752 230253 413996 532662 369723 61005 -82137
34964 -82137 17225 157940 174510 104894 49283 34832 63111 159918 313044 442735 489043
34953 489043 477084 463556 467455 479140 485451 450342 316694 80466 -156864 -266382 -232956
34942 -232956 -174621 -191498 -232143 -169047 7647 158157 181867 145119 148922 156291 77155
34931 77155 -24526 22154 214928 306268 109762 -221601 -342813 -105492 296521 558432
34921 558432 559416 414819 303393 295101 337051 356970 333967 271430 160178 10727 -116754
$$ packed form
34996d45757l9952n593J8981J00149J72880J39712K6245o7266r8180q4340l5393
34985c18514M4484J16893J24964N0122n0342o9631L8325J66198J55385K1016m6770
34974B32130K8837Q0747j6766j04196R501J83743J18666j62939l08718j43142
34964h2137R9362J40715J6570o9616n5611j4451K8279R6807J53126J29691M6308
34953D89043j1959j3528L899J1685O311l5109j33648k36228k37330j09518L3426
34942b32956N8335j6877m0645O3096J76694J50510K3710l6748L803P369p9136
34931G7155j01681M6680J92774R1340j96506l31363j21212K37321M02013K61911
34921E58432R84j44597j11426q292M1950J9919k3003o2537j11252j49451j27481
$$ plain form
34910 -116754 -172919 -189763 -231524 -286286 -268886 -132944 75449 277964 421884 470833 396629
34899 396629 210745 -21942 -217094 -311591 -284429 -158127 29968 257824 482942 588151
34889 588151 463480 187319 18038 110206 321930 410652 336094 231629 151754 35657
34879 35657 -100686 -137747 -61794 -34740 -174136 -374854 -424892 -227865 127847 443766
34869 443766 526035 315181 -46742 -329126 -415152 -352763 -231596 -97957 17039 85390
34859 85390 115026 127316 115329 94149 143958 296437 430951 419807 325191 285843 261015
34848 261015 109472 -91034 -71760 212441 450935 388576 157191 41744 98059 184831
34838 184831 231897 273407 301914 282391 267207 329722 404663 345588 150144 5296 68139
$$ packed form
34910a16754n6165j6844m1761n4762J7400J35942K08393K02515J43920M8949p4204
34899C96629j85884k32687j95152r4497K7162J26302J88095K27856K25118J05209
34889E88151j24671k76161j69281R2168K11724Q8722p4558j04465p9875j16097
34879C5657j36343l7061P5953K7054j39396k00718n0038J97027L55712L15919
34869D43766Q2269k10854l61923k82384q6026O2389J21167J33639J14996O8351
34859H5390K9636J2290j1987k1180M9809J52479J34514j1144r4616l9348k4828
34848B61015j51543k00506J9274K84201K38494o2359k31385j15447N6315Q6772
34838A84831M7066M1510K8507j9523j5184O2515P4941n9075j95444j44848O2843
$$ plain form
34827 68139 268544 370648 224224 -50111 -155935 52055 371642 475935 304444 92417
34817 92417 11290 -30836 -154027 -253838 -139890 170255 446499 499643 339279 112442
34807 112442 -34248 -54474 -17832 -10644 -22890 5845 48111 13697 -82249 -121015 -83249
34796 -83249 -91443 -188145 -236305 -136005 12007 75619 86480 134646 190195 178127 140146
34785 140146 173984 269259 326772 296620 204216 92929 19535 43828 152530 257251 314022
34774 314022 360058 405141 411765 414288 494116 586275 508366 265740 107383 153495 201381
34763 201381 75122 -68041 -13785 137332 156442 79859 101648 184359 110863 -115346 -236540
34752 -236540 -126217 51840 101234 -6546 -204658 -398623 -449093 -284750 -51482 24005
$$ packed form
34827F8139K00405J02104j46424k74335j05824K07990L19587J04293j71491k12027
34817I2417q1127m2126j23191r9811J13948L10145K76244N3144j60364k26837
34807A12442j46690k0226L6642P188j2246K8735M2266l4414r5946l8766L7766
34796h3249q194r6702m8160J00300J48012O3612J0861M8166N5549j2068l7981
34785A40146L3838R5275N7513l0152r2404j11287p3394K4293J08702J04721N6771
34774C14022M6036M5083O624K523P9828R2159p7909k42626j58357M6112M7886
34763B01381j26259j43163N4256J51117J9110p6583K1789Q2711p3496k26209j21194
34752b36540J10323J78057M9394j07780j98112j93965n0470J64343K33268P5487
$$ plain form
34742 24005 -80226 -195763 -230944 -229437 -192112 -61625 113734 209450 223409 246324 245514
34731 245514 103501 -123603 -225031 -142761 -32287 16091 81792 195139 254811 230108
34721 230108 217223 228064 157112 25954 3245 90234 65524 -122433 -196620 15684 252831
34710 252831 178669 -127309 -314742 -248311 -69275 116039 309485 432824 362625 176532
34700 176532 116423 249230 368407 300166 126271 15734 -6470 -10015 -2964 37839 51448
34689 51448 -50972 -228484 -324557 -257149 -106628 12888 83097 130481 132211 71308 29794
34678 29794 98101 211534 224912 161571 213381 432484 614720 612834 571849 651124 678957
34667 678957 380002 -120090 -348033 -99912 271848 316636 27067 -227695 -169419 137790
$$ packed form
34742B4005j04231j15537l5181J507L7325J30487J75359R5716J3959K2915q10
34731B45514j42013k27104j01428Q2270J10474M8378O5701J13347N9672k4703
34721B30108j2885J0841p0952j31158k2709Q6989k4710j87957p4187K12304K37147
34710B52831p4162l05978j87433O6431J79036J85314J93446J23339p0199j86093
34700A76532o0109J32807J19177o8241j73895j10537k2204l545P051M0803J3609
34689E1448j02420j77512r6073O7408J50521J19516P0209M7384J730o0903m1514
34678B9794O8307J13433J3378o3341N1810K19103J82236j886m0985P9275K7833
34667F78957k98955n00092k27943K48121L71760M4788k89569k54762N8276L07209
$$ plain form
34657 137790 420140 453203 229792 -45890 -146869 -31976 159109 287393 308867 225908
34647 225908 77401 -29195 -13102 53491 55227 47922 174349 373748 419261 291204 239729
34636 239729 359167 379939 92013 -257967 -270530 48790 321392 314016 154616 49631
34626 49631 39733 76561 138862 204260 242329 273353 317017 286704 93374 -135141 -137851 102120
34614 102120 257267 73873 -260225 -353448 -120712 162646 282022 306240 329236 244326
34604 244326 -35880 -307907 -288467 -36555 100552 -24474 -189581 -197800 -171905 -290675
34594 -290675 -462188 -495121 -429461 -426834 -439193 -282059 -100 134044 15899 -151640
34584 -151640 -173960 -92722 -22637 32995 107343 182431 267640 412544 561273 550240 343898
$$ packed form
34657A37790K82350L3063k23411k75682j00979J14893J91085J28284K1474q2959
34647B25908j48507j06596J6093O6593J736p305J26427J99399M5513j28057n1475
34636B39729J19438K0772k87926l49980j2563L19320K72602p376j59400j04985
34626D9631r898L6828O2301O5398L8069L1024M3664l0313j93330k28515k710K39971
34614A02120J55147j83394l34098r3223K32736K83358J19376K4218K2996q4910
34604B44326k80206k72027J9440K51912J37107j25026j65107q219K5895j18770
34594b90675j71513l2933O5660K627j2359J57134K81959J34144j18145j67539
34584a51640k2320Q1238P0085N5632P4348P5088Q5209J44904J48729j1033k06342
$$ plain form
34573 343898 132341 96092 188977 236404 142582 -65722 -297214 -446802 -486450 -518681 -618416
34562 -618416 -647400 -420216 -49559 127107 16334 -110309 -67736 -39038 -219780 -438266
34552 -438266 -390860 -93107 156975 168316 -452 -205503 -336807 -336268 -251528 -210553 -234064
34541 -234064 -181946 917 136996 71873 -70502 -77591 35567 104108 94760 91486 90145
34530 90145 32640 -19233 32258 107525 42708 -120794 -152279 44515 297609 385047 254311
34519 254311 10373 -200400 -281035 -239915 -159426 -84997 -11217 7615 -119273 -322385 -381971
34508 -381971 -249038 -160414 -276679 -410199 -321039 -87502 69638 153818 291789 416603
34498 416603 378007 263708 274078 351255 278581 98601 65515 190727 212005 55904 -37203
$$ packed form
34573C43898k11557l6249R2885M7427r3822k08304k31492j49588l9648l2231r9735
34562f18416k8984K27184L70657J76666j10773j26643M2573K8698j80742k18486
34552d38266M7406K97753K50082J1341j68768k05051j31304N39Q4740M0975k3511
34541b34064N2118J82863J36079o5123j42375p089J13158O8541r348l274j341
34530I0145n7505n1873N1491P5267o4817j63502l1485J96794K53094Q7438j30736
34519B54311k43938k10773q0635M1120Q0489P4429P3780J8832j26888k03112n9586
34508c81971J32933Q8624j16265j33520Q9160K33537J57140Q4180J37971J24814
34498D16603l8596j14299J0370P7177p2674j79980l3086J25212K1278j56101r3107
$$ plain form
34487 -37203 64378 182705 173306 150297 216952 255574 158603 26394 -40318 -132607 -341250
34476 -341250 -552005 -604645 -517259 -414095 -358741 -365466 -433084 -468015 -327963 -46321 142757
34465 142757 110115 4762 8422 78285 71301 -16000 -83858 -104776 -126552 -167703 -208301 -227917
34453 -227917 -200245 -125961 -89743 -170419 -283769 -264547 -121510 -31438 -51881 -52338 13323
34442 13323 4833 -130745 -217931 -129721 5987 41390 55990 182762 353733 415815 367284
34431 367284 293484 187821 20170 -122052 -139501 -81877 -51083 -35980 15841 67949 78631
34420 78631 97782 134650 64753 -156837 -323239 -224430 34159 172054 108471 -14264 -108362
34409 -108362 -214591 -332652 -386471 -353891 -268424 -118897 100530 290240 358473 377803
$$ packed form
34487c7203J01581J18327r399k3009O6655L8622r6971j32209o6712r2289k08643
34476c41250k10755n2640Q7386J03164N5354o725o7618l4931J40052K81642J89078
34465A42757l2642j05353L660O9863o984q7301o7858k0918k1776m1151m0598j9616
34453b27917K7672P4284L6218q0676j13350J9222J43037R0072k0443m57O5661
34442A3323q490j35578q7186Q8210J35708L5403J4600J26772J70971O2082m8531
34431C67284p3800j05663j67651j42222j7449N7624L0794J5103N1821N2108J0682
34420G8631J9151L6868o9897k21590j66402R8809K58589J37895o3583j22735r4098
34409a08362j06229j18061n3819L2580Q5467J49527K19427J89710O8233J9330
$$ plain form
34399 377803 455786 519381 432039 263903 205823 239658 151473 -101391 -282086 -201768 51350
34388 51350 287781 434175 487953 430126 299187 221249 253654 290668 211857 42230 -107124
34377 -107124 -178371 -178533 -122999 -36409 35782 62578 41699 -27630 -128525 -185976 -124537 20835
34365 20835 128124 129547 49838 -89660 -291062 -481267 -514618 -343360 -111622 -16335 -111769
34354 -111769 -275452 -322877 -153285 154929 390988 417689 315761 241484 181148 -4856
34344 -4856 -294461 -450117 -332338 -106245 -13306 -63092 -97106 -59515 -27078 -19057 34485
34333 34485 128971 165814 144303 209920 414785 564017 445227 133968 -88313 -89348 6491
34322 6491 68791 128583 221699 250563 157749 101410 247284 454246 406609 70916 -209945
$$ packed form
34399C77803P7983O3595q7342j68136n8080L3835q8185k52864j80695Q0318K53118
34388E1350K36431J46394N3778n7827j30939p7938L2405L7014p8811j69627j49354
34377a07124p1247j62N5534Q6590P2191K6796k0879o9329j00895n7451O1439J45372
34365B0835J07289J423p9709j39498k01402j90205l3351J71258K31738R5287r5434
34354a11769j63683m7425J69592L08214K36059K6701j01928p4277o0336j86004
34344d856k89605j55656J17779K26093R2939m9786l4014L7591L2437Q021N3542
34333C4485R4486L6843k1511O5617K04865J49232j18790l11259k22281j035R5839
34322F491O2300N9792R3116K8864r2814n6339J45874K06962m7637l35693k80861
$$ plain form
34311 -209945 -155241 118315 312696 327608 267222 193809 63385 -133043 -310264 -369349
34301 -369349 -261740 -12481 255052 386005 362175 322517 337571 283963 70839 -138982
34291 -138982 -131499 21596 64958 -31582 -23964 203624 434129 433481 277157 200454 252242
34280 252242 275203 169537 12836 -72937 -38553 126784 421635 751739 903357 714763
34270 714763 285770 -69584 -131692 12097 115777 76268 -6732 -29093 -1638 36686 80741
34259 80741 88416 -17120 -209577 -351650 -391369 -420931 -458836 -354431 -48900 245578 316716
34248 316716 246471 215399 166187 -53941 -325853 -369982 -189838 -62916 -74993 -17306 182201
34237 182201 292583 195252 120628 247771 372255 258525 73560 126681 347038 395359
$$ packed form
34311b09945N4704K73556J94381J4912o0386p3413j30424j96428j77221n9085
34301c69349J07609K49259K67533J30953k3830l9658J5054n3608k13124k09821
34291a38982P483J53095M3362r6540P618K27588K30505o48j56324p6703N1788
34280B52242K2961j05666j56701q5773L4384J65337K94851L30104J51618j88594
34270G14763m28993l55354o2108J43789J03680l9509q3000k2361K7455L8324M4055
34259H0741P675j05536j92457j42073l9719k9562l7905J04405L05531K94478P1138
34248C16716p0245l1072m9212k20128k71912m4129J80144J26922j2077N7687J99507
34237A82201J10382r7331p4624J27143J24484j13730j84965N3121K20357M8321
$$ plain form
34227 395359 217877 109910 214147 314242 232757 129183 221230 426546 492395 353711
34217 353711 163217 35007 -55196 -129788 -134104 -43219 59894 64890 -56729 -241351 -384969
34206 -384969 -402893 -301467 -199942 -206438 -252558 -147920 145545 400926 400793 241670 197469
34195 197469 308341 312928 52623 -249807 -265233 8361 268461 318257 275060 343638 524530
34184 524530 630384 527456 279687 52990 -72789 -146848 -199901 -138669 112489 408313
34174 408313 481544 278137 36449 -40640 -31060 -93638 -181929 -141246 10729 102582 63782
34163 63782 -19215 -79524 -140653 -217316 -280267 -310849 -287100 -164863 15382 87307 -28832
34152 -28832 -167426 -150063 -72498 -133290 -272310 -262281 -103577 -9166 -6110 103687 338171
$$ packed form
34227C95359j77482j07967J04237J00095q1485j03574R2047K05316O5849j38684
34217C53711j90494j28210r0203p4592m316R0885J03113M996j21619j84622j43618
34206c84969j7924J01426J01525o496m6120J04638K93465K55381j33j59123m4201
34195A97469J10872M587k60305l02430j5426K73594K60100M9796m3197O8578J80892
34184E24530J05854j02928k47769k26697j25779p4059n3053O1232K51158K95824
34174D08313P3231k03407k41688p7089R580o2578q8291M0683J51975R1853l8800
34163F3782q2997o0309o1129p6663o2951l0582K3749J22237J80245P1925j16139
34152b8832j38594J7363P7565o0792j39020J0029J58704R4411L056J09797K34484
$$ plain form
34141 338171 442344 307484 147676 110770 40873 -174986 -335179 -252406 -87771 -67259
34131 -67259 -88351 66259 292012 297717 95420 6508 176293 384184 397107 268436 183961
34120 183961 179222 131442 -37669 -238512 -305779 -209338 -126182 -213545 -347210 -262564 26123
34109 26123 183157 27847 -194646 -196538 -71113 -89501 -260015 -375857 -372591 -341888 -274896
34098 -274896 -88394 140685 247515 256418 321628 428956 437230 385430 444728 561849 486915
34087 486915 211990 45503 142811 283888 270507 240779 377277 554933 531217 312743
34077 312743 93561 -43145 -138601 -173261 -88421 54890 117648 57647 -63094 -192359
34067 -192359 -291135 -296333 -213761 -178790 -279814 -382729 -289580 -29788 173231 207950 176295
$$ packed form
34141C38171J04173j34860j59808l6906o9897k15859j60193Q2773J64635K0512
34131f7259k1092J54610K25753N705k02297q8912J69785K07891J2923j28671q4475
34120A83961m739m7780j69111k00843o7267R6441Q3156q7363j33665Q4646K88687
34109B6123J57034j55310k22493j892J25425j8388j70514j15842L266L0703O6992
34098b74896J86502K29079J06830Q903O5210J07328Q274n1800N9298J17121p4934
34087D86915k74925j66487R7308J41077j3381k9728J36498J77656k3716k18474
34077C12743k19182j36706r5456l4660Q4840J43311O2758o0001j20741j29265
34067a92359r8776n198Q2572L4971j01024j02915R3149K59792K03019L4719l1655
$$ plain form
34056 176295 175868 151623 30929 -128172 -226222 -283485 -402125 -581659 -661679 -493105 -137191
34045 -137191 163123 233264 143310 80191 85211 26191 -166831 -375555 -471079 -494856 -545364
34034 -545364 -577775 -475219 -279221 -174677 -224879 -279447 -209591 -101066 -112771 -241302
34024 -241302 -348610 -364742 -330096 -261035 -119780 56473 133676 59544 -43334 -55907 -42007
34013 -42007 -126013 -260773 -280096 -166863 -96896 -176890 -292723 -292540 -191590 -103511 -77464
34002 -77464 -105623 -198772 -345405 -473001 -550027 -640454 -751571 -737098 -501951 -207166 -82393
33991 -82393 -97082 -27967 172653 300291 212813 13301 -135344 -189402 -145925 33675 310861
33980 310861 512753 496887 289832 6674 -258557 -415261 -388640 -231050 -104989 -83205
$$ packed form
34056A76295m27k4245j20694j59101r8050n7263j18640j79534q0020J68574L55914
34045a37191L00314P0141q9954o3119N020n9020j93022k08724r5524k3777n0508
34034e45364l2411J02556J95998J04544n0202n4568O9856J08525j1705j28531
34024b41302j07308j6132L4646O9061J41255J76253P7203p4132j02878j2573J3900
34013d2007q4006j34760j9323J13233O9967p9994j15833J83J00950Q8079K6047
34002g7464k8159r3149j46633j27596p7026r0427j11117J4473K35147K94785J24773
33991h2393j4689O9115K00620J27638q7478j99512j48645n4058M3477J79600K77186
33980C10861K01892j5866k07055k83158k65231j56704K6621J57590J26061K1784
$$ plain form
33970 -83205 -81649 -48088 -68525 -200904 -354519 -440616 -496219 -545303 -499431 -342979 -255055
33959 -255055 -358575 -485369 -407352 -194310 -104971 -193188 -268460 -214508 -103823 1057
33949 1057 122131 218041 189002 76423 45245 111700 105080 -21732 -70496 84031 256565
33938 256565 210761 11863 -73572 51039 214633 213324 10335 -265961 -415218 -295752
33928 -295752 31072 313140 348301 179011 -17472 -158166 -271101 -352852 -348809 -256427
33918 -256427 -134046 -20305 59179 41669 -90478 -197209 -95240 193896 436970 467339
33908 467339 358796 275343 252887 202597 61122 -137460 -310065 -399407 -413109 -398745 -368863
33897 -368863 -282870 -142481 -45559 -58779 -93426 -29820 84966 124514 129642 249933 425228
$$ packed form
33970h3205J556L3561k0437j32379j53615q6097n5603m9084M5872J56452Q7924
33959b55055j03520j26794P8017K13042Q9339q8217p5272N3952J10685J04880
33949A057J21074R5910k9039j12579l1178O6455o620j26812m8764J54527J72534
33938B56565m5804j98898q5435J24611J63594j309k02989k76296j49257J19466
33928b95752L26824K82068L5161j69290j96483j40694j12935q1751M043R2382
33918b56427J22381J13741P9484j7510j32147j06731J01969K89136K43074L0369
33908D67339j08543q3453k2456n0290j41475j98582j72605q9342j3702J4364K9882
33897c68863Q5993J40389R6922j3220l4647O3606J14786L9548N128J20291J75295
$$ plain form
33886 425228 381043 37030 -323893 -449057 -457941 -587839 -789206 -825535 -638344 -349453
33876 -349453 -10599 362147 586591 474810 182232 74330 213114 292814 149706 -568
33866 -568 33963 106874 27941 -103511 -116179 -102072 -246874 -470296 -527888 -394091 -273236
33855 -273236 -259776 -233767 -106386 36791 77754 3462 -126800 -241852 -283933 -264880 -270831
33844 -270831 -326121 -317588 -167726 -5658 -16231 -176227 -296880 -280784 -176927 -28916
33834 -28916 152556 293645 311416 250830 210188 169272 72038 26282 182837 426971 450150
33823 450150 170883 -160935 -338288 -419999 -485443 -435084 -210345 511 -7985 -154721
33813 -154721 -193143 -48689 131653 199179 125277 -44818 -231145 -345292 -371267 -382662
$$ packed form
33886D25228m4185l44013l60923j25164q884j29898k01367l6329J87191K88891
33876c49453L38854L72746K24444j11781k92578j07902J38784P9700j43108j50274
33866e68L4531P2911p8933j31452j2668J4107j44802k23422n7592J33797J20855
33855b73236J3460K6009J27381J43177M0963p4292j30262j15052m2081J9053n951
33844b70831n5290Q533J49862J62068j0573j59996j20653J6096J03857J48011
33834b8916J81472J41089J7771o0586m0642m0916r7234m5756J56555K44134K3179
33823D50150k79267l31818j77353q1711o5444N0359K24739K10856q496j46736
33813a54721l8422J44454J80342O7526p3902j70095j86327j14147k5975j1395
$$ plain form
33803 -382662 -420454 -425486 -350981 -245214 -151773 -41963 65049 47075 -127355 -270443 -202216
33792 -202216 -15281 64324 14527 16262 134142 201608 74162 -159722 -303006 -289014 -219071
33781 -219071 -213886 -284968 -331248 -236418 10644 279908 407069 353647 252478 275210 436486
33770 436486 538030 361145 -52948 -380752 -353208 -63806 163463 165492 54637 -29720
33760 -29720 -89219 -143919 -128130 -5718 146010 255195 335452 376374 302173 135929 56339
33749 56339 167430 337882 389040 316009 202792 64371 -76158 -97427 45539 166306
33739 166306 59351 -212395 -411952 -421350 -277319 -35762 194503 203731 -76941 -366076
33729 -366076 -335552 -71382 51933 -78163 -208094 -177725 -133341 -179989 -153950 68539
$$ packed form
33803c82662l7792n032P4505J05767R3441J09810J07012j7974j74430j43088O8227
33792b02216J86935P9605m9797J735J17880O7466j27446k33884j43284J3992O9943
33781b19071N185p1082m6280R4830K47062K69264J27161n3422j01169K2732J61276
33770D36486J01544j76885m14093l27804K7544K89402K27269K029j10855q4357
33760b9720n9499n4700J5789J22412J51728J09185Q0257M0922p4201j66244p9590
33749E6339J11091J70452N1158p3031j13217j38421j40529k1269J42966J20767
33739A66306j06955k71746j99557r398J44031K41557K30265R228k80672k89135
33729c66076L0524K64170J23315j30096j29931L0369M4384m6648K6039K22489
$$ plain form
33719 68539 297829 297295 140104 65864 104216 73819 -99676 -271624 -291723 -188486 -112286
33708 -112286 -166761 -307482 -382872 -302236 -164931 -148784 -262255 -324054 -231226 -109976 -108123
33697 -108123 -166362 -139195 -59526 -110519 -343493 -568460 -565722 -319262 1393 235911 365263
33686 365263 467946 581215 637403 558462 386519 255709 222506 193292 66000 -107833
33676 -107833 -172068 -66221 86413 119896 24234 -48168 13686 131166 162189 128647 177784
33665 177784 301459 279114 18007 -217312 -124638 184759 310645 122934 -72882 2536
33655 2536 224465 297457 181258 86274 139285 244901 260831 164180 21232 -112180 -216074
33644 -216074 -266970 -213390 -28020 196172 266003 97332 -133342 -180152 -64502 -54763 -268592
$$ packed form
33719F8539K29290n34j57191p4240L8352l0397j73495j71948k0099J03237P6200
33708a12286n4475j40721p5390Q0636J37305J6147j13471o1799R2828J21250J853
33697a08123n8239K7167P9669n0993k32974k24967K738K46460L20655K34518J29352
33686C65263J02683J13269N6188p8941j71943j30810l3203k9214j27292j73833
33676a07833o4235J05847J52634L3483r5662p2402O1854J17480L1023l3542M9137
33665A77784J23675k2345k61107k35319R2674L09397J25886j87711j95816P5418
33655B536K21929P2992j16199r4984N3011J05616J5930r6651j42948j33412j03894
33644b16074n0896N3580J85370K24192O9831j68671k30674m6810J15650R739k13829
$$ plain form
33633 -268592 -478374 -421460 -147447 96866 207656 258831 265186 130228 -141848 -355084
33623 -355084 -326501 -90972 162388 293391 294086 223302 131660 42048 -49561 -164655 -298435
33612 -298435 -375922 -303779 -116218 -24761 -213638 -568148 -729546 -503341 -113813 71590
33602 71590 -1071 -54142 105081 331593 362146 154077 -81472 -119622 59902 257954
33592 257954 250218 37432 -131078 -57751 135454 165097 -33385 -250543 -311556 -245670 -126167
33581 -126167 49684 248812 359090 356220 356704 416218 435507 356436 275786 253056 187109
33570 187109 22554 -99699 -64995 7789 -28982 -92553 -32894 75371 52255 -62937 -66149
33559 -66149 66695 136608 34460 -113843 -149211 -60216 64460 126382 51072 -142672 -312556
$$ packed form
33633b68592k09782N6914K74013K44313J10790N1175O355j34958k72076k13236
33623c55084K8583K35529K53360J31003O95p0784r1642q9612r1609j15094j33780
33612b98435p7487P2143J87561R1457j88877l54510j61398K26205L89528J85403
33602G1590p2661n3071J59223K26512L0553k08069k35549l8150J79524J98052
33592B57954p736k12786j68510P3327J93205K9643j98482k17158o1013O5886J19503
33581a26167J75851J99128J10278k870M84N9514J9289p9071q0650k2730o5947
33570A87109j64555j22253L4704P2784l6771o3571N9659J08265k3116j15192l212
33559f6149J32844O9913j02148j48303l5368Q8995J24676O1922p5310j93744j69884
$$ plain form
33548 -312556 -343562 -289919 -244841 -150248 77101 292805 237712 -89438 -392880 -449955 -324895
33537 -324895 -176689 -57499 30108 59285 49918 69594 99182 37313 -112856 -213447 -194027
33526 -194027 -120586 -22861 145702 302815 219285 -150885 -509943 -556539 -344124 -140496
33516 -140496 -69291 -68107 -77548 -65711 53896 322984 596130 674776 557979 412415 337781
33505 337781 316590 341134 403955 395465 214449 -21574 -82401 34300 77321 -86540 -282047
33494 -282047 -303596 -195000 -118379 -102033 -78483 -53684 -67175 -66258 12206 91890 50448 -80254
33482 -80254 -165710 -178784 -181692 -130316 84749 376585 466506 240803 -81406 -239285 -211012
33471 -211012 -83994 154117 493515 726336 649012 370574 179313 143898 95029 -11663
$$ packed form
33548c12556l1006N3643M5078R4593K27349K15704n5093l27150l03442n7075J25060
33537c24895J48206J19190Q7607K9177r367J9676K9588o1869j50169j00591J9420
33526a94027P3441R7725J68563J57113q3530l70170l59058m6596K12415K03628
33516a40496P1205J184r441J1837J19607K69088K73146P8646j16797j45564p4634
33505C37781k1191K4544O2821q490j81016k36023o0827J16701M3021j63861j95507
33494b82047k1549J08596P6621J6346K3550K4799j3491R17P8464P9684m1442j30702
33482h0254q5456j3074k908N1376K15065K91836Q9921k25703l22209j57879K8273
33471b11012J27018K38111L39398K32821p7324k78438j91261l5415m8869j06692
$$ plain form
33461 -11663 2229 209460 412196 431368 354565 354859 435288 499999 527217 519012 417721 231560
33449 231560 111203 129326 116057 -82948 -306420 -288727 -99703 -88549 -378961 -683589
33439 -683589 -690469 -419984 -113168 49801 26773 -122172 -241405 -195495 -81921 -179604
33429 -179604 -557553 -882917 -802624 -418391 -166513 -254159 -436235 -400502 -173991 -13300
$$ packed form
33461a1663J3892K07231K02736J9172p6803K94Q0429O4711K7218q205j01291j86161
33449B31560j20357J8123j3269j99005k23472J7693J89024J1154k90412l04628
33439f83589o880K70485L06816J62969k3028j48945j19233M5910J13574r7683
33429a79604l77949l25364Q0293L84233K51878q7646j82076L5733K26511J60691
$$ [...]
##END NTUPLES=NMR SPECTRUM
##END=
