##TITLE=31Pdec_DPA0606
 , 24 sc
 6.6.2019
##JCAMPDX= 6.0         $$ Bruker NMR JCAMP-DX V2.0
##DATA TYPE= NMR SPECTRUM
##DATA CLASS= NTUPLES
##ORIGIN= UXNMR, Bruker Analytische Messtechnik GmbH
##OWNER= root
$$ XWIN-NMR		Version 3.5
$$ Thu Jun  6 15:45:19 2019 Russian Standard Time (UT+4h)  she@DPX200
##.OBSERVE FREQUENCY= 81.013821
##.OBSERVE NUCLEUS= ^31P
##.ACQUISITION MODE= SIMULTANEOUS
##.ACQUISITION SCHEME= undefined
##.AVERAGES= 24
##.DIGITISER RES= 17
##SPECTROMETER/DATA SYSTEM= spect
##.PULSE SEQUENCE= zgpg30
##.SOLVENT NAME= DMSO
##.SHIFT REFERENCE= (INTERNAL, DMSO, 0, 182.463)
##AUDIT TRAIL= $$ (NUMBER, WHEN, WHO, WHERE, WHAT)
$$ ##TITLE= Audit trail, XWIN-NMR		Version 3.5
$$ ##JCAMPDX= 5.01
$$ ##ORIGIN= Bruker BioSpin GmbH
$$ ##OWNER= she
$$ F:/spectra/data/she/nmr/P31/1/pdata/1/auditp.txt
$$ ##AUDIT TRAIL=  $$ (NUMBER, WHEN, WHO, WHERE, WHAT)
(   1,<2019-06-06 15:44:20.39 +0400>,<she>,<DPX200>,
      <created by zg, POWCHK disabled, PULCHK disabled
       configuration hash MD5:
       00 E9 B6 7A A2 85 ED C7 34 08 36 98 17 FE 4E 26
       data hash MD5: 32K
       D0 A2 2F 93 5B 75 2C 50 AC 6E 9C F1 B3 21 F0 1B>)
(   2,<2019-06-06 15:44:22.93 +0400>,<she>,<DPX200>,
      <Start of raw data processing
       efp BC_mod = 2 LB = 1 FT_mod = 6 PKNL = 1 PHC0 = -2554.444 PHC1 = 98.39911 SI = 64K 
       data hash MD5: 64K
       FD BA A1 44 28 28 DE 6C C2 7F 52 68 8C BB 8A 4E>)
(   3,<2019-06-06 15:44:40.73 +0400>,<she>,<DPX200>,
      <pk PHC0 = -7.060169 PHC1 = -3.6 
       data hash MD5: 64K
       4C 9F 43 A6 D6 71 B2 DB 4B 86 CD 6A 6E 6A BF 91>)
$$ ##END=
$$ 
$$ hash MD5
$$ EE B2 B6 4F 09 31 BD D4 FB DA 74 E0 E8 E4 62 D1
##$RELAX= 
##$RELAX= 
##$RELAX= 
##$RELAX= 
##$RELAX= 
##$RELAX= 
##$RELAX= 
##$RELAX= 
$$ Bruker specific parameters
$$ --------------------------
##$DU= <F:/spectra>
##$EXPNO= 1
##$NAME= <P31>
##$PROCNO= 1
##$TYPE= <nmr>
##$USER= <she>
##$AMP= (0..31)
100 100 100 100 100 100 100 100 100 100 100 100 100 100 100 100 100 100 
100 100 100 100 100 100 100 100 100 100 100 100 100 100 
##$AQSEQ= 0
##$AQ_mod= 1
##$AUNM= <au_zg>
##$AUTOPOS= <>
##$BF1= 81.014009
##$BF2= 200.13
##$BF3= 200.13
##$BF4= 200.13
##$BF5= 200.13
##$BF6= 200.13
##$BF7= 200.13
##$BF8= 200.13
##$BYTORDA= 1
##$CFDGTYP= 0
##$CFRGTYP= 5
##$CHEMSTR= <none>
##$CNST= (0..31)
1 1 145 1 1 1 1 1 1 1 1 1 1 1 1 1 1 1 1 1 1 1 1 1 1 1 1 1 1 1 1 1 
##$CPDPRG= <waltz16>
##$CPDPRG1= <>
##$CPDPRG2= <waltz16>
##$CPDPRG3= <>
##$CPDPRG4= <mlev>
##$CPDPRG5= <mlev>
##$CPDPRG6= <mlev>
##$CPDPRG7= <mlev>
##$CPDPRG8= <mlev>
##$CPDPRGB= <>
##$CPDPRGT= <>
##$D= (0..31)
0 1 0 0 0 0 0 0 0 0 0 0.03 2e-05 3e-06 0 0 0 0 0 0 0 0 0 0 0 0 0 0 0 0 
0 0 
##$DATE= 1559821459
##$DBL= (0..7)
120 120 120 11 120 120 24 19 
##$DBP= (0..7)
150 150 150 150 150 150 150 150 
##$DBP07= 0
##$DBPNAM0= <>
##$DBPNAM1= <>
##$DBPNAM2= <>
##$DBPNAM3= <>
##$DBPNAM4= <>
##$DBPNAM5= <>
##$DBPNAM6= <>
##$DBPNAM7= <>
##$DBPOAL= (0..7)
0.5 0.5 0.5 0.5 0.5 0.5 0.5 0.5 
##$DBPOFFS= (0..7)
0 0 0 0 0 0 0 0 
$$ [...]
##$SUBNAM2= <"">
##$SUBNAM3= <"">
##$SUBNAM4= <"">
##$SUBNAM5= <"">
##$SUBNAM6= <"">
##$SUBNAM7= <"">
##$SUBNAM8= <"">
##$SUBNAM9= <"">
##$SW= 369.568048894756
##$SWIBOX= (0..15)
0 1 3 0 0 0 0 0 0 0 0 0 0 0 0 0 
##$SW_h= 29940.119760479
##$TD= 32768
##$TD0= 1
##$TE= 0
##$TE2= 300
##$TE3= 300
##$TEG= 300
##$TL= (0..7)
0 120 53 12 22 120 120 120 
##$TP= (0..7)
150 150 150 150 150 150 150 150 
##$TP07= 0
##$TPNAME0= <>
##$TPNAME1= <>
##$TPNAME2= <>
##$TPNAME3= <>
##$TPNAME4= <>
##$TPNAME5= <>
##$TPNAME6= <>
##$TPNAME7= <>
##$TPOAL= (0..7)
0.5 0.5 0.5 0.5 0.5 0.5 0.5 0.5 
##$TPOFFS= (0..7)
0 0 0 0 0 0 0 0 
##$TUNHIN= 0
##$TUNHOUT= 0
##$TUNXOUT= 0
##$USERA1= <user>
##$USERA2= <user>
##$USERA3= <user>
##$USERA4= <user>
##$USERA5= <user>
##$V9= 5
##$VALIST= <valist>
##$VCLIST= <CCCCCCCCCCCCCCC>
##$VD= 0
##$VDLIST= <DDDDDDDDDDDDDDD>
##$VPLIST= <PPPPPPPPPPPPPPP>
##$VTLIST= <TTTTTTTTTTTTTTT>
##$WBST= 1024
##$WBSW= 4
##$XGAIN= (0..3)
0 0 0 0 
##$XL= 0
##$YL= 0
##$YMAX_a= 36453
##$YMIN_a= -41864
##$ZGOPTNS= <>
##$ZL1= 120
##$ZL2= 120
##$ZL3= 120
##$ZL4= 120
##$ABSF1= 0
##$ABSF2= 0
##$ABSG= 0
##$ABSL= 0
##$ALPHA= 0
##$AQORDER= 0
##$ASSFAC= 0
##$ASSFACI= 0
##$ASSFACX= 0
##$ASSWID= 0
##$AUNMP= <proc_1d>
##$AZFE= 0.1
##$AZFW= 0.5
##$BCFW= 0
##$BC_mod= 2
##$BYTORDP= 0
##$COROFFS= 0
##$CY= -3
##$DATMOD= 1
##$DC= 0
##$DFILT= <>
##$DTYPP= 0
##$F1P= 0
##$F2P= 0
##$FCOR= 1
##$FTSIZE= 65536
##$FT_mod= 6
##$GAMMA= 0
##$GB= 0
##$INTBC= 1
##$INTSCL= 5.30512e-09
##$ISEN= 30
##$LB= 1
##$LEV0= 0
##$LPBIN= 0
##$MAXI= 10000
##$MC2= 0
##$MEAN= 0
##$ME_mod= 0
##$MI= 50
##$NCOEF= 0
##$NC_proc= -3
##$NLEV= 6
##$NOISF1= 182.463
##$NOISF2= 159.3651
##$NSP= 0
##$NTH_PI= 0
##$NZP= 0
##$OFFSET= 182.463
##$PC= 4
##$PHC0= -2561.504
##$PHC1= 94.79911
##$PH_mod= 1
##$PKNL= yes
##$PPARMOD= 0
##$PSCAL= 0
##$PSIGN= 0
##$REVERSE= no
##$SF= 81.0140089999434
##$SI= 65536
##$SIGF1= 159.3651
##$SIGF2= -187.1042
##$SINO= 113.3802
##$SIOLD= 16384
##$SREGLST= <1H.CDCl3>
##$SSB= 0
##$STSI= 65536
##$STSR= 0
##$SW_p= 29940.119760479
##$SYMM= 0
##$S_DEV= 0
##$TDeff= 32768
##$TDoff= 0
##$TI= <>
##$TILT= no
##$TM1= 0
##$TM2= 0
##$TOPLEV= 0
##$USERP1= <user>
##$USERP2= <user>
##$USERP3= <user>
##$USERP4= <user>
##$USERP5= <user>
##$WDW= 1
##$XDIM= 65536
##$YMAX_p= 346115076
##$YMIN_p= -6883641
$$ End of Bruker specific parameters
$$ ---------------------------------
##NTUPLES= NMR SPECTRUM
##VAR_NAME=  FREQUENCY,     SPECTRUM/REAL,   SPECTRUM/IMAG
##SYMBOL=    X,             R,               I
##VAR_TYPE=  INDEPENDENT,   DEPENDENT,       DEPENDENT
##VAR_FORM=  AFFN,          ASDF,            ASDF
##VAR_DIM=   65536,         65536,           65536
##UNITS=     HZ,            ARBITRARY UNITS, ARBITRARY UNITS
##FACTOR=    0.456856943014862, 1,           1
##FIRST=     14782.0589164792, 0,            0
##LAST=      -15158.0608439998, 0,           0
##MIN=       -15158.0608439998, -6883641,    0
##MAX=       14782.0589164792, 346115076,    0
$$ Real data points
##PAGE= N=1
##DATA TABLE= (X++(R..R)), XYDATA
$$ [...]
40273B84542N1322q4763j59476p3242N5735Q2760K7029N37L1229N3502M1639M7488
$$ 284542 335864 251101 91625 18383 74118 156878 183907 184444 215673 269175 310814 358302
40261C58302Q0275M1928j30925l09959k92133r0079M1042m9519j76487q8973J36588
$$ 358302 438577 480505 349580 39621 -252512 -342591 -301549 -351068 -527555 -616528 -479940
40250d79940J95543J1040j52765p3623J55210L15140L24212K04925j5086k31508
$$ -479940 -284397 -273357 -426122 -499745 -344535 -29395 294817 499742 484656 253148
40240B53148k63913q6968Q2023P8423J8619O0042J03454k6620k34305k63582q9652
$$ 253148 -10765 -97733 -15710 62713 81332 141374 244828 218208 -16097 -279679 -369331
40229c69331P2825J16072J20858J06579q943j67596j76146k6853N8440o58o914
$$ -369331 -296506 -180434 -59576 47003 38060 -129536 -305682 -332535 -274095 -274753 -281667
40218b81667J41163K22641N4995j57625j10694J30442K39052J10225n4004j01660
$$ -281667 -140504 82137 137132 -20493 -131187 -745 238307 348532 294528 192868
40208A92868q9923p4258o595Q6944O0484j08736k21409j32140K8892N9023j5817
$$ 192868 102945 28687 22092 109036 169520 60784 -160625 -292765 -263873 -204850 -220667
40197b20667j9103P5352J18172M8314r643L3230P2695j3857j43351j27437L9134
$$ -220667 -239770 -164418 -46246 2068 -7575 25655 98350 84493 -58858 -186295 -147161
40186a47161J43929M4527j34681j75592n0130Q2962J22984J30169J61465J37628
$$ -147161 -3232 41295 -93386 -268978 -319108 -236146 -113162 17007 178472 316100
40176C16100k8070k40759k89380j06843J26918J81243K4500j59882j78686j7767
$$ 316100 288030 47271 -242109 -348952 -222034 -40791 -16291 -176173 -354859 -372626
40166c72626J60914J87383N0875r6328j09765j4314M1213j3285p6166j9952J26657
$$ -372626 -211712 -24329 26546 -69782 -179547 -193861 -152648 -165933 -242099 -262051 -135394
40155a35394K12626J54779J8349q9077j27659j12034n8967J1810O8287R1217Q2883
$$ -135394 77232 232011 250360 161283 33624 -78410 -137377 -125567 -57280 33937 116820
40144A16820M7971R101K5647J14643J63112M7108j40816j51848N1019J73534j310
$$ 116820 164791 173892 199539 314182 477294 524402 383586 231738 282757 456291 454981
40133D54981k58587k47023j0236Q3074r2664k52233j64089K8481R3556N5763O4326
$$ 454981 196394 -50629 -60865 22209 -70455 -322688 -486777 -458296 -364740 -308977 -244651
40122b44651J19812J40335J45540J71275J29761m3321k12402k12616r8554k8068
$$ -244651 -124839 15496 161036 332311 462072 418751 206349 -6267 -104821 -132889
40112a32889o184L7461K9110j19285k36360o2463L07481M66433K44609o8687j55344
$$ -132889 -139073 -101612 -72502 -191787 -428147 -490610 -183129 283304 527913 459226 303882
40101C03882n6561J4923J4708J8703L371j01713k20269j81304M7949L03293L93394
$$ 303882 247321 262244 276952 295655 299026 197313 -22956 -204260 -156311 146982 540376
40090E40376K62449J5379j65335j66388m7087L9623K8916k6537r0410j71758k06885
$$ 540376 802825 818204 652869 486481 439394 479017 507933 481396 390986 219228 12343
40079A2343q2434J52966K63958J28515p4634j12569j5399J1137r0439j66098r0119
$$ 12343 -70091 82875 346833 475348 400714 288145 272746 283883 193444 27346 -62773
40068f2773P3773J66022R9448p1095j94278j54932J353J15157J11154P6924J04611
$$ -62773 11000 177022 276470 205375 11097 -143835 -142482 -27325 83829 160753 265364
40057B65364J49101J14053o884j49899k57311k64365j18614R3715J58786R84j67605
$$ 265364 414465 528518 521634 371735 114424 -149941 -268555 -174840 -16054 -15070 -182675
40046a82675j14971Q3804J62515M3872q7937p2860M8942J55040J75091Q6534q2356
$$ -182675 -297646 -213842 -51327 -7455 -95392 -168252 -119310 35730 210821 297355 214999
40035B14999k17114k05532q4242Q507K9491O2470J50207K23219K16641J42763
$$ 214999 -2115 -207647 -291889 -283382 -253891 -191421 -41214 182005 398646 541409
40025E41409L2861p8265j08172o106J09744N1454j59559k71274j31315J06710
$$ 541409 574270 496005 387833 381727 491471 542925 383366 112092 -19223 87487
40015H7487K01819J23356J7259k1834j5020R97J4694M293m6882j08794j33083
$$ 87487 289306 412662 429921 408087 393067 394064 408758 413051 366169 257375 124292
40004A24292j02745k1494J00774K15467K44203J65743M5778n0410j10810j19075
$$ 124292 21547 53 100827 316294 560497 726240 772018 721608 610798 491723
39994D91723m4694N6383M6924r1763j73258n1375J34248J27441p2205j98572r8811
$$ 491723 447029 503412 550336 458573 285315 233940 368188 495629 423424 224852 126041
39983A26041O5507Q0578j5386l6469L4779J9191j64506l37401k81148l0560J71402
$$ 126041 191548 272126 256740 220271 255050 274241 109735 -227666 -508814 -539374 -367972
39972c67972J82124R9173O7641P1550R611j03750j46740p7812J4894O3727R6201
$$ -367972 -185848 -86675 -19034 52516 62127 -41623 -188363 -266175 -251281 -187554 -91353
39961i1353J25142R6175K0000L5138K15940L96483L30115N061l18178l89629k03356
$$ -91353 33789 129964 149964 185102 401042 797525 1127640 1132701 814523 424894 221538
39950B21538M5228J46920K7051j99691l08989j81412N1825J53018O6287l8158
$$ 221538 266766 413686 440737 241046 -67943 -249355 -197530 -44512 21775 -16383
39940a6383k1629M3888J7397r0337j33978k5792J64421K79316K06625j7322k09117
$$ -16383 -38012 5876 23273 -67064 -201042 -226834 -62413 216903 423528 406206 197089
39929A97089k04615n1783M6711J5911L743J13384J98096Q9913r3872j08485J7750
$$ 197089 -7526 -59309 -12598 3313 7056 120440 318536 408449 314577 206092 223842
39918B23842J6240j75629k91046j54057M6537P2520l228K5706J37289J55301O9696
$$ 223842 240082 64453 -226593 -380650 -334113 -261593 -264821 -239115 -101826 53475 123171
39907A23171J2388j9180j35075k69520k08286N9630K72358K49708R3945l7973
$$ 123171 135559 116379 -18696 -288216 -496502 -436872 -164514 85194 179139 141166
39897A41166j33092j92481j33987K9174J15265M3182j2704Q1586J58538J9291
$$ 141166 8074 -184407 -318394 -289220 -173955 -130773 -143477 -61891 96647 115938
39887A15938j90758j65200Q4159K31293J17213n0619m3434P7158J05757q927j35691
$$ 115938 -74820 -240020 -155861 75432 192645 142026 98592 175750 281507 272580 136889
39876A36889j44990l4521Q4992R2387j8031j16889r4513j206L9096N862k6444
$$ 136889 -8101 -42622 42370 134757 116726 -163 -94676 -95882 -56786 -50924 -77368
39865g7368k3544m03N4062J27045J13373l9040j69154r1233Q8599Q4202j32551
$$ -77368 -100912 -101315 -47253 79792 193165 154125 -15029 -106262 -17663 66539 -66012
39854f6012k68783j48801N0743J19383J07913J32414J16550l5476j77028r3353
$$ -66012 -334795 -483596 -432853 -313470 -205557 -73143 43407 7931 -169097 -262450
39844b62450J50650K77721J73236j0199r6010n0565O9044J63584J12312q5536
$$ -262450 -111800 165921 339157 328958 232948 182383 251427 415011 527323 441787
39834D41787k18049r4861J47536J90418q299j45748l5364J17189N5245j27586
$$ 441787 223738 128877 276413 466831 458532 312784 277420 394609 449854 322268
39824C22268j59661k7486L6356l9072n2297J07859K37383J12615j58212k81004
$$ 322268 162607 135121 171477 132405 80108 187967 425350 537965 379753 98749
39814I8749j82922n6344k1442K2336J48706K23716J16329n9832r5604R588Q0864
$$ 98749 -84173 -140517 -161959 -139623 9083 232799 349128 289296 193692 203280 284144
39803B84144O1205O9579J51467J67806J7898j67695j74013K2511K13625J74801
$$ 284144 345349 414928 566395 734201 752099 584404 410391 432902 646527 821328
39793H21328j12266m27068m99352k73816L0235J73500J54161J14232P2372n6996
$$ 821328 709062 281994 -217358 -491174 -460939 -287439 -133278 -19046 53326 -3670
39783c670k04460j54823J10394L04216K00687o9618k37099k38935j71552n1150
$$ -3670 -208130 -362953 -252559 51657 252344 182726 -54373 -293308 -464860 -516010
39773e16010J48067L06024K52854L7771j06816q2398k1479l9926p1658k0238O8349
$$ -516010 -367943 -61919 190935 228706 121890 39492 18013 -21913 -93571 -113809 -45460
39762d5460Q3365J3650n5794o6269l5345m794J1910K9112N7743Q3289P9655M3382
$$ -45460 37905 51555 -4239 -70508 -105853 -110647 -98737 -69625 -11882 71407 151062 194444
39750A94444N12j9228J311O1139J21388J18501M7708n415O363j4178j57923k97607
$$ 194444 194956 175728 177039 238178 359566 478067 525775 520360 526723 512545 354622 57015
39738E7015k17440L6826J57735J308k00074j75003K6543J70002J72813J20774
$$ 57015 -160425 -123599 34136 35444 -164630 -339633 -313090 -143088 29725 150499
39728A50499O9837J6999j4198j2958k5744m3891K8655J68415J63654o6773k63412
$$ 150499 220336 237335 223137 210179 184435 140544 169199 337614 501268 434495 171083
39717A71083j72509N2845P8134j05775k12543j24321j642M8896J01382J82260
$$ 171083 -1426 51419 129553 23778 -188765 -313086 -314728 -265832 -164450 17810
39707A7810J98882J37596Q6704L8472q6881k09661j51107M6064J28307Q361j28037
$$ 17810 216692 354288 440992 479464 392583 182922 31815 77879 206186 214547 86510
39696H6510j35150o2748L9099J84819K73245J49330p9539j04489J11522K45753
$$ 86510 -48640 -111388 -72289 112530 385775 535105 455566 351077 462599 708352
39686G08352J18218n8382q3610p2568j50502j82246n7250N6209O770o7821k8830
$$ 708352 826570 768188 684578 612010 461508 279262 222012 278221 284991 217170 188340
39675A88340r748j11270j23407R9469K71924R9612j74124j14796J86142K54031
$$ 188340 178592 67322 -56085 43384 315308 414920 240796 126000 312142 566173
39665E66173J666j72057o2672P1252J8389o7568k5436L2591l143j8440N4419L9064
$$ 566173 567839 395782 333110 404362 422751 355183 329747 362338 359195 340755 395174 434238
39653D34238j69954l38071k05010J04546K50609J46718M330l3062m9694j30703
$$ 434238 264284 -73787 -278797 -174251 76358 223076 227406 194344 144650 13947
39643A3947j86261j01630N9320J28117P2750L7083J01522J27558k7446k17739
$$ 13947 -172314 -273944 -214624 -86507 -13757 23326 124848 252406 224960 7221
39633G221j48747J70660L62998J90381j04732j66842l2068R645q7341r7577N0167
$$ 7221 -141526 29134 392132 582513 477781 310939 278871 288516 201175 103598 153765
39622A53765J51819P3228n9947r2544l8442K2163N5829L3549m9891q5685L6141
$$ 153765 305584 378812 318865 226321 187879 210042 265871 299420 249529 163844 199985
39611A99985K10925K23424P7146j9607j7161q9566k67330l14126j15770R1754
$$ 199985 410910 634334 711480 691873 674712 585146 317816 3690 -112080 -20326
39601b0326Q2444j3989L7901J79213J72306r227j65801j83083j32239q9270m7943
$$ -20326 62118 48129 86030 265243 437549 428322 262521 79438 -52801 -142071 -190014
39590a90014q678J033N04L2867P1598M8113l2621q4348m4667O3965J64922J89330
$$ -190014 -198692 -197659 -197155 -164288 -92690 -44577 -77198 -161546 -206213 -142248 22674 212004
39578B12004J33897O6304L5257O80p2417j02840j2359Q7970K2853j49004j92283
$$ 212004 345901 412205 447462 448142 375725 272885 260526 348496 371349 222345 30062
39567C0062o9889P859l0517O808J79955K28888Q548j93830q8310J25857P8241
$$ 30062 -39827 -31968 -62485 -55677 124278 353166 361714 167884 79574 205431 283672
39556B83672j47458j45381J32272K82584Q5368j80551j93642l2899K5536q1943
$$ 283672 136214 -9167 123105 405689 491057 310506 116864 83965 109501 27558
39546B7558j99520k05174j05348K7084R3200K8122r9413j32289k7935Q0996Q2529
$$ 27558 -171962 -377136 -482484 -455400 -362200 -334078 -433491 -565780 -593715 -512719 -430190
39535d30190L2685L7360Q8479J04973O5319J5715j1028j9962k1562j8003j3867
$$ -430190 -397505 -360145 -271666 -166693 -101374 -85659 -96687 -116649 -138211 -156214 -170081
39524a70081k5046p0065j25164r5184Q6752L04013L26791J18901o5699k5788R4351
$$ -170081 -195127 -265192 -390356 -485540 -398788 -94775 232016 350917 285218 259430 353781
39513C53781M7996j14638j54133o0214m7808j53279j65037q029J19026Q7113K2210
$$ 353781 401777 287139 133006 72792 24984 -128295 -293332 -301361 -182335 -95222 -73012
39502g3012K8820J9997l4817O596J48648J43828p4963j64460J08728M04510K70874
$$ -73012 -44192 -24195 -59012 -52416 96232 240060 165097 637 109365 513875 784749
39491G84749j46492l23596j61770o1215k04113k86584q8595J54552J69597O0238
$$ 784749 638257 314661 152891 91676 -112437 -399021 -487616 -333064 -163467 -103229
39481a03229M8381R9675P6348K1082J8152k2863j71471k49464r4717J00973L9455
$$ -103229 -54848 44827 121175 142257 160409 137546 -33925 -283389 -378106 -277133 -237678
39470b37678k00758k61523l5242K29032L37523L39669K73962O6397k11545k90142
$$ -237678 -438436 -699959 -735201 -506169 -168646 171023 444985 511382 299837 9695
39460I695p1151J88295K25409R5963j1807p4260j45332j59769n3203O0351N5493
$$ 9695 -61456 126839 352248 448211 436404 362144 216812 57043 3840 64191 119684
39449A19684J8316P5460J23614l515j90509j66099O0052J95723J17551J6590L0337
$$ 119684 138000 213460 337074 333559 143050 -23049 37003 232726 350277 366867 397204
39438C97204L8298m8313p7914O9119K25144J74077j5983j16967p4527l088N5980
$$ 397204 435502 387189 309275 378394 603538 777615 761632 644665 570138 567050 623030
39427F23030J47147K24400J76912K2138j03266j41821j49180j44118r0549k6801
$$ 623030 770177 994577 1171489 1193627 1090361 948540 799360 655242 564693 537892
39417E37892l7425p6380l88J70594K12686K1111j86710j43365J00251K56498K03696
$$ 537892 500467 424087 423699 594293 806979 828090 641380 498015 598266 854764 1058460
39406A058460J16079J60892K41057J61392m4570j17235R0201M02547N15085L17693
$$ 1058460 1174539 1335431 1576488 1737880 1693310 1576075 1666276 2068823 2583908 2901601
39396B901601m0603l44029m77138m46497l46445k95453l14568k80265r2976J32992
$$ 2901601 2860998 2516969 2039831 1593334 1246889 951436 636868 356603 263627 396619
39386C96619J82521M1633p3785k9465N5349K8356o4042r1552o0764p0798j25742
$$ 396619 579140 620773 546988 517523 572872 601228 537186 445634 384870 314072 188330
39375A88330j33069n0370P0957J52759J31394m431j53590j67599m1843O8038Q8927
$$ 188330 55261 4891 75848 228607 360001 355570 201980 34381 -7462 60576 149503
39364A49503J34992K62095L00316J10579j48129k24234j22166k0909L3776R7752
$$ 149503 284495 546590 846906 957485 809356 585122 462956 442047 475823 573575
39354E73575R8623n7567k14511j30078J04223J48130n7530j97618r7361K6380
$$ 573575 672198 614631 400120 270042 374265 522395 464865 267247 169886 196266
39344A96266k4360j01048r511J35764J18389j4286n2968L4453J00686P3571J4978
$$ 196266 171906 70858 61347 197111 315500 301214 248246 282699 383385 456956 471934
39333D71934j8974k1508J1239N5398M9047j2587n9932q2802j44314k02553j10889
$$ 471934 452960 431452 442691 498089 547136 534549 474617 391815 247501 44948 -65941
39322f5941J03527J84956K7846j18369k9551J35375J22956K0121O1576J63487
$$ -65941 37586 222542 250388 132019 102468 237843 360799 380920 442496 605983
39312F05983N5980j89465k04465O6190K26836M3899j89158j32294P3213P1164
$$ 605983 661963 472498 268033 334223 561059 604958 415800 283506 356719 427883
39302D27883j26556j84452O462J72038R4011q4139j22432l9785j0519m0299J3257
$$ 427883 301327 116875 123337 295375 389386 305247 182815 143030 132511 92212 105469
39291A05469J31805J09391r1915k03220m0202J64384Q0744j92920k55200j8427
$$ 105469 237274 346665 254750 51530 11328 175712 256456 63536 -191664 -210091
39281b10091J64952O4624j03656q3288L1080N0857M6142J33462J61438k6622k07919
$$ -210091 -45139 19485 -84171 -167459 -136379 -85522 -39380 94082 255520 228898 20979
39270B0979o9040K42298K95416N7808o5936Q4041J72311m7268l16260k88661m3831
$$ 20979 -48061 194237 489653 547461 481525 565566 737877 690609 374349 85688 41857
39259D1857R6729M2158m2749l1322P1127K07029K60768J01153k04911l62528k07893
$$ 41857 138586 180744 137995 106673 177800 384829 645597 746750 541839 179311 -28582
39248b8582M5016J06229J1848l799Q5204R3355k3005q6438j151R3218M3357j04423
$$ -28582 16434 122663 134511 130712 215916 309271 286266 199828 198677 291895 335252 230829
39236B30829j88687j24172M0915J76906J60724o333j59480j33224L2379J37677
$$ 230829 42142 -82030 -41115 135791 296515 290182 130702 -2522 29857 167534
39226A67534Q2440k0022j7046Q4304J47853Q6372m7730j38091j35017r1482o8722
$$ 167534 249974 229952 212906 297210 445063 531435 483705 345614 210597 119115 50393
39215E0393m1934M7989J67417K01878J11609j5457r6380j37670j45172p4789M9279
$$ 50393 8459 56448 223865 425743 537352 521895 425515 287845 142673 67884 117163
39204A17163R7229K6309j6851O9378J34144J687j93435j57575J00791K35335M4996
$$ 117163 214392 240701 223850 293228 427372 429059 235624 78049 178840 414175 459171
39193D59171k49122l19792j31712J06147K24487J85448K1296j60571k00796o1924
$$ 459171 210049 -109743 -241455 -135308 89179 274627 295923 135352 -65444 -127368
39183a27368Q7230Q4107r448l4586P049k999n7490k7203R6609J58691P8461l5075
$$ -127368 -40138 43969 34521 -65 6984 3985 -53505 -80708 15901 174592 253053 217978
39171B17978o3800k9384J66J5367J0831l8316p6637O724J68882J96372J9221j32686
$$ 217978 154178 124794 124960 140327 151158 112842 36205 42929 211811 408183 427404 294718
39159B94718n7606J00140Q4149o4200j07407k5069k634m8411J8702J66994J18232
$$ 294718 237112 337252 421401 357201 249794 224725 222091 173680 192382 359376 477608
39148D77608j61945l08250r7304J81101J61375o7267j78500j23771p4901k8619
$$ 477608 315663 7413 -89891 91210 252585 185318 6818 -116953 -191854 -220473
39138b20473J40583L30549L02244Q6451n4376n0417o0108r8328j5806J22858N3864
$$ -220473 -79890 250659 552903 639354 584978 534561 474453 376125 360319 483177 537041
39127E37041j98654k61103N449K52502J89101P556r003L7129p7776k27027j24381
$$ 537041 338387 77284 82733 335235 524336 531892 522889 560018 482242 255215 130834
39116A30834J69188L09316J67770n3756j69234j87422j65806j24796r7532q3227
$$ 130834 300022 609338 777108 723352 554118 366696 200890 76094 -21438 -104665
39106a04665n78J50958J93533L3837j10431j109K23445K37750K7259j23738q8247
$$ -104665 -105243 45715 239248 273085 162654 161545 384990 622740 649999 526261 438014
39095D38014n478M4005J22954J81512P1284j29882j56474J802N5497p3887q7189
$$ 438014 432536 476541 599495 781007 852291 722409 565935 567737 623234 549347 462158
39084D62158J55736L16676R4918k50631k66216J8299J71943K2598j49912q4046
$$ 462158 617894 934570 1029488 778857 512641 530940 702883 725481 575569 491523
39074D91523J30057K68346K78222K51200K47948K58244K49581J89683P9633j772
$$ 491523 621580 889926 1168148 1419348 1667296 1925540 2175121 2364804 2444437 2442665
39064B442665N4383K60554M90850N95779N53341M98609N89681Q27636J035252
$$ 2442665 2497048 2757602 3248452 3844231 4397572 4896181 5485862 6313498 7348750
39055G348750J048669Q81547O34134L19789p7966m36819n89457n84150o31810
$$ 7348750 8397419 9278966 9913100 10232889 10154923 9718104 9128647 8544497 7912687
39046G912687p63104p84577o45598n66966o61167p09921n40541l59564m13310
$$ 7912687 7149583 6365006 5719408 5152442 4491275 3781354 3240813 2881249 2467939
39037B467939n31560l78305k8457J07408r4071l06610k64524q8415L458O373N422
$$ 2467939 1936379 1558074 1529617 1637025 1542954 1236344 971820 883405 886863 893236 898658
39026H98658j5202p9678j21660j09403j04286r5141L0105K30947K53263m705k65724
$$ 898658 883456 803778 682118 572715 468429 373288 403393 634340 887603 882898 617174
39015F17174k33538j9506M5158q7274j53039k2406J11351N2516j09742j52391
$$ 617174 383636 364130 409288 322014 168975 146569 257920 310436 200694 48303
39005D8303k3103J21131J19187k2235j35542n6295J80114L24357J73055j67584
$$ 48303 25200 146331 265518 243283 107741 51446 231560 555917 728972 561388
38995E61388l75406k77202j5600J70192K08414J74110J14739J4151j12112j94353
$$ 561388 185982 -91220 -106820 63372 271786 445896 560635 574786 462674 268321
38985B68321j88756j18163l1175L2133L8385k4045j18586j84597j97443j80734
$$ 268321 79565 -38598 -69773 -37640 745 -23300 -141886 -326483 -523926 -704660
38975g04660j59848j31858q3436j1594P5037J49206J63055R3955L360N919J44543
$$ -704660 -864508 -996366 -1079802 -1091396 -1016359 -867153 -704098 -610143 -606783 -600864 -456321
38964d56321L16013L53321J81304j15286l56235l89208j93020R6735K84671K83136
$$ -456321 -140308 213013 394317 279031 -77204 -466412 -659432 -562697 -278026 5110
38954E110J77186R5641N1372l0828j55641k21793j59286j3123J42032K78696L52424
$$ 5110 182296 277937 329309 298481 142840 -78953 -238239 -251362 -109330 169366 521790
38943E21790K61461j7211l05800l69644j83308M8936J44627J14750O7710N4273
$$ 521790 783251 766040 460240 90596 -92712 -43776 100851 215601 283311 337584
38933C37584O4689R1647J19430J06582M8919J2885L6998M6132n0046k01187k55778
$$ 337584 402273 493920 613350 719932 768851 781736 818734 864866 814820 613633 357855
38922C57855j57962j5446M9333L3519J118k7909o8997j01900r0047n7629o7549
$$ 357855 199893 184447 233780 267299 268417 240508 171511 69611 -20436 -78065 -145614
38911a45614j06825p0605Q5328K32276K03826L6395m1673P7362J87494L0153l01859
$$ -145614 -252439 -323044 -237716 -5440 198386 234781 193108 270470 457964 488117 186258
38900A86258m21421j57067J94126K63484R1457j0129L8071K2247j23699j54721
$$ 186258 -235163 -392230 -198104 65380 156837 146708 184779 207026 83327 -71394
38890g1394P0383K98508K37624p696j28967q7525p9161j19078k8806J57309J51700
$$ -71394 -1011 297497 535121 527425 398458 310933 231772 112694 83888 241197 392897
38879C92897j06150k71788r6144J81616J97526l985j01446j2265N0430k1493q8185
$$ 392897 286747 14959 -81185 100431 297957 293972 192526 180261 230691 209198 121013
38868A21013m1130L6353M5710K435o5612j62434k14595j03424J23751K46988J63266
$$ 121013 79883 116236 161946 164381 98769 -63665 -278260 -381684 -257933 -10945 152321
38857A52321K9206K2871J03358J13055P464j18369j50271l4433J73165K92467
$$ 152321 181527 204398 307756 420811 428275 309906 159635 125202 298367 590834
38847E90834J76315o6198j49092J4199J76112J03865j03253j95890j27171l8304
$$ 590834 767149 700951 551859 566058 742170 846035 742782 546892 419721 381417
38837C81417l911M686k5575j23851j98352j19633O3579J62216J05103O527k7407
$$ 381417 377506 382192 356617 232766 34414 -85219 -21640 140576 245679 252206 224799
38826B24799r573K0047M8424L1525p6309k04359k04685m4384J47367K40749K11442
$$ 224799 215226 235273 283697 315222 238913 34554 -170131 -214515 -67148 173601 385043
38815C85043R8833j0256K1263K24244L69067J87714k08423l79225j26227K46171
$$ 385043 483876 473620 494883 719127 1088194 1275908 1067485 688260 562033 808204
38805H08204M13553N06035P91563J071236Q22950k7362q64318j080812p48024
$$ 808204 1221757 1727792 2519355 3590591 4413541 4386179 3521861 2441049 1693025
38796A693025l84418k70377k65458j90613p5298N373Q2261J72983J88647Q4455
$$ 1693025 1308607 1038230 772772 582159 506861 512234 594495 767478 956125 1040580
38786A040580k6464l6348j0492n5719j23516j10363p0308j24477k09825j57454
$$ 1040580 1014116 977768 967276 911557 788041 677678 607370 482893 273068 115614
38776A15614j7682l3431k20857k63607J2856L18682K94991L8662o5819P5995J87342
$$ 115614 97932 64501 -156356 -419963 -407107 -88425 206566 245228 179409 255404 442746
38765D42746R3567m8717o6449l2732p1643j09832r213J66683J98484j247k63127
$$ 442746 536313 487596 421147 388415 316772 206940 197727 364410 562894 561647 298520
38754B98520l38043j51535J24963K47344J43118m2030j45353j53766j19896k6430
$$ 298520 -39523 -191058 -66095 181249 324367 282337 136984 -16782 -136678 -163108
38744a63108J38999K61325K17818P3437r146j1942l4027o8196k7169K7558o0532
$$ -163108 -24109 237216 455034 528471 519325 507383 473356 405160 377991 405549 345017
38733C45017k35384k44819l5764J36785J05978K8247O6970J06209k156j31350
$$ 345017 109633 -135186 -170950 -34165 71813 100060 167030 273239 271083 139733
38723A39733q2612P1118J18800O7509Q3943J59817J26661j7999p9239Q082O8361
$$ 139733 57121 128239 247039 314548 398491 558308 684969 666970 587731 595813 664174
38712F64174k4559j52793j54887o3990k0970m6572k8108R2606K14494J93683L0823
$$ 664174 639615 486822 331935 267945 246975 200403 172295 264901 479395 673078 703901
38701G03901j14212j22705p3891j14919k17239k07626m5539J01292J05681L2147
$$ 703901 589689 466984 393093 278174 60935 -146691 -192230 -90938 14743 46890
38691D6890k7214p5760p9150O8216K97452L18311K8265k46850j85131M7549O2274
$$ 46890 19676 -56084 -135234 -67018 230434 548745 577010 330160 145029 192578 254852
38680B54852j51446k54827j15293M9181Q1301P6258J06274Q5244K201j268J05016
$$ 254852 103406 -151421 -266714 -217533 -136232 -59974 46300 131544 133745 132477 237493
38669B37493J54601O4289m2563q4210j40138k18390j64848N3771K15463J52493
$$ 237493 392094 456383 413820 329610 189472 -28918 -193766 -139995 75468 227961
38659B27961j0902q2800o6617m6773q272O3294Q1092J9802P840J02428J53852
$$ 227961 217059 134259 67642 20869 12597 75891 156983 176785 184625 287053 440905
38648D40905N5700o1386o5790n5712j44622k10404j06600M1788K5333r5871j03169
$$ 440905 496605 435219 369429 313717 169095 -41309 -147909 -106121 -80788 -176659 -279828
38637b79828J3342P7711N1831O1261J29628J40761N8343l2713q9573j24355r3668
$$ -279828 -266486 -188775 -136944 -75683 53945 194706 253049 220336 130763 6408 -87260
38626h7260K9026J23814P1512l2272k3499N0585L8041k4605q447J0167j13879
$$ -87260 -58234 65580 137092 104820 81321 131906 169947 145342 136895 147062 33183
38615C3183k29489o3268K51517K71794n0830k30911O672K93250K05812j00635
$$ 33183 -196306 -259574 -8057 263737 212907 -18004 -11332 281918 487730 387095
38605C87095k04732o1362N3897K8672l8957j24443k43298k48281j6493K43350
$$ 387095 182363 121001 174898 203570 164613 40170 -203128 -451409 -467902 -224552
38595b24552K21521j1470j05829J9812J03797K6981j3650R7451J86420J25249
$$ -224552 -3031 -14501 -120330 -100518 3279 30260 16610 114061 300481 425730
38585D25730N2602P6038M4694j49474k88543j28812J77535K56142L4187j78792
$$ 425730 478332 554370 599064 449590 161047 32235 209770 465912 500099 321307
38575C21307j34912M9391R8724n4795k05233j43681O0632J19104q2292k49217
$$ 321307 186395 235786 334510 279715 74482 -69199 -8567 110537 28245 -220972
38565b20972l6047M02695N27363J76572j29858Q8998N43083N55769J9414m88783
$$ -220972 -257019 145676 673039 849611 719753 808751 1351834 1907603 1927017 1438234
38555A438234n29210k90818j52939j54747j17664o877Q2448J23670J32306O8672
$$ 1438234 909024 618206 465267 310520 192856 185979 268427 392097 524403 593075
38545E93075o7504j61212j32784m2672N1273J73166K63458J57497j12050k32281
$$ 593075 525571 364359 231575 188903 240176 413342 676800 834297 722247 489966
38535D89966m7720J58986J01300l4858Q1976L16340K43389j37331l59395k06538
$$ 489966 442246 601232 702532 667674 749650 1065990 1309379 1172048 812653 606115
38525F06115l541n1134j92914j61321j450J08147J73122K49103K18185j6624k76350
$$ 606115 602574 551440 358526 197205 195755 303902 477024 726127 944312 927688 651338
38514F51338l11495j50861k0397j3036m3097m2173j4263L5368Q3156Q0346O1208
$$ 651338 339843 188982 168585 155549 112452 70279 56016 91384 174540 254886 316094
38503C16094J21962K03735J08675j34674j91662P4680L01798J41042j81114k10102
$$ 316094 438056 641791 750466 615792 424130 498810 800608 941650 760536 550434
38493E50434K6502J19304k8872j18716m8930p0882k50191k67994L5164L30987
$$ 550434 576936 696240 667368 548652 499722 428840 178649 -89345 -54181 276806
38483B76806K79163O580j55863j48148j20533j12577o6037p731J6235O4714J62806
$$ 276806 555969 562549 406686 258538 138005 25428 -40609 -48340 -32105 32609 195415
38472A95415J73942R644j62210j28605N0970J39410N5606p0192j10600n1017N4831
$$ 195415 369357 379001 216791 88186 139156 278566 334172 263980 153380 102363 157194
38461A57194J08779K5767j18741j13769Q5637K26302R9068j30705j56106J8943
$$ 157194 265973 291740 172999 59230 144867 371169 470237 339532 183426 202369
38451B02369J13813K19j57042j82501q6765M0624J39981J51559M5692q2629r2573
$$ 202369 316182 316401 159359 -23142 -109907 -69283 70698 222257 267949 185320 92747
38440I2747O782P1585L9637j1385l0018n8945j04472q7350J7047J07681R0465
$$ 92747 99529 171114 210751 199366 169348 110403 5931 -81419 -64372 43309 133774
38429A33774k903p4116o6164J3572J07035J24348K1700j19256j53489l5242J24725
$$ 133774 130871 56755 -9409 4163 111198 235546 257246 137990 -15499 -50741 73984
38418G3984J71117M7073j53709k53485j55793K8427R2853N548m7902M6071J46086
$$ 73984 245101 292174 138465 -115020 -270813 -242386 -149533 -143985 -191887 -145816 270
38407B70Q8634l9222m1569P6745J46437J10072N3172N948p2321j33978q0528L9465
$$ 270 88904 49682 8113 84858 231295 341367 394539 400487 328166 194188 113660 153125
38395A53125O5327l5947j42519j80099j66411p9335J02269K40196J62446m0439
$$ 153125 218452 182505 39986 -140113 -306524 -385859 -283590 -43394 119052 78613
38385G8613r5917M3933J42306P7400J6048Q5436J50643P0321o8817j38359j70499
$$ 78613 -17304 26629 168935 246335 262383 347819 498462 568783 499966 361607 191108
38374A91108k03996j38417O7234K36853K16011J02184M4011j5941j75402l06879
$$ 191108 -12888 -151305 -84071 152782 368793 470977 514988 499047 323645 16766
38364A6766k20311O133J15912M8283q162P7034K11424K34526R7252j13566k35225
$$ 16766 -203545 -197412 -81500 -33217 -41379 35655 247079 481605 578857 465291 230066
38353B30066j55918L4639J03837k0651j24985j3933J93640K48336J29100J0511
$$ 230066 74148 108787 212624 191973 66988 53055 246695 495031 624131 634642
38343F34642l7036q4806j35283j07730k7431j9855r6588j24855l7704P6160J19148
$$ 634642 597606 512800 377517 269787 242356 222501 125913 1058 -36646 39514 158662
38332A58662R4091M4316j2357p2725j36685j90207j64889j08J98233K00399l4997
$$ 158662 252753 297069 284712 211987 75302 -114905 -279794 -279902 -81669 118730 83733
38321H3733k41402j86849J6909J28357J33099J51688J45916J3413j28161p3808
$$ 83733 -157669 -344518 -327609 -199252 -66153 85535 231451 244864 116703 42895
38311D2895J01310J25397l3811j28696m0177P7946J00834Q8897Q7050L8500l9837
$$ 42895 144205 269602 235791 107095 66918 144864 245698 334595 421645 460145 420308
38300D20308m7722j5069p1703j69453j12502Q7323J78510O2003p5143r2568o3501
$$ 420308 372586 357517 285814 116361 3859 91182 269692 331695 256552 163984 100483
38289A00483k7008J05916K85568K81880M7051j77621k37153k28096j84027J8147
$$ 100483 73475 179391 464959 746839 793890 616269 379116 151020 -33007 -14860
38279a4860K81322K47983j20790l48510j33174J73795J47116m6750j4043J76134
$$ -14860 266462 514445 393655 45145 -88029 85766 232882 186132 172089 348223
38269C48223J84727L0728j8645m421j64143l75344k78285P2174K20666J6875j94380
$$ 348223 532950 563678 545033 540612 376469 1125 -277160 -204986 15680 32555 -161825
38258a61825j66251o0338m5489k4504P8284J36499R6378R8651J74189J38225n6581
$$ -161825 -328076 -388414 -433903 -458407 -380123 -243624 -147246 -48595 125594 263819 207238
38247B07238j71109n4869J11015J18168K1420l9966o7621q6578k8726J10454K04850
$$ 207238 36129 -18740 92275 210443 231863 191897 124276 37698 8972 119426 324276
38236C24276K08099K06199J66262p5612m36793n28384j98164J66873J60658p7462
$$ 324276 532375 738574 904836 829224 392431 -135953 -334117 -167244 -6586 -84048
38226h4048j37922L3188J49617R2998K5917L7111K1490n4059o0004M3358R9461
$$ -84048 -221970 -188782 -39165 53833 79750 116861 138351 84292 24288 67646 167107
38215A67107M552j18482j12962k3462n280o9717o0012J07097K84854K64321N5271
$$ 167107 171659 53177 -59785 -83247 -88527 -158244 -218256 -111159 173695 438016 493287
38204D93287j16957j14140n1165p7751j30948n9204J06221J94930J54133O8953
$$ 493287 376330 262190 211025 133274 2326 -56878 49343 244273 398406 467359
38194D67359k3002j28027j55293k0292J38424J07068m9963o7182Q6547J61241
$$ 467359 444357 316330 161037 140745 279169 386237 336274 269092 355639 516880
38184E16880M9011p6502j07674j41547j79109o0496J60344J66303r9593k46309
$$ 516880 565891 489389 381715 240168 61059 563 160907 327210 227617 -18692
38174a8692k4328K61948K36054J1213p5628l161L2504J7581M7394M8254p0553
$$ -18692 -43020 218928 454982 466195 390567 387406 419910 437491 484885 533139 462586
38163D62586j64965r6472l4104j60477k72522p7927K68055L49134J10347j18087
$$ 462586 297621 201149 167045 6568 -265954 -343881 -75826 273308 383655 265568
38153B65568j51840j11999r4196n4466j6518o4272j37842j15651m5816k9127K3305
$$ 265568 113728 1729 -92467 -146933 -163451 -227723 -365565 -481216 -527032 -556159 -532854
38142e32854K19905M01112L45372J37231K604p1175j98781k64329j30553O178
$$ -532854 -312949 88163 433535 570766 573370 502195 303414 39085 -91468 -85290
38132h5290q0165j79043J2784K75971J87978r9738p5368K25979K55944r1133k98360
$$ -85290 -165455 -344498 -331714 -55743 132235 32497 -42871 183108 439052 347919 49559
38121D9559j14916R3108O0441M748O1849m282k48320l06960j8148K67485K71334
$$ 49559 -65357 27751 88192 92940 154789 150507 -97813 -404773 -422921 -155436 115898
38110A15898J62873J14731K4798r0585O807K59126K72459N071j20024K8862J16578
$$ 115898 278771 393502 418300 327715 334522 593648 866107 871178 751154 780016 896594
38099H96594R0833K95572O22803M80058r9285l26847J0029K29669J67288N19275
$$ 896594 987427 1282999 1905802 2385860 2286575 1959728 1969757 2199426 2366714 2885989
38089B885989J221631J230678Q97943K442117O147929Q048314M350460k793884
$$ 2885989 4107620 5338298 6236241 8678358 14826287 22874601 27225061 24431177
38081B4431177p167827o056816k827705j476839j824012j598599n38559m2948
$$ 24431177 17263350 11206534 8378829 6901990 5077978 3479379 2940820 2897872
38073B897872l63507n08496k00772l6362j16356n0900J5025k95695n91071k43330
$$ 2897872 2534365 2025869 1825097 1788735 1672379 1621479 1636504 1340809 749738 506408
38063E06408L77414L96931r5086k60455N514K9957k84100k99023Q1426J69939
$$ 506408 883822 1280753 1185667 925212 930726 960683 676583 377560 458986 628925
38053F28925k30650m13755k062L93182K27422j16855q9899J12090J9292k59560
$$ 628925 398275 -15480 -17542 375640 603062 486207 396308 508398 527690 268130
38043B68130k92394p3016O5465N4890R7309K02748J67247l5544j93466j86372
$$ 268130 -24264 -97280 -31815 23075 120384 323132 490379 454835 261369 74997
38033G4997j14212p9892m9158L1170J14303J15518L5346l0107n752O6826R7014
$$ 74997 -39215 -119107 -168265 -137095 -22792 92726 128072 97965 92213 159039 256053
38022B56053Q4285R1105R0916N072r4427m5151Q3239J5094k53947l45437q7114
$$ 256053 340338 431443 522359 527431 433004 387853 471092 486186 232239 -113198 -200312
38011b00312J50987L9740j52745l7246J89900Q8572k12110k06557R4877J77244
$$ -200312 -49325 -9585 -162330 -199576 -9676 78896 -133214 -339771 -244894 -67650
38001f7650o2980j44987J07773K27576o2160l34178j85920R0900O0540j09802
$$ -67650 -130630 -275617 -167844 59732 -2428 -336606 -522526 -431626 -371086 -480888
37991d80888j4575K33880K22406m872j9757K29706L06371o031l63844l86137j43927
$$ -480888 -495463 -261583 -39177 -44049 -63806 165900 472271 466240 102396 -283741 -427668
37980d27668O2530J36633J79829K28523K09518R4568m7755j41521j62522j16806
$$ -427668 -365138 -228505 -48676 179847 389365 483933 436178 294657 132135 15329
37970A5329k1660P6990J03450J2456j35987k04374j28491q872J7691k7507L743
$$ 15329 -6331 70659 174109 186565 50578 -153796 -282287 -291159 -273468 -300975 -297232
37959b97232J59697K97866K57846N1422j54690j99682o5464J03375J32350J3803
$$ -297232 -137535 160331 418177 469599 314909 115227 49763 153138 285488 299291
37949B99291p6556j6232R5804J02994K0689l7944o0086p4922j293K08059L46533
$$ 299291 222735 206503 302307 405301 425990 388046 327960 253038 251745 459804 806337
37938H06337J66211k10480l94906k70979j16820j25637j40192m981J30928P9413
$$ 806337 972548 762068 367162 96183 -20637 -146274 -286466 -291447 -160519 -81106
37928h1106n8228o6186N0902J28275J10638O3428J2818m9446p7624l6230J3555
$$ -81106 -139334 -205520 -154618 -26343 84295 147723 160541 111095 33471 -2759 10796
37917A0796Q876q900J3127K6372l1456j09538j08547k3748M8447J3242j31605
$$ 10796 19672 10772 23899 50271 18815 -90723 -199270 -223018 -174571 -161329 -292934
37906b92934k55280j75887J14401L56630L10698Q3152k4580N6885J37071J28947
$$ -292934 -548214 -724101 -609700 -253070 57628 140780 116200 173085 310156 439103
37896D39103J35409J58280N3125j54924k35286j28415l8111m7397J0682J72759
$$ 439103 574512 732792 785917 630993 395707 267292 229181 181784 192466 365225
37886C65225K12467O3170q189J34208K39177J27070R151N1149K6834k18520l56100
$$ 365225 577692 640862 632673 766881 1006058 1133128 1142279 1193428 1220262 1001742 645642
37875F45642r0923K45947J56969k16803l12981j7175K42024K00078L7531m5050
$$ 645642 554719 800666 957635 740832 427851 410676 652700 852778 890309 845259
37865H45259p2930q3054m5323j6466n5059l5490J30423K05056n0358l87578l67108
$$ 845259 772329 689275 643952 627486 572427 536937 667360 872416 822058 434480 67372
37854F7372n0668J06899P010m238J81285K38811K0818j71883j13552K2651N9034
$$ 67372 16704 123603 130613 126375 307660 546471 567289 395406 281854 304505 363539
37843C63539R2986J78051J43965m4271j39435m4981r325j56659k16295L789K39545
$$ 363539 456525 634576 778541 734270 594835 549854 540529 383870 167575 171364 410909
37832D10909J80483n7254j83887j82178j81064j34350M0188J96843J52616q076
$$ 410909 591392 534138 350251 168073 -12991 -147341 -107153 89690 242306 234230
37822B34230q5102o9614o1192m0772L6926Q3403L8430K9890J42352J96385J3702
$$ 234230 149128 79514 18322 -22450 14476 97879 136309 166199 308551 504936 518638
37811E18638k43236k65701l5932J74278J78500M5482n9229m5876M5066P4131l8465
$$ 518638 275402 9701 -26231 148047 326547 372029 312800 266924 311990 386121 347656
37800C47656j61493j08480N4331Q9183j1858k1059Q0039M0878j54272j70105Q0413
$$ 347656 186163 77683 132014 221197 209339 188280 268319 309197 154925 -15180 65233
37789F5233J94172n1553k60087o6240K19854J46883q4990O603L09415L08255l154
$$ 65233 259405 207852 -52235 -118475 101379 248262 163272 169875 479290 787545 784391
37778G84391j28173M0007N2410k56182m30926j43044K80184L76286J69290l5298
$$ 784391 656218 696225 748635 492453 61527 -81517 198667 574953 744243 708945
37768G08945j33183j94298k07655j28508j3698P5845J53624J79883N7969j42401
$$ 708945 575762 381464 173809 45301 31603 107448 261072 440955 498924 356523
37758C56523j92219m8634N1313k5300q5767N1542K36672K22868M3349p0208k6745
$$ 356523 164304 115670 166983 141683 55916 107458 344130 566998 610347 540139 513394
37747E13394O4025R0818L7963o0942j43352j37064m4375L9393M1879j0453n8662
$$ 513394 577419 668237 706200 645258 501906 364842 320467 359860 401739 391286 332624
37736C32624q0298p8508p5623j03773j24708k2509K03711L33577J94536n2410
$$ 332624 252326 173818 98195 -5578 -130286 -152795 50916 384493 579029 526619
37726E26619j28446n7427q0415k02145j76208L5517J61557P5155o114P7593J60766
$$ 526619 398173 340746 260331 58186 -118022 -82505 79052 154207 148093 225686 386452
37715C86452P8844l8603k5573K5886l5549j41591j49060p5987M152J07751J95677
$$ 386452 465296 426693 401120 427006 391457 249866 100806 24819 28971 136722 332399
37704C32399J13905j06047j42773J42674L76276J64625k71262l64884j1507L14208
$$ 332399 446304 340257 197484 340158 716434 881059 609797 244913 233406 547614
37694E47614K51675k6209j78179j45564p3637k1187M9058J06690N4585j18409
$$ 547614 799289 773080 594901 449337 375700 354513 403571 510261 564846 446437
37684D46437k73854k46816m0858J25236M7848j72927k07308P3152L87020L92971
$$ 446437 172583 -74233 -115091 10145 57993 -114934 -322242 -249090 137930 530901
37674E30901J19498j18311j33099j5960O4461L6383p5241j80498j76429o6282
$$ 530901 650399 532088 398989 383029 447490 483873 408632 228134 51705 -14577
37664a4577K9319O1526J33957K75451K94565O0641k13059k29078n6042k4490k07546
$$ -14577 14742 76268 210225 485676 780241 840882 627823 398745 342703 318213 110667
37653A10667l18956j72623M6834Q4957l6988j15259m7574R9169K03104J86299
$$ 110667 -208289 -380912 -334078 -249121 -286109 -401368 -448942 -349773 -146669 39630
37643C9630P6410Q01L3263O2917m8086k02415j64454O1340J84556N2389j07038
$$ 39630 116040 116841 150104 213021 164935 -37480 -201934 -140594 43962 96351 -10687
37632a0687k4850K04501K68967Q5399j19125j48468o5891l8041q9383j01711n196
$$ -10687 -35537 168964 437931 523330 404205 255737 189846 151805 62422 -39289 -44485
37621d4485J12710J10663k2261j31969p4570J07829K38665K17251J13016M7206
$$ -44485 68225 178888 156627 24658 -49912 57917 296582 513833 626849 674055
37611F74055M6376L9207m2090j80612k78307k44953j01272L3260Q3338J02157
$$ 674055 720431 759638 717548 536936 258629 13676 -87596 -54336 29002 131159
37601A31159J63504K27464J97750P2380n8710j37274j56176q6146Q4499K36924
$$ 131159 294663 522127 719877 792257 733547 596273 440097 353951 438450 675374
37591F75374J95129l7446k33051k02444j4412J19705J04617J6454m9021p8113
$$ 675374 870503 833057 600006 397562 383150 502855 607472 623926 574905 496792
37581D96792q8864p0167k0060M200n1523j28061r0655P5182J91195J14650k9412
$$ 496792 407928 337761 317701 321901 270378 142317 51662 126844 318039 432689 403277
37570D03277r497J46003J66575k7840j65577m4738J18961J4180k61512l29204
$$ 403277 393780 539783 706358 678518 512941 468203 587164 601344 339832 10628
37560A0628r2197J48161J59363O1186M8001Q0235J0073j50671k51471k07528o7868
$$ 10628 -81569 66592 225955 287141 335142 415377 425450 274779 23308 -184220 -252088
37549b52088O3802R9458J3484j16488j53946l2118J77946L24605K81033M6989
$$ -252088 -188286 -88828 -75344 -191832 -345778 -377896 -199950 124655 405688 452677
37539D52677j99105k28229l2132J27751O7735m4250M1226K28416K07234l7853
$$ 452677 253572 25343 -6789 120962 188697 144447 185673 414089 621323 583470
37529E83470j87016r6019o661j16817k51448j67014O0724J88335J66158J15675
$$ 583470 396454 300435 293774 176957 -74491 -241505 -180781 7554 173712 289387
37519B89387P7258M233p8981j08024j03141j07458p9186J2633Q2008O4682N4231
$$ 289387 366645 370878 291897 183873 80732 -26726 -105912 -93279 -11271 53411 107642
37508A07642J34275J90493Q5206q6277j38485j08895j72099k89987k32813L2407
$$ 107642 241917 432410 517616 431339 292854 183959 11860 -278127 -510940 -478533
37498d78533K48861K37067J09343J5718q6028k44278k98058p9189K67567L95672
$$ -478533 -229672 7395 116738 132456 46428 -197850 -495908 -575097 -307530 88142
37488H8142J81162j37697k66265j56876L2776J53420J55045N5559p3813j26658
$$ 88142 269304 131607 -134658 -291534 -258758 -105338 49707 105266 31453 -95205
37478i5205n7321N0962Q6350N7161N0228O1263N164q0400j4822K34556L94734
$$ -95205 -152526 -101564 -15214 41947 92175 153438 158602 78202 63380 297936 692670
37467F92670K04123j95832l92363k09041J07769K32124J17042m3859p5097K9952
$$ 692670 896793 700961 308598 99557 207326 439450 556492 512633 437536 467488
37457D67488J30811P4675j28377k82444k40865j03760m8796m7313M6321J84560
$$ 467488 598299 672974 544597 262153 21288 -82472 -131268 -178581 -132260 52300
37447E2300J74673K9405k6249N9454Q4942j4455l0323J17135J78603l326j84204
$$ 52300 226973 256378 230129 289583 374525 360070 329747 446882 625485 622159 437955
37436D37955j08228O0421K0717j65956k09633p0365M4647N4464M5839K6952m6596
$$ 437955 329727 390148 410865 244909 35276 -35089 9558 64022 109861 136813 90217
37425I0217p8872K5825J16267J0709j35495m6586J65742J35516j33440k35463
$$ 90217 11345 37170 153437 164146 28651 -17935 147807 283323 149883 -85580
37415h5580k1411J69865Q7605n4321k64J28493J19666O1600J29845K17823J14782
$$ -85580 -106991 62874 150479 96158 95894 224387 344053 405653 535498 753321 868103
37404H68103r9180j54166q579J08745M8169q9295j35882n8679L4453J1498j36186
$$ 868103 768923 614757 606178 714923 763092 673797 537915 479236 513689 525187 389001
37393C89001k37851j30944P9737J22245l3768j00457P7193K52065J63146m6709
$$ 389001 151150 20206 99943 222188 188420 87963 165156 417221 580367 533658
37383E33658q4887J2581K945r0058k1606J87350K21969Q286j11897Q5719L31172
$$ 533658 448771 461352 464297 374239 352633 539983 761952 770238 658341 744060 1075232
37372A075232K67331j9580j79446j41863j41450k61204k93395j11924J04064J45158
$$ 1075232 1342563 1322983 1143537 1001674 860224 599020 305625 193701 297765 442923
37362D42923N0521l7605j07382j76563j21478J40592L91409L20716j6667k35776
$$ 442923 493444 455839 348457 171894 50416 191008 582417 903133 886466 650690
37352F50690j55176p402j8532p7431p768J01158R0070L9214R2510J50292N8036
$$ 650690 495514 488112 469580 392149 384381 485539 575609 614823 707333 857625 915661
37341I15661m8124N3485K38789K29105J38366L32259P13718P02496J15433m54987
$$ 915661 867537 921022 1159811 1388916 1527282 1859541 2573259 3275755 3391188 2936201
37331B936201m64012j71460j52634m03682m53452j73028O6876J9464j27282j39140
$$ 2936201 2472189 2300729 2148095 1744413 1290961 1117933 1184809 1204273 1076991 937851
37321I37851o3148m4970r4539j52416j86740j44719J0280J61395J26531o4460
$$ 937851 874703 829733 735194 582778 396038 251319 261599 422994 549525 485065
37311D85065j70385p4881O7076Q9413L2238L626o04j9450j4618L7419O0509R906
$$ 485065 314680 239799 306875 396288 428526 432152 431548 412098 397480 434899 495408 505314
37299E05314j8767N6803J36558P3156q5103j48555o6335P047m1380j10485n0018
$$ 505314 486547 543350 679908 753064 667961 519406 453071 460118 418738 308253 258235
37288B58235R2896J25252o730j20710n0961J11222J57820Q0168O0868J43834J32311
$$ 258235 351131 476383 469653 348943 297982 409204 567024 647192 708060 851894 984205
37277I84205p6845k60908j71913P3113J55697L7565o433J53563L01014K27733
$$ 984205 907360 646452 474539 547652 703349 740914 734481 888044 1189058 1416791
37267A416791M0811l9317J1751J01102K48550N11621P60915P51220M14020o9559
$$ 1416791 1457602 1418285 1430036 1531138 1779688 2291309 3052224 3803444 4217464 4147905
37257D147905m71559o67412o29474m28879k27364j23304k9919J46537K65260J09190
$$ 4147905 3676346 3008934 2379460 1950581 1723217 1599913 1569994 1716531 1981791 2090981
37247B090981k30177l96367k57880q3369j07955j97470j36374OK2489j8586M3593
$$ 2090981 1860804 1464437 1206557 1123188 1015233 817763 681389 681395 703884 685298 728891
37236G28891J57666J56237Q4516R7204J16464l8435k36818j70692R3241J48872
$$ 728891 886557 1042794 1127310 1224514 1340978 1302543 1065725 895033 988274 1137146
37226A137146q4728k05231R358K50197K26983J12579J28894J19255q0326k27530
$$ 1137146 1052418 847187 856545 1106742 1333725 1446304 1575198 1694453 1614127 1386597
37216A386597p6564J30645N3452j47306j05022R7887J13740k3376m688J36390
$$ 1386597 1310033 1440678 1494130 1346824 1241802 1339689 1453429 1430053 1425365 1561755
37206A561755R9684p5325o8423R8949R2092r1798r9888J24056K47917J64362J18764
$$ 1561755 1661439 1586114 1517691 1616640 1708732 1616934 1517046 1641102 1889019 2053381 2172145
37195B172145J66958R3304o5159k0114J72497J53175l5665K5049L11895L25476
$$ 2172145 2339103 2432407 2367248 2347134 2519631 2672806 2637141 2662190 2974085 3299561
37185C299561J7729o3011K39077M11245K54930K38814N21234N69208K02468N2276
$$ 3299561 3317290 3254279 3493356 3904601 4159531 4398345 4919579 5488787 5691255 5743531
37175E743531M38823P62256O26619N76308J012625J394948J323410J401943K147470
$$ 5743531 6182354 6944610 7571229 8147537 9160162 10555110 11878520 13280463 15427933
37166A5427933L051266L597401M073971M450938L862738K414669J947904L489220
$$ 15427933 18479199 22076600 26150571 30601509 34464247 36878916 38826820 42316040
37158D2316040N617120P192999R775069J4960716K1643607K9196633M0401430
$$ 42316040 47933160 55126159 64901228 79861944 101505551 130702184 171103614
37151A71103614N5158734O2541174M7593956R717598l1583162n4359581n4336024
$$ 171103614 226262348 288803522 336397478 346115076 314531914 260172333 205836309
37144B05836309m3580534l3588775k6289461j9642043j3953002j0250751p523098
$$ 205836309 162255775 128667000 102377539 82735496 68782494 58531743 51008645
37137E1008645m765158l071961l446290m608124m839604m297103l901849l481377
$$ 51008645 46243487 43171526 39725236 35117112 30277508 25980405 22078556 18597179
37129A8597179k565402j733090j665759j849037j508338r55825q45735r18320
$$ 18597179 16031777 14298687 12632928 10783891 9275553 8319728 7473993 6555673
37121F555673o10272j88233k01235m27051l55776j63215k79127n01269m08759
$$ 6555673 5945401 5757168 5555933 5128882 4773106 4609891 4330764 3829495 3420736
37112C420736j82558k04970l05737j75431n9516k78522n17221l52955m6962n0969
$$ 3420736 3238178 3033208 2727471 2552040 2492524 2214002 1696781 1343826 1296864 1245895
37102A245895j70008o47K25298O3689k49616j78238J51401K09845K5916M1781
$$ 1245895 1075887 1075240 1300538 1364227 1114611 936373 1087774 1297619 1323535 1365316
37092A365316K16569J24972j88119k74338j11815q0524j80316n9794K07487J63894
$$ 1365316 1581885 1706857 1518738 1244400 1132585 1052061 871745 811951 1019438 1183332
37082A183332j85807l25238r9580P8799p76o6198J5103Q37j64259j76306L8813
$$ 1183332 997525 672287 572707 651506 650730 584532 599635 600472 436213 259907 298720
37071B98720J44309N199o9739Q6732K02653Q7036n0340m1522n3286j87248k27982
$$ 298720 443029 448228 378489 465221 667874 754910 704570 663048 609762 422514 194532
37060A94532m9093J29741J31737Q7799J01016M5407q6790n7408J57093K05454
$$ 194532 145439 275180 406917 494716 595732 641139 554349 496941 654034 859488
37050H59488n9675k67279j14443J41606J49492M2249J23042K97117K93009K10222
$$ 859488 799813 532534 418091 559697 709189 751438 874480 1171597 1464606 1674828
37040A674828L49711O37355O87799L89277J6731k16139l48568m15984l54080k16596
$$ 1674828 2024539 2661894 3349693 3738970 3755701 3539562 3190994 2775010 2420930 2204334
37030B204334j95007l35624m60929m40833l45255k63164j60190j2458P0905r627
$$ 2204334 2009327 1673703 1212774 771941 426686 163522 3332 -9126 61779 52152
37020E2152j55875j55012M6142K41443K07214P307o3804J12397K75920J40950
$$ 52152 -103723 -258735 -212593 28850 236064 243371 179567 291964 567884 708834
37010G08834j70302k85087j18232L6553j8633j24154q4228L3110Q4109R1349J00506
$$ 708834 538532 253445 135213 171766 153133 28979 -55249 -22139 61970 153319 253825
36999B53825J5745j90458k90199q8278K33066L27997J65580L2350R0848J82464
$$ 253825 269570 79112 -211087 -299365 -66299 261698 427278 459628 550476 732940
36989G32940R5693j54879l62566l35008o6763K19588K59891N7503r0832J6554
$$ 732940 828633 673754 311188 -23820 -90583 129005 388896 446399 355567 372121
36979C72121K06990K03782L3077p0954o0546q5813j50849p6261J40598K27815
$$ 372121 579111 782893 815970 745016 684470 598657 447808 371547 512145 739960
36969G39960M1615j73611j24147R8188J46028r2104l48876l41389j08142Q7993
$$ 739960 781575 607964 483817 582005 728033 635929 287053 -54336 -162478 -74485
36959g4485Q9135j9206n8499M1271J96963K67743J72846l8988k11758k20452j13485
$$ -74485 14650 -4556 -63055 -21784 175179 442922 615768 576780 365022 144570 31085
36948C1085n3366q1720n2299J10261K15212N7736k13712k36120N4291L09302K49135
$$ 31085 -22281 -104001 -156300 -46039 169173 226909 13197 -222923 -168632 140670 389805
36937C89805J0376j16939p6763K968N5467O2389m8928k65351l59559j43226K19783
$$ 389805 400181 283242 206479 209447 264914 327303 278375 13024 -346535 -489761 -269978
36926b69978L80143K38022J027j44980j94017j70451o2001O8481J07739O5278
$$ -269978 110165 348187 349214 204234 10217 -160234 -222235 -153754 -46015 19263
36916A9263M7609N0459k5192j34320r6303R6726K09793J08885l3061j0645J13295
$$ 19263 66872 117331 92139 -42181 -138484 -41758 168035 276920 243859 233214 346509
36905C46509J42438M1538o9273j07874o6665M5935J55196J17059p1945j70278
$$ 346509 488947 530485 461212 353338 286673 332608 487804 604863 532918 362640
36895C62640L829K57653K62027M8671l2926J20154J81728p3607l70789l37843
$$ 362640 366469 624122 886149 934820 901894 1022048 1203776 1130169 759380 421537
36885D21537q6190k9796k27411l07111q5644J28773L3133j86568j48728J46329
$$ 421537 335347 305551 78140 -228971 -314615 -185842 -152709 -339277 -488005 -341676
36875c41676L46048K60191M8156q4530j06467n7854K6430M4939r3200k59294j97229
$$ -341676 4372 264563 312719 228189 121722 63868 90298 135237 42037 -217257 -414486
36864d14486R2943K88675J80253m2469r4997K501K7151q7888k05597k10658j03169
$$ -414486 -321543 -32868 147385 104916 9919 12420 39571 -48317 -253914 -464572 -567741
36853e67741O8857K20482K41235J30872M6300Q8034J43708Q3812j5486k6299j6444
$$ -567741 -498884 -278402 -37167 93705 140005 228039 371747 455559 440073 413774 397330
36842C97330j11550k08990j03445J40985K26561N4927j30577j04260N4276J25157
$$ 397330 285780 76790 -26655 114330 340891 395818 265241 160981 215257 340414
36832C40414L8325r5622j36987l8782J08394J45139K9370r2103r4371n9714r7858
$$ 340414 378739 283117 146130 107348 215742 360881 390251 298148 203777 144063 46205
36821D6205j05912N0544K17365J29837j27599j97229j2945R0747o2023k06377
$$ 46205 -59707 -9163 208202 338039 210440 13211 266 91013 28990 -177387
36811a77387j03712O6384M6286p0162o4477p892r3050k18816j19808J66054L13525
$$ -177387 -281099 -214715 -168429 -238591 -303068 -310960 -404010 -622826 -742634 -576580 -263055
36800b63055J88365O409j4820R4303J98486K28344J57452j242j29570j02703J2555
$$ -263055 -74690 -68281 -83101 11202 209688 438032 595484 594242 464672 361969 374524
36789C74524K2614j01966j75843q4639N2919Q0333R835m9053m3492J5349Q8601
$$ 374524 397138 295172 119329 34690 87609 167942 177777 128724 85232 100581 189182
36778A89182R0910m7534k34274k57047o0302J43819J50445L1511j0108M3941M4988
$$ 189182 280092 232558 -1716 -258763 -319065 -175246 -24801 6710 -3398 40543 85531
36767H5531l5558n2419M2908P8503p3309k52485k01927O5394K67375K16904J8875
$$ 85531 49973 -2446 40462 118965 45656 -206829 -408756 -343362 -75987 140917 159792
36756A59792j35121k04877k38464k08627o3684J26939K25567K00097J30003O9237
$$ 159792 24671 -180206 -418670 -627297 -690981 -564042 -338475 -138378 -8375 60862
36746F0862J5974j7871k9214p5632j72852j95945m7864J31798J35928K3669K9701
$$ 60862 76836 58965 29751 -45881 -218733 -414678 -462542 -330744 -194816 -171147 -141446
36735a41446J58500J78722N4634K4901J41070J15395j60421l27457j07383J97972
$$ -141446 17054 195776 250410 275311 416381 531776 371355 43898 -63485 134487
36725A34487J59096r5766j20820J02763J87753L3332m4418Q6416J61426M4176
$$ 134487 293583 197817 76997 179760 367513 400845 356427 442843 604269 648445
36715F48445j1113J64508L23656K13715j3260q7619m9043r2163j98132k11886
$$ 648445 637332 801840 1125496 1339211 1325951 1238332 1189289 1097126 898994 687108
36705F87108j31855o1508j059Q0335R3290k3652j26890o3154P5181J13209Q9423
$$ 687108 555253 493745 492686 573021 666311 642659 515769 452615 527796 641005 730428
36694G30428J44605K24877J63631j3865j32195j59327j99688k36852j51485K0958
$$ 730428 875033 1099910 1263541 1249676 1117481 958154 758466 521614 370129 391087
36684C91087J12965J03947J21409J63642R3529o7454j19955j6566O0520K1243
$$ 391087 504052 607999 729408 893050 986579 919125 799170 782604 843124 864367
36674H64367p416L4874K0105q6132j13054j2024J658j59992k23872P039K51991
$$ 864367 856951 891825 911930 825798 712744 700720 702378 542386 318514 325553 577544
36663E77544J45506j67857k43179k8799Q9108p2132k39479j71897j5451J0085
$$ 577544 723050 555193 312014 283215 372323 300191 60712 -111185 -126636 -116551
36653a16551l0119L0903J46148J63004R6508P0364Q6226N3945j6090l1347J5606
$$ -116551 -146670 -115767 30381 193385 289893 360257 446483 500428 484338 452991 468597
36642D68597N0775N1105L9034q620j07823j67034q9001N3047R0208j406q0550
$$ 468597 519372 570477 609511 600891 493068 326034 237033 290080 380288 378882 298332
36631B98332o3298j9457k4750n2170m9121j0679N4236J24490J20302k0245j98114
$$ 298332 235034 215577 190827 138657 89536 78857 133093 257583 377885 357640 159526
36620A59526k28810r6989J9858L2658N8569J58981J67671l2386k30727j49133
$$ 159526 -69284 -166273 -146415 -113757 -55188 103793 271464 239078 8351 -140782
36610a40782J12252J87369m49j10995P7757K98271J88219j39802k39497J0809
$$ -140782 -28530 158839 158390 47395 125152 423423 611642 471840 232343 243152
36600B43152K24520Q1159k00641k01770N8515J52155r9137l37574k00539J32583
$$ 243152 467672 548831 348190 146420 204935 357090 257953 -79621 -280160 -147577
36590a47577K06468m6124k43059j33917R4041J77495J41155J26288J01335j8739
$$ -147577 58891 12767 -230292 -364209 -270168 -92673 48482 174770 276105 257366
36580B57366j29656p1773Q5369J33184M5305j8221L047P644m1024m2302M9164
$$ 257366 127710 55937 141306 274490 319795 301574 304621 312265 271241 228939 278103
36569B78103J40530J52101R6118j5676j76168k75809j78751M9707J72151Q8822
$$ 278103 418633 570734 666852 651176 475008 199199 20448 70155 242306 331128
36559C31128n6547j26352j44385j35263l1124J46934K22245J20258O005J5691
$$ 331128 274581 148229 3844 -131419 -162543 -15609 206636 326894 332899 348590
36549C48590M4559k1269o1082N9705J93162J10889j07824j82031o6129J2494n4796
$$ 348590 393149 371880 310798 370503 563665 674554 566730 384699 318570 331064 276268
36538B76268j15595n4169K5365M824o6858j01332j09148j06134k9656J33873K47792
$$ 276268 160673 106504 131869 136693 69835 -31497 -140645 -246779 -276435 -142562 105230
36527A05230J70717n3910k33615k16603j7201J90823J98543l4973k91323l02895
$$ 105230 275947 222037 -11578 -228181 -245382 -54559 143984 109011 -182312 -485207
36517d85207p0291J44199J65662J07286J47780K42389J96626k7100k21776j86917
$$ -485207 -555498 -411299 -245637 -138351 9429 251818 448444 421344 199568 12651
36507A2651J5748J31404L0283j24120r9560O7994J19694k6825j32064r171J63374
$$ 12651 28399 159803 190086 65966 -33594 34400 154094 127269 -4795 -13966 149408
36496A49408J21700n5709r1518K1781L8314q3804j08801M0665J37520N8670r022
$$ 149408 271108 215399 123881 145662 183976 100172 -8629 32036 169556 228226 219204
36485B19204N7921P7811p4040j76945l5556J29508J2168k59943l15030j12307
$$ 219204 277125 354936 280896 103951 68395 197903 210071 -49872 -364902 -477209
36475d77209N5664N8201M1182P1203M0735m2895k6265P1216M3996j05670r8785
$$ -477209 -421545 -363344 -322162 -250959 -210224 -253119 -279384 -208168 -164172 -269842 -368627
36464c68627J54440L41869K06489n8742j23656j3223J058j31669j86095m6102
$$ -368627 -214187 127682 334171 275429 151773 138550 139608 7939 -178156 -224258
36454b24258J11574P7278j10333k23212j15183J15196K23612Q6140j42302j87019
$$ -224258 -112684 -35406 -145739 -368951 -484134 -368938 -145326 -59186 -201488 -388507
36444c88507K8448K99014L83862K46282K8637j12144j10418k4773P958o5974j17823
$$ -388507 -360059 -61045 322817 569099 597736 485592 375174 350401 358359 292385 174562
36433A74562k1570J03834M3270j34264j22974J26119K73003J09156j01528n1551
$$ 174562 152992 256826 300096 165832 42858 168977 441980 551136 449608 398057
36423C98057J21597J06567m9447q1208k6693j48962l84410l52663O891K62811
$$ 398057 519654 626221 576774 495566 468873 319911 -64499 -417162 -410271 -147460
36413a47460J31743j05422p6006J27512J74937L9231l8309J6119M8534L625P217
$$ -147460 -15717 -121139 -197145 -69633 105304 144535 106226 122345 170879 174504 181721
36402A81721J01388J44126L9273j08531j39712k7925J20834J73720O2775j48495
$$ 181721 283109 427235 466508 357977 218265 190340 311174 484894 547669 399174
36392C99174k89247k44582q0064O2122J40930J93671J97433J00840k8400m8247
$$ 399174 109927 -134655 -214719 -152597 -11667 182004 379437 480277 451877 403630
36382D03630M6673J02782L1741p5989j09495q2440n4451k1802L1212O3614M7567
$$ 403630 450303 553085 584826 508837 399342 316902 262451 240649 271861 335475 383042
36371C83042L4921O9330R1555K0028j14268j94446j58557n3514L2932M8204L602
$$ 383042 417963 487293 578848 598876 484608 290162 131605 78091 111023 159227 162829
36360A62829l9421l3232l350Q14M994O4872J14967J0560k12369k85315n9349K28952
$$ 162829 123408 90176 86826 87640 92634 157506 272473 283033 70664 -214651 -274000 -45048
36348d5048K43081P388j50783p7757M8499N9274K4792M5548N4841j7344p7867
$$ -45048 198033 205421 54638 -23119 25380 84654 109446 154994 209835 192491 114624
36337A14624m4264k2310j14209j89325p2829J37288J87315M6500p6650p1388k8484
$$ 114624 70360 48050 -66159 -255484 -328313 -191025 -3710 42790 -33860 -105248 -133732
36326a33732n660M8536R6115K845j84603k17279k6619J25285M7056p6055k454
$$ -133732 -139392 -90856 5259 8104 -176499 -393778 -420397 -295112 -248056 -324111 -326565
36315c26565J59192J47802j0351q0722l4503m1420r5818j0761J90087K34056M8447
$$ -326565 -167373 -19571 -29922 -110644 -145147 -186567 -282385 -293146 -103059 130997 179444
36304A79444q8445J942J08769M803j67347j55299k6019j6192r7291l7299J58730
$$ 179444 90999 92941 201710 206513 39166 -116133 -142152 -158344 -255635 -292934 -134204
36293a34204K16630L8453j25502n4648J34403J96998R5773k3949o8675n9586l4730
$$ -134204 82426 120879 -4623 -59271 75132 272130 367903 343954 275279 215693 180963
36282A80963j0349k504r303p713r692n7996j30295j39203p9819o7168j45489j78170
$$ 180963 170614 168110 158807 151094 141402 83406 -46889 -186092 -265911 -333079 -478568 -656738
36270f56738n0589J21933J52357P3841P3766J63058J42080n2950j95200r1980
$$ -656738 -707327 -585394 -433037 -359196 -285430 -122372 19708 -33242 -228442 -320422
36260c20422J13374J52688L0137j5428R9828J93799J33551L2433J9722R097j18876
$$ -320422 -207048 -54360 -24223 -39651 60177 253976 387527 419960 439682 448779 329903
36249C29903k39610j31507J44655K68789J09403q6773o9616N8576N4102n7814
$$ 329903 90293 -41214 103441 372230 481633 394860 325244 383820 437922 380108
36239C80108n1037Q0286P1317j71751l50924j80673J70387K84643O1128j78622
$$ 380108 329071 409357 480674 308923 -42001 -222674 -52287 232356 293484 114862
36229A14862j59608J4176R1418L5560j2431j905K463P813R0035J91397J32220
$$ 114862 -44746 -30570 60848 96408 83977 82072 84535 92348 182383 373780 506000
36218E06000r4954k29584q2427J70875K15960K5525j50691j74229j50495j45555
$$ 506000 411046 181462 99035 269910 485870 511395 360704 186475 35980 -109575
36208a09575l5187K23028L81288J95078j82967l49264j71748O3788P9323l6761
$$ -109575 -144762 78266 459554 654632 471665 122401 -49347 14441 93764 57003
36198E7003l1740J01685J25521o0342k34253j41779J48286L16595J95279m3141
$$ 57003 25263 126948 252469 192127 -42126 -183905 -35619 280976 476255 433114
36188D33114j42435q3954m0806q9385j24779o0860L8531P9564O7179M3821L533
$$ 433114 290679 206725 165919 76534 -48245 -109105 -70574 8990 76169 119990 123523
36177A23523n1330o0296n489J8600n9622j51554j19259K6567J49388J65585R5776
$$ 123523 72193 11897 6408 25008 -34614 -186168 -305427 -278860 -129472 36113 131889
36166A31889j5853j18561j34014m2579M3772K2666k2728N9660K21841K42123M2881
$$ 131889 116036 -2525 -136539 -179118 -135346 -112680 -135408 -75748 146093 388216 431097
36155D31097j87010k44476j45198l4536J2707J8148J2626R606K3490N9505J00222
$$ 431097 244087 -389 -145587 -180123 -167416 -149268 -136642 -127036 -103546 -44041 56181
36144E6181J10110M5342r0716j72304m2662K27108L13346N1039k63273k36631
$$ 56181 166291 211633 120917 -51387 -94049 133059 446405 497444 234171 -2460
36134b460M6867J47969n4796j97331k4956K18444J91405n5000k25105j93429m5448
$$ -2460 44407 192376 137580 -59751 -84707 133737 325142 270142 45037 -148392 -193840
36123a93840J13851J89175R9141p3369j09491K2144R5445K8048M8167K41370K85329
$$ -193840 -79989 109186 208327 134958 25467 47611 143056 171104 219271 460641 745970
36112G45970k4733l25236k06618R8471Q8112j58627j32843J92831K85961m5272
$$ 745970 721237 396001 189383 287854 375966 217339 84496 277327 563288 518016
36102E18016l34355k38486l6948n1535j04223N8603K36385J15460j70105k56392
$$ 518016 183661 -54825 -91773 -143308 -247531 -188928 47457 162917 -7188 -263580
36092b63580j12057J4942M1653O6080P3730j4040r6056k2891J12040J19327O0884
$$ -263580 -375637 -360695 -319042 -252962 -179232 -193272 -289328 -312219 -200179 -80852 -19968
36081a9968J30775K64908K13734k2261j66570r1511M0460R0974R9819P4123p1593
$$ -19968 110807 375715 589449 567188 400618 309107 349567 440541 540360 614483 542890
36070E42890k68104k67745r886K25200J85846k1085j29741p7678M891L9016M9462
$$ 542890 274786 7041 -2845 222355 408201 387116 257375 179697 184588 223604 273066
36059B73066N0588L7140M2663Q1079P4042m4210j85171j92664o2041M4042J9677
$$ 273066 323654 360794 403457 484536 558578 514368 329197 136533 74492 118534 138211
36048A38211m6957j7879Q3520J00500k1476j22808k3576K17935L46265K19090
$$ 138211 91254 73375 156895 257395 235919 113111 89535 307470 653735 872825
36038H72825k8990j82327k00495j87005j87798j56790q8549m3954l0433K2912
$$ 872825 843835 661508 461013 274008 86210 -70580 -159129 -203083 -233516 -210604
36028b10604J31946J96833J31832r293r5818p1125O597N4404N1706L1834J3496
$$ -210604 -78658 118175 250007 240714 144896 73771 80368 134772 186478 218312 231808
36017B31808k6656r9644j54586j32186n5479n298m959j86L7759O9145O1216K1576
$$ 231808 205152 105508 -49078 -181264 -236743 -242041 -247000 -247186 -209427 -140282 -79066 -57490
36005e7490n3547j57739j93808o3789J24901J25057r5371k55401j45877Q0764
$$ -57490 -111037 -268776 -462584 -526373 -401472 -276415 -371786 -627187 -773064 -692300
35995f92300J78164J69600K06376K28735P5545j54933j83941J1276J44688N4217
$$ -692300 -514136 -344536 -138160 90575 166120 11187 -172754 -161478 -16790 37427
35985C7427q7184q1866R184J7463p4883j53924j38513l9603O7970J02199P1912
$$ 37427 -49757 -131623 -122439 -104976 -179859 -333783 -472296 -511899 -443929 -341730 -269818
35974b69818Q3504J52780J10687j23268k92228j10490K48150L23253L5496k04369
$$ -269818 -186314 -33534 77153 -46115 -338343 -448833 -200683 122570 158066 -46303
35964d6303j36274O165l1172j04986j1906R1596l2215k38143j98018P0902K41735
$$ -46303 -182577 -176412 -207584 -312570 -324476 -232880 -265095 -503238 -701256 -630354 -388619
35953c88619J72691L5385k0506k3601K238R1467J65455O3675j75188k77867r1517
$$ -388619 -215928 -180543 -201049 -224650 -222412 -130945 34510 98185 -77003 -354870 -446387
35942d46387J82579K32677K3953j71734j14584J13896K12522M8158j54908j21986
$$ -446387 -263808 -31131 -7178 -178912 -293496 -179600 32922 81080 -73828 -195814
35932a95814O0573O6887j42135k20467J4302K48941J38540j54946k20109k0779
$$ -195814 -135241 -68354 -210489 -430956 -416654 -167713 -29173 -184119 -404228 -425007
35922d25007J08844J5443r8249n4446P5390J78820K48910K55077J23192p7646
$$ -425007 -316163 -300720 -398969 -453415 -378025 -199205 49705 304782 427974 350328
35912C50328j56274q0965k5627p0074q1883J5194Q3423Q054j03062j00250j6613
$$ 350328 194054 113089 87462 17388 -64495 -49301 34122 42176 -60886 -161136 -177749
35901a77749K7831J9397J4994J2825k1838p3786j09732j29366j25108o1797N7220
$$ -177749 -149918 -130521 -115527 -102702 -124540 -198326 -308058 -437424 -562532 -624329 -567109
35890e67109J71406K32446K22136J17508n4814j57757q3653O2691Q6873p025m7508
$$ -567109 -395703 -163257 58879 176387 121573 -36184 -119837 -57146 29727 22702 -24806
35879b4806oN099l1473N9502K70598L24776Q1280k17862k88620j69279n3794J7299
$$ -24806 -24812 -19713 -51186 8316 278914 603690 684970 467108 178488 9209 -44585 -27286
35867b7286P2332J8387j89996l39199j99240J14699K89891K51060J79541J52553
$$ -27286 45046 63433 -126563 -465762 -665002 -550303 -260412 -9352 170189 322742
35857C22742N7663j19575j99430q2395Q4753J12501m474j37318j84662j24175
$$ 322742 380405 260830 61400 -20995 63758 176259 171785 34467 -150195 -274370
35847b74370L027J07612J18034N9906K0896M0423Q6773J18563J04857J8015j19037
$$ -274370 -271343 -163731 -45697 14209 35105 75528 162301 280864 385721 403736 284699
35836B84699k09035j74542m7834Q1683J55078J37213J7080j18483j23241O800
$$ 284699 75664 -98878 -146712 -65029 90049 227262 244342 125859 2618 9418
35826I418Q9910J8211q1820p6335m2114p5299n7768J30136L00983J75956j56487
$$ 9418 99328 117539 35719 -40616 -82730 -158029 -215797 -85661 215322 391278 234791
35815B34791l16295j58155P9413J72258J60155J39464Q6868j2848r1944j33920
$$ 234791 -81504 -239659 -160246 12012 172167 311631 398499 385651 293707 159787
35805A59787j77328j48543O2542L19329L23129O3901j18592m1321P5686L0981
$$ 159787 -17541 -166084 -103542 215787 538916 602817 484225 442904 518590 549571
35795E49571k8734O3233J53051N7973p0256j9276P1281m1907k18400j29427J49563
$$ 549571 520837 584070 737121 795094 724838 705562 776843 734936 516536 387109 536672
35784E36672J98585q0979k93323j46369J50455K50625J30021j0966p0792p1652
$$ 536672 735257 654278 360955 214586 365041 615666 745687 734721 663929 592277
35774E92277k8877K4945R497o6247n7021R5300K13759J13919j15963k22283j17989
$$ 592277 563400 588345 597842 531595 474574 569874 783633 897552 781589 559306 441317
35763D41317M0181Q5136K5240j7516K2182P3458J2401j64073k79263j71873O4923
$$ 441317 481498 566634 591874 574358 596540 669998 682399 518326 239063 67190 132113
35752A32113J66133M0890j09772q5991M9893J15496P6956K4465k0288r3823j40532
$$ 132113 298246 339136 229364 143373 193266 308762 385718 410183 389895 296072 155540
35741A55540n8970R8392J35916k8547k35621k70001j00581J05973J61270K2814
$$ 155540 96570 194962 330878 302331 66710 -203291 -303872 -197899 -36629 -13815
35731a3815j73250k38794j22174M5514J17397Q9092L8192j0467n0951l088J81195
$$ -13815 -187065 -425859 -548033 -502519 -385122 -296030 -257838 -268305 -319256 -322344 -141149
35720a41149L45195K53581p1923l22307k86256j06165l7961r6469r9622J9404
$$ -141149 204046 457627 385704 63397 -222859 -329024 -366985 -463454 -563076 -543672
35710e43672J23090Q2937n6987j55526j26401L342J25402J35717L8962l7601J8337
$$ -543672 -420582 -337645 -394632 -550158 -676559 -673217 -547815 -412098 -373136 -410737 -392400
35699c92400J65188K51736J83231J536j71353k20904j07712Q7490K09616J77807
$$ -392400 -227212 24524 207755 209291 37938 -182966 -290678 -203188 6428 184235
35689A84235O4392j8270n6233r3029j16174q7498m1769m0859n7582j9819N2603
$$ 184235 248627 230357 174124 81095 -35079 -122577 -164346 -205205 -262787 -282606 -230003
35678b30003P5179M3941K6551K3823k2239r1282j01864n9559k9825K5683J92475
$$ -230003 -154824 -110883 -84332 -60509 -82748 -174030 -275894 -335453 -365278 -339595 -147120
35667a47120L76815L63447J45815l7987o8027q1866j53686j36720L017J4292k13207
$$ -147120 229695 593142 738957 700970 632943 551077 397391 260671 263688 277980 64773
35656F4773l45765q5073K87041K75197o9198k30345j6172K26782K26147J25781
$$ 64773 -280992 -366065 -79024 196173 126975 -103370 -119542 107240 333387 459168
35646D59168Q1630k6795k52497l38276j09703J86503K33942R8232L7548P1324
$$ 459168 540798 514003 261506 -76770 -186473 30 233972 332204 369752 441076
35636D41076M6463k6724j7134N2972N8484J4397J3193N439r8498j88706r3630
$$ 441076 487539 460815 443681 496653 555137 569534 582727 588166 489668 300962 207332
35625B07332R7004J27884k6518j34127p3372K8761M4522q434r1557j90830k19199
$$ 207332 304336 432220 405702 271575 198203 226964 271486 263052 171495 -19335 -238534
35614b38534r3591Q0237J20575N6529N3899Q2601k7087j92517j21169J72475K90848
$$ -238534 -332125 -251888 -131313 -74784 -20885 61716 34629 -157888 -279057 -106582 184266
35603A84266O0301j72462q8233J24271J41013K6575J4924M4741n7285j43222K7573
$$ 184266 244567 72105 -16128 108143 249156 275731 290655 335396 278111 134889 162462
35592A62462K62370J52480k24531l48364o0000J97195R8006r4732m1303J26742
$$ 162462 424832 577312 352781 4417 -55583 141612 239618 144886 103583 230325
35582B30325J24570M1312J29340K86588J89538j54307l92580l50279k08007j32411
$$ 230325 354895 396207 525547 812135 1001673 847366 454786 104507 -103500 -235911
35572b35911o6769K4909J2489j47851k50165j11283J48720K70990J97333Q8279
$$ -235911 -302680 -277771 -265282 -413133 -663298 -774581 -625861 -354871 -157538 -69259
35562f9259P0402J10392J18951P3183K6398L6356P3952J8452j79476l47128k50402
$$ -69259 1143 111535 230486 303669 330067 366423 440375 458827 279351 -67777 -318179
35551c18179N9451K41040J05594j20948j43871k9204l6380j47870r7473J46790
$$ -318179 -258728 -17688 87906 -33042 -176913 -206117 -242497 -390367 -487840 -341050
35541c41050K77794J26622o7959m6626Q0104P5148j617P1122K32528J82926j24592
$$ -341050 -63256 63366 -4593 -51219 28885 104033 102416 173538 406066 588992 464400
35530D64400l58785k72206k4804R9028Q1812Q9786J49821J35491J8748o5731j6242
$$ 464400 105615 -166591 -191395 -92367 -10555 79231 229052 364543 383291 317560 301318
35519C01318J16574K18081K06416M5808k09436l71105k58449N7328K68537J75662
$$ 301318 417892 635973 842389 888197 678761 307656 49207 106535 375072 550734
35509E50734p8312k16481j80537j29328j35589p9012J08331K61600J82463p2876
$$ 550734 472422 255941 75404 -53924 -189513 -268525 -160194 101406 283869 210993
35499B10993k56040k45546j56236j17968r0707K8192K14884L34312K96633J26480
$$ 210993 -45047 -290593 -446829 -564797 -655504 -627312 -412428 -78116 218517 344997
35489C44997q1824k13285j83925k4769J13498J14626L1920j307L7060M8693k0718
$$ 344997 263173 49888 -134037 -158806 -45308 69318 101238 99931 136991 185684 164966
35478A64966j10552j47280j26411p4469q710M6481P4123J06796J80180K38843
$$ 164966 54414 -92866 -219277 -293746 -302456 -255975 -181852 -75056 105124 343967
35468C43967J76747q588j85420k33479j49234n915J02274Q7126m3082j26261k6817
$$ 343967 520714 512126 326706 93227 -56007 -61922 40352 127478 84396 -41865 -68682
35457f8682J27335P9110j57829k71747j16801N8524K0780o7221N9051K93802L18523
$$ -68682 58653 137763 -20066 -291813 -408614 -350090 -329310 -396531 -337480 -43678 274845
35446B74845J10204o5506j11495j73543k51694j37332J56761K80760N7501k05391
$$ 274845 385049 319543 208048 34505 -217189 -354521 -197760 83000 140501 -64890
35436f4890j56405J00279K20542J35896M7665L6546k372q3354q5458j13K6801
$$ -64890 -221295 -121016 99526 235422 283087 319633 317261 233907 148449 148336 175137
35425A75137n0489r0196r16J03148P2357p4371j97593k08799j31738m4550Q98
$$ 175137 124648 34452 33536 136684 209041 134670 -62923 -271722 -403460 -448010 -447112
35414d47112K6854R1042J79186J94492J07200K6115K6438J0336j14854k23096
$$ -447112 -420258 -329216 -150030 44462 151662 177777 204215 214551 99697 -123399
35404a23399j43950J9696J1686j49495j60857P5050K51000J11055j50548j83388
$$ -123399 -267349 -247653 -235967 -385462 -546319 -471269 -220269 -109214 -259762 -443150
35394d43150O612J11765r48j36835r1780R4070K42287K45180J27655J934k1224
$$ -443150 -436538 -324773 -325721 -462556 -554336 -460266 -217979 27201 154856 156790 135566
35383A35566M9693P8140j3215j03245m1517R7056R4705p7756j88429n5648K04383
$$ 135566 185259 263399 250184 146939 105422 202478 297183 219427 30998 -24650 179733
35372A79733L15305J43565j83424l98054l16478j5287K14771J69538l9163j56186
$$ 179733 495038 638603 455179 57125 -259353 -274640 -59869 109669 70506 -85680
35362h5680j27315r6298r6428m59J73375J87053l5560k03578o1269K03224K30411
$$ -85680 -212995 -309293 -405721 -406180 -232805 -45752 -81312 -284890 -346159 -142935 87476
35351H7476L2115o2052N7302J39567J1554j66370k01489j56332j62483j57796
$$ 87476 119591 57539 114841 254408 265962 99592 -101897 -258229 -420712 -578508
35341e78508j8454J83110K59034J70451L9448m7996r8731j19606j12287j23640
$$ -578508 -596962 -413852 -154818 15633 55081 7085 -91646 -211252 -323539 -447179
35331d47179j71722j70631o6521J4981o5916j97114j31996J25568K91435K18912
$$ -447179 -618901 -789532 -856053 -841072 -906988 -1104102 -1236098 -1110530 -819095 -600183
35321f00183J11575J90144L49241L32639J14274r6143j50438q1279K5511J03066
$$ -600183 -488608 -298464 50777 383416 497690 401547 251109 169830 195341 298407
35311B98407P6467o8511j97712j63054j9408M7323L656L22R4627J36457J5747
$$ 298407 374874 306363 108651 -54403 -73811 -26488 -22832 -22510 72117 208574 224321
35300B24321j43183j55352k3964J03840J38951R6449J6670n0923m5129K9350P6365
$$ 224321 81138 -74214 -98178 5662 144613 241062 257732 206809 161680 191030 267395
35289B67395L9564j3369k1351n0709j67596k74708k23198l6722J20235J61385
$$ 267395 306959 293590 272239 221530 53934 -220774 -443972 -480694 -360459 -199074
35279a99074J28269O1612k1370m5507N8575K05847K29654J16900J9974J8677K6794
$$ -199074 -70805 -9193 -30563 -76070 -17495 188352 418006 534906 554880 573557 600351
35268F00351l6915j37610k14858k36216j46852N9329K07076J02122j27299j14498
$$ 600351 563436 425826 210968 -25248 -172100 -112771 94305 196427 69128 -45370
35258d5370K09065M36198K32933j81537l56018k10473k5853K3397J894m5595j57029
$$ -45370 163695 599893 832826 651289 295271 84798 58945 82342 84236 38641 -118388
35247a18388k61188k13913n3455L2371J2214K9608R9814P7033k1212K9762K57096
$$ -118388 -379576 -593489 -646944 -614573 -602359 -572751 -472937 -395904 -417116 -387354 -130258
35236a30258L41524P0644k99835l70086j08385J84681K86897K10584N7958o3218
$$ -130258 211266 281910 -17925 -388011 -496396 -311715 -24818 185766 243724 180506
35226A80506n6057M3812M1781j41751k76489j21952J73695K48642N9189o7235
$$ 180506 124449 168261 210042 68291 -208198 -330150 -156455 92187 151376 84141
35216H4141N6270K13413J51197m7548j39017q4755l8222o7006q2559j6262P8664
$$ 84141 140411 353824 505021 457473 318456 233701 195479 128473 45914 29652 108316
35205A08316J01283l809k03481l62975l29249j09309Q8472Q6885l5166o1478N8014
$$ 108316 209599 205790 2309 -360666 -689915 -799224 -710752 -623867 -659033 -720511 -662497
35194f62497J62428J34945N2072L2825P1271R9417J11106J20918P9101n0378j71713
$$ -662497 -500069 -365124 -313052 -280227 -208956 -109539 1567 122485 201586 151208 -20505
35183b0505j46631N394J13211P1851n1287j42870j61801j00546M5608K07013K53149
$$ -20505 -167136 -161742 -48531 23320 -27967 -170837 -332638 -433184 -387576 -180563 72586
35172G2586J61409O9118O9092O8828l1592j44709j39303p1680p3671r0596K9603
$$ 72586 233995 303113 372205 441033 409441 264732 125429 53749 -19922 -110518 -80915
35161h0915K21870K42932M5455j44862j81093j64089j72002r3489J17090K63128
$$ -80915 140955 383887 429342 284480 103387 -60702 -232704 -326193 -209103 54025
35151E4025J81930K157p2410n5697n1490j8294R6146J52504L0040r4943J5063
$$ 54025 235955 238112 165702 110005 58515 40221 136367 288871 318911 223968 239031
35140B39031K39980K43543j2720k23148k04373r2235l8416j3878J5419n603n1273
$$ 239031 479011 722554 709834 486686 282313 190078 151662 137784 153203 147600 96327
35129I6327k792J05991P6103j26724k73810k17090r1559m5998j0181J07621K07960
$$ 96327 93535 199526 275629 148905 -124905 -341995 -433554 -479552 -489733 -382112 -174152
35118a74152J75026R0325Q3297J09186N1675p0048j52866j65622j26903l7650
$$ -174152 874 91199 174496 283682 335357 265309 112443 -53179 -180082 -217732
35108b17732N5074N2542l5173o0339L8570J40911J55515J36551R9604l8460k13214
$$ -217732 -162658 -110116 -145289 -205628 -167058 -26147 129368 265919 365523 327063 113849
35097A13849j84413O5654J97195J4238j93458j11226Q6089O2509q5642k6803J82996
$$ 113849 -70564 -4910 192285 206523 13065 -98161 -12072 50437 -35205 -62008 120988
35086A20988J83170m9758j50170K1068J80204J24256R25m3872q8735j59282j02683
$$ 120988 304158 254400 104230 125298 305502 429758 430683 386811 298076 138794 36111
35075C6111Q1025J27798o0523j85822O428L15985L71132J25581j65666l09956
$$ 36111 117136 244934 184411 -1411 5017 321002 692134 817715 652049 342093
35065C42093k96556j74627j4275P8886N1352m1444j18379j27521k4615J48900
$$ 342093 45537 -129090 -143365 -64479 -13127 -54571 -172950 -300471 -325086 -176186
35055a76186J95143m519k10298r0914K24125K54100q5999l01656q2029K16299
$$ -176186 18957 14438 -195860 -286774 -62649 191451 105452 -196204 -278233 -61934
35045f1934J72451l5596q109J70943J21817j42506k40787n2349J48372J62448
$$ -61934 110517 74921 66812 237755 359572 217066 -23721 -76070 72302 234750
35035B34750O2871o7151k11237k41158l1860K36895K51453M6356m6739N5431Q7482
$$ 234750 297621 230470 19233 -221925 -253785 -16890 234563 280919 234180 289611 377093
35024C77093o5515j79371j18212n6424j04959q4017J13002K56846J44455m7389
$$ 377093 311578 132207 13995 -42429 -147388 -231405 -118403 138443 282898 235509
35014B35509n0738O8686O7646n7094j07130l9781k94l1714q458J15476J93605
$$ 235509 184771 253457 321103 264009 156879 117098 116804 85090 76632 192108 385713
35003C85713Q9935j28612k71520k39091j11153l5500n3369o8151j718Q3375R0739
$$ 385713 475648 347036 75516 -163575 -274728 -310228 -363597 -431748 -433466 -350091 -259352
34992b59352N5473P8898J32984P9910j05089k64726k40304k7516K39774L74427
$$ -259352 -203879 -124981 8003 87913 -17176 -281902 -522206 -549722 -309948 64479
34982F4479K61816J5676q4380L8690R5756j31773l60806j78218K64799M02075
$$ 64479 326295 341971 257591 296281 392037 260264 -100542 -278760 -13961 388114
34972C88114J03273j42208j8073J71936J00142m6608L284P1432j09472l31380
$$ 388114 491387 349179 331106 503042 603184 556576 559860 631292 521820 190440
34962A90440k24409Q8561J75904o35q8306J5614M3074j01983j67900k3981J20612
$$ 190440 -33969 54592 230496 229861 141555 157169 200243 98260 -69640 -93621 26991
34951B6991J07050O3389R0666N3930j16780k14592p7056J14350J00884n8249j03454
$$ 26991 134041 197430 288096 342026 225246 10654 -66402 47948 148832 90583 -12871
34940a2871J9476J09718L6314q6634q6581L1159J03914K8130j08104j40617m5976
$$ -12871 6605 116323 152637 66003 -20578 10581 114495 142625 34521 -106096 -152072
34929a52072L8299K0333l0736k7773N010L7053J24491K61491K77176O3285k06929
$$ -152072 -113773 -93440 -124176 -151949 -146939 -109886 14605 276096 553272 616557 409628
34918D09628k84754j73148m6138M6249J50966J93158P0151r8173j05159R27J1332
$$ 409628 124874 -48274 -94412 -48163 102803 295961 366112 267939 162780 163707 175039
34907A75039n2845J1281J64190J33169j02989k26508q6698P6933O4852J2931O7507
$$ 175039 122194 133475 297665 430834 327845 101337 14639 91572 156424 169355 236862
34896B36862J01173q967j04727p036J73371K24679J38536J7678j20615k46315
$$ 236862 338035 329068 224341 217305 390676 615355 753891 771569 650954 404639
34886D04639k28096n4119N7103k5481j20448l9644R5755Q2762k5057o0395l3734
$$ 404639 176543 122424 179527 154046 33598 -6046 89709 172471 147414 87019 53285
34875E3285k5918K3999J58861K15254P0415j01477r8122k4327o1400j05971J8393
$$ 53285 27367 51366 210227 425481 495896 394419 296297 271970 210570 104599 122992
34864A22992J78785J40843n320k4645J3369r9834k34436r8370J94749K50315M9155
$$ 122992 301777 442620 437300 412655 426024 326190 91754 -6616 188133 438448 487603
34853D87603n9065k3593j64990m85545n22167j12351K58803J91703m5391l8026
$$ 487603 428538 404945 239955 -245590 -767757 -880108 -621305 -429602 -474993 -513019
34843e13019J12173Q4715n6566m1606P2547L2454j01605m4346J85663K59961O9035
$$ -513019 -400846 -316131 -372697 -414303 -341756 -309302 -410907 -455253 -269590 -9629 59406
34832E9406j20995r9044J9721M5791j5421o1416p4156q3281o2765L1189J66171
$$ 59406 -61589 -160633 -140912 -95121 -110542 -171958 -246114 -329395 -392160 -360971 -194800
34821a94800K37835J66923o626j32960j00437K9969J07499Q7612L2281n2138j92984
$$ -194800 43035 209958 203332 70372 -30065 -96 107403 195015 227296 175158 -17826
34810a7826k73876j29347J27625J59616q5877k23181O082L06754K67740j7437
$$ -17826 -291702 -421049 -293424 -133808 -219685 -442866 -436784 -130030 137710 120273
34800A20273j38613j4294O3621l3539j02225q639J04020J04446O6411N6482r900
$$ 120273 -18340 -32634 30987 -2552 -104777 -113416 -9396 95050 161461 217943 208043
34789B08043j61837k42066j40992K580p245j41815j98877p3625J28139K25041
$$ 208043 46206 -195860 -336852 -334272 -341517 -483332 -682209 -755834 -627695 -402654
34779d02654J53817L3849K9656J32328J53106M508j25778l3976J63388J71195
$$ -402654 -248837 -214988 -185332 -53004 100102 104610 -21168 -55144 108244 279439
34769B79439m6380k14927j55805j945N9534L8987L2494M2176L0481J3634n856
$$ 279439 233059 18132 -137673 -139618 -80084 -41097 -8603 33573 64054 77688 71832
34758G1832p5743j72179j68602j9844J43796J96059J66140J23326M7094p5365
$$ 71832 -3911 -176090 -344692 -364536 -220740 -24681 141459 264785 311879 236514
34748B36514j49228j02892k0964j9756p3977q4747l8597J4028N4840O2384k0859
$$ 236514 87286 -15606 -36570 -56326 -130303 -215050 -253647 -239619 -184779 -122395 -143254
34737a43254j58771j66312N0922K88903K72035L8845j06310j7122J32198J46497
$$ -143254 -302025 -468337 -417415 -128512 143523 182368 76058 58936 191134 337631
34727C37631O6251K6271K0231n0750j80381k44625j65411J852J38227J65758R6593
$$ 337631 403882 430153 450384 399634 219253 -25372 -190783 -188931 -50704 115054 211647
34716B11647J9266J8750P7452Q2211l2200j76037j95811o2875Q4688J00798q829
$$ 211647 230913 249663 327115 409326 377126 201089 5278 -57597 27091 127889 119060
34705A19060j05829p1565P9067K15373K03129K0115k11429l17592k29420n0776
$$ 119060 13231 -58334 20733 236106 439235 459350 247921 -69671 -299091 -349867
34695c49867M9230R337p9553r6477k0834P0888J09663J08142J28456J83100J90132
$$ -349867 -300637 -291300 -370853 -467330 -488164 -417276 -307613 -199471 -71015 112085 302217
34684C02217O9743j12824j80238p1603M8527J3874r0272o2017P5119Q8870p7159
$$ 302217 371960 259136 78898 7295 55822 69696 -20576 -82593 -7474 81396 4237
34673D237j84052p3111P3640L1134j07085j03427L0673R1421N1970Q1683K02663
$$ 4237 -179815 -252926 -179286 -148152 -255237 -358664 -327991 -236570 -184600 -102917 99746
34662I9746K06253k1118l03086l89257k20988O1200K46317J87026m9740j89130
$$ 99746 305999 284881 -18205 -407462 -628450 -567250 -320933 -133907 -183647 -372777
34652c72777p1050R4006K2179j62913q5533K46229L76701J05480j65233m7066
$$ -372777 -443827 -349821 -327642 -490555 -576088 -329859 46842 152322 -12911 -59977
34642e9977K31526K01276j26406l26207k06835J1252J15773J30098J05027Q526
$$ -59977 171549 372825 246419 -79788 -286623 -275371 -159598 -29500 75527 84053
34632H4053j11453j16510n804N6421j584o8580o2518l5718j5857N8130J67732
$$ 84053 -27400 -143910 -149714 -93293 -94877 -163457 -225975 -261693 -277550 -219420 -51688
34621e1688J71630K5534j20030j42133j14391j43436j76208j04248M3343J49295
$$ -51688 119942 145476 25446 -116687 -231078 -374514 -550722 -654970 -611627 -462332
34611d62332J83649K02833K12941J51829O153j35488j64166n5213J03781J79670
$$ -462332 -278683 -75850 137091 288920 295073 159585 -4581 -59794 43987 223657
34601B23657J15554q991p8631r5682j57297k66065k68193n8142K24472L15386
$$ 223657 339211 330220 251589 155907 -1390 -267455 -535648 -593790 -369318 -53932
34591e3932J39884q9191j27819J3687J18766O8133j9155Q817J03610J09302J7084
$$ -53932 85952 -3239 -131058 -117371 1395 69528 50373 59190 162800 272102 289186
34580B89186m5073n9838j48690l01582l04118p0466J52905J20809k9793J0193
$$ 289186 244113 184275 35585 -265997 -570115 -640581 -487676 -366867 -396660 -386467
34570c86467K24926K81171L1289k70249l29013j66326j950N2017N4521R4312J87405
$$ -386467 -161541 119630 150919 -119330 -448343 -614669 -616619 -564602 -510081 -415769 -228364
34559b28364K66395K33952Q0323o2746p2014m376O364j6539N8742K02137K17101
$$ -228364 38031 271983 352306 289560 217546 213170 219534 202995 261737 463874 680975
34548F80975M9390j14379j36260j08040j33810j34061k1822R2550N5594q4084
$$ 680975 730365 615986 479726 371686 237876 103815 81993 174543 230137 146053
34538A46053j57975j23226p0080m8295k9183M397M6020R7718J26026N9616p8436
$$ 146053 -11922 -135148 -205228 -253523 -282706 -278309 -232289 -134571 -8545 51071 -27365
34527b7365j31736j7326J24577J17074r099j00393j18442j25633j08046m870J22748
$$ -27365 -159101 -176427 -51850 65224 56125 -44268 -162710 -288343 -396389 -401259 -278511
34516b78511J42096N9071M189J2311o082o3226n2240M7256J00090L0589m9003
$$ -278511 -136415 -77344 -73155 -60844 -66926 -130152 -182392 -135136 -35046 -4457 -53460
34505e3460k6586K5564j7492j11963j03084L3685J47753J22352J8360l7481k7716
$$ -53460 -80046 -54482 -71974 -183937 -287021 -253336 -105583 16769 35129 -2352 -30068
34494c0068k7704n2902l0958M8927O9540l7494j30961k9810J85080K30114K0737
$$ -30068 -57772 -110674 -141632 -92705 -23165 -60659 -191620 -221430 -36350 193764 214501
34483B14501j85219j54337j519K4843p1895r6762j6144J2364n3140o0919N4817
$$ 214501 29282 -125055 -126574 -101731 -173626 -270388 -286532 -274168 -327308 -388227 -333410
34472c33410J44151Q6755j9823l5742N777r173p4499q5345M922J44515K41917
$$ -333410 -189259 -102504 -122327 -158069 -152292 -161465 -235964 -321309 -316387 -171872 70045
34461G0045K04155J0613j81082j31760J54969L31041J08552l16470m67036j93246
$$ 70045 274200 284813 103731 -28029 126940 457981 566533 250063 -216973 -410219
34451d10219J59243K38411J06287L2142O2249K4531j24186k02258q2959J14692
$$ -410219 -250976 -12565 93722 125864 188113 212644 88458 -113800 -196759 -82067
34441h2067J87781P9446j15663k64793k51649l7668K33647K99536P1379k11870
$$ -82067 105714 185160 69497 -195296 -446945 -484613 -250966 48570 119949 -91921
34431i1921k57259p7206P8969R5070Q9801J50834J80771P9951q5027j87794j91098
$$ -91921 -349180 -426386 -347417 -252347 -162546 -11712 169059 249010 163983 -23811 -214909
34420b14909j15403J2170J02651L8949j40339k26909j19323K4860L5521k1714
$$ -214909 -330312 -318142 -215491 -176542 -316881 -543790 -663113 -638253 -602732 -624446
34410f24446m114M7847K2000m231J29148L40108L52188R6264j66878j98004o2177
$$ -624446 -628560 -580713 -558713 -562944 -433796 -93688 258500 354764 187886 -10118 -72295
34399g2295L6233M2757M7296Q3366O9588n2078j93855j81284M2860K92916L04254
$$ -72295 -36062 6695 53991 137357 206945 154867 -38988 -220272 -177412 115504 419758
34388D19758N4707j87762k08018r7524m4388k6412Q0902K10400J81925K1174p2083
$$ 419758 474465 286703 78685 -18839 -63227 -89639 -8737 201663 383588 404762 332679
34377C32679n9578r1130j84410j73702l1787N6812L2585O4226J91033J89099j3798
$$ 332679 273101 181971 -2439 -176141 -207928 -151116 -118531 -54305 136728 325827 312029
34366C12029j16395Q4353K85559J02327l05233m36462j73635J17058J85167J72542
$$ 312029 195634 279987 565546 667873 362640 -73822 -247457 -130399 54768 227310
34356B27310K08982J33868j66448m38831l65357l4611J57508L4070j59324j12392
$$ 227310 436292 570160 403712 -35119 -400476 -435087 -277579 -243509 -402833 -515225
34346e15225J49475L20562K05102n8695j94591j29251l2986l4498m5254N0495
$$ -515225 -365750 -45188 159914 101219 -93372 -222623 -255609 -290107 -335361 -284866
34336b84866J64673J24594m7155j57398j31241q4801p8897n27K05476L53419K38046
$$ -284866 -120193 4401 -42754 -200152 -331393 -416194 -495091 -495618 -290142 63277 301323
34325C01323m3619j79265n3296R2728r350k73212l49361q8627K33154K54020J19
$$ 301323 257704 78439 25143 117871 108521 -164691 -514052 -602679 -369525 -115505 -115386
34314a15386j53533k687K08922J55050r7751k04609n9429P4365m987j34713p0436
$$ -115386 -268919 -271606 -62684 92366 -5385 -209994 -269423 -195058 -200045 -334758 -405194
34303d05194J18098J60243N886j06140j1663J52406J62632R18j73027k39033j91262
$$ -405194 -287096 -126853 -120967 -227107 -238770 -86364 76268 77186 -95841 -334874 -526136
34292e26136o1902J05889K31048K48515J91535J37611Q3985k5625j55147j79526
$$ -526136 -588038 -482149 -251101 -2586 188949 326560 410545 384920 229773 50247
34282E0247o6438O0141Q9439M7342r442r7060k06597k27104j05860J3550k1152
$$ 50247 -16191 43950 133389 180731 171289 74229 -132368 -359472 -465332 -451782 -472934
34271d72934j19471p4203J03914J90929R5990j1010K2105J10541Q9568m6190j61162
$$ -472934 -592405 -666608 -562694 -371765 -275775 -286785 -264680 -154139 -64571 -110761 -271923
34260b71923j48043j3411J31581J43008j039j23463n3766J10488J27784j3307
$$ -271923 -419966 -433377 -301796 -158788 -159827 -283290 -337056 -226568 -98784 -112091
34250a12091q2832l152L0192p8405j30197J0975J48895Q5622k3879N6506K15634
$$ -112091 -194923 -198075 -167883 -246288 -376485 -365510 -216615 -130993 -154872 -98366 117268
34239A17268J75399l3488j25892k3461P3463M7414j6562o6758j40346j76703p0025
$$ 117268 292667 259179 133287 109826 183289 230703 214141 147383 7037 -169666 -239691
34228b39691P7515N7314o7784j7150K16991K89931M7240j96375j24494J26585
$$ -239691 -162176 -104862 -172646 -189796 27195 317126 364366 167991 43497 170082
34218A70082K22657J03449n8627j76882k51764k00830K2968K26121J63615r5095
$$ 170082 392739 496188 437561 260679 8915 -191915 -168947 57174 220789 125694
34208A25694k31122j08416P5132R6677k3377j22078j11511j6963R8793J69577
$$ 125694 -105428 -213844 -138712 -42035 -65412 -187490 -299001 -315964 -217171 -47594
34198d7594J44632M2261m0298k2331N3546N0156r1195k25575j40303J40432K97078
$$ -47594 97038 139299 99001 76670 130216 180372 89177 -136398 -276701 -136269 160809
34187A60809R1879k73072l69262r6015K03062K22922N9660k8066k784k797o1820
$$ 160809 252688 -20384 -389646 -485661 -282599 -59677 -17 -28083 -30867 -33664 -95484
34176i5484q7536m7771J017K8367L4430o349q0263q2520L6072J48390J26278N5032
$$ -95484 -183020 -230791 -229774 -201407 -166977 -173326 -253589 -336109 -300037 -151647 -25369 29663
34164B9663R3981J90952J48628m9373k00548j92123j38168j51352j67613r1281
$$ 29663 123644 314596 463224 413851 213303 21180 -116988 -268340 -435953 -527234
34154e27234L5861J16628J38696J35703R8583J8758n1183o4803n3678o1255o2095
$$ -527234 -491373 -374745 -236049 -100346 -1763 16995 -34188 -98991 -152669 -213924 -276019
34143b76019j8925L3053L7142R198K375J0584r715m1583k1305M8869Q9403O5912
$$ -276019 -294944 -261891 -224749 -215551 -213176 -202592 -212307 -253890 -275195 -226326 -136923 -71011
34131g1011L9378N3024M9301k8864j15707r7765J9177J19156J38055J08030M6033
$$ -71011 -31633 21391 70692 41828 -73879 -171644 -152467 -33311 104744 212774 258807
34120B58807o5926j66044j34231J0147R4549O5053Q3142K11853K22581m7217l34750
$$ 258807 192881 26837 -107394 -97247 -2698 62355 145497 357350 579931 532714 197964
34109A97964k81185J248Q2021j12012k12969n7415N3115q2449j83638K3376L01513
$$ 197964 -83221 -81973 48 -111964 -324933 -382348 -329233 -411682 -595320 -571944 -270431
34098b70431K70599J7469p8347L6013O3809j11855k63327j96593J2725J89511
$$ -270431 168 17637 -60710 -24697 39112 -72743 -336070 -532663 -519938 -330427
34088c30427K26744R0341j23624j78292K6310K31181J38094j22921j64135O5397
$$ -330427 -103683 -13342 -136966 -315258 -288948 -57767 80327 -42594 -206729 -141332
34078a41332K18114R9276r2507j56842j62551j86778j11592J24404L30365L17868
$$ -141332 76782 176058 83551 -73291 -235842 -422620 -534212 -409808 -79443 238425
34068B38425J54249N558q0198r9595j6344R9173O9677r7896j46953L3846J91078
$$ 238425 392674 398232 318034 218439 202095 301268 370945 273049 126096 159942 351020
34057C51020R3463r7280j06090Q155n467j45743j89505r2139l5413q8303j13879
$$ 351020 444483 347203 241113 249268 243801 98058 -91447 -183586 -218999 -307302 -421181
34046d21181m5664J761l7969o0980J4505J06504J12329O3333M7780P0921P1008
$$ -421181 -466845 -465084 -503053 -564033 -549528 -443024 -330695 -267362 -219582 -148661 -77653
34035g7653K0488m6022q0653p2956n5932n0538j1826J07443K29511J94153j1993
$$ -77653 -57165 -103187 -183840 -256796 -312728 -363266 -375092 -267649 -38138 156015 144022
34024A44022j78456j23223O7532J69005J13477K4269J673J2543j1587p0601j04925
$$ 144022 -34434 -157657 -90125 78880 192357 216626 218299 230842 219255 148654 43729
34013D3729o3289K4559L9800q2755k01491j05464J49285K36501J2017k32638j63159
$$ 43729 -19560 4999 44799 -37956 -239447 -344911 -195626 40875 52892 -179746 -342905
34002c42905J20591K48371J03886q7729j36190p5011J5572J16349J69928R6023
$$ -342905 -222314 26057 129943 42214 -93976 -168987 -153415 -37066 132862 228885
$$ [...]
##END NTUPLES=NMR SPECTRUM
##END=
