##TITLE=31Pdec_DPA0406
 CDCl3, 24 sc
 5.6.2019
##JCAMPDX= 6.0         $$ Bruker NMR JCAMP-DX V2.0
##DATA TYPE= NMR SPECTRUM
##DATA CLASS= NTUPLES
##ORIGIN= UXNMR, Bruker Analytische Messtechnik GmbH
##OWNER= root
$$ XWIN-NMR		Version 3.5
$$ Wed Jun  5 13:56:57 2019 Russian Standard Time (UT+4h)  she@DPX200
##.OBSERVE FREQUENCY= 81.013821
##.OBSERVE NUCLEUS= ^31P
##.ACQUISITION MODE= SIMULTANEOUS
##.ACQUISITION SCHEME= undefined
##.AVERAGES= 24
##.DIGITISER RES= 17
##SPECTROMETER/DATA SYSTEM= spect
##.PULSE SEQUENCE= zgpg30
##.SOLVENT NAME= DMSO
##.SHIFT REFERENCE= (INTERNAL, DMSO, 0, 182.463)
##AUDIT TRAIL= $$ (NUMBER, WHEN, WHO, WHERE, WHAT)
$$ ##TITLE= Audit trail, XWIN-NMR		Version 3.5
$$ ##JCAMPDX= 5.01
$$ ##ORIGIN= Bruker BioSpin GmbH
$$ ##OWNER= she
$$ F:/spectra/data/she/nmr/P31/1/pdata/1/auditp.txt
$$ ##AUDIT TRAIL=  $$ (NUMBER, WHEN, WHO, WHERE, WHAT)
(   1,<2019-06-05 13:55:35.78 +0400>,<she>,<DPX200>,
      <created by zg, POWCHK disabled, PULCHK disabled
       configuration hash MD5:
       00 E9 B6 7A A2 85 ED C7 34 08 36 98 17 FE 4E 26
       data hash MD5: 32K
       1E CC 72 C6 51 DB 4C 60 98 C8 07 BE CA 77 24 66>)
(   2,<2019-06-05 13:55:38.34 +0400>,<she>,<DPX200>,
      <Start of raw data processing
       efp BC_mod = 2 LB = 1 FT_mod = 6 PKNL = 1 PHC0 = -2208.758 PHC1 = 99.19911 SI = 64K 
       data hash MD5: 64K
       0D BD A1 82 77 34 37 67 25 81 59 2E 47 44 B8 27>)
(   3,<2019-06-05 13:56:14.92 +0400>,<she>,<DPX200>,
      <pk PHC0 = 37.42762 PHC1 = -41.59999 
       data hash MD5: 64K
       EB 33 67 00 EF 6D EE 5C 6F 27 41 26 0F 6C 51 F2>)
(   4,<2019-06-05 13:56:28.07 +0400>,<she>,<DPX200>,
      <abs ABSG = 5 
       data hash MD5: 64K
       B2 4B 7A EA FE 48 E4 6B DB 2A D4 19 8A 41 A2 B5>)
$$ ##END=
$$ 
$$ hash MD5
$$ 98 DB 77 F0 82 41 34 23 02 B1 38 91 AE F5 2A 78
##$RELAX= 
##$RELAX= 
##$RELAX= 
##$RELAX= 
##$RELAX= 
##$RELAX= 
##$RELAX= 
##$RELAX= 
$$ Bruker specific parameters
$$ --------------------------
##$DU= <F:/spectra>
##$EXPNO= 1
##$NAME= <P31>
##$PROCNO= 1
##$TYPE= <nmr>
##$USER= <she>
##$AMP= (0..31)
100 100 100 100 100 100 100 100 100 100 100 100 100 100 100 100 100 100 
100 100 100 100 100 100 100 100 100 100 100 100 100 100 
##$AQSEQ= 0
##$AQ_mod= 1
##$AUNM= <au_zg>
##$AUTOPOS= <>
##$BF1= 81.014009
##$BF2= 200.13
##$BF3= 200.13
##$BF4= 200.13
##$BF5= 200.13
##$BF6= 200.13
##$BF7= 200.13
##$BF8= 200.13
##$BYTORDA= 1
##$CFDGTYP= 0
##$CFRGTYP= 5
##$CHEMSTR= <none>
##$CNST= (0..31)
1 1 145 1 1 1 1 1 1 1 1 1 1 1 1 1 1 1 1 1 1 1 1 1 1 1 1 1 1 1 1 1 
##$CPDPRG= <waltz16>
##$CPDPRG1= <>
##$CPDPRG2= <waltz16>
##$CPDPRG3= <>
##$CPDPRG4= <mlev>
##$CPDPRG5= <mlev>
##$CPDPRG6= <mlev>
##$CPDPRG7= <mlev>
##$CPDPRG8= <mlev>
##$CPDPRGB= <>
##$CPDPRGT= <>
##$D= (0..31)
0 1 0 0 0 0 0 0 0 0 0 0.03 2e-05 3e-06 0 0 0 0 0 0 0 0 0 0 0 0 0 0 0 0 
0 0 
##$DATE= 1559728535
##$DBL= (0..7)
120 120 120 11 120 120 24 19 
##$DBP= (0..7)
150 150 150 150 150 150 150 150 
##$DBP07= 0
##$DBPNAM0= <>
##$DBPNAM1= <>
##$DBPNAM2= <>
$$ [...]
##$SUBNAM3= <"">
##$SUBNAM4= <"">
##$SUBNAM5= <"">
##$SUBNAM6= <"">
##$SUBNAM7= <"">
##$SUBNAM8= <"">
##$SUBNAM9= <"">
##$SW= 369.568048894756
##$SWIBOX= (0..15)
0 1 3 0 0 0 0 0 0 0 0 0 0 0 0 0 
##$SW_h= 29940.119760479
##$TD= 32768
##$TD0= 1
##$TE= 0
##$TE2= 300
##$TE3= 300
##$TEG= 300
##$TL= (0..7)
0 120 53 12 22 120 120 120 
##$TP= (0..7)
150 150 150 150 150 150 150 150 
##$TP07= 0
##$TPNAME0= <>
##$TPNAME1= <>
##$TPNAME2= <>
##$TPNAME3= <>
##$TPNAME4= <>
##$TPNAME5= <>
##$TPNAME6= <>
##$TPNAME7= <>
##$TPOAL= (0..7)
0.5 0.5 0.5 0.5 0.5 0.5 0.5 0.5 
##$TPOFFS= (0..7)
0 0 0 0 0 0 0 0 
##$TUNHIN= 0
##$TUNHOUT= 0
##$TUNXOUT= 0
##$USERA1= <user>
##$USERA2= <user>
##$USERA3= <user>
##$USERA4= <user>
##$USERA5= <user>
##$V9= 5
##$VALIST= <valist>
##$VCLIST= <CCCCCCCCCCCCCCC>
##$VD= 0
##$VDLIST= <DDDDDDDDDDDDDDD>
##$VPLIST= <PPPPPPPPPPPPPPP>
##$VTLIST= <TTTTTTTTTTTTTTT>
##$WBST= 1024
##$WBSW= 4
##$XGAIN= (0..3)
0 0 0 0 
##$XL= 0
##$YL= 0
##$YMAX_a= 104810
##$YMIN_a= -129003
##$ZGOPTNS= <>
##$ZL1= 120
##$ZL2= 120
##$ZL3= 120
##$ZL4= 120
##$ABSF1= 182.463
##$ABSF2= -187.1042
##$ABSG= 5
##$ABSL= 3
##$ALPHA= 0
##$AQORDER= 0
##$ASSFAC= 0
##$ASSFACI= 0
##$ASSFACX= 0
##$ASSWID= 0
##$AUNMP= <proc_1d>
##$AZFE= 0.1
##$AZFW= 0.5
##$BCFW= 0
##$BC_mod= 2
##$BYTORDP= 0
##$COROFFS= 0
##$CY= -3
##$DATMOD= 1
##$DC= 0
##$DFILT= <>
##$DTYPP= 0
##$F1P= 0
##$F2P= 0
##$FCOR= 1
##$FTSIZE= 65536
##$FT_mod= 6
##$GAMMA= 0
##$GB= 0
##$INTBC= 1
##$INTSCL= 5.30512e-09
##$ISEN= 30
##$LB= 1
##$LEV0= 0
##$LPBIN= 0
##$MAXI= 10000
##$MC2= 0
##$MEAN= 0
##$ME_mod= 0
##$MI= 50
##$NCOEF= 0
##$NC_proc= -4
##$NLEV= 6
##$NOISF1= 182.463
##$NOISF2= 159.3651
##$NSP= 0
##$NTH_PI= 0
##$NZP= 0
##$OFFSET= 182.463
##$PC= 4
##$PHC0= -2171.33
##$PHC1= 57.59912
##$PH_mod= 1
##$PKNL= yes
##$PPARMOD= 0
##$PSCAL= 0
##$PSIGN= 0
##$REVERSE= no
##$SF= 81.0140089999434
##$SI= 65536
##$SIGF1= 159.3651
##$SIGF2= -187.1042
##$SINO= 113.3802
##$SIOLD= 16384
##$SREGLST= <1H.CDCl3>
##$SSB= 0
##$STSI= 65536
##$STSR= 0
##$SW_p= 29940.119760479
##$SYMM= 0
##$S_DEV= 0
##$TDeff= 32768
##$TDoff= 0
##$TI= <>
##$TILT= no
##$TM1= 0
##$TM2= 0
##$TOPLEV= 0
##$USERP1= <user>
##$USERP2= <user>
##$USERP3= <user>
##$USERP4= <user>
##$USERP5= <user>
##$WDW= 1
##$XDIM= 65536
##$YMAX_p= 552606032
##$YMIN_p= -19156798
$$ End of Bruker specific parameters
$$ ---------------------------------
##NTUPLES= NMR SPECTRUM
##VAR_NAME=  FREQUENCY,     SPECTRUM/REAL,   SPECTRUM/IMAG
##SYMBOL=    X,             R,               I
##VAR_TYPE=  INDEPENDENT,   DEPENDENT,       DEPENDENT
##VAR_FORM=  AFFN,          ASDF,            ASDF
##VAR_DIM=   65536,         65536,           65536
##UNITS=     HZ,            ARBITRARY UNITS, ARBITRARY UNITS
##FACTOR=    0.456856943014862, 1,           1
##FIRST=     14782.0589164792, 0,            0
##LAST=      -15158.0608439998, 0,           0
##MIN=       -15158.0608439998, -19156798,   0
##MAX=       14782.0589164792, 552606032,    0
$$ Real data points
##PAGE= N=1
##DATA TABLE= (X++(R..R)), XYDATA
$$ [...]
44567 42948 118702 394421 534459 279669 -126581 -384472 -643187 -1099586 -1429768 -1202102
44557 -1202102 -638734 -354249 -460636 -543528 -455426 -478065 -664494 -677783 -436796 -321957
44547 -321957 -506427 -616268 -347911 30327 118099 -44392 -167780 -177235 -170174 -147644 -80112
44536 -80112 -63882 -168259 -273840 -254556 -177261 -166683 -219620 -276128 -319141 -311050 -205631
44525 -205631 -86058 -83065 -115293 19252 234107 164004 -288833 -738999 -820935 -617277
44515 -617277 -409550 -292335 -230933 -222107 -186934 32729 366900 475298 217123 -118947
44505 -118947 -264979 -339862 -516570 -660344 -618879 -559970 -644116 -632822 -241257 333075
44495 333075 665036 716667 761641 832408 710979 411382 209699 171306 58967 -217418
44485 -217418 -414452 -330314 -101347 -14460 -182763 -435960 -424751 69054 770070 1034593
44475 1034593 589753 -46586 -220759 -26165 -89619 -608330 -1135703 -1321157 -1311070 -1297328
44465 -1297328 -1180099 -886424 -588357 -373727 -92330 233631 246305 -196795 -666176 -711491
44455 -711491 -476707 -390855 -505026 -563459 -538009 -609617 -698350 -494363 4425 408413
44445 408413 493221 470957 556274 599618 380452 12914 -203332 -177520 -33833 147196
44435 147196 336969 395818 193358 -103647 -134616 188384 541742 621537 510775 478556
44425 478556 599540 756863 866926 872712 630197 82166 -486277 -643148 -303704 189310
44415 189310 508372 629819 637801 522267 315073 198686 291076 468681 553209 538119
44405 538119 499102 429367 306735 186213 93632 -27924 -147791 -109065 95226 213041
44395 213041 77006 -161202 -341152 -573618 -919018 -1052801 -673135 -79502 128271 -119959
44385 -119959 -297461 -72263 284557 400201 307081 252199 302065 345029 284668 87130
44375 87130 -188386 -327117 -131880 283353 601872 733403 838792 896548 659964 203474
44365 203474 66504 532990 1123397 1201682 823865 544222 564564 569928 354637 126959
44355 126959 111889 242717 372065 466956 460370 209062 -224960 -502745 -416019 -166808
44345 -166808 -53650 -77238 -71722 -28788 -8089 117573 471543 795723 659501 93587
44335 93587 -366305 -399254 -288415 -370426 -469183 -254263 107855 146106 -180882 -436158
44325 -436158 -400144 -328927 -393958 -324090 134354 737941 1018899 820481 342844 -117326
44315 -117326 -267576 74290 705008 1084145 920711 503577 210791 -16900 -375626 -676171
44305 -676171 -600407 -289664 -165484 -265727 -271427 -137840 -146400 -293658 -189926 279969
44295 279969 689238 676369 408448 225273 200435 275294 454907 607364 410738 -185366
44285 -185366 -709597 -699414 -301051 -68149 -302885 -812501 -1177218 -1074381 -489236 218387
44275 218387 588572 525885 336201 242772 139302 -53031 -113182 149752 543540 726808
44265 726808 616066 368986 164363 153656 367452 502282 128182 -665352 -1187170 -995332
44255 -995332 -465876 -182075 -171469 -198184 -390007 -944530 -1498173 -1489744 -1011502 -621785
44245 -621785 -416198 -27468 467771 476796 -85804 -493364 -285636 30237 -179728 -714772
44235 -714772 -972425 -887001 -810435 -756262 -419928 149978 482483 327233 -59063 -320487
44225 -320487 -359613 -255412 -124431 -99656 -192343 -166806 192997 692400 872097 574612
44215 574612 116983 -126328 -60452 229049 614820 881757 823826 529031 354247 495357
44205 495357 775194 932696 871788 540649 -92649 -750340 -893804 -394811 128941 47222
44195 47222 -443863 -676102 -517520 -451877 -692899 -846945 -606028 -213744 15069 148187
44185 148187 296438 274493 -5905 -195286 -18198 188191 -52750 -585818 -855674 -742600
44175 -742600 -616175 -644714 -609965 -405552 -193022 -20717 214891 382799 218878 -96336
44165 -96336 -16982 533857 946255 785251 359452 120136 -17161 -339621 -719986 -802342
44155 -802342 -566178 -304850 -209516 -275584 -432881 -517687 -359085 -138342 -345249 -1059734
44145 -1059734 -1608676 -1347160 -516049 102088 149129 -115350 -355130 -412624 -205973 127564
44135 127564 115775 -516624 -1288171 -1429938 -854316 -169106 198230 332040 308530 -7796
44125 -7796 -488613 -646266 -305480 66479 5711 -320547 -445628 -291816 -185536 -317186
44115 -317186 -481381 -366934 39084 394248 373639 95733 26025 358126 710366 657308
44105 657308 321999 91753 -38994 -356352 -763661 -792617 -343332 88817 80476 -232103
44095 -232103 -482026 -518955 -382182 -173233 -97183 -309220 -605626 -596411 -275495 -51091
44085 -51091 -112829 -185867 -59065 80073 45786 -29479 -31337 -132104 -445803 -756217 -858990
44074 -858990 -850746 -829008 -665187 -363741 -271032 -565566 -873297 -795619 -543862 -613883 -1029701
44063 -1029701 -1342542 -1263978 -918161 -535766 -219768 24872 262371 561232 808062 757553
44053 757553 438176 266890 516897 902464 967583 671923 308119 56220 -75030 -79062
44043 -79062 -54519 -279583 -835442 -1324374 -1307570 -870920 -425786 -122530 168004 439790
44033 439790 521262 389405 181653 -28231 -185533 -131527 159122 373473 229950 -101810
44023 -101810 -287057 -340573 -475648 -646122 -682764 -697582 -853906 -893132 -452428 230731
44013 230731 509735 208537 -245722 -570314 -918151 -1346890 -1577490 -1449980 -1143585 -812213
44003 -812213 -454613 -223473 -342487 -610099 -549962 -204612 -165733 -583743 -802066 -354091
43993 -354091 286590 457209 295490 374892 715419 814956 502979 171755 166234 380808
43983 380808 489351 274704 -249012 -799537 -981093 -700390 -335377 -288675 -506323 -639869
43973 -639869 -506138 -152636 322673 719821 710415 236204 -199097 -32886 617429 1092488
43963 1092488 1047923 794334 736564 846617 853321 686022 514915 469478 484838 420476 268115
43952 268115 201111 355304 576318 551660 265696 113537 386892 829052 941517 600879
43942 600879 107494 -273009 -508961 -587806 -431604 -92187 212726 337414 316406 224434
43932 224434 124522 159898 455415 859874 1002301 705019 174713 -290041 -593719 -748371
43922 -748371 -688229 -370930 43959 311933 379437 406617 514696 626463 592865 390915
43912 390915 119798 -165477 -511996 -918425 -1225163 -1278023 -1152744 -1047045 -951558 -650171
43902 -650171 -131058 241884 160127 -209609 -479224 -573666 -711084 -919711 -932005 -632836
43892 -632836 -309568 -291374 -541362 -783505 -896825 -991056 -1141493 -1218564 -1029595 -570414
43882 -570414 -82809 169216 171903 136101 174357 140498 -92723 -345755 -352320 -186646 -178279
43871 -178279 -389660 -491705 -271557 18933 10817 -303888 -652507 -852980 -858928 -594635
43861 -594635 -68621 400587 405877 -36504 -461323 -539848 -447107 -488463 -585691 -407298 87118
43850 87118 539142 673920 630310 664951 727612 569176 177932 -172031 -325553 -420886
43840 -420886 -552048 -537656 -258040 6762 -74889 -319855 -231501 219092 459784 126208
43830 126208 -412847 -625409 -547171 -533992 -568415 -363054 -48983 -143756 -704914 -1063042
43820 -1063042 -703609 -10018 264328 2275 -232344 -48307 292152 302006 -116804 -616240
43810 -616240 -815268 -675505 -499801 -560058 -743740 -698382 -348842 -35869 -17300 -119302
43800 -119302 -127158 -211405 -556496 -820760 -541433 21293 106627 -394739 -686244 -229931
43790 -229931 474483 716551 622074 749020 1018370 796137 -59561 -909424 -1168141 -907451
43780 -907451 -525023 -276907 -280483 -564190 -912908 -975178 -692240 -360729 -177052 -43663
43770 -43663 62640 -73295 -479820 -787053 -760701 -730915 -1085588 -1560690 -1509450 -804325
43760 -804325 -11205 378057 460333 521466 518004 272850 -48688 -55958 298293 607068 571573
43749 571573 406760 490849 801625 973351 827350 543515 301623 73590 -128644 -115697
43739 -115697 165321 432455 427569 263771 161371 60160 -182861 -415445 -419828 -379271
43729 -379271 -640299 -1060894 -1113054 -697373 -338808 -394813 -545697 -354403 60026 261526
43719 261526 140281 -34853 -46906 82908 238417 304073 188770 -77829 -335991 -470325
43709 -470325 -488724 -399955 -205262 -45702 -97907 -256580 -223707 -11157 -599 -343890
43699 -343890 -682986 -696080 -543136 -478501 -401056 -160183 41352 -2460 -35388 279464
43689 279464 724084 794553 474592 217294 216358 213650 47765 -99928 -103693 -112019 -223574
43678 -223574 -285882 -175160 -22487 -22768 -187337 -354313 -320432 7097 442400 601720
43668 601720 348538 27538 15950 207697 250668 115962 29211 -23944 -243344 -516809
43658 -516809 -476438 -95689 219286 206256 10239 -171098 -276348 -175187 240955 665142
43648 665142 572341 -29615 -532428 -593980 -551429 -706587 -750709 -337713 205091 279359
43638 279359 -114786 -417056 -302118 -3318 131999 60903 -24474 40310 249416 452853
43628 452853 541567 616181 842999 1136465 1203295 955706 636527 462984 415359 445644
43618 445644 555609 551792 119035 -650789 -1183170 -1135416 -823890 -658422 -562714 -343755
43608 -343755 -226147 -476437 -786184 -648091 -206752 -114810 -552278 -972333 -919955 -580907
43598 -580907 -335717 -221037 -97612 -10239 -75049 -221150 -323980 -466558 -810541 -1258961
43588 -1258961 -1484669 -1346217 -1108986 -1118163 -1310910 -1234807 -631379 153103 528032 342695
43578 342695 -34719 -278418 -415672 -515847 -439156 -110764 231462 316865 176709 -4044
43568 -4044 -152381 -214160 -51504 288837 444559 208982 -66520 88827 576684 873597
43558 873597 764849 526529 404054 307916 90918 -186572 -363367 -352620 -186373 -35946
43548 -35946 -120275 -419834 -606697 -472013 -252062 -257727 -387516 -376081 -324157 -495227 -703277
43537 -703277 -465722 210289 723889 664707 231802 -236163 -663569 -1009405 -1116234 -1025862
43527 -1025862 -1033991 -1190227 -1144359 -748222 -388793 -382343 -431530 -122902 343209 431131 110633
43516 110633 -95586 117719 471896 584827 445616 254852 66169 -192337 -468480 -575184
43506 -575184 -451217 -308367 -418839 -770486 -1041931 -979304 -695220 -482598 -433576 -416880
43496 -416880 -357957 -317820 -317726 -313616 -342523 -463976 -559911 -453928 -241223 -208009 -386545
43485 -386545 -512413 -489532 -530959 -708916 -758825 -550690 -376665 -465088 -545075 -277798
43475 -277798 143229 263647 72957 -27115 101620 152191 -74538 -350378 -425904 -437177
43465 -437177 -644451 -932220 -859080 -227383 587659 997749 821296 411640 187300 231760
43455 231760 433962 762205 1141212 1263730 919107 426422 306692 531571 573817 263914
43445 263914 52583 239775 503445 498775 384613 355674 189901 -213693 -355322 129563
43435 129563 664660 465953 -194244 -356138 108264 331209 -78020 -398046 -37238 456967
43425 456967 263500 -452437 -850738 -605375 -103664 314057 653951 872678 778937 434873
43415 434873 228877 399533 761201 997454 992699 785503 407165 -93000 -570171 -851803
43405 -851803 -878825 -760694 -688056 -753602 -858245 -865012 -824424 -894251 -1019510 -909662 -436113
43394 -436113 155070 565132 760075 789272 547105 26721 -380110 -247258 266869 557040
43384 557040 367709 82559 112681 360481 509401 546168 668094 819237 665554 66334
43374 66334 -647637 -952888 -608051 161337 867846 1137743 954855 582780 278604 129191
43364 129191 130614 270251 453837 492713 307247 56744 -77811 -158421 -360569 -641884
43354 -641884 -760258 -613834 -335666 -31259 312009 568702 426285 -191851 -872051 -1147307
43344 -1147307 -1048027 -940739 -933028 -785947 -412637 -108648 -154978 -437753 -613293 -487736
43334 -487736 -124038 267844 441913 276676 -56477 -218651 -91818 106044 175031 194752
43324 194752 283965 311678 84717 -307670 -577177 -592418 -452784 -285393 -165578 -155294
43314 -155294 -209935 -136641 113150 200737 -237230 -1002074 -1445861 -1244507 -763604 -540883
43304 -540883 -676660 -896784 -977890 -890518 -680102 -433016 -284820 -284173 -294831 -168917 27570
43293 27570 82129 -102888 -406781 -615155 -587664 -361776 -150807 -165427 -376523 -547617
43283 -547617 -564793 -592474 -774292 -928646 -769567 -367646 -127917 -266953 -549379 -661462
43273 -661462 -640725 -727778 -918299 -944450 -720253 -535397 -650022 -876435 -791891 -300331
43263 -300331 239985 443068 239962 -218302 -753786 -1154949 -1204663 -896215 -485773 -192391
43253 -192391 4615 148355 116148 -125390 -289154 -100189 286286 526285 621556 842089
43243 842089 1206069 1458509 1529767 1552483 1409246 799623 -102111 -599666 -365480 83074
43233 83074 132007 -126959 -243618 -182246 -248740 -487934 -652965 -645721 -561712 -415552 -221427
43222 -221427 -211896 -547986 -926753 -929528 -666983 -592565 -739139 -681030 -266269 172545 421477
43211 421477 634244 827176 709136 280371 51731 302263 604050 519692 332791 546523
43201 546523 994092 1076392 714021 430145 502485 615383 455974 140275 -152166 -530987
43191 -530987 -1087433 -1537809 -1516122 -1091851 -719704 -709651 -937194 -1070439 -940500 -663386
43181 -663386 -478792 -500011 -605677 -588611 -412837 -269911 -344348 -570550 -692075 -559749
43171 -559749 -301538 -151729 -164160 -197795 -186466 -268953 -544753 -831568 -857681 -634558
43161 -634558 -423227 -351475 -304356 -209230 -153130 -139678 -13790 234732 361524 230656
43151 230656 26193 -81757 -184290 -307087 -175893 322694 738371 583686 62354 -233992
43141 -233992 -206139 -251656 -461687 -466676 -167754 26577 -84792 -146317 63428 148588 -243276
43130 -243276 -725977 -683058 -173262 227893 311178 394752 643153 753918 454215 -47028
43120 -47028 -273950 20227 635753 1088090 1012537 524397 97977 -12078 -39198 -222030
43110 -222030 -329747 -27544 481684 653194 391082 170961 304072 514422 414973 43214
43100 43214 -305266 -509410 -639688 -707417 -621367 -328686 125061 611164 929081 903109
43090 903109 544038 58609 -312083 -399893 -130647 387753 824619 874444 577053 248690
43080 248690 112697 155468 285477 405403 360124 73608 -255535 -336996 -161602 51860
43070 51860 227867 428401 518125 254554 -229675 -456257 -231855 147010 429708 692328
43060 692328 910262 770424 233136 -173567 -20651 426066 659856 610893 450999 117815
43050 117815 -429427 -808952 -686946 -414547 -550338 -920474 -861367 -326093 12318 -159290
43040 -159290 -362120 -203873 -1092 -151161 -442891 -447051 -191401 -2940 24041 -5277
43030 -5277 -104315 -294092 -368244 -153408 134583 152025 -62788 -184242 -124693 -119489 -312438
43019 -312438 -582156 -807349 -1014388 -1194623 -1221517 -1047280 -798235 -586938 -380943 -136246
43009 -136246 74861 149504 56250 -205360 -610567 -993372 -1085983 -840816 -605093 -753356
42999 -753356 -1174851 -1371549 -1118022 -759087 -685811 -762665 -579166 -118382 227927 294519
42989 294519 346167 515868 490625 56713 -418016 -472119 -262091 -297037 -616464 -777237
42979 -777237 -631458 -540656 -686081 -708394 -310375 223343 465466 461764 497504 501322 165976
42968 165976 -425198 -768996 -618161 -312688 -272227 -437748 -449850 -211318 11399 30692
42958 30692 22419 236298 571910 652895 315825 -158895 -373473 -231519 62371 299261
42948 299261 434499 538369 695320 899730 986742 767935 294334 -176708 -551506 -990502
42938 -990502 -1475961 -1604279 -1122511 -412015 -33298 18462 146871 392641 379135 -13205
42928 -13205 -461500 -739304 -923351 -988133 -744730 -331749 -211155 -445777 -510386 -106677
42918 -106677 347273 392532 215225 238701 441737 542872 536850 592289 676074 693517 757733
42907 757733 938915 1011834 836435 697262 847568 1024969 899533 709067 894253 1327688
42897 1327688 1493135 1284187 1049292 946985 829684 710629 783549 981367 1019863 864726
42887 864726 681590 400636 -124226 -591860 -515871 -26585 220198 5328 -223962 -200124
42877 -200124 -226289 -490260 -646181 -426162 -105339 26512 156399 490941 743613 545509
42867 545509 50394 -308111 -426958 -518312 -677586 -800344 -776207 -518491 11202 598189
42857 598189 827312 552861 73276 -338020 -745573 -1171095 -1298488 -927012 -403532 -198468
42847 -198468 -292900 -369337 -367851 -428832 -485137 -369708 -210053 -287705 -578756 -815415 -925099
42836 -925099 -1028532 -1074257 -878564 -514309 -289850 -329087 -493847 -705720 -1003117 -1279529
42826 -1279529 -1321283 -1153785 -1031937 -1035071 -972881 -739143 -447486 -157088 207712 566897
42816 566897 649831 416928 224007 354493 617934 640350 374987 88316 -34114 -24722
42806 -24722 52962 182269 269571 150888 -178865 -457336 -397760 -22889 328758 350705
42796 350705 64475 -259726 -399014 -312292 -54426 282290 542064 592665 494095 436865
42786 436865 461199 405866 211616 74892 153537 291701 225746 -53613 -318290 -383464
42776 -383464 -230390 17782 93344 -255198 -869493 -1127969 -605746 310989 810208 614810
42766 614810 209440 97374 219718 254387 154463 125133 242313 351356 303383 127745
42756 127745 -37957 -116781 -186756 -400909 -767893 -1053792 -1019014 -738621 -533400 -550231
42746 -550231 -575476 -361965 -8978 142173 -48715 -341782 -439746 -380474 -462816 -785368
42736 -785368 -1044903 -932237 -589530 -431533 -566130 -694331 -625554 -557906 -696399 -905242
42726 -905242 -970247 -935803 -905560 -760175 -411957 -128772 -204417 -441556 -376095 60700
42716 60700 506423 724176 756535 569104 63928 -473582 -474528 143809 742676 761770 389594
42705 389594 160074 228110 384895 507162 591915 512085 126798 -417196 -793241 -881799
42695 -881799 -830709 -781026 -738808 -665641 -505796 -186940 218898 416560 190520 -267582
42685 -267582 -562630 -595400 -614015 -759667 -830050 -607881 -227150 -41166 -204732 -523282
42675 -523282 -705614 -680569 -632723 -743896 -938116 -941805 -620967 -190646 -8053 -179747
42665 -179747 -455541 -515315 -283110 73104 376992 584013 689567 615762 310372 -66533
42655 -66533 -212153 -16647 281049 379641 260914 112439 2592 -154515 -331646 -320436
42645 -320436 -9596 425124 689794 626324 270550 -198650 -518505 -502334 -226554 46951
42635 46951 179601 255626 339211 328268 165034 15669 60745 212156 223634 36846 -150791
42624 -150791 -168493 -89237 -112169 -291062 -448631 -392264 -193835 -160569 -463255 -891013
42614 -891013 -1101543 -1020535 -800621 -467919 85846 722698 997980 668154 50893 -320525
42604 -320525 -271854 -59074 8915 -151581 -421613 -638708 -760486 -907750 -1159999 -1327724
42594 -1327724 -1132254 -640293 -246574 -124601 -11612 266402 395652 42533 -528812
42585 -528812 -733235 -440180 -49441 167442 357810 638147 769821 524846 123940 30731
42575 30731 379539 800477 835125 439856 20651 -49098 114071 68520 -319133 -641149
42565 -641149 -504661 -87707 149446 148972 265080 616272 835537 593855 57661 -362059
42555 -362059 -497550 -478405 -458990 -467463 -434139 -257648 70980 359324 377162 193210 151814
42544 151814 389436 576440 340140 -205739 -591114 -561744 -282186 -11008 171464 282911
42534 282911 324054 344808 452690 636080 709823 565896 369967 347852 439555 351225 -42500
42523 -42500 -520727 -799084 -844063 -809606 -782564 -728552 -616652 -448320 -196730 137149
42513 137149 422065 500282 406356 340696 403506 498878 527373 502946 424926 227689 -30793
42502 -30793 -111877 107687 418839 540140 490027 507396 679529 861307 932407 926124 893874
42491 893874 833589 790177 849455 959853 910890 599535 224701 97873 288341 546880
42481 546880 593794 424204 278825 324028 441495 407703 224953 125148 219166 302256 117696
42470 117696 -288335 -605283 -607176 -364041 -134967 -126870 -337607 -589261 -731593 -800640
42460 -800640 -911000 -1038366 -1059254 -980822 -917896 -834878 -589404 -298652 -322630 -712861
42450 -712861 -1024673 -940888 -741815 -792116 -878001 -553366 59145 384636 252484 75207
42440 75207 134885 239335 220773 255756 455051 574431 411099 123652 -116123 -434823
42430 -434823 -895224 -1137393 -779115 17903 741171 1134066 1268042 1158478 719499 75903
42420 75903 -452987 -740682 -935671 -1096845 -1034088 -644334 -176221 35130 -25043 -95873
42410 -95873 -38178 5925 -107745 -256879 -222073 -50730 -24521 -213081 -304145 -59197 270241
42399 270241 272929 -10910 -180345 -130895 -186388 -497477 -768411 -802318 -883561 -1247788 -1510590
42388 -1510590 -1117752 -210303 452497 431412 52309 -148486 -47316 139876 242327 224475
42378 224475 72111 -191956 -436586 -505314 -361501 -107892 95587 123345 -23257 -191312
42368 -191312 -235135 -229756 -417280 -869127 -1293999 -1304472 -862772 -360823 -217049 -450018
42358 -450018 -708212 -685511 -412258 -125839 16594 -1201 -170542 -453656 -688838 -688994
42348 -688994 -480505 -302430 -327915 -519516 -775844 -1031757 -1154328 -961481 -489206 -63942
42338 -63942 70122 67643 241814 602035 824532 648199 150139 -352406 -569281 -443520
42328 -443520 -172800 21965 177616 498534 921035 990619 386855 -563618 -1144321 -985302
42318 -985302 -374752 109937 123136 -231963 -539947 -469038 -146507 -38795 -339546 -664122
42308 -664122 -571481 -196914 -39079 -248852 -530620 -713015 -968760 -1356580 -1546478 -1237141
42298 -1237141 -590956 -31658 208689 156452 -106326 -477539 -759368 -762748 -497804 -163507
42288 -163507 37255 28125 -133133 -314190 -406026 -384857 -261438 -31437 238574 365875
42278 365875 256991 90018 82641 140232 16802 -198676 -132228 245885 449784 184495
42268 184495 -126462 100852 745988 1115451 868076 384940 162081 215383 263364 214282
42258 214282 205900 294076 364161 350586 346244 419096 446760 255737 -115318 -412833 -451629
42247 -451629 -307527 -184258 -178165 -236486 -251803 -116082 192780 445675 243265 -485376
42237 -485376 -1166029 -1101933 -330197 380551 463039 125205 -146842 -247632 -306992 -233932
42227 -233932 134828 589711 700484 383133 -44997 -338693 -486643 -436829 -105397 271361
42217 271361 251060 -163418 -399177 -105821 298010 225989 -231752 -513320 -443206 -373070
42207 -373070 -498021 -550187 -320586 -59718 -88314 -291930 -307334 -56809 182304 165806
42197 165806 -92249 -429864 -648600 -547489 -96480 386814 475066 153008 -105769 52852
42187 52852 351969 226861 -398714 -972915 -1010461 -660334 -403921 -386882 -338290 -86186
42177 -86186 187451 306065 405852 639075 786277 524358 14908 -174770 170713 596875
42167 596875 610073 299439 38775 -146970 -498366 -966745 -1220245 -1174508 -1048064 -855707
42157 -855707 -367543 281059 504062 113631 -265899 -105436 169172 -132351 -763897 -868234
42147 -868234 -395224 -263114 -907577 -1564510 -1473343 -1026010 -1004569 -1242414 -949584 -105225
42137 -105225 431406 235610 -134467 -148110 -74930 -314033 -608904 -541879 -357203 -592695
42127 -592695 -1132115 -1331252 -1027314 -746824 -818484 -905318 -650401 -251734 -66583 -79882
42117 -79882 -145450 -383302 -877803 -1251401 -1059276 -485219 -153169 -282422 -488207 -434708
42107 -434708 -229654 -85746 -22067 -45176 -230819 -450710 -401931 -122217 -91688 -540658
42097 -540658 -1021475 -1027418 -715718 -579765 -657366 -581786 -289653 -135366 -286195 -486636
42087 -486636 -525666 -535054 -690053 -945799 -1183783 -1307259 -1116230 -473606 268131 441242
42077 441242 -72185 -546796 -350775 169125 223802 -233746 -466246 -80819 403563 340142
42067 340142 -156439 -469410 -358419 -175225 -282157 -604192 -815362 -739237 -478578 -291885
42057 -291885 -395529 -753059 -1012167 -802977 -180259 378495 517733 381646 295826 261196
42047 261196 46224 -320860 -513233 -398546 -240939 -292017 -470480 -607546 -731721 -892486
42037 -892486 -950325 -808884 -650651 -654946 -672720 -510581 -358806 -523666 -838915 -815556
42027 -815556 -386344 -31419 -61010 -226874 -240852 -255621 -519239 -866931 -921441 -622239
42017 -622239 -236111 40753 208690 287396 287641 304689 385491 336798 -77294 -733459 -1184018
42006 -1184018 -1156457 -826773 -524596 -356460 -247892 -195770 -260849 -351500 -248354 62581
41996 62581 255521 51456 -344337 -433888 -71376 348427 455651 376613 405242 459259
41986 459259 249354 -134286 -260563 -18181 194925 96065 -48742 136497 560630 831512
41976 831512 808694 681594 600487 522169 400161 282883 184616 31361 -204742 -418280
41966 -418280 -473857 -360521 -213933 -171544 -200510 -128050 98856 277154 211736 35747
41956 35747 54581 303436 514411 542102 536593 598845 538914 154517 -432240 -880343 -961605
41945 -961605 -713187 -398403 -340987 -601789 -808107 -559704 -12260 284776 176186 89234
41935 89234 286569 427613 191281 -109636 15914 482372 798394 773454 602382 412819
41925 412819 169022 -93913 -339323 -697448 -1166378 -1321535 -817295 -61041 169985 -222432
41915 -222432 -537145 -273026 278468 590776 560686 374190 132117 -88688 -104381 131803
41905 131803 335204 192450 -250642 -666952 -800363 -620128 -253969 104806 311756 380279
41895 380279 417526 448604 413201 313513 204993 49387 -239448 -592622 -815735 -848948
41885 -848948 -825149 -839445 -822330 -678113 -423953 -180515 -110171 -293709 -554451 -535611
41875 -535611 -127318 332277 497230 474990 569435 767404 860854 904949 1080890 1207544
41865 1207544 925977 358636 30601 68452 35625 -303148 -624545 -674798 -703528 -952840
41855 -952840 -1199318 -1182652 -1080617 -1150577 -1236777 -1051616 -681460 -419573 -320728 -284275
41845 -284275 -357410 -583827 -748240 -648026 -457664 -467135 -613901 -629165 -493499 -372955
41835 -372955 -245913 -1220 201904 118080 -81797 44094 504836 756438 444588 -86294
41825 -86294 -251975 39367 341166 222695 -316224 -914517 -1189486 -1030760 -656962 -399105
41815 -399105 -392865 -466126 -320856 167572 796763 1172778 1043181 524801 -3414 -210716
41805 -210716 -13430 424804 786350 789139 445428 83586 -21408 57011 127053 220204
41795 220204 408243 445831 31072 -626926 -971281 -858688 -674246 -613304 -401242 74345
41785 74345 409226 294788 16340 -46783 -20784 -220441 -556789 -674802 -435720 61923
41775 61923 644591 942170 501506 -560158 -1380940 -1298507 -637921 -107931 169170 438195
41765 438195 543887 174327 -357179 -395727 57142 386680 375807 393679 530849 369551
41755 369551 -176929 -557626 -444338 -249855 -406260 -682198 -642003 -331590 -70842 87029
41745 87029 269926 416832 366464 152020 -55144 -141443 -31994 291387 597874 513906
41735 513906 18418 -429031 -447198 -164253 84427 200606 256579 263244 235603 247584 227206
41724 227206 -29048 -442821 -586679 -296810 -15356 -168609 -504562 -493091 -180153 -138938
41714 -138938 -617732 -1201426 -1406361 -1253052 -1091156 -1089823 -1084712 -848255 -398090 -22876
41704 -22876 7791 -246590 -453874 -396876 -196770 -110948 -243436 -520063 -797696 -896758
41694 -896758 -673708 -203803 203630 298013 137667 -19098 13125 228958 462404 467853
41684 467853 100720 -487380 -915198 -892067 -422650 260676 833892 1020846 830130 633063
41674 633063 747566 956184 755915 112385 -425241 -488480 -367814 -490000 -769639 -813478
41664 -813478 -536402 -237100 -188195 -412139 -752453 -957041 -824778 -472328 -305843 -510718
41654 -510718 -722897 -465599 189724 666167 564931 99418 -183961 -4456 376074 475642
41644 475642 182506 -118396 -129690 -108456 -399589 -714538 -458849 250952 587139 193642
41634 193642 -330310 -437821 -403677 -601294 -715840 -382194 -33931 -262849 -733231 -666124
41624 -666124 -168706 -94909 -632186 -1019394 -815718 -512328 -564419 -653562 -376820 17485
41614 17485 124015 80388 213058 380570 225328 -195261 -543652 -766697 -1040286 -1292854
41604 -1292854 -1267513 -1009563 -840743 -811553 -591919 -48727 403351 285078 -280240 -666059
41594 -666059 -519300 -204102 -306388 -820461 -1108298 -721499 21465 476181 451440 243145
41584 243145 65210 -141139 -369278 -456196 -430668 -574915 -955781 -1189050 -892674 -186801
41574 -186801 432865 580348 236476 -306178 -656039 -645685 -512269 -583708 -782430 -719907
41564 -719907 -319594 27065 67880 58581 269722 493913 417442 206824 280311 641822
41554 641822 885656 820246 670486 618155 522937 239721 -80183 -204533 -167188 -210313
41544 -210313 -447898 -726428 -818672 -679966 -477359 -374750 -345056 -267428 -167813 -199034
41534 -199034 -348276 -373986 -170398 5472 -92612 -247072 -33840 481719 674669 149673
41524 149673 -671846 -1016660 -669861 -130952 98691 59473 52191 108851 36869 -145768
41514 -145768 -184752 -41286 -34810 -363612 -748927 -804007 -561327 -339459 -228356 -58193
41504 -58193 173298 219185 -10439 -278494 -360860 -290210 -157873 63619 362528 582360
41494 582360 621707 552655 437292 243604 41263 12717 128096 103466 -117892 -154656
41484 -154656 247664 712036 672446 153327 -293298 -350634 -245296 -287211 -456908 -541149
41474 -541149 -422272 -136375 178893 340858 276781 141029 132719 206034 123684 -205796
41464 -205796 -598282 -795391 -671810 -301217 36126 11554 -371834 -643124 -368659 259195
41454 259195 620556 424970 -38734 -400311 -591860 -662416 -582798 -409040 -340860 -426343
41444 -426343 -460436 -341758 -244535 -233249 -30223 511295 967611 796471 101361 -463511
41434 -463511 -512270 -270456 -87899 1174 110064 215076 236535 203988 174305 134330 114273
41423 114273 246838 574890 929428 1130187 1180778 1131808 900547 424042 -112697 -430476
41413 -430476 -500443 -525251 -593421 -579741 -424052 -278612 -269610 -295953 -216014 -108426 -177930
41402 -177930 -460235 -764861 -888220 -771249 -465651 -58565 344859 626284 676396 444928
41392 444928 43067 -218870 -67637 365649 581617 286135 -207561 -372311 -157152 2098
41382 2098 -178569 -515367 -732669 -814762 -831250 -724940 -516717 -468729 -729159 -983164
41372 -983164 -818705 -374588 -244013 -667012 -1152244 -1085587 -498177 169 -37325 -433973
41362 -433973 -696303 -631335 -529387 -731870 -1142611 -1315724 -1015342 -496253 -137900 8644
41352 8644 123711 230875 185875 -12941 -204735 -357453 -567537 -722150 -523043 -12182
41342 -12182 274807 -26361 -547577 -651074 -289275 -5103 -141348 -466680 -630722 -590025
41332 -590025 -438701 -173965 135078 224843 -26122 -322002 -302790 -45687 80574 -30029
41322 -30029 -143867 -144522 -207868 -424559 -569955 -451444 -254180 -286759 -511969 -598515 -409456
41311 -409456 -186949 -181164 -294148 -254276 -49630 30756 -153212 -292803 6373 628784
41301 628784 1009381 871622 594366 608716 724060 479858 -707 -84253 383038 742204
41291 742204 458605 -91428 -190724 212703 560094 522396 269964 2497 -274808 -481120
41281 -481120 -425990 -161680 -18183 -175646 -491109 -807350 -1102467 -1249545 -996514 -368111
41271 -368111 210268 396770 311651 258047 297051 302902 249100 222606 265099 348048 410086
41260 410086 350826 131328 -89765 -128882 -101182 -273689 -548535 -492879 -48667 219110
41250 219110 -111855 -683522 -878656 -673886 -514899 -563765 -580757 -450537 -320310 -211231
41240 -211231 50967 437092 624278 419530 -7235 -379950 -546627 -436389 -101218 139784
41230 139784 -78308 -674780 -1113960 -1007086 -496273 43950 414572 572319 483354 216074
41220 216074 -2094 -25661 32997 20310 -7126 77818 197855 134349 -177563 -571141 -849867
41209 -849867 -953203 -926951 -818051 -624501 -332258 -2897 207539 183692 -3474 -154401
41199 -154401 -129527 84495 433146 785083 911226 658385 161696 -274896 -518237 -648631
41189 -648631 -666886 -424999 41931 365964 244973 -147713 -360376 -188759 180861 489411
41179 489411 654086 693127 597083 370377 107762 -61572 -91514 -56020 -89734 -287072
41169 -287072 -603193 -834751 -771740 -445697 -182930 -282287 -621443 -744410 -445154 -91201
41159 -91201 -136979 -436228 -401392 121315 547799 346693 -208028 -426724 -128921 228120
41149 228120 253870 47560 -113525 -157017 -171338 -215224 -271351 -234624 63392 625624 1097322
41138 1097322 1053020 517826 -24418 -185480 -11826 255794 487011 634104 650873 576255
41128 576255 521013 476302 307182 1519 -265598 -374181 -364168 -256664 -12412 270444
41118 270444 381717 310080 265661 311985 279996 149451 148152 287211 185671 -344985 -877807
41107 -877807 -903861 -535199 -275967 -280569 -270340 -94530 51106 -17634 -229265 -412957
41097 -412957 -454891 -302235 -44832 34293 -255692 -682432 -787887 -426286 113078 508854
41087 508854 690982 709685 580833 351034 140546 38407 48819 130726 174227 5273
41077 5273 -398512 -740729 -667230 -185695 359368 689705 763488 614175 313785 89337
41067 89337 158723 395634 454845 292311 229171 393491 476697 261353 32433 133698
41057 133698 391247 375680 57267 -228105 -365686 -550462 -790368 -814601 -619491 -636300
41047 -636300 -1064737 -1422806 -1163479 -473000 15942 145451 317176 666744 761980 351979
41037 351979 -106885 -73409 298385 463237 309246 160432 103298 -119393 -542569 -864090
41027 -864090 -1012343 -1298147 -1776903 -1956372 -1491266 -769995 -384133 -312237 -108948 287878
41017 287878 468803 245731 -42236 -16033 308842 695175 985905 1084546 903541 543156
41007 543156 335876 468376 645773 381009 -356686 -992845 -972000 -397038 142998 312474
40997 312474 315559 391929 388611 115027 -170233 -94570 138496 -56098 -724325 -1210643 -1096813
40986 -1096813 -762617 -705888 -801507 -663000 -338890 -157298 -173489 -258595 -479126 -875460
40976 -875460 -1085723 -752468 -158416 108203 23279 83559 447994 731126 690228 536458
40966 536458 466577 421878 410693 528699 550202 86107 -676951 -1003506 -640290 -232245
40956 -232245 -362689 -738304 -775104 -507961 -387075 -527607 -693912 -777922 -812521 -724218
40946 -724218 -520735 -514697 -906740 -1339286 -1336254 -1019871 -896476 -1063187 -1156348 -1013084
40936 -1013084 -825301 -631759 -238388 232963 277521 -241886 -720387 -535413 147061 629365
40926 629365 547857 149963 -185615 -370807 -516676 -668621 -771566 -805535 -819674 -811492
40916 -811492 -673288 -370551 -140738 -339265 -1006263 -1722784 -2016715 -1814961 -1401890 -1076914
40906 -1076914 -992594 -1160809 -1393244 -1352588 -911326 -381279 -143075 -137994 -21028 258993
40896 258993 413641 368520 447256 842854 1256347 1305397 1035358 761269 599658 442669
40886 442669 265812 162912 123062 39951 -55489 -12064 149253 175716 -84899 -443464
40876 -443464 -571164 -343144 107050 566867 848836 799761 401054 -116452 -422486 -430014
40866 -430014 -353728 -325673 -120417 502656 1265330 1513406 1002273 270392 24308 339946
40856 339946 715340 762513 527420 185598 -199135 -509692 -492335 -63562 477574 752838
40846 752838 703263 499946 186084 -322118 -901526 -1182616 -978074 -577179 -442952 -691676
40836 -691676 -1019624 -1100376 -888747 -525799 -140361 132307 76033 -443072 -1228895 -1832087
40826 -1832087 -1940173 -1613379 -1130203 -728275 -519983 -487123 -458771 -243885 91003 227349
40816 227349 36262 -151285 35703 433089 507651 86448 -407810 -524893 -284543 27852
40806 27852 267318 409289 359120 72769 -250261 -353147 -233386 -60534 113852 304985
40796 304985 333227 -54875 -757062 -1281206 -1239341 -689156 44845 636879 785374 305635
40786 305635 -567104 -1180873 -1054816 -389415 198107 353746 214698 64822 14776 16767
40776 16767 -12378 -131736 -327062 -514124 -654563 -792014 -890488 -793013 -512325 -383842
40766 -383842 -642807 -974477 -853119 -295537 121981 50394 -241112 -403241 -519214 -801825
40756 -801825 -1107297 -1115056 -806979 -433573 -122666 169418 401113 451797 368310 334209
40746 334209 367709 273839 -53832 -459086 -709561 -735449 -630834 -495200 -324361 -60029
40736 -60029 251044 423480 383448 381229 706138 1186670 1300620 889125 411635 297048
40726 297048 401975 396573 321143 350654 316311 -19715 -402949 -352181 90940 408671 388537
40715 388537 332825 438388 489437 313843 91514 17181 28593 46918 147492 318310
40705 318310 362923 216193 75131 64733 47641 -91355 -236607 -258137 -204281 -174221 -211882
40694 -211882 -357311 -550800 -518289 -101628 330850 250498 -240991 -500558 -295420 -90211
40684 -90211 -224827 -422356 -390982 -309480 -338263 -219684 171606 398572 117038 -281695
40674 -281695 -260339 2615 -50698 -446173 -717084 -651164 -417747 -115475 234839 371567
40664 371567 41551 -476749 -609272 -232879 239915 463717 431794 231253 -37306 -165751
40654 -165751 -82627 -104792 -524333 -1055056 -1147060 -748689 -278191 45843 303840 401796
40644 401796 136568 -234296 -127811 498961 975984 828684 377382 182900 310838 437011
40634 437011 377274 221584 106319 53672 -21319 -173053 -238591 56560 626766 904963
40624 904963 530593 -73799 -259722 -79500 -102108 -444480 -639930 -470358 -275015 -317446
40614 -317446 -434962 -473018 -534994 -644118 -655293 -632865 -814156 -1091736 -1066672 -711814
40604 -711814 -396090 -164598 300717 838738 745964 -83481 -746065 -578850 -114817 -152871
40594 -152871 -492687 -379825 201869 505768 119867 -604508 -1162256 -1366698 -1222629 -793253
40584 -793253 -245540 253672 661457 913173 836688 419998 -60859 -395104 -652989 -846559
40574 -846559 -734469 -248131 255130 485749 590599 698915 561156 85705 -235882 -17499
40564 -17499 312693 150195 -277479 -282423 141765 365688 230337 277205 764473 1196170
40554 1196170 1089147 629498 259770 44198 -239474 -642940 -935280 -839098 -312075 308750
40544 308750 532968 265480 -26294 66442 329780 331925 149795 206470 539866 774137
40534 774137 757745 697387 670544 532853 336456 319826 420387 301000 -63717 -330158
40524 -330158 -396950 -544581 -839182 -945150 -733431 -549109 -598764 -545318 -49386 655387
40514 655387 1051363 920615 402468 -234528 -661090 -640512 -341688 -214172 -372698 -440930
40504 -440930 -188542 83013 56049 -107896 -131939 -118303 -274233 -442546 -347088 -92077
40494 -92077 19295 14282 179083 548568 850774 914702 804267 591029 306643 96623
40484 96623 129806 343436 496921 457838 255530 -59399 -393317 -554324 -469747 -361386
40474 -361386 -439011 -527853 -312794 139583 466904 567780 661492 774223 622983 163075
40464 163075 -160797 34682 567595 981825 1074355 881607 427605 -156413 -465221 -196131
40454 -196131 369645 634425 417809 78044 -87196 -155083 -210059 -85713 299627 677305
40444 677305 774134 678619 592261 451388 122467 -212764 -247685 -38660 56368 -106261
40434 -106261 -329559 -449689 -514134 -575291 -609857 -666336 -812080 -932064 -864657 -703461
40424 -703461 -636684 -547616 -191528 263881 373196 114360 -99250 -186390 -534237 -1170722
40414 -1170722 -1497481 -1206712 -793745 -683286 -506839 124209 732416 658572 182402 78494
40404 78494 344017 294640 -194955 -474398 -196322 228505 420047 535203 760885 939354
40394 939354 943000 875763 698437 191428 -505373 -855062 -666144 -374834 -350453 -416048
40384 -416048 -322070 -203308 -241984 -303452 -233089 -138977 -81168 138135 552930 764967 458832
40373 458832 -98141 -405878 -346158 -159555 -35352 4092 855 56384 239553 369084
40363 369084 158302 -295866 -512609 -290834 -1109 6703 -103413 -42509 91373 47464
40353 47464 -121338 -192760 -146914 -105973 -111433 -201809 -457483 -738243 -690705 -293793 -60508
40342 -60508 -356210 -829557 -903676 -553681 -187244 865 112987 173294 113203 26086
40332 26086 52233 94912 -16077 -178651 -156387 35477 185357 237024 310562 458962 633154
40321 633154 772059 735998 341275 -321717 -834930 -965870 -983677 -1191850 -1435477 -1406276
40311 -1406276 -1148185 -878252 -587546 -241721 -86739 -255284 -330088 121301 768119 909193
40301 909193 544773 381079 739470 1132272 1093092 822803 710341 686868 442775 7018
40291 7018 -255464 -130458 195684 363872 221175 -45624 -176457 -211560 -425524 -835995
40281 -835995 -1063749 -882624 -617234 -677439 -944585 -1004803 -797249 -606833 -552475 -515093
40271 -515093 -474132 -492575 -457978 -264319 -154054 -418231 -832914 -880813 -482335 -8213
40261 -8213 370668 764285 1009231 714815 17577 -362786 -112201 194701 -31849 -510819
40251 -510819 -522332 88189 770136 968036 633520 140309 -85398 64863 260069 109860
40241 109860 -283510 -389434 49396 662445 946080 837240 599547 392606 213164 94703
40231 94703 87210 80911 -148356 -671418 -1235746 -1398713 -922121 -110602 372239 192127
40221 192127 -271473 -430589 -216302 -394 58124 164530 422108 652407 742477 786215
40211 786215 799612 657204 398468 244889 222544 119549 -90377 -148394 52081 282391
40201 282391 345062 271438 64586 -347678 -772989 -803567 -405564 -59306 -96440 -287730
40191 -287730 -313365 -224411 -150628 39759 417902 663129 452948 -46058 -422508 -546542
40181 -546542 -533837 -397806 -91559 240541 374775 303629 198390 160406 168900 166388 91725
40170 91725 -21487 61130 540644 1229252 1786264 2334299 3309075 4518112 4976966 4114579
40160 4114579 2632293 1636599 1343540 1241431 1154597 1365527 1817323 1975186 1600152
40151 1600152 1076270 797358 682050 479609 202574 66068 214876 599660 950678
40142 950678 904393 398241 -109295 -104721 326721 630086 541651 351907 362307 469794
40132 469794 456120 375257 419277 590453 726548 759095 782326 894864 1061961 1135186 1006595
40121 1006595 760484 608820 617477 602641 414860 201468 198473 359658 433965 363599 332133
40110 332133 399272 371601 141203 -93106 -118911 -49112 -142243 -360172 -345105 113910 769523
40099 769523 1187027 1212744 1014956 736107 360215 -16028 -61077 408827 1079868 1434680
40089 1434680 1317159 967450 593982 220309 -87363 -192648 -131318 -70474 14918 298030
40079 298030 685712 827777 655708 525730 645830 734368 493595 98185 -64299 117770
40069 117770 491879 887085 1122654 1044110 789555 746190 1005783 1167938 942542 598938
40059 598938 486349 465131 241452 -35434 -3311 294933 511639 561403 617829 674166
40049 674166 591936 500742 659472 956168 1022905 843072 767108 891226 911012 701249
40039 701249 568995 732946 958374 970179 898380 986593 1065840 690077 -205171 -1048642
40029 -1048642 -1181099 -585297 63149 114886 -390072 -886719 -986070 -766482 -431963 -51284
40019 -51284 276910 375432 298573 362190 642396 774316 516512 181517 174334 409940 563379
40008 563379 619310 758540 933422 986063 995805 1094763 1129974 930268 713176 780498 993772
39997 993772 1012130 865132 803476 774259 583310 399829 498531 639552 370145 -123536
39987 -123536 -181999 267152 535889 236083 -151559 -58053 360351 523569 170111 -465560
39977 -465560 -941364 -926967 -496652 -137815 -166871 -216855 249261 1011207 1295777 933164
39967 933164 609688 782769 1041604 888191 532568 448142 611786 679237 580964 493204
39957 493204 461663 435804 467355 544902 432682 -13275 -538057 -776017 -704586 -579182
39947 -579182 -553061 -566755 -501565 -288443 35985 310654 430297 555057 910046 1357510
39937 1357510 1468692 1105933 645776 506947 691939 874433 723296 130901 -624214
39928 -624214 -981031 -678945 -172418 -81128 -320091 -278634 190756 582678 597392 529413
39918 529413 618653 656924 514696 462123 628779 676217 360767 -59553 -307111 -484739
39908 -484739 -668675 -623260 -301672 -122778 -328729 -547411 -423850 -196227 -173236 -136743
39898 -136743 183824 491540 385908 81114 46832 234089 261806 115898 70686 136459
39888 136459 157173 246540 549302 759185 470333 -128017 -479114 -460156 -389742 -343919
39878 -343919 -77187 380513 622955 454213 131346 -49959 -44111 93310 297560 423978
39868 423978 379291 299117 349200 453818 464593 411856 310842 -8531 -501076 -638223
39858 -638223 -45235 832169 1259750 1222436 1278240 1533143 1472487 865667 177157 -115596
39848 -115596 -94050 -78059 -150734 -206272 -154516 68299 437619 733737 757975 644034 649958
39837 649958 686115 427630 -111980 -525903 -579943 -452081 -337684 -179947 102934 431233
39827 431233 701809 864762 831664 569860 294838 288518 514317 675771 642351 549571
39817 549571 516548 553852 712352 1028421 1349176 1464598 1337307 985937 358492 -357486
39807 -357486 -592558 -65602 621973 648607 84956 -284663 -139376 110326 217150 433375
39797 433375 774461 760029 262813 -79366 217956 717146 741579 382137 239305 455428
39787 455428 590169 342027 -98919 -410054 -479755 -358372 -126488 129526 340434 461055
39777 461055 413429 120740 -333998 -700615 -797816 -665651 -445393 -231900 -79371 -13282
39767 -13282 9297 37743 25640 -71680 -117286 107041 591671 1027360 1067631 607885 -105443
39756 -105443 -566336 -404030 145074 390186 55101 -268960 105026 978130 1517531 1331828
39746 1331828 797785 412762 344961 588775 1022806 1272580 1029271 584405 567488 1067984
39736 1067984 1497640 1429234 1091717 893559 914044 1031039 1129863 1026748 588294 70627
39726 70627 -58813 236430 504671 494427 445015 557713 665050 628571 611850 730514
39716 730514 845298 916169 1144107 1532822 1719692 1497542 1141300 981422 992196 1002133
39706 1002133 963942 832625 533304 223404 229532 575831 938100 1160126 1387319 1609509
39696 1609509 1588560 1368756 1305552 1424991 1345823 1032317 971860 1326128 1578405 1395752
39686 1395752 1193299 1405555 1812112 2066852 2303060 2677726 2864110 2573187 2102195
39677 2102195 1818958 1579294 1198740 985109 1190779 1434928 1330674 1203437 1467844
39668 1467844 1759857 1509327 989325 903374 1206931 1286997 1182601 1651276 2916158 4163743
39658 4163743 4511115 3886106 2807112 1822349 1300234 1303366 1503575 1514336 1330190 1205065
39648 1205065 1248785 1441751 1799343 2145980 2053080 1494003 1201437 1736345 2522672 2574061
39638 2574061 1946452 1591492 1851175 2029728 1577424 836338 348056 147179 50488 35694
39628 35694 23152 -198474 -549756 -622679 -293424 65889 170465 152352 121458 -105751
39618 -105751 -580048 -957401 -943795 -659630 -350859 -76868 139846 207299 177648 233574
39608 233574 344304 304635 197974 362338 772487 979836 874795 949548 1467118 1899311
39598 1899311 1668887 1045991 753177 922954 1007832 646114 110446 -175617 -175061 -107349
39588 -107349 -12745 294184 830070 1201197 975604 300457 -116290 191803 894125 1352865
39578 1352865 1429906 1440173 1499755 1423578 1223605 1186652 1368458 1463298 1316217 1169934
39568 1169934 1237359 1362976 1274194 908548 398189 -12604 -14565 474278 1041193 1170504
39558 1170504 931667 869605 1167937 1394478 1199034 785148 492162 343838 243793 239104
39548 239104 359721 518071 726642 1064676 1320003 1116732 574780 364503 858356 1663702
39538 1663702 2225288 2414998 2279187 1765248 1084930 822277 1189840 1593724 1414896
39529 1414896 833243 398157 192653 -16215 -161083 -33806 214363 355169 629830
39520 629830 1359817 2188606 2402950 1942253 1435441 1255220 1179819 1025344 964862 1085150
39510 1085150 1192258 1214643 1303386 1413826 1301001 1060060 1137576 1640603 2171984 2535217
39500 2535217 3014830 3690700 4080144 3843023 3302718 2876549 2568717 2476537 3097484 4452388
39490 4452388 5654585 6415900 8352870 13155458 19366583 22691706 20442933 14617326
39482 14617326 9557288 7368754 6812353 6068564 4941936 4143294 3821203 3628704 3508353
39473 3508353 3615169 3791923 3717716 3392922 3040831 2710239 2369276 2203310 2376756 2610586
39463 2610586 2457233 1990510 1789186 2142285 2647365 2772482 2519517 2295817 2327678 2462780
39453 2462780 2458143 2219017 1783122 1307390 1100461 1418965 2104284 2633557 2720533 2675379
39443 2675379 2919901 3351759 3567059 3541317 3569353 3640831 3567425 3719981 4733660 6336201
39433 6336201 7713194 9574267 14187552 21742754 27914684 27551536 20760675 13064921
39425 13064921 9046032 8011019 6840785 4774629 3377221 3268449 3343519 2892796 2506395
39416 2506395 2707637 3130947 3321700 3301833 3160503 2908846 2779831 2945343 3048825 2746108
39406 2746108 2447172 2664832 2941344 2468127 1557181 1330297 1986067 2546311 2424786
39397 2424786 2118975 2140245 2331342 2539263 2976595 3569180 3826061 3680843 3646149 3870787
39387 3870787 3875500 3467857 3056561 2807535 2387483 1822262 1670911 2017197 2247477 2203322
39377 2203322 2539967 3459182 4125570 3985466 3696128 3967468 4328191 3923494 2890174
39368 2890174 2074920 1862524 2034885 2374791 2729108 2831200 2635752 2486498 2522655 2394252
39358 2394252 1992125 1864675 2366087 2965370 3003931 2613587 2281713 2040769 1742966 1631411
39348 1631411 1920873 2223668 2095936 1812275 1945274 2501493 3095904 3647742 4264767
39339 4264767 4748063 4873494 4930678 5367698 6101073 6742574 7304761 8112269 9163087
39330 9163087 10100382 10705835 10969035 10800371 10162815 9501622 9668367 11214350 13694438
39321 13694438 15638944 15524160 13229026 10378961 8704870 8235336 7788363 6950240 6442500
39312 6442500 6549241 6538514 6040915 5731610 6028026 6275241 5970781 5724554 6156999 6807403
39302 6807403 7008080 6947905 7013981 6995994 6842586 7249260 8478939 9531096 9603812 9493108
39292 9493108 10308866 11615628 12195604 11981945 11837056 11950851 11876189 11763259 12172327
39283 12172327 12904839 13288330 13425164 13990369 14992697 15852885 16509957 17384108 18459168
39274 18459168 19435587 20560054 22284208 24319864 25998050 27344364 28936167 31012291
39266 31012291 33552854 36828262 41047341 45943890 51477202 58318167 66921514 76988322
39258 76988322 88657807 103159212 121356821 142908795 167900935 197861334 234172751
39251 234172751 277431119 329025039 388920064 447930117 485904341 484916776 445644606
39244 445644606 386827819 328303001 278406971 236970293 203027920 175538401 151315534
39237 151315534 127691318 105957862 88973345 76688480 66723767 58005449 51102559
39230 51102559 45907707 41491732 37710835 34930700 32661643 30144474 27668897 25801716
39222 25801716 24062788 21846470 19812173 18802981 18181008 16823250 15057042 14029576
39214 14029576 13775267 13433638 12832374 12386969 11926770 11024901 10059013 9661335 9562389
39205 9562389 9149321 8623506 8447128 8275846 7654413 7112195 7294913 7653089 7300098
39196 7300098 6541434 6217416 6169469 5771446 5373094 5704046 6338817 6285362 5705818 5542237
39186 5542237 5775582 5593573 5042038 4964662 5407184 5547822 5198793 5014925 5187464 5203261
39176 5203261 4943654 4841858 4922295 4792042 4572950 4771777 5276235 5532694 5629622 6138017
39166 6138017 6980833 7548939 7843059 8386787 9057325 9116891 8434974 7658071 7137388 6626145
39156 6626145 6017377 5484960 4968947 4376230 4109673 4508715 5029880 4949024 4565126 4639530
39146 4639530 4965665 4704951 3908561 3421533 3389773 3155184 2624299 2465764 2839243 3106995
39136 3106995 2971817 2847493 2967115 3097761 3210528 3499222 3734916 3527720 3151779
39127 3151779 3163151 3358967 3136779 2673526 2614307 2799787 2548256 2047956 2138410 2775583
39117 2775583 3088916 2977746 3238069 3979810 4329312 3947974 3513018 3405077 3201423
39108 3201423 2784532 2705067 3087571 3342942 3294220 3450850 3881879 3988011 3693660 3679653
39098 3679653 4099704 4253337 3902821 3727790 4037856 4177194 3701872 3104445 2877341
39089 2877341 2800652 2596355 2419245 2348664 2211320 2119613 2339341 2541955 2137034 1373266
39079 1373266 1078517 1331194 1502367 1514037 1786247 2058262 1715814 1225732 1652857 2742450
39069 2742450 3190418 2876647 2951102 3535648 3420595 2452333 2059371 2748068 3224749 2841506
39059 2841506 2762413 3675077 4465666 4358491 4292840 4873590 5089402 4574425 4957299 7162658
39049 7162658 9588421 11189051 14164324 20530980 27470474 29533595 25191057 18358552
39041 18358552 13384145 11045535 9785991 8487871 7055395 5792161 5137629 5286550
39033 5286550 5770847 6017270 6139945 6423705 6426296 5587100 4362850 3692964 3629541 3510869
39023 3510869 3168349 2941670 2818772 2558583 2353213 2457834 2566371 2419125 2468065 3003321
39013 3003321 3301289 2723398 1964096 2020061 2618035 2937415 3169786 3949740 4908954 5291133
39003 5291133 5385171 5839472 6240524 5990045 5811775 6550153 7325705 7060581 6969789 8862389
38993 8862389 11743064 13605417 16428403 24852269 38142906 47564402 45230769 33378245
38985 33378245 21513299 15752556 14355781 13010220 10554566 8407110 7297576 6709122
38977 6709122 6318686 6243727 6246555 5852780 5143751 4656039 4556690 4526443 4436585 4556461
38967 4556461 4952785 5177678 4842016 4158506 3583190 3195385 2851576 2730879 3153954
38958 3153954 3910819 4402025 4568564 5040534 6070925 6910198 6694046 5538751 4307769
38949 4307769 3607191 3415556 3428011 3368770 3138611 2909286 2886907 2902407 2602950 2107345
38939 2107345 1943383 2223682 2515575 2676923 3049267 3569137 3580126 2967218 2587645 3003284
38929 3003284 3632251 3781526 3644361 3552751 3152402 2219669 1476910 1594814 2082195 2162674
38919 2162674 2068491 2393054 2793220 2511725 1729986 1283404 1404362 1753715 2272652 2990483
38909 2990483 3433370 3255060 3000801 3219174 3362511 2733636 1984998 2319286 3531204
38900 3531204 4200756 3681427 2679951 2000239 1856856 2284505 3118009 3703320 3635040
38891 3635040 3524199 4033817 4586352 4223871 3320295 3062082 3529883 3742034 3422188
38882 3422188 3244602 3372163 3214294 2724813 2570706 2856868 2945452 2700420 2718859 3158568
38872 3158568 3437669 3240566 2831150 2350325 1783391 1526935 1945197 2501929 2403223 1905828
38862 1905828 1869975 2273397 2384506 2153913 2152812 2361303 2309268 2164923 2377705 2567425
38852 2567425 2141933 1621321 1865823 2439614 2367529 2026623 2456536 3243115 3123906 2357958
38842 2357958 2299327 2829535 2569332 1607239 1527206 2504716 2890541 2135739 1671772 2263426
38832 2263426 2875429 2898063 3146127 3801519 3682104 2545089 1905158 2503078 3075167
38823 3075167 2707848 2327427 2738006 3234776 3318583 3772558 4874897 5531040 5290974
38814 5290974 5178240 5485405 5062403 3946580 4079149 5903779 7091585 6724063 7873455
38805 7873455 13062679 19344840 21298414 17726815 12335321 8581119 6783277 5937590
38797 5937590 5561343 5362508 5023406 4714916 4695075 4583204 4034477 3574025 3687159 3811361
38787 3811361 3373981 3006190 3502032 4400498 4847520 5045296 5609607 6296285 6556302
38778 6556302 6553561 6553003 6194037 5385698 4901444 5097127 5202585 4863184 4996476 6004905
38768 6004905 6686650 6262840 5915868 6790990 8026887 8469260 8837686 10304198 12253151
38759 12253151 13413988 14070975 15242555 16745294 17944684 19369873 21678702 24005279
38751 24005279 25272616 26324410 28932036 33470808 39414931 47635451 60688908 81052162
38743 81052162 109431869 143069691 174329659 192731819 191007335 169773922 136528631
38736 136528631 101344150 72903375 55073512 45277555 38025765 31144361 26577307
38729 26577307 25035557 23785906 21097245 18736335 17861344 16460893 13457575 11270344
38721 11270344 11309133 11059374 8949852 7763245 9411975 10832504 9425796 7997106
38713 7997106 9395051 10924765 9619195 8351430 10518872 13341049 13261221 13267964 17271959
38704 17271959 21966293 22673001 22493854 26403589 31303308 32456954 34507548 43905599
38696 43905599 55900283 63388672 72704603 92808361 115442726 131232214 162316519
38689 162316519 243287017 357399271 426274318 390976194 282809298 185144507 140032380
38682 140032380 123582825 102944860 78342858 62775730 53579276 41840317 30470489
38675 30470489 26224704 25611857 21910595 17283587 16867676 18129783 15954107 12296965
38667 12296965 11829942 12929227 11180824 7774419 6894000 8056828 7860110 6588353
38659 6588353 6863124 8047527 7672164 6419454 6513642 7023015 5658605 3559877 3573117
38650 3573117 5149358 5412281 4182595 3739900 4451751 4571551 3792948 3455028 3654994
38641 3654994 3307413 2628630 2718734 3193106 2865322 2160619 2311443 2856332 2475268 1619360
38631 1619360 1759124 2619421 2682881 1960519 1822330 2449822 2781663 2683618 2960465 3471103
38621 3471103 3333230 2772375 2784359 3210341 3066187 2521163 2661623 3523291 4163363 4409242
38611 4409242 4755310 4868809 4069999 3011096 2971110 3683843 3757642 3088402 2922136 3576660
38601 3576660 4036944 3908896 3949132 4502793 5128835 5883979 7253429 8670962 8848517
38592 8848517 7808870 6952870 6906637 6913916 6509108 6104386 5727965 4893071 3944427 3825050
38582 3825050 4306873 4222504 3632747 3878544 5266972 6677771 7661942 8784204 9684199
38573 9684199 9236723 8024153 8067333 9618585 10961536 11793971 13554832 15840996 16386395
38564 16386395 15562570 16470503 19271830 20784579 21635542 27124309 37846354 48259533
38556 48259533 60896907 91229350 144563975 194316872 201780777 160013353 102906954
38549 102906954 65779509 51337746 42054020 30772142 24023006 23869991 23645740 20476453
38541 20476453 18803357 20496905 21829940 21471386 22366046 24203483 22445869 16747702
38533 16747702 12585231 12327555 11956093 9042665 6868634 7639723 8276581 6449602 4817546
38524 4817546 5602178 6399150 5099486 3916731 4776293 5462300 4121105 3064560 4284686
38515 4284686 5540933 4776215 4192873 5942524 7851512 7586599 7158946 8961722 11037246
38506 11037246 10822297 10212822 12190671 15372610 16810674 18071227 23856020 35458274
38498 35458274 48505652 56096777 53064990 40203998 25644084 18143428 17601871 16743141
38490 16743141 12849966 10947745 13485566 15350429 13186485 11201905 12383016 12367484
38482 12367484 8386177 5803841 8424083 10763842 8153567 5856181 8994971 12377560
38474 12377560 10667221 9435418 14446726 19526249 18281145 17866464 25950955 34565154
38466 34565154 34724638 36253159 51903022 72479273 82649278 90509830 111106281 132670060
38458 132670060 141745413 175527035 289807771 456718336 552606032 490744857 328463170
38451 328463170 196430220 150128979 142454509 122056161 94131766 79239546 69701373
38444 69701373 51830009 34604016 30438934 31167026 24373526 15343895 14302013 16837518
38436 16837518 13880125 8834613 9353761 12170940 10155325 6003918 6167597 8397294
38428 8397294 6966143 3964050 4730424 7613515 7955824 7075660 8334400 9312583 6513127
38419 6513127 3128973 3836082 6238272 5436676 2917559 3096251 4922866 4614552 3234852
38410 3234852 4103078 5854409 5276138 4060966 5696081 8411381 8155882 6040521 5978247
38401 5978247 7250884 6267205 3748962 3410560 5020431 5244733 4119983 4462666 5905537
38392 5905537 5541140 3678406 3248033 4200395 3951121 2681280 2834273 3969778 3394121
38383 3394121 1429164 929773 1950532 1892442 628537 543502 1674847 1666011 488216
38374 488216 485227 1698958 1779772 654068 715731 2148446 2549105 1562562 1480147 2715293
38364 2715293 2988921 1706537 1021292 1729407 2035004 1277201 1125332 2113468 2544500
38355 2544500 1809770 1435415 1922379 1815781 799124 512162 1386691 1763538 1049611
38346 1049611 747652 1477185 1913346 1537391 1549943 2224240 2227626 1399461 1335110 2374381
38336 2374381 2900295 2511089 2936612 4737330 5966133 5350347 4153806 3648156 3261072
38327 3261072 2454820 2007823 2194559 1978191 1146531 1002813 1887115 2318672 1669476
38318 1669476 1337729 2096238 2606144 1871519 980116 1051341 1487026 1569608 1844838 2624515
38308 2624515 2977559 2465150 2118406 2545908 2822047 2323452 1875732 2022844 1981653 1387495
38298 1387495 1250768 2077755 2822996 2770512 2661546 2932181 2717972 1704113 1054844
38289 1054844 1334210 1394755 538115 -130276 229166 689631 479529 483211 1341820 1922480
38279 1922480 1298137 518208 735511 1206519 882026 444877 951993 1811922 1920378
38270 1920378 1612229 1759288 2037171 1753950 1362284 1545179 1781862 1346967 763931
38261 763931 799457 1004552 701271 399106 753335 1136657 783332 379002 917734 1852328
38251 1852328 1985885 1435545 1138129 1093265 654309 1128 -147187 163856 385544 550615
38241 550615 960580 1355325 1453837 1659580 2211805 2433231 1878453 1324938 1476004 1658905
38231 1658905 1093169 446618 665066 1170467 821317 -90146 -431101 -192831 -230691 -537713
38221 -537713 -393706 110413 224370 -39051 -40194 160031 -54168 -567266 -633660 -113062
38211 -113062 481565 937078 1330776 1404639 961028 508906 544926 654727 292964 -141635
38201 -141635 -66648 130942 -103926 -233865 484178 1475828 1663302 1277390 1349986 1839382
38191 1839382 1841150 1359852 1260803 1604817 1595809 1159039 1074325 1470775 1603299 1269290
38181 1269290 1134568 1463879 1728750 1665242 1615150 1656829 1442453 1035095 920210 1087518
38171 1087518 1046327 794001 816350 1099380 1099148 742578 546785 707768 924867 1099746
38161 1099746 1353397 1430101 978641 351650 239745 600060 825188 850365 1175571 1875867
38151 1875867 2465173 2656824 2493848 1967750 1301535 1209624 1936259 2499516 1989813 1135514
38141 1135514 1277287 2195263 2452807 1689708 993229 978417 1065464 878545 887948 1281387
38131 1281387 1490268 1265923 1114136 1300407 1452121 1425285 1543569 1743670 1527631 1001761
38121 1001761 921925 1458028 1918735 1912388 1768540 1645409 1309688 999747 1362188 2237292
38111 2237292 2606880 2073327 1349347 1003132 798836 571551 629179 922828 912541 629441
38101 629441 780543 1430291 1720181 1325136 1017739 1276658 1517856 1332469 1329061 1963448
38091 1963448 2552627 2326718 1647419 1347543 1525166 1739554 1832019 1897682 1931391 2011205
38081 2011205 2356859 2855411 3090160 3095179 3386141 3986569 4220547 3783108 3188450 2824688
38071 2824688 2435546 1904422 1638774 1747133 1731343 1426623 1327382 1557116 1529775 1140331
38061 1140331 1210233 2092534 2891548 2864652 2632280 3105927 4056650 4673151 4830253 4910155
38051 4910155 4994699 5093545 5608120 6747794 7974020 8739081 9274657 10003046 10727305
38042 10727305 11055511 11062039 10903985 10381346 9493845 8795060 8573570 8367443 7923257 7866269
38032 7866269 8684095 9820154 10597791 11307248 12519716 14059857 15570639 17367144 19761978
38023 19761978 22279728 24588748 27472763 31728715 36865871 42254246 48869387 58295973
38015 58295973 70468022 84074613 98688249 114084312 127045310 131393458 123187936
38008 123187936 105166032 84752195 68010284 56235297 47558541 40169078 33572455
38001 33572455 27886269 23093758 19102677 15955562 13615797 11751336 10050455 8616617
37993 8616617 7681908 7036128 6224967 5291831 4741342 4667833 4540273 4052572 3546272 3292924
37983 3292924 3001443 2434106 1909057 1734692 1687578 1507064 1380113 1483939 1587871 1563642
37973 1563642 1713122 2104446 2204501 1729298 1239677 1279657 1535272 1498975 1332889 1338805
37963 1338805 1205124 633140 162784 457995 1201850 1592655 1548856 1537079 1577673 1352436
37953 1352436 1013423 976750 1136386 1121126 1085855 1410491 1861708 1898765 1577934 1330544
37943 1330544 1121559 699305 384942 648356 1125930 1062428 574090 459823 852518 1084656
37933 1084656 884525 706525 806676 921085 956425 1138747 1405623 1477004 1545390 2022282
37923 2022282 2583339 2413432 1509911 803906 799664 984486 820899 477711 299041 314966
37913 314966 549874 1106504 1699952 1790838 1409365 1198442 1453956 1778930 1847747 1812383
37903 1812383 1749798 1403461 741468 176782 1738 113141 398793 839677 1189189 1168917
37893 1168917 999565 1086537 1235129 958816 511469 662826 1368025 1681719 1233799 780155
37883 780155 918386 1226013 1169121 990582 1105975 1340412 1351332 1213173 1073492 787762
37873 787762 350892 132283 244894 238089 -149115 -485019 -341436 37774 216885 222203
37863 222203 270210 300595 212783 160110 232685 243541 139844 189476 469909 647313 557142
37852 557142 507815 709686 914893 924340 917468 969668 806066 374345 89399 143004 149043
37841 149043 -134285 -323650 -97192 205316 156018 -92695 -184587 -126766 -36820 192804
37831 192804 539501 650973 435188 342620 627813 883995 791572 740315 1132685 1624560
37821 1624560 1706360 1549548 1591474 1707337 1517161 1182074 1172950 1469123 1635166 1526610
37811 1526610 1358234 1233959 1100040 986652 876672 581909 146795 38851 485187
37802 485187 984799 990643 713681 691932 914171 990608 895303 895669 978605 962470 954895 1091382
37790 1091382 1063194 565152 -7630 -29151 350706 433989 142226 152215 772630 1435843
37780 1435843 1550908 1254323 1018723 1001442 1099542 1277665 1499877 1556949 1262623 750894
37770 750894 394923 419834 645232 642049 209003 -326223 -441327 -69511 320742 356415
37760 356415 167072 29904 -46633 -151313 -199335 -129254 -111824 -253718 -307990 14053
37750 14053 608476 1116745 1342770 1324809 1178682 1064990 1114032 1211010 1071053 663599
37740 663599 300302 183829 191703 232200 427812 769610 981926 924485 750024 521781
37730 521781 129828 -273169 -301182 11463 187086 152318 407776 1038809 1341493 921782
37720 921782 410632 466544 757704 649903 298741 272248 572040 801996 904515 1005815
37710 1005815 922196 523201 193890 253152 342888 99905 -52749 404744 1069250 1184589
37700 1184589 857150 776225 1030889 1152412 1088042 1166445 1260937 943767 386990 202655
37690 202655 424133 488008 198521 -80080 -144459 -114163 35204 357809 503526 184371
37680 184371 -93688 382757 1355340 1887132 1728731 1483697 1485274 1447338 1232580 1061147
37670 1061147 920837 614187 382970 645094 1166143 1360210 1299152 1464442 1639425 1174463
37660 1174463 325182 115722 732811 1226468 1023445 598792 384657 164235 -101382
37651 -101382 28842 511639 597759 47680 -400828 -250925 100 -188302 -575140 -751805
37641 -751805 -772971 -733703 -481142 -111883 8198 -8713 359451 1011040 1195394 760814
37631 760814 435435 618790 932235 1183072 1629721 2075795 1965864 1618541 2005481 3121799
37621 3121799 4128657 5183525 7098821 9055225 9506114 10183316 15617936 26198894
37613 26198894 34746838 33761364 24516443 15254293 11262752 10630474 9611970 7842332
37605 7842332 6760053 6245972 5242094 3888333 2999528 2471074 1734313 1004221 842637
37596 842637 1094764 1227346 1187771 1173560 1090895 870968 773524 851356 714961 307484
37586 307484 235730 798270 1358229 1269957 805660 550225 462058 200896 -104967 -103770
37576 -103770 135677 337026 551230 911443 1153148 945278 474836 195560 199516 300594
37566 300594 512180 929019 1296744 1228537 804206 499698 521890 616493 572212 533009
37556 533009 676071 865819 829775 542642 256035 178531 270107 396982 557964 795816
37546 795816 946875 748420 272292 -38145 39372 140845 -173222 -763298 -1109196 -991264
37536 -991264 -606388 -157277 255342 438744 266648 119 17085 244739 302990 179007
37526 179007 236587 517993 616796 410592 354486 753549 1234394 1323967 1162047 1184652
37516 1184652 1359661 1234860 680035 153967 137350 559534 925654 891769 579779 329217
37506 329217 258646 208258 94840 102415 385334 757974 889750 708779 423464 246911
37496 246911 290204 598886 1055406 1346887 1274322 1005601 797572 604235 243200 -177740
37486 -177740 -341895 -175026 96140 299347 449743 573367 662582 754803 829443 740648
37476 740648 482791 331126 430147 489535 269220 89249 343682 744391 690256 263996
37466 263996 145636 515709 778054 549727 247152 373292 770462 951335 766406 402206
37456 402206 36636 -203921 -206042 -46127 -3705 -219866 -528716 -718928 -731930 -555220
37446 -555220 -215183 66476 30613 -236784 -397273 -366116 -357368 -405754 -305682 -115159
37436 -115159 -210316 -641738 -917896 -697363 -266965 -27561 98384 380894 722913 794030
37426 794030 551268 292321 275904 500835 762789 788102 440514 -91411 -433370 -388250
37416 -388250 -1607 683596 1630977 2551032 2991229 2802595 2255990 1654171 1126789 804548
37406 804548 787632 865410 677358 264940 70412 282782 600190 749802 788681 753560
37396 753560 512000 163885 89618 340512 463813 223285 9303 188279 510410 566273
37386 566273 413016 314069 240375 101844 134923 531130 915565 729388 25116 -562649
37376 -562649 -582055 -151578 342141 620186 641222 606620 779090 1134029 1325072 1137627
37366 1137627 769462 498816 337125 223797 270467 508831 640228 384670 -72808 -292310
37356 -292310 -126476 190938 391496 388508 258531 195813 378509 735023 958584 843815
37346 843815 460026 -33814 -498379 -710084 -489316 -38213 185146 46947 -146483 -192837
37336 -192837 -225691 -279033 -118746 269044 510579 438565 376270 533818 628834 466851
37326 466851 375473 608582 813361 626524 361152 488178 791179 717047 349576 347127
37316 347127 964445 1726300 2116230 2118827 1985380 1808409 1468078 872920 227108 23428
37306 23428 545780 1354719 1624286 1113426 421902 140047 197816 260471 269311 296471 322836
37295 322836 440066 801168 1144663 963071 403924 273712 777169 1087096 694727 280055
37285 280055 493266 775328 391336 -139437 154880 1024753 1403087 1152693 1177533 1992080
37275 1992080 3353635 5123916 7208899 8674536 8281831 6187562 3996032 2814631
37267 2814631 2263719 1678488 1193700 1135849 1258704 1192005 1014677 914510 818737 701971
37257 701971 723974 797816 578941 105326 -134578 33374 248796 328114 514164 815478
37247 815478 834682 540996 484953 895152 1259421 1189690 1019579 1103312 1175646 916620
37237 916620 576195 503648 552115 477758 484957 827344 1217403 1158399 627460 18877 -370970
37226 -370970 -479065 -343867 -126957 -38413 -39906 110449 397853 516490 427390 483760
37216 483760 803496 1015281 889118 718063 758438 785416 586542 440915 654070 966782
37206 966782 889289 402482 -54751 -153206 27831 139108 -118775 -628554 -816416 -302614
37196 -302614 456563 657023 268456 56102 382888 680644 382864 -255657 -637738 -592907
37186 -592907 -317008 -18661 62012 -257926 -726642 -828374 -519300 -246394 -92423 368567
37176 368567 1109316 1377896 833529 170292 75675 327679 537873 1013559 2082102 3192519
37166 3192519 3576011 3359686 3203252 3210195 3009362 2599221 2298480 2074411 1670412 1240026
37156 1240026 1170347 1402957 1534803 1455312 1337999 1183492 917426 753993 923245 1213563
37146 1213563 1282585 1221177 1341145 1661082 2088964 2814262 3965654 5130156 5742655
37137 5742655 5718449 5249916 4339686 3076294 1994715 1544471 1513876 1539527 1765371 2343356
37127 2343356 2745516 2394401 1634625 1240538 1249599 1137544 876918 893807 1152068 1208730
37117 1208730 1069876 1099979 1201580 1026032 912197 1591905 2910957 3834135 3855594 3467342
37107 3467342 3083126 2483366 1601752 921992 696377 566468 341260 402815 935542 1447400
37097 1447400 1488961 1245261 1025939 759864 393127 217739 368552 487188 307357 132530
37087 132530 328494 740329 1002002 1071061 1085077 994244 696716 324713 119292 169920
37077 169920 405175 646646 641072 314349 -14362 -3248 186908 162061 10972 201416
37067 201416 768929 1222218 1329176 1364282 1445274 1285571 826440 482580 478209 513005
37057 513005 363260 244065 288715 257969 96031 181569 638596 979351 885930 792164
37047 792164 1149181 1599275 1509250 979759 668948 786292 858976 480214 -164516 -580153
37037 -580153 -500166 -101692 195923 181194 103841 312142 674230 683332 177937 -422152
37027 -422152 -699472 -662221 -448367 -39321 503205 892837 970589 906305 858953 748976
37017 748976 532475 357545 281820 190155 134777 339273 694020 721351 294146 -76124
37007 -76124 23301 322956 378892 250053 253221 382505 418420 370552 386873 390302 193166
36996 193166 -118202 -232263 -20080 307759 439619 279735 73706 182639 613239 907876
36986 907876 739913 423195 445059 698469 724568 566702 689852 1080779 1201987 942678
36976 942678 814210 988449 965849 538045 267033 534037 857751 724815 431142 459432
36966 459432 599615 390888 -12158 -123743 44857 91207 -78881 -223405 -240669 -196524
36956 -196524 -75439 89050 74652 -165710 -282652 -38748 281490 346423 312985 480948
36946 480948 763401 932754 1051217 1209214 1170939 753728 266276 114570 246705 404476
36936 404476 611202 959063 1204770 1041953 555670 45976 -326016 -416321 -33499 611754
36926 611754 818810 228432 -623324 -1020030 -940859 -776623 -611875 -324629 -26404 125716
36916 125716 227539 300684 94249 -329703 -344074 322816 936594 715230 -23988 -409378
36906 -409378 -277488 -89722 49346 415586 917434 1147466 1076393 1003372 951299 758253
36896 758253 594651 736756 998494 1015271 888542 920404 951365 633637 125610 -173516
36886 -173516 -335105 -635226 -843889 -564547 -64160 58414 -121355 4857 544363 1008907
36876 1008907 1158117 1152107 960187 429379 -120068 -187922 37321 -95235 -606302 -830162
36866 -830162 -502555 -121329 -111938 -337954 -550628 -688503 -659102 -415736 -259099 -470140
36856 -470140 -691042 -301510 639195 1447664 1725607 1591448 1161781 503917 -33798 -158672
36846 -158672 -147801 -334014 -368253 161980 709479 426053 -362641 -525123 82738 433944
36836 433944 59627 -288031 -17098 422044 503956 475757 700095 962850 941421 713568
36826 713568 429189 81701 -151838 1875 296643 141400 -441378 -773509 -595130 -391955
36816 -391955 -472416 -543050 -429549 -404362 -542194 -536271 -394672 -524600 -883595 -854196 -233732
36805 -233732 416537 649014 609468 470371 187861 -14617 236445 697112 708700 296570
36795 296570 161614 479869 711132 703352 869592 1108342 778422 29251 -120163 567356
36785 567356 1081379 821501 441703 480095 444744 -36814 -397490 -248809 -165492 -540485
36775 -540485 -772818 -447337 -231428 -681046 -1186039 -1053048 -655731 -538434 -339506 356731
36765 356731 993207 949809 684736 890224 1227529 974115 303130 -103422 -155490 -140604
36755 -140604 16584 397841 581841 339823 231930 687985 1152260 988748 551490 460425
36745 460425 487561 106308 -459688 -662587 -556549 -466090 -309793 -24863 -2986 -332492
36735 -332492 -343536 296357 851792 743601 614161 1180953 1901551 1890428 1382795 1148055
36725 1148055 1167258 1027420 930593 1165123 1250893 755039 281876 501916 895152 655979
36715 655979 148180 194163 564056 474370 26763 -111271 70514 200716 423488 852607
36705 852607 825799 -48325 -825883 -529220 234577 347152 79431 373874 969134 932249
36695 932249 463097 438570 653917 265804 -423556 -386064 249035 457260 184184 231602
36685 231602 528506 261835 -421982 -549084 -46969 283378 376611 841161 1433644 1273799
36675 1273799 506123 126841 255887 183726 -39336 239761 697703 394482 -384861 -452344
36665 -452344 179495 355565 -86670 -147600 306177 294658 -296923 -410171 205283 530154
36655 530154 150682 -148985 -30786 -149855 -686231 -942465 -748870 -722472 -865824 -464999
36645 -464999 407257 861960 825231 1094016 1652499 1610997 948288 609382 746148 588162
36635 588162 160532 338762 1062626 1283329 827836 588262 821046 992075 1207119 1988664
36625 1988664 2887169 3231864 3768231 5313484 6416734 5090998 2416261 1347107 2161098
36616 2161098 2420886 1454912 1208383 2186687 2347627 1008039 226708 1013473 1589901
36607 1589901 871099 378386 1091105 1572391 954403 754120 1904092 2852532 2441049
36598 2441049 1909279 2253624 2332084 1394015 797160 1403840 1889464 1348787 941412 1341280
36588 1341280 1317259 421346 177584 1029117 1186324 110544 -153501 1189141 2037666
36579 2037666 1424734 1454184 3106137 3974696 2612340 1289621 1837329 2601919 2227565
36570 2227565 2441210 4145654 4864959 3267275 2084050 3172380 3942146 2295005 719960
36561 719960 1543512 2525771 1393145 323817 1483699 2569985 1436345 573825 2145709
36552 2145709 3349427 1854506 820691 2978821 5000925 3746139 2566530 4869314
36544 4869314 7213679 5984463 4878920 7862714 10969016 9773478 8461640 11962288
36536 11962288 16083953 16053924 17217830 25088756 32887353 32988918 32071120 38613505 45126422
36527 45126422 42947223 44306926 64035974 89903484 106367210 141400438 240183030
36520 240183030 379148837 456409589 402384034 266295416 154673057 110093462 93962123
36513 93962123 69486671 46513416 41726116 43760222 37161020 28577749 28742495 30709709
36505 30709709 24214790 14811839 12368838 13638920 10750390 6196716 6152189 7832928
36497 7832928 5604133 2215556 3009324 5382486 4051512 1115650 1532534 3624623
36489 3624623 2874787 702763 1176729 2943220 2250905 479263 1242318 3156180 2552288
36480 2552288 566439 779797 2334514 1892005 218464 558509 2345386 2516527 1486318
36471 1486318 2086457 3876035 3939622 2316246 1581320 1921685 1369653 132124 173464
36462 173464 1143583 931369 -298199 -501638 428285 875333 817735 1446571 2234362 1769256
36452 1769256 726507 750998 1266923 630115 -522642 -379020 567249 493274 -218117
36443 -218117 179060 1265833 1228312 432114 756913 1953069 2131758 1419158 1627091
36434 1627091 2585047 2320540 847020 333836 1290952 1824093 1061607 289269 197526
36425 197526 -147234 -988567 -1141466 -233138 580577 697395 867584 1568355 2441279 3437179
36415 3437179 4647045 5135976 3998818 2380130 2229468 3208619 3182410 1707607 549802
36406 549802 598690 775080 390882 224033 673426 963850 779082 800706 1151484 1087873
36396 1087873 587223 472698 711442 401753 -340144 -364878 403894 749570 315983 73098
36386 73098 335443 249591 -361400 -539924 -15291 336579 263197 541754 1198151 1177237
36376 1177237 302062 -240810 70390 316018 -55358 -346943 -128140 20269 -142549
36367 -142549 -18997 432911 412069 -89561 -1303 900995 1414528 878303 139208 -78379
36357 -78379 -205218 -589599 -769759 -638234 -835115 -1361662 -1310895 -567232 -202587 -573137
36347 -573137 -668451 -34718 360902 -13543 -247967 223243 489095 -116821 -713520 -439130
36337 -439130 89616 41068 -208862 -54486 161308 52628 107661 631284 913177 499513
36327 499513 164066 573152 1115246 1103845 992743 1298690 1459512 931315 333911 304709
36317 304709 266327 -407707 -1002018 -579003 364933 697689 379690 129248 41119 -206434
36307 -206434 -359924 -25388 391763 277039 -135385 -281446 -300544 -561473 -722577 -305410
36297 -305410 285765 338077 11358 10928 456498 902486 1087697 940172 316706 -572028
36287 -572028 -1019156 -754736 -404381 -428257 -406922 -54279 19645 -567340 -1044088 -710499
36277 -710499 -178961 -271144 -559874 -272968 155829 -146067 -795719 -699568 109519 582285
36267 582285 345123 -1761 -81156 -37596 197968 816044 1421374 1431069 1031778 819783
36257 819783 742159 350648 -182503 -317981 -169947 -274364 -574678 -615523 -488057 -587871
36247 -587871 -701771 -372782 69896 -82604 -666372 -852997 -471124 -111070 -46222 -31185
36237 -31185 -29358 -178003 -195130 225009 636028 433735 -36552 -8836 357623 310870 -76897
36226 -76897 -90719 194254 5794 -623569 -804621 -360649 -145233 -569631 -1026806 -1045864
36216 -1045864 -876822 -666265 -178541 380901 380252 -87905 -159440 373894 684603 320237
36206 320237 -105772 -66156 106601 83702 142754 377269 307869 -137029 -231499 303957
36196 303957 603192 -46230 -1020844 -1286269 -836047 -415181 -357865 -457293 -555451 -578693
36186 -578693 -337384 144636 445708 358754 285180 565811 864882 719578 289442 39530
36176 39530 31117 29799 21247 150591 374770 539881 582955 416785 -55664 -584881 -653803
36165 -653803 -193726 217317 171969 -29367 -9808 33026 -220706 -565855 -633522 -557390
36155 -557390 -702139 -953610 -846500 -312160 172391 185130 -210394 -623223 -705224 -408466
36145 -408466 -16040 163303 179305 328085 623718 697889 360867 -55547 -122221 169755
36135 169755 504346 628852 476049 105997 -308584 -585739 -707545 -754248 -695482 -470635
36125 -470635 -216496 -118308 -90870 60224 239666 215641 80951 98109 162444 -42671
36115 -42671 -396661 -451569 -206079 -116124 -247257 -115531 426305 823857 644451 173888
36105 173888 -130774 -249752 -340295 -366114 -316771 -365093 -526308 -566032 -446971 -412413 -465282
36094 -465282 -299488 72384 221385 51434 6645 260679 377010 124931 -52054 182819
36084 182819 458601 364291 118258 57982 25094 -203613 -391019 -285573 -118389 -155825
36074 -155825 -238449 -230526 -374536 -693347 -657419 -59025 393865 66361 -587239 -777156
36064 -777156 -627228 -797259 -1277312 -1489555 -1308895 -1072060 -771844 -144765 550562 717392
36054 717392 365174 83942 81211 429 -282605 -435438 -330826 -241124 -239110 -25351 488665
36043 488665 952747 1064518 838536 355239 -285002 -750700 -731759 -436340 -355402 -534378
36033 -534378 -584197 -392951 -250438 -233462 -70640 272588 451049 334106 201005 169611
36023 169611 -33815 -503908 -852417 -766639 -469820 -339648 -403680 -474094 -476184 -374828
36013 -374828 -32453 576532 1162099 1352075 1066907 580017 294112 449905 896207 1163368
36003 1163368 941196 445407 127468 122075 228546 308190 358014 286979 29126 -148830
35993 -148830 112069 670832 955776 718710 317137 115010 8633 -235530 -517813 -565136
35983 -565136 -331390 23070 406507 815532 1154045 1238526 1016891 692365 563555 711693
35973 711693 892182 855186 748966 967807 1525922 1883444 1601766 902211 303432 -38998
35963 -38998 -292901 -483408 -491224 -389535 -372246 -410801 -339619 -204570 -171672 -180133 -66895
35952 -66895 41435 -129799 -498986 -656248 -402397 71653 514214 793076 799783 517361
35942 517361 146252 -127946 -377822 -647059 -652117 -208929 268463 250407 -85316 -118548
35932 -118548 239954 504323 478238 426719 359285 -57148 -699573 -898433 -457711 -43150
35922 -43150 -157570 -394358 -198732 208049 239315 -152465 -550766 -744614 -800802 -705813
35912 -705813 -422738 -142345 -64401 -69639 41202 154290 56869 -103101 34132 479288
35902 479288 810824 669781 130485 -410474 -578226 -312718 73485 211347 100805 66172
35892 66172 245105 366071 153360 -289531 -668265 -862867 -929863 -910590 -802289 -599925
35882 -599925 -278279 127200 400772 332337 59211 -43542 131060 313763 312520 238434
35872 238434 185594 47054 -202118 -376813 -389825 -358267 -279329 7845 379517 397300
35862 397300 -25669 -358405 -173536 238404 310752 -82278 -670577 -1190800 -1393533 -1026264
35852 -1026264 -240085 310710 230832 -45215 86287 472190 513959 187441 90813 511633
35842 511633 1058722 1314020 1331296 1320016 1250929 994992 581302 140604 -222962 -405639
35832 -405639 -333620 -112386 1223 -134261 -384834 -479010 -254137 213127 672922 941831
35822 941831 1086122 1261770 1393835 1236928 796264 407825 277949 227033 53972 -146682
35812 -146682 -250899 -387461 -675480 -943557 -1005818 -967908 -951492 -780944 -311046 169646
35802 169646 272351 68103 -79152 -65422 -18796 116293 503832 1020574 1375810 1547225
35792 1547225 1668895 1594375 1085153 396125 113702 327085 476331 179072 -263685 -407615
35782 -407615 -301494 -290733 -461123 -567149 -381656 60372 478889 553230 244152 -83002
35772 -83002 -39507 295564 487190 325658 26651 -147001 -159538 -67359 67145 56600
35762 56600 -282286 -750087 -821517 -264963 518125 924260 728283 145175 -436589 -656707
35752 -656707 -380742 111942 323326 71994 -340659 -593817 -709161 -783893 -674357 -270466
35742 -270466 114078 23667 -494817 -870903 -711635 -270249 -82727 -308190 -605489 -599886
35732 -599886 -292485 45690 257357 425035 627755 743856 602638 234288 -157828 -416459
35722 -416459 -504431 -424658 -220730 -28193 34943 32554 123191 303995 395927 319652 237142
35711 237142 333503 547290 611574 356050 -62320 -256666 4095 500799 762917 609900
35701 609900 351761 347393 529532 563432 359174 175595 240569 488410 697451 729878
35691 729878 626415 582843 790118 1165364 1327747 1029725 529345 296829 407567 504098
35681 504098 350606 116188 34968 67045 35049 -108802 -280564 -359306 -187771 320625
35671 320625 936445 1169918 782165 133767 -181408 620 304433 345162 147402 -44740
35661 -44740 -173693 -360616 -559806 -518646 -206696 -30569 -345707 -900425 -1119374 -893278
35651 -893278 -673589 -721766 -737477 -464176 -214040 -378481 -724815 -669698 -111176 463706
35641 463706 650485 513403 319839 249949 381378 638471 730597 426648 -90217 -399077
35631 -399077 -363677 -217979 -153515 -109377 9748 158493 220825 85798 -274818 -630534
35621 -630534 -577485 -72208 341075 208493 -160212 -177415 88340 101364 -144081 -85412
35611 -85412 384925 654374 405379 157646 393581 787174 818832 629002 660079 828757
35601 828757 691649 232195 -99884 -63578 134251 259589 323908 411008 516779 590410
35591 590410 562986 379517 127162 -2033 -18837 -209779 -693113 -1100022 -979839 -403906
35581 -403906 100157 151728 -155244 -468576 -548272 -459724 -484712 -757499 -984579 -742112
35571 -742112 -87486 434937 506039 392447 412428 438054 235319 -54384 -164286 -161229
35561 -161229 -242940 -294760 -79590 283423 450608 363437 248657 206367 160101 117372 120076
35550 120076 44326 -178804 -270186 45079 494898 541957 159209 -171550 -233371 -305058
35540 -305058 -517524 -524911 -73921 514864 736061 500756 125841 -40680 181896 718222
35530 718222 1169776 1095690 541669 38675 -84964 -81206 -260285 -450842 -344185 -96737
35520 -96737 -119965 -404597 -545371 -437519 -463947 -838831 -1179363 -1019332 -485710 -128053
35510 -128053 -187876 -355898 -262235 56396 275914 201164 -58547 -245872 -196237 29473
35500 29473 200995 160494 34618 115345 488813 900806 1064850 969139 763168 494586
35490 494586 160963 -81439 -21774 292451 560739 574655 386869 139813 -78100 -196959
35480 -196959 -197320 -208159 -368287 -566212 -549915 -334870 -234801 -393595 -555603 -447325
35470 -447325 -145008 114794 273117 384649 386889 172627 -183402 -449905 -455089 -189910
35460 -189910 217537 554368 658882 585331 541078 622200 723899 712591 533381 173824
35450 173824 -270795 -535096 -459430 -300354 -438675 -798704 -960605 -856607 -854745 -1058635
35440 -1058635 -1094453 -812531 -626182 -826848 -1106406 -1150464 -1167070 -1357183 -1396570 -1021627
35430 -1021627 -633914 -640919 -631710 -4734 905668 1210203 811702 489837 667200 947014
35420 947014 963855 870380 781636 489232 4042 -278900 -251660 -319956 -656930 -836355
35410 -836355 -575924 -268213 -315387 -436777 -175646 280987 366454 8445 -290664 -179740
35400 -179740 145533 268932 -8460 -547856 -997855 -1077129 -851755 -639698 -574064 -459874
35390 -459874 -170945 83274 107544 99212 369927 822837 1029266 809756 469087 379358
35380 379358 503565 463111 39399 -510324 -732336 -533384 -274895 -242618 -267098 -95202
35370 -95202 88370 -105595 -609703 -897932 -677355 -199219 193519 450776 620870 635278
35360 635278 487228 344829 296069 213631 20229 -162466 -271696 -423745 -589245 -449335
35350 -449335 139582 760522 851813 412942 -1461 26128 348807 582650 650842 803614
35340 803614 1129133 1288285 943109 318569 -17321 52598 75156 -122332 -6427 793465
35330 793465 1662622 1698590 929289 124191 -379961 -833583 -1165830 -892689 -86135 479824
35320 479824 459437 377117 575296 589881 119879 -201972 230203 887250 812351 31945
35310 31945 -581470 -607196 -419273 -333537 -191964 114681 340904 307766 213793 329343
35300 329343 618182 780822 565549 45122 -364089 -294104 117238 398158 413539 484729
35290 484729 726212 761072 365544 -105022 -299286 -383122 -534655 -452869 47940 424773
35280 424773 98029 -582503 -806023 -488414 -231424 -267239 -241297 602 176936 166201
35270 166201 137911 23610 -450160 -1084455 -1249748 -805056 -349515 -317916 -419359 -277396
35260 -277396 -76116 -163436 -424797 -489091 -316330 -210452 -360816 -617243 -674687 -391446
35250 -391446 9518 97586 -252915 -612591 -508924 -59570 250971 308027 430340 740214
35240 740214 973794 984589 958521 1005592 984089 891177 1013067 1485976 2050807 2419162
35230 2419162 2571791 2562714 2368507 2085551 1949179 1989301 1951080 1685350 1335361 1048397
35220 1048397 816348 675504 711510 785554 634657 322473 166215 132196 -178607 -766111
35210 -766111 -1013817 -557248 124050 376452 208779 26377 -81992 -265857 -391910 -174363
35200 -174363 263656 452752 218647 -113891 -197186 -40434 139761 208159 170403 95536
35190 95536 50611 51905 62185 43831 -25375 -169322 -349092 -407337 -225643 61912 163625
35179 163625 -55483 -471760 -845608 -913188 -486133 268436 780337 651740 177924 -69735
35169 -69735 -27124 -23500 -42053 244140 723281 895734 812130 1155159 2067624 2692829 2392219
35158 2392219 1722599 1547516 1739557 1530749 784902 136345 22013 253423 496826
35149 496826 620451 582337 425909 360932 490603 559073 313036 -53663 -202446 -210725
35139 -210725 -388397 -687898 -774939 -600330 -442119 -423359 -412649 -375519 -422642 -512675 -463700
35128 -463700 -262031 -67748 42103 75868 -10702 -174007 -164148 138370 450136 488404
35118 488404 430292 583784 846576 949109 983234 1146115 1191168 776440 197807 61843
35108 61843 295537 236407 -256041 -560844 -330726 -7444 -8798 -85962 109478 386509
35098 386509 395432 217045 138603 164964 124222 -5387 -168751 -368025 -485708 -286792
35088 -286792 151672 346103 30955 -431016 -563126 -400256 -273662 -252792 -188147 -119006
35078 -119006 -240293 -519592 -642101 -349083 297715 934631 1142687 834431 412112 312766
35068 312766 413454 232676 -285551 -683477 -778495 -930973 -1249188 -1169410 -334917 633053
35058 633053 889819 536375 357030 623191 860761 714722 367434 64517 -178803 -307596
35048 -307596 -191390 20244 -27558 -342820 -545617 -489740 -461677 -599707 -601816 -288748
35038 -288748 -32099 -245491 -742952 -995687 -849433 -617280 -546844 -535012 -387322 -106130
35028 -106130 151813 259001 197643 38393 -110232 -150964 -28847 228731 454928 401545
35018 401545 -11986 -527567 -765807 -615715 -284875 -4694 124277 29861 -300150 -610554
35008 -610554 -500666 55968 535545 442834 -79899 -460564 -415025 -208102 -228782 -533033
34998 -533033 -841941 -834289 -409008 220204 668998 716419 496747 287410 177328 90534
34988 90534 59011 208358 428113 337757 -222651 -843648 -944770 -470079 53068 166968
34978 166968 -42817 -228562 -304404 -443356 -656608 -698290 -471813 -264015 -371498 -668493
34968 -668493 -814082 -796895 -939766 -1327026 -1579271 -1390056 -1008628 -896069 -1077611 -1181011
34958 -1181011 -1039529 -874723 -835863 -730653 -386623 16099 218878 281780 425174 604869
34948 604869 556329 238237 -55624 -90362 29537 79289 45965 106155 363396 728521
34938 728521 1022969 1119727 1013126 823365 718611 762089 819692 675502 292873 -61642
34928 -61642 -45177 362559 769665 785711 462781 170445 78214 4269 -180562 -293248
34918 -293248 -165907 8714 -67274 -340139 -487829 -381055 -195843 -121947 -213565 -470770
34908 -470770 -795170 -922970 -718701 -499844 -700130 -1189416 -1340678 -892752 -346883 -294089
34898 -294089 -686459 -1034259 -1047926 -796310 -438761 -102237 88068 90635 -8126 -151076
34888 -151076 -363645 -547437 -453493 -36047 388588 530200 453769 333165 148281 -110748
34878 -110748 -209921 3427 231990 58987 -459586 -860302 -842929 -488368 -16038 375969
34868 375969 523606 442968 386317 510369 623157 504278 265823 84548 -165248 -584981
34858 -584981 -799698 -378673 432501 977969 1106509 1198791 1315818 1056032 413582 44413
34848 44413 321617 726659 625573 168703 -84660 -72150 -202868 -615872 -978910 -997025
34838 -997025 -743583 -470574 -355619 -434188 -568011 -491889 -77623 447585 690973 511965
34828 511965 154245 -41196 11737 94543 -28917 -307308 -463434 -367659 -183160 -52990
34818 -52990 129483 442430 671965 632073 529007 614483 664364 288253 -364877 -759365
34808 -759365 -775799 -764729 -791935 -503047 117935 530836 449739 267442 355593 512061
34798 512061 463469 365715 388208 314338 14163 -161997 49258 312304 264021 158803
34788 158803 360370 587094 326913 -286438 -685527 -747036 -786290 -815137 -492300 192307
34778 192307 784346 982069 918692 797177 654203 497487 327808 69679 -211658 -176250
34768 -176250 344535 960228 1189625 1093942 984544 785461 298311 -127473 71669 740646
34758 740646 1128001 951472 646925 512648 337554 28390 -103615 55126 124534 -190406
34748 -190406 -711522 -1164042 -1440256 -1351418 -707235 148180 473212 68810 -462472 -626352
34738 -626352 -592443 -565027 -301929 276593 626936 314644 -268803 -496469 -402362 -408660
34728 -408660 -528934 -477523 -315406 -365829 -636215 -859375 -974628 -1078539 -1050800 -737745
34718 -737745 -385019 -374621 -612959 -675818 -492582 -370129 -359545 -139133 391655 884225
34708 884225 1047368 982326 869615 688020 420958 231160 227184 281210 251293 198602 225080
34697 225080 245855 87787 -253140 -558533 -574626 -243556 208070 442006 332094 64497
34687 64497 -133606 -238465 -302381 -260512 -73045 77010 -2054 -164045 -73303 295016
34677 295016 553867 361441 -194836 -706844 -804900 -428022 105894 323791 57466 -348519
34667 -348519 -450359 -251421 -104943 -136201 -88992 197357 480687 455691 166305 -132346
34657 -132346 -367121 -663079 -1023823 -1225021 -1090013 -741404 -479025 -448225 -517550 -491428
34647 -491428 -346434 -182718 -23853 186620 408944 502222 439250 369771 405819 490451
34637 490451 537181 527563 405284 94643 -261243 -331110 -48199 213867 157910 8288
34627 8288 116001 338581 243699 -181743 -502232 -520657 -521868 -707239 -826074 -621383 -312720
34616 -312720 -314975 -660061 -993270 -1053687 -904958 -723592 -590597 -540732 -642713 -894831
34606 -894831 -1081398 -872143 -172029 652300 1030448 739435 109570 -366960 -494540 -360485
34596 -360485 -73729 260094 447155 379665 253690 342931 579608 642180 460253 316520
34586 316520 379356 448043 301748 31581 -149183 -197139 -153074 24844 312775 465846
34576 465846 268569 -136492 -394082 -369213 -239454 -184139 -187355 -179026 -190264 -270590 -347415
34565 -347415 -276402 -21618 279182 456186 483841 463703 441460 345661 165600 59675
34555 59675 128118 165958 -122161 -659342 -1001316 -891381 -583202 -465448 -564943 -626676
34545 -626676 -533033 -378482 -192145 122840 513242 678127 408527 -87845 -360929 -194813
34535 -194813 200556 467399 453669 252255 13885 -148108 -128947 99068 341811 281763
34525 281763 -150610 -617074 -726963 -470991 -154227 19838 109275 226605 384622 551926
34515 551926 667214 586290 221675 -228157 -405547 -229098 -10433 -44872 -265862 -404867
34505 -404867 -315488 -29376 327002 543045 437633 120289 -30635 180452 504898 624486
34495 624486 600014 696157 920037 1053369 1064754 1151219 1358932 1472416 1356824 1156189
34485 1156189 1048949 1009163 917039 749137 571852 475148 552589 787526 930868 707600
34475 707600 226864 -39007 171756 549759 601412 233508 -249824 -600364 -829241 -1006963
34465 -1006963 -1094716 -1016877 -771513 -449603 -212969 -191950 -301104 -246344 125572 555076
34455 555076 638059 329161 -22738 -124736 -7553 170112 344565 491638 549068 507548
34445 507548 438573 357068 203929 16332 -77685 -107869 -269410 -544752 -561289 -54305
34435 -54305 700503 1160176 1101096 717127 271464 -83287 -236098 -163001 -19343 47023
34425 47023 127948 367945 632407 671694 569977 668692 1007691 1204541 998429 589427
34415 589427 292437 147521 42353 -46677 -127358 -273902 -448562 -456203 -259273 -117815
34405 -117815 -218764 -391001 -415028 -389456 -509862 -676451 -653022 -498689 -501112 -713552
34395 -713552 -860386 -731815 -443198 -255002 -283513 -404568 -352909 26900 540185 771628
34385 771628 577335 293313 290244 503687 637533 654974 753919 961838 1090623 1061428
34375 1061428 971376 846633 615047 332974 170640 151933 154336 170613 306798 500561
34365 500561 516211 281836 -4979 -166763 -225822 -249877 -234843 -192359 -158014 -84654 73276
34354 73276 173082 30969 -223433 -218681 152277 546536 598381 331677 55127 16709 218863
34343 218863 415368 280643 -232481 -726955 -781304 -491268 -304901 -370266 -433797 -393190
34333 -393190 -477706 -741265 -851039 -643152 -476329 -684783 -999479 -903354 -349442 242740
34323 242740 556896 606808 509567 366376 315624 410505 457603 221617 -207820 -462884
34313 -462884 -339369 -45703 18725 -340518 -923984 -1300026 -1196104 -737292 -230164 214243
34303 214243 649522 960899 903101 522423 178445 17233 -193246 -505961 -508794 45769
34293 45769 691628 806794 484485 336375 554576 704482 463674 76160 -64623 84695
34283 84695 293051 346599 118958 -401973 -984028 -1225510 -940043 -384341 14044 99502
34273 99502 81527 231194 558841 809073 759343 476289 220943 149954 233915 432147
34263 432147 742280 1050816 1168412 1087971 967671 784193 328712 -292199 -533173 -103167
34253 -103167 533275 744672 573693 533864 753513 863284 688762 506421 514572 530115
34243 530115 397028 303436 451959 699971 763656 578562 267521 -65940 -325879 -367897
34233 -367897 -162144 79848 118928 -20967 -118199 -76785 -44631 -184375 -431380 -565658
34223 -565658 -494116 -346416 -243183 -108912 125423 259767 61869 -262377 -225665 197238
34213 197238 394588 -51897 -734882 -994992 -813829 -657461 -652029 -490788 -107710 132973
34203 132973 30003 -147134 -122232 -2992 -3527 -82505 -77238 24763 147810 302197 531314
34192 531314 788732 975741 1030242 946850 791255 670039 581829 379017 28935 -212787
34182 -212787 -125510 94597 77326 -175847 -334105 -288744 -276525 -413720 -489355 -334880
34172 -334880 -70510 151647 368268 638208 902577 1123142 1335065 1481636 1424885 1173979
34162 1173979 858163 451044 -171242 -849551 -1170368 -994004 -642223 -440780 -385916 -379431
34152 -379431 -439519 -493266 -292319 218371 693009 765708 445956 -11979 -400089 -568390
34142 -568390 -401227 25602 446175 679498 709799 471876 -102499 -730403 -872181 -392177
34132 -392177 207632 416277 238995 -98365 -554148 -1065102 -1304056 -1044060 -531769 -167783
34122 -167783 -36387 -33344 -174115 -432755 -547821 -373352 -186488 -254642 -340070 -93735
34112 -93735 253615 128302 -511577 -1031891 -911639 -303303 253473 375702 64016 -335331
34102 -335331 -367519 86915 591824 593908 58522 -550657 -870447 -943293 -942362 -902559 -824814
34091 -824814 -822116 -996039 -1236614 -1258943 -892830 -345477 -74557 -258970 -492262 -267908
34081 -267908 280801 502679 130098 -391496 -620685 -661829 -702443 -518643 91141 760613
$$ [...]
##END NTUPLES=NMR SPECTRUM
##END=
