##TITLE=31Pdec_DMP2312
 aceton-d6, 64 sc
 23.12.2024
##JCAMPDX= 6.0         $$ Bruker NMR JCAMP-DX V2.0
##DATA TYPE= NMR SPECTRUM
##DATA CLASS= NTUPLES
##ORIGIN= UXNMR, Bruker Analytische Messtechnik GmbH
##OWNER= root
$$ XWIN-NMR		Version 3.5
$$ Mon Dec 23 14:36:07 2024 Russian Standard Time (UT+4h)  she@DPX200
##.OBSERVE FREQUENCY= 81.013821
##.OBSERVE NUCLEUS= ^31P
##.ACQUISITION MODE= SIMULTANEOUS
##.ACQUISITION SCHEME= undefined
##.AVERAGES= 24
##.DIGITISER RES= 17
##SPECTROMETER/DATA SYSTEM= spect
##.PULSE SEQUENCE= zgpg30
##.SOLVENT NAME= CDCl3
##.SHIFT REFERENCE= (INTERNAL, CDCl3, 0, 198.062)
##AUDIT TRAIL= $$ (NUMBER, WHEN, WHO, WHERE, WHAT)
$$ ##TITLE= Audit trail, XWIN-NMR		Version 3.5
$$ ##JCAMPDX= 5.01
$$ ##ORIGIN= Bruker BioSpin GmbH
$$ ##OWNER= she
$$ F:/spectra/data/she/nmr/P31/2/pdata/1/auditp.txt
$$ ##AUDIT TRAIL=  $$ (NUMBER, WHEN, WHO, WHERE, WHAT)
(   1,<2024-12-23 14:34:45.43 +0400>,<she>,<DPX200>,
      <created by zg, POWCHK disabled, PULCHK disabled
       configuration hash MD5:
       00 E9 B6 7A A2 85 ED C7 34 08 36 98 17 FE 4E 26
       data hash MD5: 32K
       3A 1B DD FB 35 5E 3A 83 46 20 5C 8D C7 4E 75 A6>)
(   2,<2024-12-23 14:34:47.79 +0400>,<she>,<DPX200>,
      <Start of raw data processing
       efp BC_mod = 2 LB = 1.5 FT_mod = 6 PKNL = 1 PHC0 = 2028.453 PHC1 = 364.686 SI = 64K 
       data hash MD5: 64K
       03 09 F8 2F 80 BB 5C 64 70 78 A2 87 44 06 50 34>)
(   3,<2024-12-23 14:35:00.70 +0400>,<she>,<DPX200>,
      <abs ABSG = 5 
       data hash MD5: 64K
       95 10 2B 39 F3 C9 F9 01 EE CC 27 A0 EB BA B3 4E>)
(   4,<2024-12-23 14:35:30.98 +0400>,<she>,<DPX200>,
      <pk PHC0 = -50.40732 PHC1 = 0 
       data hash MD5: 64K
       72 0F 68 A5 E3 03 12 3E 55 A5 12 E8 7F 75 5E D3>)
(   5,<2024-12-23 14:35:34.73 +0400>,<she>,<DPX200>,
      <abs ABSG = 5 
       data hash MD5: 64K
       7C 30 42 7B FB 4B 96 AF 91 AA 30 2E 24 86 78 56>)
$$ ##END=
$$ 
$$ hash MD5
$$ 51 22 7B C8 8E 37 65 10 F5 A9 D7 E5 7F E5 FD B8
##$RELAX= 
##$RELAX= 
##$RELAX= 
##$RELAX= 
##$RELAX= 
##$RELAX= 
##$RELAX= 
##$RELAX= 
$$ Bruker specific parameters
$$ --------------------------
##$DU= <F:/spectra>
##$EXPNO= 2
##$NAME= <P31>
##$PROCNO= 1
##$TYPE= <nmr>
##$USER= <she>
##$AMP= (0..31)
100 100 100 100 100 100 100 100 100 100 100 100 100 100 100 100 100 100 
100 100 100 100 100 100 100 100 100 100 100 100 100 100 
##$AQSEQ= 0
##$AQ_mod= 1
##$AUNM= <au_zg>
##$AUTOPOS= <>
##$BF1= 81.014009
##$BF2= 200.13
##$BF3= 200.13
##$BF4= 200.13
##$BF5= 200.13
##$BF6= 200.13
##$BF7= 200.13
##$BF8= 200.13
##$BYTORDA= 1
##$CFDGTYP= 0
##$CFRGTYP= 5
##$CHEMSTR= <none>
##$CNST= (0..31)
1 1 145 1 1 1 1 1 1 1 1 1 1 1 1 1 1 1 1 1 1 1 1 1 1 1 1 1 1 1 1 1 
##$CPDPRG= <waltz16>
##$CPDPRG1= <>
##$CPDPRG2= <waltz16>
##$CPDPRG3= <>
##$CPDPRG4= <mlev>
##$CPDPRG5= <mlev>
##$CPDPRG6= <mlev>
##$CPDPRG7= <mlev>
##$CPDPRG8= <mlev>
##$CPDPRGB= <>
##$CPDPRGT= <>
##$D= (0..31)
0 1 0 0 0 0 0 0 0 0.06 0 0.03 2e-05 3e-06 0 0 0.0002 0 0 0 0 0 0 0 0 0 
0 0 0 0 0 0 
$$ [...]
##$SUBNAM3= <"">
##$SUBNAM4= <"">
##$SUBNAM5= <"">
##$SUBNAM6= <"">
##$SUBNAM7= <"">
##$SUBNAM8= <"">
##$SUBNAM9= <"">
##$SW= 400.765351723535
##$SWIBOX= (0..15)
0 1 3 0 0 0 0 0 0 0 0 0 0 0 0 0 
##$SW_h= 32467.5324675325
##$TD= 32768
##$TD0= 1
##$TE= 0
##$TE2= 300
##$TE3= 300
##$TEG= 300
##$TL= (0..7)
0 120 53 12 22 120 120 120 
##$TP= (0..7)
150 150 150 150 150 150 150 150 
##$TP07= 0
##$TPNAME0= <>
##$TPNAME1= <>
##$TPNAME2= <>
##$TPNAME3= <>
##$TPNAME4= <>
##$TPNAME5= <>
##$TPNAME6= <>
##$TPNAME7= <>
##$TPOAL= (0..7)
0.5 0.5 0.5 0.5 0.5 0.5 0.5 0.5 
##$TPOFFS= (0..7)
0 0 0 0 0 0 0 0 
##$TUNHIN= 0
##$TUNHOUT= 0
##$TUNXOUT= 0
##$USERA1= <user>
##$USERA2= <user>
##$USERA3= <user>
##$USERA4= <user>
##$USERA5= <user>
##$V9= 5
##$VALIST= <valist>
##$VCLIST= <CCCCCCCCCCCCCCC>
##$VD= 0
##$VDLIST= <DDDDDDDDDDDDDDD>
##$VPLIST= <PPPPPPPPPPPPPPP>
##$VTLIST= <TTTTTTTTTTTTTTT>
##$WBST= 1024
##$WBSW= 4
##$XGAIN= (0..3)
0 0 0 0 
##$XL= 0
##$YL= 0
##$YMAX_a= 339385
##$YMIN_a= -336248
##$ZGOPTNS= <>
##$ZL1= 120
##$ZL2= 120
##$ZL3= 120
##$ZL4= 120
##$ABSF1= 198.0616
##$ABSF2= -202.7028
##$ABSG= 5
##$ABSL= 3
##$ALPHA= 0
##$AQORDER= 0
##$ASSFAC= 0
##$ASSFACI= 0
##$ASSFACX= 0
##$ASSWID= 0
##$AUNMP= <proc_1d>
##$AZFE= 0.1
##$AZFW= 0.5
##$BCFW= 0
##$BC_mod= 2
##$BYTORDP= 0
##$COROFFS= 0
##$CY= -3
##$DATMOD= 1
##$DC= 0
##$DFILT= <>
##$DTYPP= 0
##$F1P= 0
##$F2P= 0
##$FCOR= 1
##$FTSIZE= 65536
##$FT_mod= 6
##$GAMMA= 0
##$GB= 0
##$INTBC= 1
##$INTSCL= 9.790993e-09
##$ISEN= 30
##$LB= 1.5
##$LEV0= 0
##$LPBIN= 0
##$MAXI= 10000
##$MC2= 0
##$MEAN= 0
##$ME_mod= 0
##$MI= 50
##$NCOEF= 0
##$NC_proc= 0
##$NLEV= 6
##$NOISF1= 182.463
##$NOISF2= 159.3651
##$NSP= 0
##$NTH_PI= 0
##$NZP= 0
##$OFFSET= 198.0616
##$PC= 4
##$PHC0= 1978.046
##$PHC1= 364.686
##$PH_mod= 1
##$PKNL= yes
##$PPARMOD= 0
##$PSCAL= 0
##$PSIGN= 0
##$REVERSE= no
##$SF= 81.0140089999434
##$SI= 65536
##$SIGF1= 159.3651
##$SIGF2= -187.1042
##$SINO= 113.3802
##$SIOLD= 16384
##$SREGLST= <1H.CDCl3>
##$SSB= 0
##$STSI= 65536
##$STSR= 0
##$SW_p= 32467.5324675325
##$SYMM= 0
##$S_DEV= 0
##$TDeff= 32768
##$TDoff= 0
##$TI= <>
##$TILT= no
##$TM1= 0
##$TM2= 0
##$TOPLEV= 0
##$USERP1= <user>
##$USERP2= <user>
##$USERP3= <user>
##$USERP4= <user>
##$USERP5= <user>
##$WDW= 1
##$XDIM= 65536
##$YMAX_p= 393354581
##$YMIN_p= -1896402
$$ End of Bruker specific parameters
$$ ---------------------------------
##NTUPLES= NMR SPECTRUM
##VAR_NAME=  FREQUENCY,     SPECTRUM/REAL,   SPECTRUM/IMAG
##SYMBOL=    X,             R,               I
##VAR_TYPE=  INDEPENDENT,   DEPENDENT,       DEPENDENT
##VAR_FORM=  AFFN,          ASDF,            ASDF
##VAR_DIM=   65536,         65536,           65536
##UNITS=     HZ,            ARBITRARY UNITS, ARBITRARY UNITS
##FACTOR=    0.49542278885378, 1,            1
##FIRST=     16045.7642231865, 0,            0
##LAST=      -16421.768244346, 0,            0
##MIN=       -16421.768244346, -1896402,     0
##MAX=       16045.7642231865, 393354581,    0
$$ Real data points
##PAGE= N=1
##DATA TABLE= (X++(R..R)), XYDATA
$$ [...]
$$ plain form
38911 -149163 -141321 -128661 -109220 -92938 -91517 -101513 -106867 -98302 -83116 -74079 -74134 -76018 -74487 -73408
38897 -73408 -78420 -86165 -86674 -76637 -64159 -57557 -55409 -52494 -49780 -51111 -53923 -52013 -45752 -40892
38883 -40892 -37850 -31339 -21603 -16659 -20122 -24899 -23759 -19815 -20863 -27706 -33750 -34067 -30286 -27304 -28058
38868 -28058 -31203 -32793 -30816 -27830 -27454 -29392 -30990 -32356 -35109 -36502 -30933 -19055 -9684 -9481 -15001
38853 -15001 -18245 -16378 -12469 -10017 -10727 -15132 -21113 -23182 -17319 -6290 2858 6331 6037 4870 2717
38838 2717 -1724 -7363 -10896 -10230 -6452 -2233 946 3466 6126 8995 11451 12185 9305 2301 -5491
38823 -5491 -8226 -2931 7375 16839 22015 23552 24532 28053 34441 39502 37795 29206 19933 14933 12076
38808 12076 6603 -1354 -7942 -12652 -19163 -28708 -36889 -38911 -35131 -29244 -23160 -16756 -12145 -14204
$$ packed form
38911a49163P842J2660J9441J6282J421r996n354Q565J5186R037n5j884J531J079
38897g3408n012p745n09J0037J2478O602K148K915K714j331k812J910O261M860
38883d0892L042O511R736M944l463m777J140L944j048o843o044l17L781K982p54
38868b8058l145j590J977K986L76j938j598j366k753j393N569J1878R371K03n520
38853a5001l244J867L909K452p10m405n981k069N863J1029R148L473k94j167k153
38838B717m441n639l533O66L778M219L179K520K660K869K456P34k880p004p792
38823e491k735N295J0306R464N176J537R80L521O388N061j707q589r273n000k857
38808A2076n473p957o588m710o511r545q181k022L780N887O084O404M611k059
$$ plain form
38794 -14204 -24092 -34521 -36287 -30048 -26170 -30227 -34775 -31275 -24508 -25734 -34604 -39326 -34954 -29503
38780 -29503 -28828 -27449 -20374 -13191 -12050 -12352 -6700 2719 8950 11609 14369 16661 17276 20770 29929
38765 29929 36988 34055 28289 33587 48993 58940 55696 48692 48796 54671 58905 58080 51938 40250
38751 40250 25337 12225 2942 -4966 -13047 -20253 -27039 -35022 -41862 -42553 -36327 -26802 -16338 -7030
38737 -7030 -5067 -14773 -29048 -35807 -33908 -32071 -32217 -27247 -17555 -14799 -22911 -28927 -21865 -9524
38723 -9524 -5946 -11180 -14873 -13232 -10929 -10419 -10168 -11003 -14802 -18340 -16662 -11554 -9325 -10813 -10157 -3420
38707 -3420 6928 16100 21213 21857 19956 18425 17672 15240 10612 6696 4035 -1470 -10857 -17173 -14351
38692 -14351 -7312 -6450 -14022 -22389 -24584 -20797 -14969 -10478 -9435 -11665 -13862 -13096 -10868 -10553 -11692
$$ packed form
38794a4204r888j0429j766O239L878m057m548L500O767j226q870m722M372N451
38780b9503O75J379P075P183J141l02N652R419O231K659K760K292O15L494R159
38765B9929P059k933n766N298J5406R947l244p004J04N875M234q25o142j1688
38751D0250j4913j3112r283p908q081p206o786p983o840o91O226R525J0464R308
38737g030J963r706j4275o759J899J837j46M970R692K756q112o016P062J2341
38723i524L578n234l693J641K303N10K51q35l799l538J678N108K229j488O56O737
38707c420J0348R172N113O44j901j531p53k432m628l916k661n505r387o316K822
38692a4351P039Q62p572q367k195L787N828M491J043k230k197P66K228L15j139
$$ plain form
38677 -11692 -10488 -5626 66 3966 6537 9409 12959 16342 18225 17052 11848 3648 -3748 -5075
38663 -5075 2274 13852 20312 17499 12621 15672 26241 35172 39199 46014 62370 84274 102763
38650 102763 113062 113595 102236 80229 56161 39606 32108 28121 22583 14286 4453 -4521 -11078
38637 -11078 -17305 -26419 -35866 -38029 -30736 -21702 -18714 -20957 -24367 -29156 -35728 -38739 -33259 -23467
38623 -23467 -17590 -16685 -15710 -13482 -13633 -16264 -16282 -11264 -5250 -3238 -5827 -9995 -12121 -10339 -6679 -5852
38607 -5852 -9045 -10779 -5675 3261 7486 3440 -3766 -7271 -6036 -4856 -8191 -14271 -16188 -10842 -5152
38592 -5152 -8151 -17073 -18748 -7335 6995 11920 8570 6633 9329 11012 6937 -1208 -8088 -8576
38578 -8576 -1312 8123 11377 7923 6131 9894 11517 4392 -4755 -5537 -132 591 -6287 -13519 -16433
$$ packed form
38677a1692J204M862N692L900K571K872L550L383J883j173n204q200p396j327
38663e075P349J1578O460k813m878L051J0569Q931M027O815J6356K1904J8489
38650A02763J0299N33j1359k2007k4068j6555p498l987n538q297r833q974o557
38637a1078o227r114r447k163P293R034K988k243l410m789o572l011N480R792
38623b3467N877R05R75K228j51k631j8N018O014K012k589m168k126J782L660Q27
38607e852l193j734N104Q936M225m046p206l505J235J180l335o080j917N346N690
38592e152k999q922j675J1413J4330M925l350j937K696J683m075q145o880m88
38578h576P264R435L254l454j792L763J623p125r147p82N405P23o878p232k914
$$ plain form
38563 -16433 -18024 -21332 -24894 -26372 -24650 -18842 -10220 -3102 748 4645 8813 5679 -9188 -27961
38549 -27961 -41625 -53634 -71145 -89064 -97381 -100549 -113550 -139368 -166076 -187857 -214102 -254378
38537 -254378 -307348 -367675 -431803 -494476 -552016 -610010 -672170 -719454 -720540 -672865 -615770 -588922
38525 -588922 -590472 -590544 -574132 -552249 -536863 -524405 -506197 -481546 -455634 -431941 -410229 -388270
38513 -388270 -364354 -339557 -315809 -290958 -261116 -230378 -210778 -206744 -206200 -194910 -174608 -158460
38501 -158460 -152456 -150655 -146861 -141456 -136219 -130405 -123708 -117288 -110351 -100532 -88618 -78548 -71717 -65171
38487 -65171 -56562 -47576 -41428 -39622 -42020 -47695 -54695 -60456 -63123 -61920 -56863 -49331 -42274 -38279
38473 -38279 -37220 -36298 -32568 -25944 -20277 -19985 -24052 -25449 -19756 -12526 -13249 -22737 -32173 -35051 -33750
$$ packed form
38563a6433j591l308l562j478J722N808Q622P118L850L897M168l134j4867j8773
38549b7961j3664j2009j7511j7919q317l168j3001k5818k6708k1781k6245m0276
38537b54378n2970o0327o4128o2673n7540n7994o2160m7284j086M7675N7095K6848
38525e88922j550p2J6412K1883J5386J2458J8208K4651K5912K3693K1712K1959
38513c88270K3916K4797K3748K4851K9842L0738J9600M034N44J1290K0302J6148
38501a58460O004J801L794N405N237N814O697O420O937R819J1914J0070O831O546
38487f5171Q609Q986O148J806k398n675p000n761k667J203N057P532P057L995
38473c8279J059R22L730O624N667K92m067j397N693P230p23r488r436k878J301
$$ plain form
38458 -33750 -32381 -29682 -23089 -15018 -10239 -9847 -11693 -14315 -17052 -18493 -18411 -19816 -25930 -35473 -42862
38443 -42862 -43179 -36734 -29186 -25959 -25316 -19737 -7307 2186 -1225 -12792 -18156 -12586 -5489 -4473
38429 -4473 -5360 -2289 1789 1256 -2682 -5460 -6766 -8623 -10679 -12929 -18359 -27204 -33335 -32137 -27526
38414 -27526 -25495 -25382 -23798 -22398 -24544 -28001 -28297 -26096 -24155 -20363 -12020 -4490 -6399 -16583 -24119
38399 -24119 -22040 -13725 -4871 3225 9902 11469 5823 -2873 -7907 -6946 -3333 -1851 -4335 -8492 -10300
38384 -10300 -7861 -2646 2951 7694 10809 11734 11817 13627 16974 18213 15363 11182 9180 9383 10209 11561
38368 11561 13684 15857 18686 24704 33890 41246 41268 32886 18982 4444 -4774 -5902 -4508 -9615
38354 -9615 -21038 -27709 -22213 -10617 -3472 -3511 -7435 -13071 -17815 -16184 -7143 657 -810 -7359 -9457
$$ packed form
38458c3750J369K699O593Q071M779L92j846k622k737j441Q2j405o114r543p389
38443d2862l17O445P548L227O43N579J2430R493l411j1567n364N570P097J016
38429d473q87L071M078n33l938k778j306j857k056k250n430q845o131J198M611
38414b7526K031J13J584J400k146l457k96K201J941L792Q343P530j909j0184p536
38399b4119K079Q315Q854Q096O677J567n646q696n034R61L613J482k484m157j808
38384a0300K439N215N597M743L115R25Q3J810L347J239k850m181k002K03Q26J352
38368A1561K123K173K829O018R186P356K2q382j3904j4538r218j128J394n107
38354i615j1423o671N496J1596P145l9l924n636m744J631R041P800j467o549k098
$$ plain form
38339 -9457 -6760 -6368 -9408 -9779 -5827 -3335 -5397 -7755 -6695 -4735 -5679 -9297 -13558 -17962 -22165
38324 -22165 -24176 -21853 -15040 -6183 277 1018 -1709 -985 6769 16859 21706 18626 10300 1375 -2789
38309 -2789 1705 13007 25140 35827 46867 54811 50455 32948 15058 6469 646 -12013 -26522
38296 -26522 -31328 -27516 -25938 -28975 -29401 -25525 -23345 -23455 -19153 -9328 -1457 344 -346 -1544 -5955
38281 -5955 -12891 -17103 -17764 -19220 -21626 -20907 -19111 -23625 -34031 -41038 -41125 -40561 -41635 -37480 -25925
38266 -25925 -16372 -15922 -19336 -20225 -21833 -27879 -31945 -26522 -16391 -12952 -19226 -28801 -36209 -40665 -42252
38251 -42252 -41240 -39646 -38539 -35825 -30330 -24910 -21926 -19391 -15456 -12861 -14804 -19708 -23654 -24864
38237 -24864 -22971 -17876 -12404 -12112 -19211 -29840 -39107 -44837 -45470 -40161 -32666 -28676 -27116 -21001 -9209
$$ packed form
38339i457K697L92l040l71L952K492k062k358J060J960r44l618m261m404m203
38324b2165k011K323O813Q857O460P41k727P24P754J0090M847l080q326q925m164
38309b789M494J1302J2133J0687J1040P944m356j7507j7890q589n823j2659j4509
38296b6522m806L812J578l037m26L876K180j10M302R825P871J801o90j198m411
38281e955o936m212o61j456k406P19J796m514j0406p007q7N64j074M155J1555
38266b5925R553M50l414q89j608o046m066N423J0131L439o274r575p408m456j587
38251d2252J012J594J107K714N495N420K984K535L935K595j943m904l946j210
38237b4864J893N095N472K92p099j0629r267n730o33N309P495L990J560O115J1792
$$ plain form
38222 -9209 544 3756 5381 9548 12060 9439 6804 8994 11367 7848 1504 -1855 -4367 -10296 -14612
38207 -14612 -8823 4292 12687 11251 6260 3285 14 -6524 -13213 -14920 -10905 -4456 987 4021
38193 4021 5548 7357 9360 9354 6576 3034 87 -2716 -3661 1027 9614 13072 6591 -1866 -1461 6230
38177 6230 9629 3509 -4708 -6017 -1231 1095 -4768 -14690 -17654 -7020 10530 20673 17767 10906
38163 10906 10406 13680 10501 -1815 -15849 -24772 -28266 -27893 -23105 -13675 -2120 7580 11661 7904
38149 7904 -1912 -11915 -17216 -17736 -14769 -6824 7002 22155 32518 38285 44879 54087 60874 60244
38135 60244 54083 49388 50592 54156 51351 37901 20286 9122 6256 3290 -5903 -17169 -23826
38122 -23826 -26443 -29573 -33229 -33818 -31007 -28136 -27316 -28202 -29608 -28753 -21980 -10271 -755 1896 1966 5299
$$ packed form
38222i209R753L212J625M167K512k621k635K190K373l519o344l359k512n929m316
38207a4612N789J3115Q395j436m991k975l271o538o689j707M015O449N443L034
38193D021J527J809K003ok778l542k947k803r45M688Q587L458o481q457M05P691
38177F230L399o120q217j309M786K326n863r922k964J0634J7550J0143k906o861
38163A0906n00L274l179j2316j4034q923l494L73M788R430J1555R700M081l757
38149G904r816j0003n301n20K967P945J3826J5153J0363N767O594R208O787o30
38135F0244o161m695J204L564k805j3450j7615j1164k866k966r193j1266o657
38122b3826k617l130l656n89K811K871Q20q86j406Q55O773J1709R516K651P0L333
$$ plain form
38106 5299 9401 8028 3171 4213 15050 29233 39486 46098 53048 60014 62138 57032 49828 49836 61333
38091 61333 78661 92652 100950 108396 117973 126990 132766 135802 135734 131315 127171 132423 147488 159381
38077 159381 156283 140505 121122 101093 79935 62830 56405 58233 59493 56422 51732 46991 41291
38064 41291 35729 32183 29263 25801 25676 31851 38008 34141 19807 5055 -1175 1962 9927 16355
38050 16355 15515 7055 -2839 -9006 -12738 -15719 -14318 -6565 995 1622 -1398 -1429 -210 -3007 -6742
38035 -6742 -4044 4087 10577 14176 17904 18945 12731 4991 6209 14494 17092 9286 -1055 -8343
38021 -8343 -14998 -20574 -19160 -11483 -7025 -9589 -12287 -11000 -10790 -13885 -13324 -5586 737 -3308 -14519
38006 -14519 -23388 -25531 -21882 -14543 -7839 -7024 -11298 -13936 -12529 -12132 -15595 -19036 -20251 -22922 -28344
$$ packed form
38106E299M102j373m857J042J0837J4183J0253O612O950O966K124n106p204QJ1497
38091F1333J7328J3991Q298P446R577R017N776L036o8m419m144N252J5065J1893
38077A59381l098j5778j9383k0029k1158j7105o425J828J260l071m690m741n700
38064D1291n562l546k920l462j25O175O157l867j4334j4752o230L137P965O428
38050A6355q40q460r894o167l732k981J401P753P560O27l020l1J219k797l735
38035f742K698Q131O490L599L728J041o214p740J218Q285K598p806j0341p288
38021h343o655n576J414P677M458k564k698J287K10l095N61P738O323m045j1211
38006a4519q869k143L649P339O704Q15m274k638J407L97l463l441j215k671n422
$$ plain form
37991 -28344 -31441 -29515 -26627 -25097 -21367 -14938 -12296 -16441 -21160 -21256 -19834 -19780 -17152 -9764 -3593
37976 -3593 -3382 -4769 -2675 826 4292 13616 31793 49452 55148 49466 41005 34988 33908 41667
37962 41667 56700 67152 63608 51833 43191 38286 31332 25212 28243 37972 41780 34632 24897 20757
37948 20757 20850 20838 20393 20236 19120 16753 14275 10168 1526 -8681 -11838 -4706 4610 5953 -660 -6531
37932 -6531 -6767 -6347 -11777 -20149 -21799 -14291 -7643 -11045 -19265 -19529 -8878 4661 17035 32823
37918 32823 52542 66941 70196 69766 75764 87698 99023 107979 115430 117366 109103 94294 81455
37905 81455 72676 62480 47333 31092 20969 20936 27988 33702 32518 28869 30958 37271 37455 28814
37891 28814 21816 23999 28484 26307 21036 21115 24792 23843 17690 12860 11053 7724 1418 -3797 -4826
$$ packed form
37991b8344l097J926K888J530L730O429K642m145m719r6J422N4K628P388O171
37976c593K11j387K094L501L466R324J8177J7659N696n682q461o017j080P759
37962D1667J5033J0452l544j1775q642m905o954o120L031R729L808p148r735m140
37948B0757R3j2m45j57j116k367k478m107q642j0207l157P132R316J343o613n871
37932f531k36M20n430q372j650P508O648l402q220k64J0651J3539J2374J5788
37918C2823J9719J4399L255m30N998J1934J1325Q956P451J936q263j4809j2839
37905H1455q779j0196j5147j6241j0123l3P052N714j184l649K089O313J84q641
37891B8814o998K183M485k177n271P9L677r49o153m830j807l329o306n215j029
$$ plain form
37876 -4826 -2142 3102 9750 16294 23286 32386 40389 40660 34424 32524 40435 50712 57313 66650 84188
37861 84188 100475 103807 98331 94719 89836 72547 45602 24326 14444 7234 -2678 -9915 -10738 -9264
37847 -9264 -8702 -8258 -10359 -19102 -29906 -32865 -28252 -26552 -31168 -34123 -32038 -32896 -41529 -50415 -51449
37832 -51449 -46823 -42071 -37445 -32116 -28528 -26823 -22748 -16420 -15454 -23764 -34208 -37677 -33402 -26022
37818 -26022 -18938 -14613 -14709 -15984 -12672 -6262 -5129 -10982 -14794 -11527 -9797 -19412 -36850 -51327
37804 -51327 -59263 -64112 -66444 -63193 -54862 -46250 -40684 -38002 -36294 -31666 -19254 752 20502 32329
37790 32329 36979 40051 43218 44129 43042 43690 47206 49648 47141 41008 36286 36060 38581 40443 41623
37775 41623 45144 51235 55050 52474 45361 37930 31127 24743 21859 25254 31217 32914 28969 23274
$$ packed form
37876d826K684N244O648O544O992R100Q003K71o236j900P911J0277O601R337J7538
37861H4188J6287L332n476l612m883j7289k6945k1276r882p210r912p237q23J474
37847i264N62M44k101q743j0804k959M613J700m616k955K085q58q633q886j034
37832e1449M626M752M626N329L588J705M075O328R66q310j0444l469M275P380
37818b6022P084M325r6j275L312O410J133n853l812L267J730r615j7438j4477
37804e1327p936m849k332L251Q331Q612N566K682J708M628J2412K0006J9750J1827
37790C2329M650L072L167R11j087O48L516K442k507o133m722k26K521J862J180
37775D1623L521O091L815k576p113p431o803o384k884L395N963J697l945n695
$$ plain form
37761 23274 17660 10806 3441 -1577 -3904 -4905 -3628 616 3948 3132 2594 7928 14623 13025 3370
37746 3370 -4610 -6762 -7803 -8908 -4537 5295 11682 10723 9844 14397 18123 14168 7064 5798 11182
37731 11182 17069 19123 16561 10005 2737 -72 2680 6881 9942 12972 14610 10634 2728 -762
37717 -762 2974 6533 4517 1880 4103 7325 5729 1944 2157 5998 8648 8882 8514 7587 5940 6178
37701 6178 10082 15262 19137 22346 25105 25098 22175 19920 19584 18487 17168 20846 30058 37425 37997 35109
37685 35109 31780 25231 15376 9217 9458 7745 -2083 -12074 -11233 -2024 4249 3515 745 -241 382 2734
37669 2734 6268 7297 4410 3182 8933 18311 24217 25073 23250 18960 12236 6607 4540 3567 2168
37654 2168 3638 8446 9921 4658 -219 1641 4770 1383 -5300 -7829 -7875 -11193 -15028 -13173 -9223
$$ packed form
37761B3274n614o854p365n018k327j001J277M244L332q16n38N334O695j598r655
37746C370p980k152j041j105M371R832O387r59q79M553L726l955p104j266N384
37731A1182N887K054k562o556p268k809K752M201L061L030J638l976p906l490
37717g62L736L559k016k637K223L222j596l785K13L841K650K34l68r27j647K38
37701F178L904N180L875L209K759pk923k255l36j097j319L678R212P367N72k888
37685C5109l329o549r855o159K41j713r828r991Q41R209O273p34k770r86O23K352
37669B734L534J029k887j228N751R378N906Q56j823m290o724n629k067r73j399
37654B168J470M808J475n263m877J860L129l387o683k529m6l318l835J855L950
$$ plain form
37639 -9223 -11614 -18176 -18623 -11332 -5525 -6766 -11139 -13814 -13303 -7619 3568 12954 11878 3329 -527
37624 -527 5572 15077 20983 22997 22442 18840 13644 10248 8491 4780 -1846 -8835 -14284 -16842 -13844
37609 -13844 -5808 157 -1343 -5256 -3532 1909 2580 -3009 -8810 -12120 -15136 -17264 -15922 -13577 -13831
37594 -13831 -11967 -684 15332 22491 16978 9101 7357 9442 11763 16825 26401 36134 41906 45315
37580 45315 49753 56555 66415 78579 88247 91269 91049 93624 97290 95984 91577 91862 96167 94873 85366
37565 85366 76770 75080 74787 70500 66634 68778 73610 74744 72786 72864 75932 77960 75553 69192 62589
37550 62589 59817 60855 60824 56721 52390 51959 51788 46104 37739 34539 36902 38009 35387 33014 32867 34043
37534 34043 39356 52400 68110 76564 76475 74956 74746 72769 70477 72990 78213 80158 82718 94360
$$ packed form
37639i223k391o562m47P291N807j241m373k675N11N684J1187R386j076q549l856
37624e27O099R505N906K014n55l602n196l396j757l711o626o989n449k558K998
37609a3844Q036N965j500l913J724N441O71n589n801l310l016k128J342K345k54
37594a3831J864J1283J6016P159n513p877j744K085K321N062R576R733N772L409
37580D5315M438O802R860J2164R668L022k20K575L666j306m407K85M305j294r507
37565H5366q596j690k93m287l866K144M832J134j958P8L068K028k407o361o603
37550F2589k772J038l1m103m331m31j71n684q365l200K363J107k622k373j47J176
37534C4043N313J3044J5710Q454q9j519k10j977k292K513N223J945K560J1642
$$ plain form
37520 94360 107793 102779 74440 42057 22717 12197 382 -10463 -14372 -15030 -17626 -18066 -12634
37507 -12634 -9132 -15927 -27421 -32054 -28413 -22824 -17297 -10602 -5840 -6291 -7862 -5137 -1050 -1869 -6395
37492 -6395 -8353 -6137 -2755 413 3301 4398 4210 6814 12325 13511 6455 -1331 -917 5277 8692
37477 8692 7974 8808 13408 17593 16586 8631 -4633 -17744 -25391 -29915 -39068 -53056 -61403 -57592
37463 -57592 -48721 -44305 -43360 -39910 -33688 -27002 -17629 -3615 10222 18566 23099 26644 26263 20214
37449 20214 15207 17748 24107 27852 31366 40033 50553 55692 56383 58434 60732 57471 49921 45741
37435 45741 47603 51121 53121 54260 54527 52884 50189 47204 42195 35075 29694 27264 23301 16848 15673
37420 15673 24919 37448 43715 44230 43396 38957 28563 19465 18830 20063 12343 -746 -6389 -3453
$$ packed form
37520I4360J3433n014k8339l2383j9340j0520j1815j0845l909o58k596m40N432
37507a2634L502o795j1494m633L641N589N527O695M762m51j571K725M087q19m526
37492f395j958K216L382L168K888J097j88K604N511J186p056p786M14O194L415
37477H692p18Q34M600M185j007p955j3264j3111p647m524r153j3988q347L811
37463e7592Q871M416R45L450O222O686R373J4014J3837Q344M533L545l81o049
37449B0214n007K541O359L745L514Q667J0520N139O91K051K298l261p550m180
37435D5741J862L518K000J139K67j643k695k985n009p120n381k430l963o453j175
37420A5673R246J2529O267N15q34m439j0394r098o35J233p720j3089n643K936
$$ plain form
37406 -3453 -3626 -12308 -22046 -25847 -24850 -21324 -14915 -7471 -2160 3020 12140 21985 25050 21537 19061
37391 19061 20588 21902 20864 19914 19459 17743 17066 21238 27409 29390 28196 29763 32919 29791 18345
37376 18345 5164 -4393 -9726 -9470 -2283 6909 11026 11080 13197 16811 16408 13816 16769 24783 28451
37361 28451 24339 19180 17221 14574 8970 5011 6819 14186 27178 44960 59290 60037 48983 38026
37347 38026 32701 28541 24515 27056 37739 49199 56811 62669 65101 57600 42930 34898 39558 46792
37333 46792 47547 47370 54365 64593 69113 67094 63108 58794 55257 56639 63529 69268 69634 69556 73667
37318 73667 77674 76496 73880 75797 80345 82291 82553 85520 91397 98173 106921 118713 130389 139270
37304 139270 147906 159113 171394 184249 201584 223040 238114 237362 225766 217521 220604 232790
$$ packed form
37406c453j73q682r738l801R97L526O409P444N311N180R120R845L065l513k476
37391A9061J527J314j038r50m55j716o77M172O171J981j194J567L156l128j1446
37376A8345j3181r557n333K56P187R192M117N4K117L614m03k592K953Q014L668
37361B8451m112n159j959k647n604l959J808P367J2992J7782J4330P47j1054j0957
37347C8026n325m160m026K541J0683J1460P612N858K432p501j4670q032M660P234
37333D6792P55j77O995J0228M520k019l986m314l537J382O890N739L66p8M111
37318G3667M007j178k616J917M548J946K62K967N877O776Q748J1792J1676Q881
37304A39270Q636J1207J2281J2855J7335K1456J5074p52j1596q245L083J2186
$$ plain form
37292 232790 248761 263134 269052 262227 246784 231678 221539 214984 210279 207620 206469 205232 204314
37279 204314 206811 215360 228881 242253 250149 253146 258638 272398 291065 307614 322043 339812
37267 339812 361149 380416 395946 410916 423167 425017 417188 412697 420705 434647 443000 444903 448457
37254 448457 459272 477135 499338 521739 540428 556103 571701 582473 575436 543886 496477 446966
37242 446966 400962 357319 315131 272442 224454 171061 122016 87336 65485 47041 27291
37231 27291 9818 -146 -1609 1121 959 -5460 -12958 -14112 -10467 -10497 -15898 -19206 -17273 -16520 -20453
37216 -20453 -22730 -18909 -14753 -15288 -15393 -10012 -4705 -6333 -11182 -12432 -12180 -15358 -18088 -13389 -3747
37201 -3747 2732 4845 7239 10785 13306 15785 18548 15816 3978 -9036 -12984 -9651 -7188 -4793
$$ packed form
37292B32790J5971J4373N918o825j5443j5106j0139o555m705k659j151j237r18
37279B04314K497Q549J3521J3372P896K997N492J3760J8667J6549J4429J7769
37267C39812K1337J9267J5530J4970J2251J850p829m491Q008J3942Q353J903L554
37254D48457J0815J7863K2203K2401J8689J5675J5598J0772p037l1550m7409m9511
37242D46966m6004m3643m2188m2689m7988n3393m9045l4680k1851j8444j9750
37231B7291j7473r964j463K730j62o419p498j154L645l0n401l308J933P53l933
37216b0453k277L821M156n35j05N381N307j628m849j250K52l178k730M699R642
37201c747O479K113K394L546K521K479K763k732j1838j3014l948L333K463K395
$$ plain form
37187 -4793 3844 14565 14680 1884 -11413 -15041 -11490 -6801 -1611 4171 6316 1569 -6943 -13494
37173 -13494 -15353 -12753 -7102 -862 3869 7469 10992 12906 10719 5065 -799 -4465 -5078 -2951 -1087
37158 -1087 -3810 -10691 -15750 -16457 -18603 -26952 -35818 -35843 -26826 -16634 -9608 -3158 5136 13508 19411
37143 19411 22479 23745 24348 24122 20528 12165 4326 5892 18546 34568 47602 59220 72283 85668
37129 85668 99123 114941 130621 139208 141901 149927 167585 184468 192108 196176 202259 202219 187766
37116 187766 166798 151602 140003 123294 104280 91201 81357 68007 56879 57264 62060 56430
37104 56430 42880 37207 40858 38681 25758 15604 17132 22362 23345 24429 30514 37867 43881 52939
37090 52939 65701 74552 76169 77600 84275 92914 101518 115315 137068 161894 186936 215807 248229
$$ packed form
37187d793Q637J0721J15j2796j3297l628L551M689N190N782K145m747q512o551
37173a3494j859K600N651O240M731L600L523J914k187n654n864l666o13K127J864
37158a087k723o881n059p07k146q349q866k5R017J0192P026O450Q294Q372N903
37143A9411L068J266O03k26l594q363p839J566J2654J6022J3034J1618J3063J3385
37129H5668J3455J5818J5680Q587K693Q026J7658J6883P640M068O083m0j4453
37116A87766k0968j5196j1599j6709j9014j3079r844j3350j1128L85M796n630
37104E6430j3550n673L651k177j2923j0154J528N230R83J084O085P353O014R058
37090E2939J2762Q851J617J431O675Q639Q604J3797K1753K4826K5042K8871L2422
$$ plain form
37077 248229 275702 292845 302996 307864 302790 288111 273882 265721 255576 234249 204565 174847
37065 174847 147493 121439 98673 80835 65353 51217 42723 41868 42757 38854 30483 21026 11564
37052 11564 3222 -1172 -1384 -96 3015 10261 17580 16883 9957 9558 21445 35113 38706 33827 28246
37037 28246 22713 14103 5161 1758 4116 7990 11541 15381 18946 21625 24380 26738 26069 23076 23291
37022 23291 29371 36042 36290 29402 20733 16816 21254 30806 35558 28808 16766 12023 17746 25788
37008 25788 29590 29795 27354 21737 17166 19536 25059 23243 13817 8643 12968 17256 13423 7274 7326
36993 7326 11301 11751 7222 1090 -3824 -4341 2122 11630 16398 16145 17734 21575 19937 11739 6104
36978 6104 6929 7675 6489 11163 22041 26277 18996 14291 22976 34439 35084 31104 36169 47775 54195
$$ packed form
37077B48229K7473J7143J0151M868n074j4679j4229q161j0145k1327k9684k9718
37065A74847k7354k6054k2766j7838j5482j4136q494q55Q89l903q371r457r462
37052A1564q342m394k12J288L111P246P319o97o926l99J1887J3668L593m879n581
37037B8246n533q610q942l403K358L874L551L840L565K679K755K358o69k993K15
37022B3291O080O671K48o888q669l917M438R552M752o750j2042m743N723Q042
37008B5788L802K05k441n617m571K370N523j816r426n174M325M288l833o149N2
36993G326L975M50m529o132m914n17O463R508M768k53J589L841j638q198n635
36978F104Q25P46j186M674J0878M236p281m705Q685J1463O45l980N065J1606O420
$$ plain form
36963 54195 56723 66057 81022 88610 83916 75623 72255 74729 81094 87804 88119 79144 68354 64165
36949 64165 63273 56631 44384 35025 32350 32333 30592 25328 16038 6486 4832 13831 25615 32265 34856
36934 34856 35623 30528 18976 11533 16145 24508 24351 17890 15205 16690 16542 17405 25747 36845 40018
36919 40018 36132 35079 38236 38621 36953 41755 52818 59253 56116 50017 45997 40847 32215 23720
36905 23720 18067 13857 10910 10655 10795 7755 4355 6842 14856 22491 28066 34207 39629 39869 35365
36890 35365 30726 27627 26065 29303 38563 46504 46051 42144 44191 50917 54525 56011 62765 73616
36876 73616 80396 82965 88369 95674 96542 91801 92624 102590 112215 114655 114282 116033 118259 120512 127667
36861 127667 141508 156682 168271 175904 179495 179500 181259 188905 194681 185272 159660 129830 103264
$$ packed form
36963E4195K528R334J4965P588m694q293l368K474O365O710L15q975j0790m189
36949F4165q92o642j2247r359k675j7j741n264r290r552j654Q999J1784O650K591
36934C4856P67n095j1552p443M612Q363j57o461k685J485j48Q63Q342J1098L173
36919D0018l886j053L157L85j668M802J1063O435l137o099m020n150q632q495
36905B3720n653m210k947k55J40l040l400K487Q014P635N575O141N422K40m504
36890C5365m639l099j562L238R260P941m53l907K047O726L608J486O754J0851
36876G3616O780K569N404P305Q68m741Q23R966R625K440l73J751K226K253P155
36861A27667J3841J5174J1589P633L591NJ759P646N776r409k5612k9830k6566
$$ plain form
36848 103264 76806 49138 26083 9763 -5694 -23296 -38285 -47768 -55257 -62184 -64928 -63937 -66139
36835 -66139 -74300 -82747 -87166 -90433 -95704 -101519 -106021 -108893 -108527 -104820 -103413 -107784 -109543 -98760
36821 -98760 -82199 -76883 -85685 -94951 -97634 -101295 -108727 -108649 -94377 -76854 -69042 -69346 -69895 -70288 -73237
36806 -73237 -75943 -75498 -75401 -78554 -80819 -78701 -76210 -76906 -75943 -67303 -53436 -41555 -35130 -33437 -34262
36791 -34262 -33607 -28556 -23111 -24585 -32091 -36132 -31810 -24645 -21424 -23534 -30408 -39875 -43831 -34659 -18138
36776 -18138 -8598 -8914 -7795 163 5887 2544 -3185 -4134 -4616 -10859 -19863 -25956 -29554 -32495 -33292
36761 -33292 -32821 -35586 -40222 -38718 -29971 -23169 -22510 -20477 -12510 -6033 -7472 -11784 -12275 -9500 -3469
36746 -3469 10570 30583 44455 46963 48118 56370 66614 74003 85032 102835 115230 111951 102605
$$ packed form
36848A03264k6458k7668k3055j6320j5457j7602j4989r483p489o927k744R91k202
36835f6139q161q447m419l267n271n815m502k872L66L707J407m371j759J0783
36821i8760J6561N316q802r266k683l661p432P8J4272J7523P812l04n49l93k949
36806g3237k706M45R7l153k265K118K491o96R63Q640J3867J1881O425J693q25
36791c4262O55N051N445j474p506m041M322P165L221k110o874r467l956R172J6521
36776a8138R540l16J119P958N724l343n729r49m82o243r004o093l598k941p97
36761c3292M71k765m636J504Q747O802O59K033P967O477j439m312m91K775O031
36746c469J4039K0013J3872K508J155Q252J0244P389J1029J7803J2395l279r346
$$ plain form
36733 102605 102536 109826 110710 100114 83095 62729 39738 18424 1413 -15628 -34009 -44499 -40616
36720 -40616 -31265 -28283 -29095 -24037 -13850 -7383 -7927 -13238 -22747 -33702 -37139 -29115 -19057 -16061
36706 -16061 -15030 -8105 -733 -2384 -9386 -11977 -11521 -15206 -19617 -15919 -7490 -6427 -14418 -21143 -20294
36691 -20294 -15040 -9692 -6930 -10030 -17096 -17755 -6886 3808 296 -13326 -21753 -19947 -13831 -5636
36677 -5636 5432 12280 6529 -5959 -11419 -8177 -5652 -5970 -2631 3752 4797 60 -1850 636
36663 636 -985 -10279 -20607 -26757 -30309 -32352 -31796 -30957 -31979 -28872 -15114 2005 7595 -572 -10500
36648 -10500 -14036 -13419 -10203 -1844 9117 15425 16638 18955 22990 23603 21959 25030 32601 37881 41819
36633 41819 53271 73583 95125 117390 150096 196402 246761 294085 341554 389163 425155 439539
$$ packed form
36733A02605o9P290Q84j0596j7019k0366k2991k1314j7011j7041j8381j0490L883
36720d0616R351K982q12N058J0187O467n44n311r509j0955l437Q024J0058K996
36706a6061J031O925P372j651p002k591M56l685m411L698Q429J063p991o725Q49
36691b0294N254N348K762l100p066o59J0869J0694l512j3622q427J806O116Q195
36677e636J1068O848n751j2488n460L242K525l18L339O383J045m737j910K486
36663F36j621r294j0328o150l552k043N56Q39j022L107J3758J7119N590q167r928
36648a0500l536O17L216Q359J0961O308J213K317M035O13j644L071P571N280L938
36633D1819J1452K0312K1542K2265L2706M6306N0359M7324M7469M7609L5992J4384
$$ plain form
36621 439539 437593 432623 431629 433196 432943 425632 406527 374888 334180 289150 246188 213390 193105
36608 193105 176550 153669 126613 105439 92779 82033 69206 56979 47434 39162 31025 21931
36596 21931 9321 -5261 -13600 -11709 -7680 -9727 -13496 -11843 -8728 -9931 -8532 3860 18892
36583 18892 23364 23825 38646 68712 97450 119277 146361 185294 227782 267943 309049 348230
36571 348230 372807 377882 372397 363870 351955 338761 328743 316195 290280 254606 223935 200337
36559 200337 172972 143534 128686 131588 133944 124250 112041 105360 96572 81849 73140 76980 80260
36546 80260 71082 56831 48315 42809 36487 37017 48785 60392 61522 58555 59572 58286 47846 37088
36532 37088 37099 43122 44804 43351 43839 41531 31195 20370 18506 21534 20827 18525 20418 22607 19227
$$ packed form
36621D39539j946m970r94J567k53p311j9105l1639m0708m5030m2962l2798k0285
36608A93105j6555k2881k7056k1174j2660j0746j2827j2227r545q272q137r094
36596B1931j2610j4582q339J891M029k047l769J653L115j203J399J2392J5032
36583A8892M472M61J4821L0066K8738K1827K7084L8933M2488M0161M1106L9181
36571C48230K4577N075n485q527j1915j3194j0018j2548k5915l5674l0671k3598
36559B00337k7365k9438j4848K902K356r694j2209o681q788j4723q709L840L280
36546H0260r178j4251q516n506o322N30J1768J1607J130k967J017j286j0440j0758
36532C7088J1O023J682j453M88k308j0336j0825j864L028p07k302J893K189l380
$$ plain form
36517 19227 15242 17800 22194 19584 12087 8178 9579 13355 19616 26939 28295 21546 15280 14832 12958
36502 12958 4575 -1126 4358 13101 13175 6385 578 -4469 -9373 -5129 12722 29985 31179 22645
36488 22645 21031 26575 26342 18133 12123 11581 9519 3814 796 3859 10188 17363 23392 23971 19424
36473 19424 18866 27313 35806 35708 34538 43705 58112 63657 59449 56752 60051 64868 71718 87364 113553
36458 113553 147098 188662 239240 290921 333687 369055 405945 446772 488767 534021 584983
36447 584983 633209 664990 676151 672152 658992 644131 638723 645733 652165 646369 636624 638938 653675
36434 653675 669607 684171 702691 723122 739568 757011 784608 817155 840666 853980 867352
36423 867352 881864 888762 888434 891233 898396 900332 896547 900177 918545 943978 967996 991593 1018123
$$ packed form
36517A9227l985K558M394k610p497l909J401L776O261P323J356o749o266m48j874
36502A2958q383n701N484Q743P4o790n807n047m904M244J7851J7263J194q534
36488B2645j614N544k33q209o010n42k062n705l018L063O329P175O029N79m547
36473A9424n58Q447Q493r8j170R167J4407N545m208k697L299M817O850J5646K6189
36458A13553L3545M1564N0578N1681M2766L5368L6890M0827M1995M5254N0962
36447E84983M8226L1781J1161l999j3160j4861n408P010O432n796r745K314J4737
36434F53675J5932J4564J8520K0431J6446J7443K7597L2547K3511J3314J3372
36423H67352J4512O898l28K799P163J936l785L630J8368K5433K4018K3597K6530
$$ plain form
36410 1018123 1048032 1082965 1123256 1159199 1175932 1168376 1141142 1094846 1025678 939217 851375
36399 851375 772707 701739 634397 569678 506264 444363 390819 352226 324085 296865 270130
36388 270130 249554 233727 217297 204067 202026 206756 204902 194231 185931 186162 188684 186787 180339
36375 180339 170730 160427 156607 163180 170654 166526 154010 147580 151861 158167 159659 156292 147422 133789
36361 133789 124110 125184 128846 123918 116203 118828 127558 126786 117823 118518 133393 146120 145511 138959
36347 138959 135543 134529 135431 141466 147754 142747 126492 112318 107060 104933 102726 103818 105057 98164
36333 98164 87421 87395 99246 107876 106462 104566 107290 106471 98992 94636 98329 102330 102793 106398 114133
36318 114133 116586 112045 111277 117848 122145 121249 125030 135334 139718 134573 133582 143026 149517 144119 138279
$$ packed form
36410A018123K9909L4933M0291L5943J6733p556k7234m6296o9168q6461q7842
36399H51375p8668p0968o7342o4719o3414o1901n3544l8593k8141k7220k6735
36388B70130k0576j5827j6430j3230k041M730j854j0671q300K31K522j897o448
36375A80339r609j0303l820O573P474m128j2516o430M281O306J492l367q870j3633
36361A33789r679J074L662m928p715K625Q730p72q963O95J4875J2727o09o552
36347A38959l416j014R02O035O288n007j6255j4174n258k127k207J092J239o893
36333I8164j0743k6J1851Q630j414j896K724q19p479m356L693M001M63L605P735
36318A14133K453m541p68O571M297q96L781J0304M384n145r91R444O491n398n840
$$ plain form
36303 138279 142187 146649 141836 136671 142978 154916 160437 161201 166420 177433 191062 208027 226770
36290 226770 239336 243640 249452 263344 278661 287974 293201 296219 293153 285338 281675 282987 279090
36277 279090 267683 258722 253297 238597 213589 198040 202428 208874 197745 175576 160455 155785
36265 155785 154664 155316 156201 149507 134359 123348 122996 122443 114096 108412 113632 118374 110904 99351
36251 99351 95899 96979 96289 100774 114961 125556 121626 115399 122982 138842 149933 161130 184973
36238 184973 218788 253278 291557 337968 379918 403034 413778 425845 435685 433360 425252 421607
36226 421607 412642 382935 340833 307580 284750 258739 231031 216092 212445 203356 186297 176310
36214 176310 178214 178818 170434 161791 161230 165822 170365 172960 170300 160201 148538 142494 139904 136027
$$ packed form
36303A38279L908M462m813n165O307J1938N521P64N219J1013J3629J6965J8743
36290B26770J2566M304N812J3892J5317R313N227L018l066p815l663J312l897
36277B79090j1407q961n425j4700k5008j5549M388O446j1129k2169j5121m670
36265A55785j121O52Q85o694j5148j1011l52n53q347n684N220M742p470j1553
36251I9351l452J080o90M485J4187J0595l930o227P583J5860J1091J1197K3843
36238A84973L3815L4490L8279M6411M1950K3116J0744J2067R840k325q108l645
36226D21607q965k9707m2102l3253k2830k6011k7708j4939l647r089j7059r987
36214A76310J904O04q384q643n61M592M543K595k660j0099j1663o044k590l877
$$ plain form
36200 136027 134776 140851 148244 150099 151530 158203 162302 156561 151786 161240 176888 181287 174746 170047
36186 170047 168352 162097 154945 156962 165521 171211 176017 186022 195674 201542 220370 266293 318572
36173 318572 341223 329320 307058 285697 256103 221306 201732 202508 205143 198356 190827 187643 180352
36160 180352 167634 161534 165318 166921 160868 155661 154223 148608 139510 139217 149076 154859 150530 146467
36146 146467 148779 150821 150431 154994 163570 163948 153216 142166 135064 125201 114379 114875 126609 134214
36132 134214 132901 135497 147018 154670 151761 150408 160592 175720 188467 203146 223403 244133
36120 244133 263007 283872 303183 310664 308793 313382 329298 343969 349687 352781 355738 351075 339260
36107 339260 332293 332880 329902 320140 313669 312288 304811 289692 279236 274948 263132 242510 230571
$$ packed form
36200A36027j251O075P393J855J431O673M099n741m775R454J5648M399o541m699
36186A70047j695o255p152K017Q559N690M806J0005R652N868J8828M5923N2279
36173C18572K2651j1903k2262k1361k9594l4797j9574P76K635o787p529l184p291
36160A80352j2718o100L784J603o053n207j438n615r098k93R859N783m329m063
36146A46467K312K042l90M563Q576L78j0732j1050p102r863j0822M96J1734P605
36132A34214j313K596J1521P652k909j353J0184J5128J2747J4679K0257K0730
36120B44133J8874K0865J9311P481j871M589J5916J4671N718L094K957m663j1815
36107C39260o967N87k978r762o471j381p477j5119j0456m288j1816k0622j1939
$$ plain form
36094 230571 233149 233788 224246 218798 224885 226216 211545 195910 195532 203491 207639 211443 219327 221886
36080 221886 214154 209591 217708 225997 221884 214369 215506 218293 212273 204351 204385 205641 199422 194720 203241
36065 203241 217633 224011 224831 230822 240492 244979 244113 242587 239525 235072 236627 246094 252428 248399
36051 248399 241756 238859 232598 218793 208043 207381 206575 197147 188336 188973 190580 184725 180162 185659
36037 185659 192884 194267 200483 220505 240867 245798 242877 247345 255165 253491 245124 241027 240390 238441
36023 238441 241449 253299 260226 250651 237617 239211 249214 250726 247046 253660 269182 279954 286184
36010 286184 298453 313793 318963 313272 306559 299640 287987 279291 285239 299797 306471 303391 301467
35997 301467 302273 298417 292388 294830 306131 317681 328452 343277 358517 366452 369921 376652 384355
$$ packed form
36094B30571K578O39r542n448O087J331j4671j5635l78P959M148L804P884K559
36080B21886p732m563Q117Q289m113p515J137K787o020p922L4J256o219m702Q521
36065B03241J4392O378Q20N991R670M487q66j526l062m453J555R467O334m029
36051B48399o643k897o261j3805j0750o62q06r428q811O37J607n855m563N497
36037A85659P225J383O216K0022K0362M931k921M468P820j674q367m097o37j949
36023B38441L008J1850O927r575j3034J594J0003J512l680O614J5522J0772O230
36010B86184J2269J5340N170n691o713o919j1653q696N948J4558O674l080j924
35997C01467Q06l856o029K442J1301J1550J0771J4825J5240P935L469O731P703
$$ plain form
35984 384355 387278 390559 400603 408364 401188 385341 377685 379821 378989 370272 360193 352352 346121 345113
35970 345113 351767 359154 362155 368613 385043 402115 410430 418077 433867 446751 443894 436473 443333
35957 443333 460420 471932 480797 499967 522558 530803 528837 536329 553109 560556 556834 560523 577505
35944 577505 592694 598056 602405 609318 610448 605709 606944 616277 621862 619286 617191 618530 616242 610342
35930 610342 609574 613171 610074 598923 590602 588972 586797 581734 578710 576365 569146 562497 567579 581462
35916 581462 590522 591972 593776 596092 592642 587752 591274 598994 598918 594154 598084 610217 619601 628657
35902 628657 649049 676549 695742 708386 730751 762853 786873 797250 805913 815492 813452 796036
35890 796036 773145 746762 709460 667017 637231 622835 609797 594878 589728 594992 595730 585680
$$ packed form
35984C84355K923L281J0044P761p176j5847p656K136q32q717j0079p841o231j008
35970C45113O654P387L001O458J6430J7072Q315P647J5790J2884k857p421O860
35957D43333J7087J1512Q865J9170K2591Q245j966P492J6780P447l722L689J6982
35944E77505J5189N362M349O913J130m739J235R333N585k576k095J339k288n900
35930F10342p68L597l097j1151q321j630k175n063l024k345p219o649N082J3883
35916E81462R060J450J804K316l450m890L522P720p6m764L930J2133R384R056
35902F28657K0392K7500J9193J2644K2365L2102K4020J0377Q663R579k040j7416
35890G96036k2891k6383l7302m2443k9786j4396j3038j4919n150N264P38j0050
$$ plain form
35878 585680 571862 554227 527112 501133 494203 498587 487103 455511 427547 413493 396981 370271
35866 370271 348715 339138 325933 301717 281989 275491 268409 252391 241249 244888 251565 250099 246048
35853 246048 243403 234590 220952 218599 231323 241551 239607 237311 241629 241545 233697 233967 248954 261157
35839 261157 257001 245329 235297 221819 206210 203960 216704 222926 211998 200856 201398 199453 183819
35826 183819 168403 165895 165729 157835 152022 153217 143878 113794 82999 71885 71282 64510 56037 54840
35812 54840 51759 38140 26609 28990 32654 22407 7416 3239 5133 1990 -972 4158 9082
35799 9082 5641 3573 11087 16296 9088 1887 6392 9896 -955 -12206 -4115 17020 34581 52654
35785 52654 84574 124606 156965 180934 203453 219201 221006 217933 221397 225417 220235 211421 206152
$$ packed form
35878E85680j3818j7635k7115k5979o930M384j1484l1592k7964j4054j6512k6710
35866C70271k1556r577j3205k4216j9728o498p082j6018j1142L639O677j466m051
35853B46048k645q813j3638k353J2724J0228j944k296M318q4p848K70J4987J2203
35839B61157m156j1672j0032j3478j5609k250J2744O222j0928j1142N42j945j5634
35826A83819j5416k508j66p894n813J195r339l0084l0795j1114o03o772q473j197
35812E4840l081j3619j1531K381L664j0247j4991m177J894l143k962N130M924
35799I082l441k068P514N209p208p201M505L504j0851j1251Q091K1135J7561J8073
35785E2654L1920M0032L2359K3969K2519J5748J805l073L464M020n182q814n269
$$ plain form
35772 206152 196699 177984 164321 166835 171330 161299 145770 140887 141134 133631 124330 124225 124971 114122
35758 114122 100283 97707 99892 93399 83797 82901 84201 75929 64761 62050 60785 50505 40173
35745 40173 41443 44678 37004 28386 33564 43919 44097 40683 47124 56812 59689 68566 98076 133391
35731 133391 151886 161331 183607 213879 229998 231243 233913 237859 230511 216003 208303 202612 183981
35718 183981 157019 138156 126722 111772 97664 94135 91762 76719 58932 55758 59495 51790
35706 51790 37780 33885 34395 23875 10689 13207 23806 21999 12791 15918 27174 27122 18561 18217
35692 18217 21085 11444 -300 8101 27967 32017 21867 21165 28007 18766 -3648 -10045 5669
35679 5669 18961 17951 15062 15097 10524 8237 21899 38521 32462 11417 7078 21214 24797 11416
$$ packed form
35772B06152r453j8715j3663K514M495j0031j5529m883K47p503r301j05P46j0849
35758A14122j3839k576K185o493r602q96J300q272j1168k711j265j0280j0332
35745D0173J270L235p674q618N178J0355J78l414O441R688K877Q877K9510L5315
35731A33391J8495R445K2276L0272J6119J245K670L946p348j4508p700n691j8631
35718A83981k6962j8863j1434j4950j4108l529k373j5043j7787l174L737p705
35706E1790j4010l895N10j0520j3186K518J0599j807r208L127J1256n2q561l44
35692A8217K868r641j1744Q401J9866M050j0150p02O842r241k2414o397J5714
35679E669J3292j010k889L5m573k287J3662J6622o059k1045m339J4136L583j3381
$$ plain form
35665 11416 5887 15632 19097 9943 9033 23029 32062 28098 26305 29650 21214 565 -10379 -6397
35651 -6397 -6687 -16709 -20290 -16103 -22380 -38002 -39193 -23423 -16497 -27075 -34306 -29782 -30934 -42628
35637 -42628 -46537 -39792 -43502 -61487 -71095 -66298 -68638 -83724 -89369 -79959 -79560 -96345 -106958 -101768
35623 -101768 -102211 -115760 -117002 -93120 -65961 -47559 -14384 51302 131534 204619 270389 325242
35611 325242 351736 354515 368721 410754 456231 485191 509822 537271 546685 528118 505671 496422
35599 496422 483063 452179 423125 412920 407376 392623 381559 384310 385555 374915 367343 372055
35587 372055 375169 372804 383909 409573 419670 402998 389770 399673 409893 401801 395869 408835
35575 408835 418076 403011 383187 380617 381502 370361 365662 385221 410688 422477 436665 471503
$$ packed form
35665A1416n529R745L465r154r10J3996R033l964j793L345q436k0649j0944L982
35651f397k90j0022l581M187o277j5622j191J5770O926j0578p231M524j152j1694
35637d2628l909O745l710j7985r608M797k340j5086n645R410L99j6785j0613N190
35623a01768m43j3549j242K3882K7159J8402L3175O5686Q0232P3085O5770N4853
35611C25242K6494K779J4206M2033M5477K8960K4631K7449R414j8567k2447r249
35599D96422j3359l0884k9054j0205n544j4753j1064K751J245j0640p572M712
35587C72055L114k365J1105K5664J0097j6672j3228R903J0220q092n932J2966
35575D08835R241j5065j9824k570Q85j1141m699J9559K5467J1789J4188L4838
$$ plain form
35563 471503 510275 533399 555046 591693 626510 642002 656555 690462 724749 731075 714932 693966
35551 693966 662322 612563 564897 538429 519029 488227 456303 435917 413998 381901 360495
35540 360495 361850 360213 336020 313298 316301 325241 314795 300510 304563 310342 295566 277512 280096
35527 280096 287631 276598 262049 266199 271930 255186 233858 236143 248881 245667 237655 246995 257961
35514 257961 245626 226550 229208 239297 226786 203529 201295 214477 216649 212962 224654 241711
35502 241711 241467 234135 240577 246525 228816 204766 204254 214974 207158 189991 190245 197389 184857 164673
35488 164673 165417 176034 167016 147680 146788 155932 148243 133448 137608 148070 136180 114894 115556
35475 115556 127700 121285 107711 117212 136483 132504 118085 128034 149858 146237 127783 132809 151842
$$ packed form
35563D71503L8772K3124K1647L6647L4817J5492J4553L3907L4287O326j6143k0966
35551F93966l1644m9759m7666k6468j9400l0802l1924k0386k1919l2097k1406
35540C60495J355j637k4193k2722L003Q940j0446j4285M053N779j4776j8054K584
35527B80096P535j1033j4549M150N731j6744k1328K285J2738l214q012R340J0966
35514B57961j2335j9076K658J0089j2511k3257k234J3182K172l687J1692J7057
35502B41711k44p332O442N948j7709k4050n12J0720p816j7167K54P144j2532k0184
35488A64673P44J0617r018j9336q92R144p689j4795M160J0462j1890k1286O62
35475A15556J2144o415j3574R501J9271l979j4419R949K1824l621j8454N026J9033
$$ plain form
35462 151842 145481 122648 125487 147759 145189 119033 111889 125272 119384 94131 92974 122765 143736
35449 143736 144291 154833 182224 199652 206025 227501 256827 259222 240768 241968 261929 260164 235846
35436 235846 231634 253703 261794 245936 240197 252060 250584 233469 233752 251165 249087 228180 229400
35423 229400 254784 260378 238301 229673 243952 242612 217248 206744 220537 221119 199821 194030 211747
35410 211747 215452 198650 200896 227734 234224 208591 193365 201559 192021 152373 126116 130366 125363
35397 125363 93300 69191 66294 50791 19297 19623 61986 90749 79659 75859 112863 158200
35385 158200 184869 216634 263076 286630 274971 271929 297186 309385 287024 269712 279805 280460
35373 280460 252869 237714 256690 269296 251387 240567 259742 272362 258225 256077 284862 300648
$$ packed form
35462A51842o361k2833K839K2272k570k6156p144J3383n888k5253j157K9791K0971
35449A43736N55J0542K7391J7428O373K1476K9326K395j8454J200J9961j765k4318
35436B35846m212K2069Q091j5858n739J1863j476j7115K83J7413k078k0907J220
35423B29400K5384N594k2077q628J4279j340k5364j0504J3793N82k1298n791J7717
35410B11747L705j6802K246K6838O490k5633j5226Q194r538l9648k6257M250n003
35397A25363l2063k4109k897j5503l1494L26M2363K8763j1090l800L7004M5337
35385A58200K6669L1765M6442K3554j1659l042K5257J2199k2361j7312J0093O55
35373B80460k7591j5155J8976J2606j7909j0820J9175J2620j4137k148K8785J5786
$$ plain form
35361 300648 279160 263045 279076 287578 264022 250811 275390 296048 283463 277687 308478 336424
35349 336424 329358 320746 336452 341167 314331 301002 328943 352575 337493 322801 341650 359398
35337 359398 349599 350892 388973 423351 430082 452125 507512 536995 507277 475676 485501 490606
35325 490606 454266 426655 446939 463449 432087 400197 409669 411761 365428 325460 341636 363583
35313 363583 339158 313601 334647 353601 321682 291037 315586 344231 320074 292769 320460
35302 320460 352585 327021 293175 317400 353979 334714 301527 322606 359118 344533 316436
35291 316436 339023 373381 356380 329962 358543 396782 375847 342200 370526 416931 402592
35280 402592 366534 387805 430840 418691 387044 412745 460687 455846 435902 475746 532200 523574
$$ packed form
35361C00648k1488j6115J6031Q502k3556j3211K4579K0658j2585n776L0791K7946
35349C36424p066q612J5706M715k6836j3329K7941K3632j5082j4692J8849J7748
35337C59398r799J293L8081L4378O731K2043N5387K9483k9718l1601R825N105
35325D90606l6340k7611K0284J6510l1362l1890R472K092m6333l9968J6176K1947
35313C63583k4425k5557K1046J8954l1919l0645K4549K8645k4157k7305K7691
35302C20460L2125k5564l3846K4225L6579j9265l3187K1079L6512j4585k8097
35291C16436K2587L4358j7001k6418K8581L8239k0935l3647K8326M6405j4339
35280D02592l6058K1271M3035j2149l1647K5701M7942m841j9944L9844N6454q626
$$ plain form
35268 523574 491317 519535 567252 548812 507254 533374 584743 565104 513593 530574 583332
35257 583332 573790 532210 550535 589336 549740 473552 469166 501608 464435 397622 417992 491925
35245 491925 498766 464914 508987 606714 640039 628972 681114 762224 757356 709682 751760 848697
35233 848697 862756 822988 867932 969419 986679 949210 1003223 1118793 1141127 1093557 1130136
35222 1130136 1225382 1222234 1152988 1189660 1306642 1326380 1271396 1324469 1465244 1507731 1476694
35211 1476694 1569601 1761243 1838599 1816790 1911523 2106641 2178908 2151083 2269244 2522799
35201 2522799 2659105 2689271 2883080 3238484 3478688 3607428 3914296 4387204 4707077 4881166
35191 4881166 5259594 5858561 6336209 6722274 7452439 8575577 9698882 10835554 12457297
$$ packed form
35268E23574l2257K8218M7717j8440m1558K6120N1369j9639n1511J6981N2758
35257E83332r542m1580J8325L8801l9596p6188m386L2442l7173o6813K0370P3933
35245D91925O841l3852M4073R7727L3325j1067N2142Q1110m868m7674M2078R6937
35233H48697J4059l9768M4944J01487J7260l7469N4013J15570K2334m7570L6579
35222A130136R5246l148o9246L6672J16982J9738n4984N3073J40775M2487l1037
35211A476694R2907J91642P7356k1809R4733J95118P2267k7825J18161K53555
35201B522799J36306L0166J93809L55404K40204J28740L06868M72908L19873J74089
35191D881166L78428N98967M77648L86065P30165J123138J123305J136672J621743
$$ plain form
35182 12457297 14563170 16646365 18792670 21787851 25886114 30603713 36035181 43113955
35174 43113955 52233943 63093276 76329581 93626888 115999311 144700433 184433857
35167 184433857 240624899 308569797 367696512 393354581 376733125 330683970 275875946
35160 275875946 225081776 181370627 145212658 117546881 97525250 82247375 69733098
35153 69733098 59910888 52552770 46392785 40647159 35658107 31594023 27885963 24299082
35145 24299082 21334082 19186283 17329942 15452272 13873196 12741675 11666832 10448855
35137 10448855 9413140 8728835 8085478 7314876 6691286 6351230 6009946 5509226 5094398
35128 5094398 4900970 4684392 4301189 3972550 3833067 3673940 3366874 3113171 3042155 2965337
$$ packed form
35182A2457297K105873K083195K146305K995181M098263M717599N431468P078774
35174D3113955R119988J0859333J3236305J7297307K2372423K8701122L9733424
35167A84433857N6191042O7944898N9126715K5658069j6621456m6049155n4808024
35160B75875946n0794170m3711149l6157969k7665777k0021631j5277875j2514277
35153F9733098r822210p358118o159985n745626m989052m064084l708060l586881
35145B4299082k965000k147799j856341j877670j579076j131521j074843j217977
35137A0448855j035715o84305o43357p70602o23590l40056l41284n00720m14828
35128E094398j93428k16578l83203l28639j39483j59127l07066k53703p1016p6818
$$ plain form
35118 2965337 2753440 2576763 2551324 2506723 2322343 2155230 2123053 2081430 1920617 1777271
35108 1777271 1751412 1705327 1540142 1394016 1374227 1358911 1250693 1168000 1199475 1218260 1125435
35097 1125435 1039586 1062131 1083748 1004899 927405 946163 962579 885730 816902 854207 904991
35086 904991 869161 826117 865240 906055 859982 804444 825933 848365 784288 705462 699866 704217
35074 704217 638391 566371 566613 577171 523419 468964 488169 515780 473183 421035 437890 466509
35062 466509 428517 377043 388964 415799 386626 352632 385423 433388 420744 391109 413400
35051 413400 441338 405826 354271 359114 376428 333338 271501 266880 287115 263212 226040 238690
35039 238690 267014 248504 218953 241416 278072 260968 223963 236725 270585 256754 218741
$$ packed form
35118B965337k11897j76677k5439m4601j84380j67113l2177m1623j60813j43346
35108A777271k5859m6085j65185j46126j9789j5316j08218q2693L1475J8785r2825
35097A125435q5849K2545K1617p8849p7494J8758J6416p6849o8828L7305N0784
35086I04991l5830m3044L9123M0815m6073n5538K1489K2432o4077p8826n596M351
35074G04217o5826p2020K42J0558n3752n4455J9205K7611m2597n2148J6855K8619
35062D66509l7992n1474J1921K6835k9173l3994L2791M7965j2644k9635K2291
35051D13400K7938l5512n1555M843J7314m3090o1837m621K0235k3903l7172J2650
35039B38690K8324j8510k9551K2463L6656j7104l7005J2762L3860j3831l8013
$$ plain form
35028 218741 222197 248689 240890 219731 237735 268029 256171 230817 248388 279564 264914 231881
35016 231881 241907 271770 262766 238653 257737 293963 283403 246992 250579 282358 285434 274285
35004 274285 302416 348661 352752 335127 365780 436469 473617 458352 430472 395975 333983 274373
34992 274373 266522 288482 282032 255804 259493 282017 273829 246168 248366 268271 254721 218961
34980 218961 214376 233839 226303 198702 202253 231795 236868 220209 227850 252442 243890 208092 199526
34967 199526 221313 225612 208204 210855 233556 234669 216121 220921 248236 256160 245289 254817 280002
34954 280002 278835 256882 260282 287709 294044 277897 279927 297227 285754 246342 221874 209866
34942 209866 165544 93422 48317 41313 30244 7439 10302 39047 50827 43845 61781 105496
$$ packed form
35028B18741L456K6492p799k1159J8004L0294j1858k5354J7571L1176j4650l3033
35016B31881J0026K9863r004k4113J9084L6226j0560l6411L587L1779L076j1149
35004B74285K8131M6245M091j7625L0653P0689L7148j5265k7880l4497o1992n9610
34992B74373p851K1960o450k6228L689K2524q188k7661K198J9905j3550l5760
34980B18961m585J9463p536k7601L551K9542N073j6659P641K4592q552l5798q566
34967A99526K1787M299j7408K651K2701J113j8548M800K7315P924j0871R528K5185
34954B80002j167k1953L400K7427O335j6147K030J7300j1473l9412k4468j2008
34942B09866m4322p2122m5105p004j1069k2805K863K8745J1780o982J7936M3715
$$ plain form
34930 105496 125930 115758 122767 158918 180660 174916 181207 210588 224039 210978 210418 234278
34918 234278 246155 235375 236341 255853 257414 236531 234780 259375 266190 243848 236400 258838 268912
34905 268912 249984 243855 270455 290594 282144 280187 305503 323093 309677 296733 308560 319759
34893 319759 311117 307333 322769 328315 308419 294465 306292 316107 304872 298622 313350 318903 295128
34880 295128 272114 277140 289968 286087 277263 275506 263367 233314 211785 212750 211292 191703 176499
34867 176499 180305 181836 169266 165670 181597 190493 179070 173328 186681 192673 178453 173808 195231
34854 195231 211941 201066 187232 192900 198234 186027 179044 195699 213365 211755 209298 221819
34842 221819 228917 215652 203902 208775 208621 191858 186889 209853 229425 221042 209838 220946 233318
$$ packed form
34930A05496K0434j0172P009L6151K1742n744O291K9381J3451j3061n60K3860
34918B34278J1877j0780R66J9512J561k0883j751K4595O815k2342p448K2438J0074
34905B68912j8928o129K6600K0139q450j957K5316J7590j3416j2944J1827J1199
34893C19759q642l784J5436N546j9896j3954J1827R815j1235o250J4728N553k3775
34880B95128k3014N026J2828l881q824j757j2139l0053k1529R65j458j9589j5204
34867A76499L806J531j2570l596J5927Q896j1423n742J3353N992j4220m645K1423
34854A95231J6710j0875j3834N668N334j2207o983J6655J7666j610k457J2521
34842B21819P098j3265j1750M873j54j6763m969K2964J9572q383j1204J1108J2372
$$ plain form
34829 233318 223796 212431 221652 233000 226529 221372 235296 246015 235350 229259 249438 267560
34817 267560 254690 235087 241636 256924 250169 236142 243730 258368 249976 230704 232571 251248
34805 251248 260568 260316 264256 263977 248612 237081 248436 264511 262796 259215 276116 296624 295986
34792 295986 290261 306557 331091 335464 330887 347352 379799 402182 415119 434356 452791 459462
34780 459462 474973 521565 578410 612687 633601 667684 702139 704535 681419 665797 660581 644480
34768 644480 620485 608106 598558 567129 521496 491220 478009 461389 443843 444501 456660 456887
34756 456887 448805 454263 469222 471699 465058 470015 482341 482427 478248 493972 523073 537447 536464 542204
34742 542204 552472 544902 523856 517322 528692 535343 533665 542298 561193 569791 566533 570238 582750
$$ packed form
34829B33318r522j1365R221J1348o471n157J3924J0719j0665o091K0179J8122
34817B67560j2870j9603O549J5288o755j4027P588J4638q392j9272J867J8677
34805B51248R320k52L940k79j5365j1531J1355J6075j715l581J6901K0508o38
34792B95986n725J6296K4534M373m577J6465L2447K2383J2937J9237J8435O671
34780D59462J5511M6592N6845L4277K0914L4083L4455K396k3116j5622n216j6101
34768F44480k3995j2379r548l1429m5633l0276j3211j6620j7546O58J2159K27
34756D56887q082N458J4959K477o641M957J2326Q6m179J5724K9101J4374r83N740
34742E42204J0268p570k1046o534J1370O651j678Q633J8895Q598l258L705J2512
$$ plain form
34729 582750 589367 594407 615674 644759 653617 640412 628749 621799 598288 555579 516597 490844
34717 490844 465562 436785 412070 382342 329241 261625 207742 171190 132143 90668 68198
34706 68198 65100 57760 40850 32933 37030 35110 25471 26315 37902 40112 31994 34694 50100 55623
34692 55623 45709 39878 43854 41798 33182 37252 53104 55341 38900 29300 38284 47683 47649 51912
34678 51912 62994 61265 43559 36015 52324 73018 81788 89452 105501 117035 113211 103559 97472
34665 97472 90877 84344 88067 99314 101735 94724 95124 103995 103534 93607 96507 115747 125854 115739
34651 115739 107290 115841 125712 121930 115062 116950 120193 118298 119438 125333 123015 111292 108657 121798
34637 121798 133376 133344 134322 143379 147858 143103 145269 161742 176412 178573 179086 184689 184752 177256 178656
$$ packed form
34729E82750O617N040K1267K9085Q858j3205j1663o950k3511m2709l8982k5753
34717D90844k5282k8777k4715k9728n3101o7616n3883l6552l9047m1475k2470
34706F8198l098p340j6910p917M097j920r639Q44J1587K210q118K700J5406N523
34692E5623r914n831L976k056q616M070J5852K237j6441r600Q984R399l4M263
34678E1912J1082j729j7706p544J6309K0694Q770P664J6049J1534l824r652o087
34665I7472o595o533L723J1247K421p011M00Q871m61r927K900J9240J0107j0115
34651A15739q449Q551R871l782o868J888L243j895J140N895k318j1723k635J3141
34637A21798J1578l2R78R057M479m755K166J6473J4670K161N13N603O3p496J400
$$ plain form
34622 178656 193029 200445 191413 184510 194100 208665 216916 227466 246784 264922 278212 298908
34610 298908 328854 352479 368398 395582 434174 455406 447721 436830 439967 437657 415312 395400
34598 395400 397694 400618 376153 336006 309492 298745 288746 281498 287731 300253 304550 302935 304656
34585 304656 306860 306429 313596 332918 348683 349188 346337 351879 355975 350030 347467 358948 370057 368085
34571 368085 367940 385356 406848 414080 416917 432833 452965 459329 459176 471718 494670 512880 527410
34558 527410 548130 568900 576793 575919 578449 582860 582825 584855 595440 604476 602487 598955 602168 598578
34544 598578 575830 548603 536079 530893 516816 500188 495368 494587 481988 464368 458886 462098 459540
34531 459540 454498 459293 469016 471585 473031 485545 501650 507732 511777 529362 553361 566630 573907
$$ packed form
34622A78656J4373P416r032o903R590J4565Q251J0550J9318J8138J3290K0696
34610B98908K9946K3625J5919K7184L8592K1232p685j0891L137k310k2345j9912
34598C95400K294K924k4465m0147k6514j0747r999p248O233J2522M297j615J721
34585C04656K204m31P167J9322J5765N05k851N542M096n945k563J1481J1109j972
34571C68085j45J7416K1492P232K837J5916K0132O364j53J2542K2952J8210J4530
34558E27410K0720K0770P893q74K530M411l5K030J0585R036j989l532L213l590
34544E98578k2748k7227j2524n186j4077j6628m820p81j2599j7620n482L212k558
34531D59540n042M795R723K569J446J2514J6105O082M045J7585K3999J3269P277
$$ plain form
34518 573907 590670 610173 613386 604478 604723 615967 620724 615449 614675 623455 631992 636260 640503 642262
34504 642262 637302 634624 644745 659584 666058 671296 690786 720291 743966 761112 779471 792243
34492 792243 789309 781671 785778 792700 783242 764897 760904 769081 766010 748662 737071 735625 725075
34479 725075 695688 657843 616900 566822 512188 468530 436753 402826 365504 339017 326307
34468 326307 315024 302130 296982 297699 289589 270363 253782 246124 241014 237220 238268 235541 216864
34455 216864 191511 181660 189331 196935 198913 205606 216482 218530 212913 215273 227596 237201 244969
34442 244969 265567 297384 321862 336135 356204 383191 397393 392866 387673 391003 388910 372586
34430 372586 353395 339324 322222 298650 278791 264926 245245 218453 200777 199104 200197 195018
$$ packed form
34518E73907J6763J9503L213q908K45J1244M757n275p74Q780Q537M268M243J759
34504F42262m960k678J0121J4839O474N238J9490K9505K3675J7146J8359J2772
34492G92243k934p638M107O922r458j8345l993Q177l071j7348j1591j446j0550
34479G25075k9387l7845m0943n0078n4634m3658l1777l3927l7322k6487j2710
34468C26307j1283j2894n148P17q110j9226j6581p658n110l794J048k727j8677
34455B16864k5353r851P671P604J978O693J0876K048n617K360J2323R605P768
34442B44969K0598L1817K4478J4273K0069K6987J4202m527n193L330k093j6324
34430C72586j9191j4071j7102k3572j9859j3865j9681k6792j7676j673J093n179
$$ plain form
34418 195018 190523 189451 182606 169649 163513 165569 160501 144161 131991 131285 130191 123135 121335 128205
34404 128205 130148 122320 117883 121442 120108 112086 115759 136609 153023 150799 144936 150495 158584 160005
34390 160005 166784 188851 212581 224781 237459 266793 306591 344759 388969 453923 538418 636217
34378 636217 755982 910904 1103713 1343101 1658580 2066739 2519900 2906726 3112326 3082649
34368 3082649 2848264 2499908 2132816 1799620 1510441 1266157 1072274 923283 800432
34359 800432 694168 609344 542749 478596 413869 363862 332962 304928 272940 252399 249733
34348 249733 245341 224674 200884 188257 178238 161890 151070 154311 154797 137278 116157 111143
34336 111143 113753 104447 86503 76433 75027 73356 74232 82833 88396 79780 67841 69036 78138 79918
$$ packed form
34418A95018m495j072o845j2957o136K056n068j6340j2170p06j094p056j800O870
34404A28205J943p828m437L559j334q022L673K0850J6414k224n863N559Q089J421
34390A60005O779K2067K3730J2200J2678K9334L9798L8168M4210O4954Q4495R7799
34378F36217J19765J54922J92809K39388L15479M08159M53161L86826K05600k9677
34368C082649k34385l48356l67092l33196k89179k44284j93883j48991j22851
34359H00432j06264q4824o6595o4153o4727n0007l0900k8034l1988k0541k666
34348B49733m392k0667k3790j2627j0019j6348j0820L241M86j7519k1121n014
34336A11143K610r306j7944j0070j406j671Q76Q601N563q616j1939J195R102J780
$$ plain form
34322 79918 75753 75039 72302 57850 40913 37272 42593 41738 35734 35912 40015 38291 35596 43221 55312
34307 55312 56727 48283 41916 37514 27124 15498 13423 16737 14433 11001 17478 27278 25704 17611
34293 17611 19571 28932 27735 15521 11163 21099 31234 33149 34587 40028 42669 40295 39475 39988
34279 39988 33497 21412 16434 22739 30954 35685 41732 49971 52812 47719 41769 39910 40391 42663
34265 42663 48012 52760 52374 50479 52340 53570 48444 43960 49754 58997 57075 45702 39659 41783
34251 41783 40731 33413 30051 34839 39541 39797 41855 49358 57006 60146 58890 52290 40360 30932
34237 30932 31895 38388 40698 41854 52579 71641 87295 96579 106761 118751 125885 129341 138465
34224 138465 154781 170485 183130 197097 210617 216158 213939 210957 207272 197326 183737 175121 171509
$$ packed form
34322G9918m165p14k737j4452j6937l641N321q55o004J78M103j724k695P625J2091
34307E5312J415q444o367m402j0390j1626k075L314k304l432O477R800j574q093
34293A7611J960R361j197j2214m358R936J0135J915J438N441K641k374q20N13
34279C9988o491j2085m978O305Q215M731O047Q239K841n093n950j859M81K272
34265D2663N349M748l86j895J861J230n126m484N794R243j922j1373o043K124
34251D1783j052p318l362M788M702K56K058P503P648L140j256o600j1930r428
34237C0932R63O493K310J156J0725J9062J5654R284J0182J1990P134L456R124
34224A38465J6316J5704J2645J3967J3520N541k219k982l685r946j3589q616l612
$$ plain form
34211 171509 166001 158524 153136 145031 126489 102644 84712 71406 54908 40683 40399 48032 45440
34198 45440 31246 21953 23713 25343 21164 18272 18132 13239 6018 8844 20368 23889 15169 10082
34184 10082 17631 26846 28460 28776 32798 33390 26852 20921 18503 12445 5277 13227 38502 57558
34170 57558 51955 34088 26836 32662 39291 43511 51503 62927 70048 69631 66463 69177 87378 124319
34156 124319 166219 188121 177831 147101 115096 90270 72490 61006 53230 44858 37156 35824
34144 35824 39476 39423 33720 29599 28851 24012 13521 7052 10106 16102 19678 25173 35622 45246 49122
34129 49122 49385 47241 40400 32208 30423 33170 29919 20136 15900 21549 26850 25713 24923 28038 28511
34114 28511 26667 34942 55619 71092 69102 62197 68698 88300 110375 133697 162983 195671 225851
$$ packed form
34211A71509n508p477n388q105j8542k3845j7932j3306j6498j4225k84P633k592
34198D5440j4194r293J760J630m179k892j40m893p221K826J1524L521q720n087
34184A0082P549R215J614L16M022N92o538n931k418o058p168P950K5275J9056
34170E7558n603j7867p252N826O629M220P992J1424P121m17l168K714J8201L6941
34156A24319M1900K1902j0290l0730l2005k4826j7780j1484p776q372p702j332
34144C5824L652n3n703m121p48m839j0491o469L054N996L576N495J0449R624L876
34129D9122K63k144o841q192j785K747l251r783m236N649N301j137p90L115M73
34114B8511j844Q275K0677J5473j990o905O501J9602K2075K3322K9286L2688L0180
$$ plain form
34101 225851 253269 276639 285880 272681 243138 211538 187352 173296 166858 158045 135840 102808
34089 102808 73176 52601 32869 10898 -3403 -5681 -7024 -15476 -22942 -21244 -16560 -16520 -16898 -13114
34075 -13114 -11470 -16508 -19783 -13869 -5795 -4441 -5900 -3221 649 1338 3357 10865 19080 24844 33470
34060 33470 45619 51737 50396 56242 76688 96647 101693 101027 110456 126689 136955 141491 147058
34047 147058 149060 140445 130169 132950 146084 153374 146927 130325 107525 84177 72815 79967 92976
34034 92976 93954 81709 67427 56190 46581 40838 40682 39520 32189 25564 27037 30846 28701 24403
34020 24403 24250 23381 16746 13064 21269 32839 34805 31215 34112 42143 46171 47696 52993 56769 50401
34005 50401 39121 32503 25581 8932 -9709 -14168 -4232 7861 18452 29986 34843 23874 6227
$$ packed form
34101B25851K7418K3370R241j3199k9543l1600k4186j4056o438q813k2205l3032
34089A02808k9632k0575j9732k1971j4301k278j343q452p466J698M684M0l78L784
34075a3114J644n038l275N914Q074J354j459K679L870O89K019P508Q215N764Q626
34060C3470J2149O118j341N846K0446J9959N046o66R429J6233J0266M536N567
34047A47058K002q615j0276K781J3134P290o447j6602k2800k3348j1362P152J3009
34034I2976R78j2245j4282j1237r609n743j56j162p331o625J473L809k145m298
34020B4403j53q69o635l682Q205J1570J966l590K897Q031M028J525N297L776o368
34005E0401j1280o618o922j6649j8641m459R936J2093J0591J1534M857j0969j7647
$$ plain form
33992 6227 -852 2464 4024 4834 15607 32556 40801 39686 40971 43657 35317 18562 11232 17757
33978 17757 23855 23123 25997 37501 47814 50906 52948 56602 55570 50015 49207 53573 51789 41290
33964 41290 34580 39195 47158 50032 49747 49473 47623 45003 44835 43236 33388 20488 17662 25617 31574
33949 31574 29569 26094 24741 22230 21529 31723 51807 70224 82514 94316 106883 116574 128878
33936 128878 155038 194620 239426 292834 363768 442492 507234 557247 614290 687243 760665
33925 760665 823247 879416 924098 935735 910264 877348 865012 867794 865900 856309 847251 838908
33913 838908 828240 820252 818618 816727 811247 811999 825147 839162 840695 832724 824622 816172 803822
33900 803822 791106 780450 765406 742595 720877 708145 700059 691456 686726 688856 691276 691301 698528
$$ packed form
33992F227p079L316J560Q10J0773J6949Q245j115J285K686q340j6755p330O525
33978A7757O098p32K874J1504J0313L092K042L654j032n555q08M366j784j0499
33964D1290o710M615P963K874k85k74j850k620j68j599r848j2900k826P955N957
33949C1574k005l475j353k511p01J0194K0084J8417J2290J1802J2567R691J2304
33936A28878K6160L9582M4806N3408P0934P8724O4742N0013N7043P2953P3422
33925G60665O2582N6169M4682J1637k5471l2916j2336K782j894r591r058q343
33913H38908j0668p988j634j891n480P52J3148J4015J533p971q102q450j2350
33900H03822j2716j0656j5044k2811k1718j2732q086q603m730K130K420K5P227
$$ plain form
33887 698528 718612 741798 758584 772338 783962 779180 746667 696303 644193 591312 532391 474089
33875 474089 426596 385797 340646 291979 249484 216308 189781 170335 156733 139570 112517
33864 112517 83519 63320 50531 39475 33387 36115 39181 31992 18516 9801 6125 544 -5476
33851 -5476 -4561 2333 7566 9909 13971 18745 17409 7219 -8125 -23320 -32848 -32481 -24970 -18308
33837 -18308 -14213 -6962 2615 4543 -2608 -5810 1595 7915 3208 -3743 -2564 -549 -7959 -16744
33823 -16744 -12867 -203 6429 4219 408 -5162 -16928 -28698 -30038 -23555 -19491 -17688 -11453 -4750
33809 -4750 -7972 -19029 -25113 -21988 -16972 -14250 -10849 -5734 -978 3633 6942 2691 -9681 -17969
33795 -17969 -13341 -4933 -4342 -5611 2118 12062 10768 3933 8163 21575 26780 21765 23589 39198
$$ packed form
33887F98528K0084K3186J6786J3754J1624m782l2513n0364n2110n2881n8921n8302
33875D74089m7493m0799m5151m8667m2495l3176k6527j9446j3602j7163k7053
33864A12517k8998k0199j2789j1056o088K728L066p189j3476q715l676n581o020
33851e476R15O894N233K343M062M774j336j0190j5344j5195r528L67P511O662
33837a8308M095P251R577J928p151l202P405O320m707o951J179K015p410q785
33823a6744L877J2664O632k210l811n570j1766j1770j340O483M064J803O235O703
33809d750l222j1057o084L125N016K722L401N115M756M611L309m251j2372q288
33795a7969M628Q408N91j269P729R944j294o835M230J3412N205n015J824J5609
$$ plain form
33781 39198 55182 61265 63695 69439 75021 77478 80853 86131 88694 90316 100306 120979 145031 170039
33767 170039 201737 239771 273783 297282 313136 323314 326336 326521 331548 338147 333878 315292 290458
33754 290458 262209 225079 181997 147087 126217 109926 91345 76045 67572 58291 42944 28230
33742 28230 20498 15603 8770 3121 587 -4507 -14324 -20256 -15576 -6595 -2751 -3226 -1196 5424 14556
33727 14556 25353 37117 48293 60794 79079 101379 119191 129761 142089 166143 202185 243830
33715 243830 285142 321849 351994 377639 400081 413842 413761 406975 406095 409130 398966 366536 322358
33702 322358 280045 240384 198615 156765 120222 89475 62699 40887 25189 14553 9275 10407
33690 10407 13502 11391 5765 6388 14996 20000 12576 -1210 -10169 -11487 -8614 -3838 304 -1016
$$ packed form
33781C9198J5984O083K430N744N582K457L375N278K563J622R990K0673K4052K5008
33767A70039L1698L8034L4012K3499J5854J0178L022J85N027O599m269j8586k4834
33754B90458k8249l7130m3082l4910k0870j6291j8581j5300q473r281j5347j4714
33742B8230p732m895o833n649k534n094r817n932M680Q981L844m75K030O620R132
33727A4556J0797J1764J1176J2501J8285K2300J7812J0570J2328K4054L6042M1645
33715B43830M1312L6707L0145K5645K2442J3761q1o786q80L035j0164l2430m4178
33702C22358m2313l9661m1769m1850l6543l0747k6776k1812j5698j0636n278J132
33690A0407L095k111n626O23Q608N004p424j3786q959j318K873M776M142j320
$$ plain form
33676 -1016 -8810 -16780 -18492 -13445 -3601 9474 21066 24100 17274 6773 -1638 -4962 3116 29686
33662 29686 69524 103861 117933 113322 100004 84648 70397 59066 47918 31361 10399 -6184
33650 -6184 -13415 -15970 -19769 -25227 -31093 -36648 -37830 -30010 -17057 -8656 -6877 -5480 -3901 -9690
33636 -9690 -23902 -36715 -41862 -42938 -41226 -31550 -16714 -11517 -23102 -39698 -48149 -50513 -53067
33623 -53067 -51235 -38710 -22420 -14810 -16844 -19949 -19989 -19284 -19058 -18573 -18293 -17601 -14118 -10091 -12331 -20545
33607 -20545 -24316 -18230 -10807 -10578 -12602 -7912 2626 14356 30777 57358 88550 112074 123131
33594 123131 125543 122381 114210 104159 97078 94334 92929 87120 70142 41069 11479 -3907 -5705
33581 -5705 -8296 -16952 -20485 -12661 -5554 -11173 -23265 -29607 -30595 -32475 -32811 -26981 -20175 -18679 -17026
$$ packed form
33676a016p794p970j712N047R844J3075J1592L034o826j0501q411l324Q078K6570
33662B9686L9838L4337J4072m611j3318j5356j4251j1331j1148j6557k0962j6583
33650f184p231k555l799n458n866n555j182P820J2953Q401J779J397J579n789
33636i690j4212j2813n147j076J712R676J4836N197j1585j6596q451k364k554
33623e3067J832J2525J6290P610k034l105m0P05K26M85K80O92L483M027k240q214
33607b0545l771O086P423K29k024M690J0538J1730J6421K6581L1192K3524J1057
33594A23131K412l162q171j0051p081k744j405n809j6978k9073k9590j5386j798
33581e705k591q656l533P824P107n619j2092o342r88j880l36N830O806J496J653
$$ plain form
33566 -17026 -8000 1996 2034 -5421 -10182 -11971 -17550 -25447 -28851 -29902 -36069 -44921 -46807 -40897 -35367
33551 -35367 -33693 -33508 -36441 -45646 -55540 -57828 -56412 -62590 -76001 -84190 -81658 -75881 -72870 -69870
33537 -69870 -65286 -63857 -67611 -71226 -70613 -68599 -69036 -71663 -74970 -78515 -81166 -81861 -82177 -83852 -85251
33522 -85251 -84664 -84396 -86736 -89611 -91456 -95369 -102254 -105639 -100925 -94012 -92388 -93753 -92680 -92092 -97279
33507 -97279 -104358 -106595 -107234 -113634 -122894 -126114 -123633 -123180 -125779 -126447 -126390 -131365 -139483 -143345 -142639 -142298
33491 -142298 -140615 -132591 -122908 -120838 -122974 -115759 -95424 -71195 -48653 -25159 -2928 9735 14194
33478 14194 23458 43020 62637 72834 77807 85959 98001 110447 122124 131934 137322 138727 139078
33465 139078 137326 129867 118716 109772 102982 93808 84199 81110 83589 82947 77269 74239 77597 82347
$$ packed form
33566a7026R026R996L8p455m761j789n579p897l404j051o167q852j886N910N530
33551c5367J674J85k933r205r894k288J416o178j3411q189K532N777L011L000
33537f9870M584J429l754l615O13K014m37k627l307l545k651o95l16j675j399
33522h5251N87K68k340k875j845l913o885l385M714O913J624j365J073N88n187
33507i7279p079k237o39o400r260l220K481M53k599o68N7m975q118l862P06L41
33491a42298J683Q024R683K070k136P215K0335K4229K2542K3494K2231J2663M459
33478A4194R264J9562J9617J0197M973Q152J2042J2446J1677R810N388J405L51
33465A39078j752p459j1151q944o790r174r609l089K479o42n678l030L358M750
$$ plain form
33451 82347 85592 90137 94479 91257 79667 68424 62539 57812 51749 48452 48478 45379 37628 33288
33437 33288 37043 42220 41389 36071 30803 26249 23410 26333 35133 43183 45449 43479 39918 35393 32303
33422 32303 33153 33941 28732 21902 24595 36683 44273 39202 29630 26361 29378 33300 36125 36811 33175
33407 33175 27594 26732 31433 35000 34560 34984 38379 39485 35057 28446 22006 14671 9179 10715 16162
33392 16162 16520 12198 12931 20099 23707 20557 19753 25039 28065 25871 28374 39884 49596 50485 51434
33377 51434 59126 64197 59336 56057 66932 83409 88634 82751 78235 77611 72871 62313 52501 46374
33363 46374 42098 40288 40998 37636 25077 10060 3371 6001 12419 21457 33163 40682 37469 28633
33349 28633 23903 23059 19193 12665 10478 13924 17057 16134 12375 7352 2691 1361 3165 3271 796
$$ packed form
33451H2347L245M545M342l222j1590j1243n885m727o063l297K6l099p751m340
33437C3288L755N177q31n318n268m554k839K923Q800Q050K266j970l561m525l090
33422C2303Q50P88n209o830K693J2088P590n071r572l269L017L922K825O86l636
33407C3175n581q62M701L567m40M24L395J106m428o611o440p335n492J536N447
33392A6162L58m322P33P168L608l150q04N286L026k194K503J1510R712Q89R49
33377E1434P692N071m861l279J0875J6477N225n883m516o24m740j0558r812o127
33363D6374m276j810P10l362j2559j5017o689K630O418R038J1706P519l213q836
33349B8633m730q44l866o528k187L446L133r23l759n023m661j330J804J06k475
$$ plain form
33334 796 2451 11295 19672 21113 20424 22517 20722 8692 -3986 -2583 11151 21723 20911 13622
33320 13622 5903 -128 -976 6616 18646 27519 31644 33780 32960 26511 17033 9158 2886 -2273 -1818
33305 -1818 6310 14074 12728 5133 -286 -2092 -2917 -762 5884 10604 8312 5795 11077 18919 19988
33290 19988 17655 20744 25484 21314 10855 7207 13299 19934 22894 25908 27424 20959 9661 5049
33276 5049 9360 13079 11420 9663 11030 12981 16860 27579 42464 54114 65116 85305 113476
33263 113476 138055 158570 189044 233962 276779 300680 307853 309940 310855 307989 301274 292301 280210
33250 280210 264079 244288 219368 188486 158129 137545 126363 116265 105260 98593 94535 83407
33238 83407 64633 50703 47952 46412 36354 23072 16464 16086 15898 15424 16943 18505 18489 21347 30911
$$ packed form
33334G96J655Q844Q377J441o89K093j795j2030j2678J403J3734J0572q12p289
33320A3622p719o031q48P592J2030Q873M125K136q20o449r478p875o272n159M55
33305a818Q128P764j346p595n419j806q25K155O646M720k292k517N282P842J069
33290A9988k333L089M740m170j0459l648O092O635K960L014J516o465j1298m612
33276E049M311L719j659j757J367J951L879J0719J4885J1650J1002K0189K8171
33263A13476K4579K0515L0474M4918M2817K3901P173K087R15k866o715q973j2091
33250B80210j6131j9791k4920l0882l0357k0584j1182j0098j1005o667m058j1128
33238H3407j8774j3930k751j540j0058j3282o608l78j88m74J519J562j6K858R564
$$ plain form
33223 30911 42842 50824 55778 62221 69669 74446 77318 83290 94975 110221 125946 142240 162582
33210 162582 188847 214829 228601 225720 215802 209563 204056 189662 167234 146584 130604 114152
33198 114152 97855 88670 85105 75911 57113 37888 25841 18677 14121 15035 19560 18704 10065 2964
33184 2964 4038 8245 9463 8843 7190 721 -9285 -14155 -11718 -11010 -16357 -19309 -14677 -11802 -19346
33169 -19346 -30116 -32791 -29534 -30103 -35979 -41589 -44982 -46831 -44353 -35601 -24863 -16260 -7915 830
33155 830 4357 549 -3109 -1931 -3481 -14631 -28013 -32858 -31318 -31579 -31993 -25903 -16950 -15078 -19955
33140 -19955 -21685 -16936 -12445 -12772 -15022 -15824 -14625 -10487 -3652 766 -1537 -6112 -5087 1119 4894
33125 4894 2354 -4041 -11504 -17899 -19024 -13176 -7001 -8895 -17482 -23707 -23159 -19421 -16495 -15010 -15396
$$ packed form
33223C0911J1931P982M954O443P448M777K872N972J1685J5246J5725J6294K0342
33210A62582K6265K5982J3772k881r918o239n507j4394k2428k0650j5980j6452
33198A14152j6297r185l565r194j8798j9225j2047p164m556R14M525q56q639p101
33184B964J074M207J218o20j653o469j0006m870K437P08n347k952M632K875p544
33169a9346j0770k675L257n69n876n610l393j849K478Q752J0738Q603Q345Q745
33155H30L527l808l658J178j550j1150j3382m845J540k61m14O090Q953J872m877
33140a9955j730M749M491l27k250q02J199M138O835M418k303m575J025O206L775
33125D894k540o395p463o395j125N848O175j894q587o225N48L738K926J485l86
$$ plain form
33110 -15396 -18407 -22494 -25296 -26670 -26916 -25402 -24850 -31528 -45015 -53475 -47489 -34155 -28209 -32308
33096 -32308 -35587 -29280 -13540 10288 43551 84429 126475 165863 204927 247601 296116 351651
33084 351651 411982 467624 505767 520277 515664 501977 488486 480042 475005 467357 454084 439318
33072 439318 428974 423944 421296 418766 414872 408312 400721 396227 394978 391360 381873 369771 358451
33059 358451 346295 332348 320619 313314 305845 294016 280062 266514 251372 235539 227077 230515
33047 230515 239410 247227 257510 274437 292002 303577 314383 331745 349018 352655 341280 325177
33035 325177 310260 294871 279640 267997 258337 246537 234484 226134 218115 204545 187550 172359
33023 172359 156496 135881 116891 108858 108693 107171 105970 112060 118821 111788 92724 78739 75806
$$ packed form
33110a5396l011m087k802j374k46J514N52o678j3487q460N986J3334N946m099
33096c2308l279O307J5740K3828L3263M0878M2046L9388L9064M2674M8515N5535
33084C51651O0331N5642L8143J4510m613j3687j3491q444n037p648j3273j4766
33072D39318j0344n030k648k530l894o560p591m494j249l618r487j2102j1320
33059C58451j2156j3947j1729p305p469j1829j3954j3548j5142j5833q462L438
33047B30515Q895P817J0283J6927J7565J1575J0806J7362J7273L637j1375j6103
33035C25177j4917j5389j5231j1643r660j1800j2053q350q019j3570j6995j5191
33023A72359j5863k0615j8990q033j65j522j201O090O761p033j9064j3985k933
$$ plain form
33010 75806 72624 64656 64088 77826 93174 95721 87433 77232 66526 54444 46095 44613 43907 39253
32996 39253 36840 43185 52518 54684 49840 46062 46769 48841 49535 47838 41785 30946 19864 14490
32982 14490 16771 24774 34680 40981 39782 34426 32711 35926 35995 26486 11639 1686 3323 16025
32968 16025 32672 42808 41138 33809 30480 30572 25440 14101 6416 8200 13650 16736 19896 25392
32954 25392 27366 20370 9115 2247 1489 3295 6508 11783 16948 19013 18672 18626 19371 19287 16453 8803
32938 8803 -4064 -17973 -26745 -28708 -26988 -23779 -19391 -16286 -17714 -22400 -26813 -31782 -39654 -46346
32924 -46346 -45209 -37978 -31937 -26862 -16314 -2178 5275 3976 3221 6728 6632 -31 -2903 5558 17683
32909 17683 23013 22338 21000 19062 17152 21355 32044 37649 30541 20458 20774 29320 34842 35714 39301
$$ packed form
33010G5806l182p968n68J3738J5348K547q288j0201j0706j2082q349j482p06m654
32996C9253k413O345R333K166m844l778P07K072O94j697o053j0839j1082n374
32982A4490K281Q003R906O301j199n356j715L215O9r509j4847r953J637J2702
32968A6025J6647J0136j670p329l329R2n132j1339p685J784N450L086L160N496
32954B5392J974o996j1255o868p58J806L213N275N165K065l41m6P45q4k834p650
32938H803j2867j3909q772j963J720L209M388L105j428m686m413m969p872o692
32924d6346J137P231O041N075J0548J4136P453j299p55L507r6o663k872Q461J2125
32909A7683N330o75j338j938j910M203J0689N605p108j0083L16Q546N522Q72L587
$$ plain form
32894 39301 47047 52302 51179 46292 41636 40792 46764 57018 63049 60971 57117 57335 58018 54567 50231
32879 50231 48061 43071 32736 26251 30690 35684 26296 5604 -10293 -15856 -19802 -27853 -37045 -46810
32865 -46810 -60891 -76280 -83037 -77770 -66740 -54121 -38262 -21589 -12864 -15543 -22731 -27155 -28359
32852 -28359 -27606 -24000 -19065 -17742 -20987 -23212 -20122 -14087 -9530 -7568 -6863 -5742 -2952 -253 -3221
32837 -3221 -14422 -27269 -32734 -30559 -26873 -22808 -14722 -5206 -3131 -10134 -16747 -16413 -15076 -21250
32823 -21250 -33205 -42540 -45959 -46900 -47811 -46836 -42245 -36085 -31720 -28595 -20241 1236 36902 77345
32809 77345 108911 123654 122544 110935 93945 75984 61585 54488 55297 59849 61217 55928 47951
32796 47951 43848 44653 46588 48743 53533 58928 58110 49863 41976 40174 40773 39127 37969 40828 43792
$$ packed form
32894C9301P746N255j123m887m656q44N972J0254O031k078l854K18O83l451m336
32879E0231k170m990j0335o485M439M994r388k0692j5897n563l946q051r192r765
32865d6810j4081j5389o757N267J1030J2619J5859J6673Q725k679p188m424j204
32852b8359P53L606M935J323l245k225L090O035M557J962P05J121K790K699k968
32837c221j1201j2847n465K175L686M065Q086R516K075p003o613L34J337o174
32823b1250j1955r335l419r41r11R75M591O160M365L125Q354K1477L5666M0443
32809G7345L1566J4743j110j1609j6990j7961j4399p097Q09M552J368n289p977
32796D7951m103Q05J935K155M790N395q18q247p887j802N99j646j158K859K964
$$ plain form
32781 43792 41425 35689 31526 28081 21708 13859 8883 7090 5890 4423 2636 1171 6406 27233
32767 27233 59999 85831 92314 89235 92007 98492 96216 85232 77215 75737 73993 70601 71412 75262
32753 75262 73500 65790 62044 65525 67068 59840 48034 37198 26937 17047 10596 7110 1875 -5250
32739 -5250 -9537 -11665 -17967 -28061 -32928 -28509 -21123 -16390 -13044 -10671 -12693 -17809 -19062 -15377
32725 -15377 -13566 -15232 -13403 -6907 -5683 -14830 -24758 -25337 -19852 -16481 -15210 -12288 -9617 -10272 -11102
32710 -11102 -8189 -3870 -919 3646 11218 14907 9170 351 -1819 1271 506 -6584 -14096 -18290 -21226
32695 -21226 -24667 -27576 -29449 -30414 -28506 -21950 -13539 -8488 -8346 -10304 -11329 -10102 -6468 -1853 944
32680 944 188 -3954 -11214 -20576 -27470 -26261 -17169 -6429 1560 7218 10073 7082 -269 -3786 1797
$$ packed form
32781D3792k367n736m163l445o373p849m976j793j200j467j787j465N235K0827
32767B7233L2766K5832O483l079K772O485k276j0984q017j478j744l392Q11L850
32753G5262j762p710l746L481J543p228j1806j0836j0261r890o451l486n235p125
32739e250m287k128o302j0094m867M419P386M733L346K373k022n116j253L685
32725a5377J811j666J829O496J224r147r928n79N485L371J271K922K671o55q30
32710a1102K913M319K951M565P572L689n737q819k170L090p65p090p512m194k936
32695b1226l441k909j873r65J908O556Q411N051J42j958j025J227L634M615K797
32680I44p56m142p260r362o894J209R092J0740P989N658K855k991p351l517N583
$$ plain form
32665 1797 11670 17575 17582 15644 15105 16044 16369 13648 8611 6717 11732 18546 18936 13980 12520 16907
32649 16907 20020 18318 17179 19445 19257 12865 5900 3580 2752 490 1576 9383 17158 16895 10573
32634 10573 4888 1057 -2953 -6567 -9948 -16129 -22610 -19194 -3214 11164 9616 -3155 -11981 -12590
32620 -12590 -11804 -11518 -6803 1476 5351 2004 -2945 -5280 -6246 -6422 -4086 -441 926 35 -598 -1917
32604 -1917 -6093 -9986 -8778 -4877 -4865 -8444 -9115 -5439 -2385 -1051 3181 10351 13332 9396 6130
32589 6130 10646 19171 22885 19644 14412 10887 8107 4659 1711 454 -813 -4258 -7498 -4507 5992
32574 5992 15962 16774 10921 8460 12140 14589 12461 13638 24155 36023 36802 26435 16045 12924
32560 12924 14573 15994 15746 15053 16137 21037 28663 34488 35766 34352 32281 29006 25490 25349 28629
$$ packed form
32665A797R873N905Pj938n39R39L25k721n037j894N015O814L90m956j460M387
32649A6907L113j702j139K266j88o392o965k320q28k262J086P807P775k63o322
32634A0573n685l831m010l614l381o181o481L416J5980J4378j548j2771q826o09
32620a2590P86K86M715Q279L875l347m949k335r66j76K336L645J367q91o33j319
32604a917m176l893J208L901J2l579o71L676L054J334M232P170K981l936l266
32589F130M516Q525L714l241n232l525k780l448k948j257j267l445l240K991J0499
32574E992R970Q12n853k461L680K449k128J177J0517J1868P79j0367j0390l121
32560A2924J649J421k48o93J084M900P626N825J278j414k071l275l516j41L280
$$ plain form
32545 28629 30764 31249 35624 44243 48150 42582 35045 31664 25676 10598 -4759 -8561 -6196 -12604
32531 -12604 -28590 -40732 -43171 -43789 -47923 -50501 -47393 -42396 -39324 -37221 -36293 -39534 -45828 -49475
32517 -49475 -48531 -46495 -45068 -42494 -39021 -36730 -34810 -32378 -33545 -40817 -46534 -41840 -31746 -28797
32503 -28797 -33071 -32187 -21607 -10789 -6988 -6774 -7122 -11336 -19011 -22759 -20853 -21651 -29212 -35357 -32840
32488 -32840 -26581 -24559 -26295 -27570 -28993 -32950 -38462 -44521 -51887 -56946 -51291 -32535 -8132 16313
32474 16313 44071 76453 103318 112678 104652 89241 74711 63646 55822 49676 44295 42658 47727
32461 47727 53598 48599 31192 14744 11209 17353 22807 24405 25519 27095 26990 24966 22786 21689
32447 21689 22569 24924 24551 18218 11416 13153 21498 24697 19939 18919 28457 37777 34547 23125 15519
$$ packed form
32545B8629K135M85M375Q619L907n568p537l381n988j5078j5357l802K365o408
32531a2604j5986j2142k439o18m134k578L108M997L072K103R28l241o294l647
32517d9475R44K036J427K574L473K291J920K432j167p272n717M694J0094K949
32503b8797m274Q84J0580J0818L801K14l48m214p675l748J906p98p561o145K517
32488c2840O259K022j736j275j423l957n512o059p366n059N655J8756K4403K4445
32474A6313K7758L2382K6865R360q026j5411j4530j1065p824o146n381j637N069
32461D7727N871m999j7407j6448l535O144N454J598J114J576j05k024k180j097
32447B1689Q80K355l73o333o802J737Q345L199m758j020R538R320l230j1422p606
$$ plain form
32432 15519 12767 8291 3875 8267 21547 32919 35261 33478 37372 52011 74912 97709 111209
32419 111209 112665 107207 100397 92994 84756 77437 70603 60773 48534 39417 33213 21018 -426
32406 -426 -19867 -25583 -21207 -18462 -20588 -22603 -22100 -19457 -12547 -2032 2682 -5696 -19032 -22891
32392 -22891 -16254 -10212 -9229 -6870 -263 4449 4011 4201 10106 19089 26902 32766 35106 30239 19535
32377 19535 11434 12047 18672 25599 31048 35108 35959 32561 27837 25397 24981 23765 20689 17652 17399
32362 17399 20902 25673 26681 20691 10019 867 -2154 199 2047 -3756 -19186 -37259 -47244 -44820
32348 -44820 -34533 -22629 -12640 -8358 -13184 -22742 -25639 -17432 -7680 -6770 -11766 -12986 -9205 -7165
32334 -7165 -9634 -13526 -17827 -23869 -28356 -25417 -16912 -12853 -18945 -29195 -33361 -28221 -20074 -18174
$$ packed form
32432A5519k752m476m416M392J3280J1372K342j783L894J4639K2901K2797J3500
32419A11209J456n458o810p403q238p319o834r830j2239r117o204j2195k1444
32406d26j9441n716M376K745k126k015N03K643O910J0515M714q378j3336l859
32392b2891O637O042R83K359O607M712m38J90N905Q983P813N864K340m867j0704
32377A9535q101O13O625O927N449M060Q51l398m724k440m16j216l076l037k53
32362A7399L503M771J008n990j0672r152l021K353J848n803j5430j8073r985K424
32348d4820J0287J1904R989M282m826r558k897Q207R752R10m996j220L781K040
32334g165k469l892m301o042m487K939Q505M059o092j0250m166N140Q147J900
$$ plain form
32320 -18174 -25617 -35505 -37950 -31642 -24238 -20071 -14631 -5297 763 -3139 -12038 -17376 -20167 -25751
32306 -25751 -30448 -25649 -12776 -2251 1582 3177 3952 -178 -7818 -10183 -4012 2855 2818 -2167 -6139
32291 -6139 -7147 -6164 -3950 -2406 -4592 -10899 -18568 -25451 -30419 -30971 -25540 -17420 -11322 -7478 -4376
32276 -4376 -4115 -7705 -8178 2122 18701 28761 27121 19127 9204 -2430 -12048 -13739 -10082 -9771
32262 -9771 -12441 -8152 4938 15679 18172 22115 37179 58439 76596 92903 113085 133528 144766
32249 144766 144887 140136 134963 129308 123366 117829 111027 101634 92564 87258 84230 79829 74043 68921
32235 68921 63454 54821 43413 32700 24949 19817 16033 12450 8819 6573 6690 6471 1923 -6008
32221 -6008 -11780 -12758 -11783 -10967 -8304 -2765 2238 3444 1716 -1136 -5712 -12913 -21833 -30920 -37607
$$ packed form
32320a8174p443r888k445O308P404M167N440R334O060l902q899n338k791n584
32306b5751m697M799J2873J0525L833J595P75m130p640k365O171O867l7m985l972
32291f139j008R83K214J544k186o307p669o883m968n52N431Q120O098L844L102
32276d376K61l590m73J0300J6579J0060j640p994r923j1634r618j691L657L11
32262i771k670M289J3090J0741K493L943J5064K1260J8157J6307K0182K0443J1238
32249A44766J21m751n173n655n942n537o802r393r070n306l028m401n786n122
32235F8921n467q633j1408j0713p751n132l784l583l631k246J17k19m548p931
32221f008n772r78R75Q16K663N539N003J206j728k852m576p201q920r087o687
$$ plain form
32206 -37607 -36884 -25742 -9528 2365 8031 13665 22074 28900 32248 36816 44562 50202 51060 52842
32192 52842 59103 62793 56118 42849 32960 29459 27535 22662 13090 -1362 -16219 -22142 -15316 -5182
32178 -5182 -4785 -15434 -27130 -32029 -30951 -27890 -24539 -20772 -16321 -11452 -7904 -7900 -10870 -13895 -16698
32163 -16698 -22029 -29194 -32540 -29565 -25219 -24247 -24652 -23272 -22236 -24237 -26189 -23784 -18477 -14044 -9711
32148 -9711 -2598 5891 11549 12769 10222 4334 -2950 -7867 -10278 -14826 -22633 -27588 -25878 -22657 -22865
32133 -22865 -22192 -15403 -7766 -8578 -17398 -26037 -30698 -32584 -29727 -19111 -5928 -463 -5021 -12043
32119 -12043 -15321 -15480 -14649 -13607 -14337 -18008 -20521 -17222 -11606 -11646 -17773 -22478 -21930 -19638 -17958 -14666
32103 -14666 -9760 -7505 -9057 -10199 -9112 -9697 -14341 -19457 -21079 -19631 -17090 -14762 -15313 -20697 -26239
$$ packed form
32206c7607P23J1142J6214J1893N666N634Q409O826L348M568P746N640Q58J782
32192E2842O261L690o675j3269r889l501j924m873r572j4452j4857n923O826J0134
32178e182L97j0649j1696m899J078L061L351L767M451M869L548Mk970l025k803
32163a6698n331p165l346K975M346R72m05J380J036k001j952K405N307M433M333
32148i711P113Q489N658J220k547n888p284m917k411m548p807m955J710L221k08
32133b2865O73O789P637q12q820q639m661j886K857J0616J3183N465m558p022
32119a2043l278j59Q31J042p30l671k513L299N616m0o127m705N48K292J680L292
32103a4666M906K255j552j142J087n85m644n116j622J448K541K328n51n384n542
$$ plain form
32088 -26239 -23886 -14370 -9061 -15184 -25353 -27322 -19307 -9603 -4316 -2025 329 1603 -2159 -12672
32074 -12672 -26335 -35970 -36896 -31747 -27593 -28051 -30632 -32087 -32968 -35275 -38594 -40909 -41374 -40305 -37985
32059 -37985 -35357 -34688 -37517 -42273 -45363 -44648 -41004 -36240 -30273 -21724 -11962 -6843 -11548 -23422 -32780
32044 -32780 -32475 -25133 -19918 -23611 -35278 -47781 -54048 -53649 -52644 -54698 -54681 -46212 -33403 -26822 -27522
32029 -27522 -24921 -13812 -3281 -2487 -6584 -5214 2112 8496 11933 15176 17200 14754 10255 9119
32015 9119 10786 10529 8338 7696 7273 2582 -4940 -9015 -8533 -8862 -13157 -19290 -25160 -30515 -34215 -35621
31999 -35621 -36934 -38238 -33718 -20466 -7173 -4664 -10962 -15960 -17644 -21709 -27433 -27891 -24244 -25731
31985 -25731 -33514 -38158 -36126 -35026 -38137 -37553 -29099 -21155 -20608 -21400 -16209 -9817 -10901 -17965 -22698
$$ packed form
32088b6239K353R516N309o123j0169j969Q015R704N287K291K354J274l762j0513
32074a2672j3663r635r26N149M154m58k581j455q81k307l319k315m65J069K320
32059c7985K628O69k829m756l090P15L644M764N967Q549R762N119m705j1874r358
32044c2780L05P342N215l693j1667j2503o267L99J005k054J7Q469J2809O581p00
32029b7522K601J1109J0531P94m097J370P326O384L437L243K024k446m499j136
32015I119J667k57k191o42m23m691p522m075M82l29m295o133n870n355l700j406
31999c5621j313j304M520J3252J3293K509o298m998j684m065n724m58L647j487
31985b5731p783m644K032J100l111N84Q454P944N47p92N191O392j084p064m733
$$ plain form
31970 -22698 -21521 -15937 -7439 349 636 -7200 -12713 -7358 2207 2511 -8311 -19034 -20494 -14837
31956 -14837 -10277 -12530 -21120 -29937 -31964 -26188 -18377 -13621 -11572 -10689 -12038 -15657 -18096 -17501 -16721
31941 -16721 -17602 -16862 -11849 -5987 -4248 -7128 -12691 -19808 -25571 -24795 -17094 -9860 -9343 -13197 -16434
31926 -16434 -19570 -24945 -29506 -28062 -21116 -13850 -9404 -7583 -7736 -8955 -9939 -11445 -15187 -18172 -14061
31911 -14061 -3739 2429 -1638 -8437 -8246 -3560 -3561 -8883 -11616 -8356 -4177 -3800 -6091 -7836 -7467 -4929
31895 -4929 -2029 -2282 -6941 -12859 -17166 -20772 -23723 -21717 -12695 -2811 411 -2423 -6264 -11171 -20407
31880 -20407 -31046 -34852 -29145 -20496 -16595 -18849 -23574 -26975 -28569 -31272 -36886 -41259 -38286 -29873
31866 -29873 -25272 -27252 -26870 -17677 -7001 -4765 -8198 -8206 -5650 -9342 -20202 -28859 -28744 -22171 -13984
$$ packed form
31970b2698J177N584Q498P788K87p836n513N355R565L04j0822j0723j460N657
31956a4837M560k253q590q817k027N776P811M756K049Q83j349l619k439N95P80
31941a6721q81P40N013N862J739k880n563p117n763P76P701P234N17l854l237
31926a6434l136n375m561J444O946P266M446J821j53j219r84j506l742k985M111
31911a4061J0322O168m067o799J91M686jn322k733L260M179L77k291j745L69K538
31895d929K900k53m659n918m307l606k951K006R022R884L222k834l841m907r236
31880b0407j0639l806N707Q649L901k254m725l401j594k703n614m373K973Q413
31866b9873M601j980L82R193J0676K236l433qK556l692j0860q657J15O573Q187
$$ plain form
31851 -13984 -8149 -9766 -20793 -33721 -38575 -36214 -35660 -38892 -39228 -35851 -37976 -50078 -62829 -64859
31837 -64859 -56826 -48643 -48092 -56093 -68191 -76963 -77266 -72000 -69062 -71448 -75227 -77870 -81999 -89103 -96589
31822 -96589 -104146 -116303 -134620 -153253 -167074 -179446 -197170 -221546 -249010 -277621 -308692 -344152
31810 -344152 -385597 -433725 -485523 -533931 -573167 -603188 -627060 -645664 -657166 -660999 -661064 -664373
31798 -664373 -674246 -682818 -673545 -636885 -582975 -533218 -498917 -473588 -446428 -415765 -386025 -358179
31786 -358179 -329119 -297267 -264034 -231463 -201750 -177199 -157548 -138891 -118102 -97375 -82202
31775 -82202 -75530 -75273 -76578 -75406 -70831 -64756 -59072 -53604 -47957 -43995 -43777 -45710 -45784 -42418 -36966
31760 -36966 -29999 -21209 -13398 -11835 -17378 -23589 -23542 -17688 -12912 -14845 -22420 -29133 -28947 -21774 -13596
$$ packed form
31851a3984N835j617j1027j2928m854K361N54l232l36L377k125j2102j2751k030
31837f4859Q033Q183N51q001j2098q772l03N266K938k386l779k643m129p104p486
31822i6589p557j2157j8317j8633j3821j2372j7724k4376k7464k8611l1071l5460
31810c44152m1445m8128n1798m8408l9236l0021k3872j8604j1502l833o5l309
31798f64373r873q572R273L6660N3910M9757L4301K5329K7160L0663K9740K7846
31786c58179K9060L1852L3233L2571K9713K4551J9651J8657K0789K0727J5173
31775h2202O672K57j305J172M575O075N684N468N647L962K18j933p4L366N452
31760c6966O967Q790P811J563n543o211M7N854M776j933p575o713J86P173Q178
$$ plain form
31745 -13596 -10760 -14613 -21933 -28459 -30272 -24258 -11233 1797 6109 -698 -12240 -18828 -14985 -3324
31731 -3324 7395 9578 3663 -3785 -8958 -13911 -19630 -21840 -17863 -12750 -12902 -17169 -20069 -20786 -22523
31716 -22523 -25273 -25979 -24781 -24826 -26413 -26684 -24644 -21848 -19192 -17268 -17947 -21080 -22312 -19192 -16200 -17887
31700 -17887 -20721 -18706 -13671 -12159 -14928 -17682 -19529 -22234 -23754 -21646 -20396 -25678 -33686 -36225
31686 -36225 -33612 -31180 -26103 -11841 5536 11216 3564 -3025 -348 3902 3305 3720 9384 12356
31672 12356 5787 -3914 -8386 -10793 -17720 -26080 -28397 -24555 -19239 -13762 -8427 -6761 -9645 -11525
31658 -11525 -9724 -10643 -18977 -28197 -30646 -30150 -34545 -41353 -41502 -33597 -24798 -20239 -19964 -23422 -28919
31643 -28919 -31215 -27418 -22884 -24318 -29686 -31756 -28871 -25449 -24388 -25336 -27897 -30520 -28889 -21157 -12011
$$ packed form
31745a3596K836l853p320o526j813O014J3025J3030M312o807j1542o588L843J1661
31731c324J0719K183n915p448n173m953n719k210L977N113j52m267k900p17j737
31716b2523k750p06J198m5j587k71K040K796K656J924o79l133j232L120K992j687
31700a7887k834K015N035J512k769k754j847k705j520K108J250n282q008k539
31686c6225K613K432N077J4262J7377N680p652o589K677M250n97M15N664K972
31672A2356o569r701m472k407o927q360k317L842N316N477N335J666k884j880
31658a1525J801r19q334r220k449M96m395o808j49P905Q799M559K75l458n497
31643b8919k296L797M534j434n368k070K885L422J061r48k561k623J631P732R146
$$ plain form
31628 -12011 -6670 -4548 -3627 -5909 -12383 -17762 -17314 -14565 -15351 -18852 -21497 -24572 -29792 -32372 -27712
31613 -27712 -21027 -20643 -24745 -24697 -19623 -17720 -23263 -30945 -33594 -28745 -18081 -6895 -3299 -11442 -25780
31598 -25780 -37025 -42103 -43580 -42774 -39939 -38272 -40575 -43836 -43506 -41054 -41312 -44873 -48911 -52369 -54604
31583 -54604 -52756 -46612 -41485 -39612 -34059 -18907 171 14581 26384 42715 61265 72835 75344
31570 75344 74327 72088 66991 60749 55726 48142 35259 25495 28334 37183 36852 26622 20681 25441
31556 25441 31812 31678 26793 18347 2996 -15599 -25315 -21984 -15717 -15437 -18535 -20849 -24474 -29140
31542 -29140 -27716 -18293 -10424 -11255 -14880 -13815 -12289 -18822 -32338 -44503 -50814 -51762 -47477 -38274
31528 -38274 -27506 -18925 -14119 -14785 -22004 -30745 -31883 -23262 -12254 -4396 2822 11418 17216 18098
$$ packed form
31628a2011N341K122R21k282o474n379M48K749p86l501k645l075n220k580M660
31613b7712O685L84m102M8N074J903n543p682k649M849J0664J1186L596q143j4338
31598b5780j1245n078j477Q06K835J667k303l261L30K452k58l561m038l458k235
31583e4604J848O144N127J873N553J5152J9078J4410J1803J6331J8550J1570K509
31570G5344j017k239n097o242n023p584j2883r764K839Q849l31j0230n941M760
31556B5441O371j34m885q446j5351j8595r716L331O267K80l098k314l625m666
31542b9140J424R423P869q31l625J065J526o533j3516j2165o311r48M285R203
31528c8274J0768Q581M806o66p219q741j138Q621J1008P858P218Q596N798Q82
$$ plain form
31514 18098 19661 26027 31992 30807 23699 15715 8325 2185 1112 6552 12945 14447 12138 10190
31500 10190 10088 12471 18411 24661 24524 17857 12668 12249 9818 1878 -3421 -228 2268 -7251 -23424
31485 -23424 -30824 -25354 -17029 -13831 -14443 -16718 -22568 -32173 -40841 -43956 -40518 -31669 -20149 -10860
31471 -10860 -7805 -10604 -15894 -19878 -18091 -7999 4551 7352 -4227 -20218 -28437 -28551 -27669 -27955
31457 -27955 -27064 -26422 -29798 -35913 -40710 -45140 -52964 -62357 -67277 -66401 -64136 -63728 -65249 -68594 -72306
31442 -72306 -71619 -64477 -57472 -58500 -64990 -66999 -61136 -53836 -50938 -51726 -54354 -60030 -69288 -78892 -84816
31427 -84816 -85693 -83148 -81286 -84724 -93911 -103754 -109678 -112781 -116213 -120386 -125740 -135555 -150259 -163180
31413 -163180 -168563 -169808 -172177 -171102 -156936 -129521 -99016 -73067 -51577 -33492 -19306 -5738
$$ packed form
31514A8098J563O366N965j185p108p984p390o140j073N440O393J502k309j948
31500A0190j02K383N940O250j37o667n189m19k431p940n299L193K496r519j6173
31485b3424p400N470Q325L198o12k275n850r605q668l115L438Q849J1520R289
31471a0860L055k799n290l984J787J0092J2550K801j1579j5991q219j14Q82k86
31457b7955Q91O42l376o115m797m430p824r393m920Q76K265M08j521l345l712
31442g2306O87P142P005j028o490k009N863P300K898p88k628n676r258r604n924
31427h4816q77K545J862l438r187r843n924l103l432m173n354r815j4704j2921
31413a63180n383j245k369J075J4166K7415L0505K5949K1490J8085J4186J3568
$$ [...]
##END NTUPLES=NMR SPECTRUM
##END=
