##TITLE=31Pdec_DMP-04
 
 24 sc
 9.4.2024
##JCAMPDX= 6.0         $$ Bruker NMR JCAMP-DX V2.0
##DATA TYPE= NMR SPECTRUM
##DATA CLASS= NTUPLES
##ORIGIN= UXNMR, Bruker Analytische Messtechnik GmbH
##OWNER= root
$$ XWIN-NMR		Version 3.5
$$ Tue Apr  9 13:47:15 2024 Russian Standard Time (UT+4h)  she@DPX200
##.OBSERVE FREQUENCY= 81.013821
##.OBSERVE NUCLEUS= ^31P
##.ACQUISITION MODE= SIMULTANEOUS
##.ACQUISITION SCHEME= undefined
##.AVERAGES= 24
##.DIGITISER RES= 16
##SPECTROMETER/DATA SYSTEM= spect
##.PULSE SEQUENCE= zgpg30
##.SOLVENT NAME= CDCl3
##.SHIFT REFERENCE= (INTERNAL, CDCl3, 0, 248.564)
##AUDIT TRAIL= $$ (NUMBER, WHEN, WHO, WHERE, WHAT)
$$ ##TITLE= Audit trail, XWIN-NMR		Version 3.5
$$ ##JCAMPDX= 5.01
$$ ##ORIGIN= Bruker BioSpin GmbH
$$ ##OWNER= she
$$ F:/spectra/data/she/nmr/P31/1/pdata/1/auditp.txt
$$ ##AUDIT TRAIL=  $$ (NUMBER, WHEN, WHO, WHERE, WHAT)
(   1,<2024-04-09 13:46:23.14 +0400>,<she>,<DPX200>,
      <created by zg, POWCHK disabled, PULCHK disabled
       configuration hash MD5:
       00 E9 B6 7A A2 85 ED C7 34 08 36 98 17 FE 4E 26
       data hash MD5: 32K
       05 4A 71 23 EB C9 B5 A3 D9 15 B2 84 0C FF 15 F4>)
(   2,<2024-04-09 13:46:25.35 +0400>,<she>,<DPX200>,
      <Start of raw data processing
       efp BC_mod = 2 LB = 10 FT_mod = 6 PKNL = 1 PHC0 = -13231.73 PHC1 = 64.08333 SI = 64K 
       data hash MD5: 64K
       F9 A6 E7 42 67 16 E2 18 5A 48 C1 B2 24 38 5C 1E>)
(   3,<2024-04-09 13:46:46.42 +0400>,<she>,<DPX200>,
      <pk PHC0 = -98.46582 PHC1 = 0 
       data hash MD5: 64K
       28 A1 3D 01 06 1C 42 73 4E 51 DF 17 79 AD E7 11>)
(   4,<2024-04-09 13:46:49.85 +0400>,<she>,<DPX200>,
      <abs ABSG = 5 
       data hash MD5: 64K
       A1 84 D6 EA 2A A8 7B 80 22 67 A8 85 63 98 4C A3>)
$$ ##END=
$$ 
$$ hash MD5
$$ 28 18 5F 80 9E B5 98 05 74 63 66 FC E6 BC 0A 20
##$RELAX= 
##$RELAX= 
##$RELAX= 
##$RELAX= 
##$RELAX= 
##$RELAX= 
##$RELAX= 
##$RELAX= 
##$RELAX= 
$$ Bruker specific parameters
$$ --------------------------
##$DU= <F:/spectra>
##$EXPNO= 1
##$NAME= <P31>
##$PROCNO= 1
##$TYPE= <nmr>
##$USER= <she>
##$AMP= (0..31)
100 100 100 100 100 100 100 100 100 100 100 100 100 100 100 100 100 100 
100 100 100 100 100 100 100 100 100 100 100 100 100 100 
##$AQSEQ= 0
##$AQ_mod= 1
##$AUNM= <au_zg>
##$AUTOPOS= <>
##$BF1= 81.014009
##$BF2= 200.13
##$BF3= 200.13
##$BF4= 200.13
##$BF5= 200.13
##$BF6= 200.13
##$BF7= 200.13
##$BF8= 200.13
##$BYTORDA= 1
##$CFDGTYP= 0
##$CFRGTYP= 5
##$CHEMSTR= <none>
##$CNST= (0..31)
1 1 145 1 1 1 1 1 1 1 1 1 1 1 1 1 1 1 1 1 1 1 1 1 1 1 1 1 1 1 1 1 
##$CPDPRG= <waltz16>
##$CPDPRG1= <>
##$CPDPRG2= <waltz16>
##$CPDPRG3= <>
##$CPDPRG4= <mlev>
##$CPDPRG5= <mlev>
##$CPDPRG6= <mlev>
##$CPDPRG7= <mlev>
##$CPDPRG8= <mlev>
##$CPDPRGB= <>
##$CPDPRGT= <>
##$D= (0..31)
0 1 0 0 0 0 0 0 0 0 0 0.03 2e-05 3e-06 0 0 0 0 0 0 0 0 0 0 0 0 0 0 0 0 
0 0 
##$DATE= 1712655982
##$DBL= (0..7)
120 120 120 11 120 120 24 19 
##$DBP= (0..7)
150 150 150 150 150 150 150 150 
##$DBP07= 0
##$DBPNAM0= <>
##$DBPNAM1= <>
##$DBPNAM2= <>
$$ [...]
##$SUBNAM3= <"">
##$SUBNAM4= <"">
##$SUBNAM5= <"">
##$SUBNAM6= <"">
##$SUBNAM7= <"">
##$SUBNAM8= <"">
##$SUBNAM9= <"">
##$SW= 501.771253377433
##$SWIBOX= (0..15)
0 1 3 0 0 0 0 0 0 0 0 0 0 0 0 0 
##$SW_h= 40650.406504065
##$TD= 32768
##$TD0= 1
##$TE= 0
##$TE2= 300
##$TE3= 300
##$TEG= 300
##$TL= (0..7)
0 120 53 12 22 120 120 120 
##$TP= (0..7)
150 150 150 150 150 150 150 150 
##$TP07= 0
##$TPNAME0= <>
##$TPNAME1= <>
##$TPNAME2= <>
##$TPNAME3= <>
##$TPNAME4= <>
##$TPNAME5= <>
##$TPNAME6= <>
##$TPNAME7= <>
##$TPOAL= (0..7)
0.5 0.5 0.5 0.5 0.5 0.5 0.5 0.5 
##$TPOFFS= (0..7)
0 0 0 0 0 0 0 0 
##$TUNHIN= 0
##$TUNHOUT= 0
##$TUNXOUT= 0
##$USERA1= <user>
##$USERA2= <user>
##$USERA3= <user>
##$USERA4= <user>
##$USERA5= <user>
##$V9= 5
##$VALIST= <valist>
##$VCLIST= <CCCCCCCCCCCCCCC>
##$VD= 0
##$VDLIST= <DDDDDDDDDDDDDDD>
##$VPLIST= <PPPPPPPPPPPPPPP>
##$VTLIST= <TTTTTTTTTTTTTTT>
##$WBST= 1024
##$WBSW= 4
##$XGAIN= (0..3)
0 0 0 0 
##$XL= 0
##$YL= 0
##$YMAX_a= 5014
##$YMIN_a= -4961
##$ZGOPTNS= <>
##$ZL1= 120
##$ZL2= 120
##$ZL3= 120
##$ZL4= 120
##$ABSF1= 248.5645
##$ABSF2= -253.2056
##$ABSG= 5
##$ABSL= 3
##$ALPHA= 0
##$AQORDER= 0
##$ASSFAC= 0
##$ASSFACI= 0
##$ASSFACX= 0
##$ASSWID= 0
##$AUNMP= <proc_1d>
##$AZFE= 0.1
##$AZFW= 0.5
##$BCFW= 0
##$BC_mod= 2
##$BYTORDP= 0
##$COROFFS= 0
##$CY= -3
##$DATMOD= 1
##$DC= 0
##$DFILT= <>
##$DTYPP= 0
##$F1P= 0
##$F2P= 0
##$FCOR= 1
##$FTSIZE= 65536
##$FT_mod= 6
##$GAMMA= 0
##$GB= 0
##$INTBC= 1
##$INTSCL= 6.047779e-11
##$ISEN= 30
##$LB= 10
##$LEV0= 0
##$LPBIN= 0
##$MAXI= 10000
##$MC2= 0
##$MEAN= 0
##$ME_mod= 0
##$MI= 50
##$NCOEF= 0
##$NC_proc= -7
##$NLEV= 6
##$NOISF1= 182.463
##$NOISF2= 159.3651
##$NSP= 0
##$NTH_PI= 0
##$NZP= 0
##$OFFSET= 248.5645
##$PC= 4
##$PHC0= -13330.2
##$PHC1= 64.08333
##$PH_mod= 1
##$PKNL= yes
##$PPARMOD= 0
##$PSCAL= 0
##$PSIGN= 0
##$REVERSE= no
##$SF= 81.0140089999694
##$SI= 65536
##$SIGF1= 159.3651
##$SIGF2= -187.1042
##$SINO= 113.3802
##$SIOLD= 16384
##$SREGLST= <1H.CDCl3>
##$SSB= 0
##$STSI= 65536
##$STSR= 0
##$SW_p= 40650.406504065
##$SYMM= 0
##$S_DEV= 0
##$TDeff= 32768
##$TDoff= 0
##$TI= <>
##$TILT= no
##$TM1= 0
##$TM2= 0
##$TOPLEV= 0
##$USERP1= <user>
##$USERP2= <user>
##$USERP3= <user>
##$USERP4= <user>
##$USERP5= <user>
##$WDW= 1
##$XDIM= 65536
##$YMAX_p= 418837908
##$YMIN_p= -3584944
$$ End of Bruker specific parameters
$$ ---------------------------------
##NTUPLES= NMR SPECTRUM
##VAR_NAME=  FREQUENCY,     SPECTRUM/REAL,   SPECTRUM/IMAG
##SYMBOL=    X,             R,               I
##VAR_TYPE=  INDEPENDENT,   DEPENDENT,       DEPENDENT
##VAR_FORM=  AFFN,          ASDF,            ASDF
##VAR_DIM=   65536,         65536,           65536
##UNITS=     HZ,            ARBITRARY UNITS, ARBITRARY UNITS
##FACTOR=    0.620285442955139, 1,           1
##FIRST=     20137.2065510682, 0,            0
##LAST=      -20513.1999529968, 0,           0
##MIN=       -20513.1999529968, -3584944,    0
##MAX=       20137.2065510682, 418837908,    0
$$ Real data points
##PAGE= N=1
##DATA TABLE= (X++(R..R)), XYDATA
$$ [...]
38033b0434j293O00K891N586Q717J2285J6238K0460K4786K9021L2940L6289L8800
38020B06886M0204M0291L8973L6315L2539K7972K2968J7863J2930Q389M397J043
38008D90770j656l768n388o645p651q508r281r993j0632j1174j1588j1857j1983
37995C80646j1976j1855j1626j1286j0828j0250r557q741p789o676n422m114k872
37982B67654j825j067o55o15r42j573k400l273m050m623m942n009m886m667m435
37967B22692m259m189m269m515m878n238n460n425n107m557l891l218k619k097
37953A62970j628j183p77m89m28o97j328k268l387m509n473o140o416o264n739
37938A16244m986m168l414k773k227j750j329r71o75m22j87M4K72M97P27R85J281
$$ plain form
38033 -20434 -21727 -21127 -18236 -12650 -3933 8352 24590 45050 69836 98857 131797 168086 206886
38020 206886 247090 287381 326354 362669 395208 423180 446148 464011 476941 485330 489727 490770
38008 490770 489114 485346 479958 473313 465662 457154 447873 437880 427248 416074 404486 392629 380646
37995 380646 368670 356815 345189 333903 323075 312825 303268 294527 286738 280062 274640 270526 267654
37982 267654 265829 264762 264107 263492 262550 260977 258577 255304 251254 246631 241689 236680 231794 227127 222692
37967 222692 218433 214244 209975 205460 200582 195344 189884 184459 179352 174795 170904 167686 165067 162970
37953 162970 161342 160159 159382 158893 158465 157768 156440 154172 150785 146276 140803 134663 128247 121983 116244
37938 116244 111258 107090 103676 100903 98676 96926 95597 94626 93951 93529 93342 93386 93658 94155 94882 95867 97148
37921I7148J592J879K094K221K272K296K366K551K905L412M002M574N061N458
37907A39831N800O129O434O641O671O493O154N780N511N444N577N805N947N805
37893B24022N222M156K693J035n95k032l208m158m955n648o244o698o952o954
37879A89684o685o166n453m624l768k953k238j674j312j192j309j626k048k470
37865A46166k802k999l059l008k882k705k471k150j722j193o17o5M12P98J114
37850A22817J387J622J793J850J740J433R60M09j12n31q73j224j653k161k661
37835A24796l055l306l438l521l602l689l761l779l733l622l446l172k753k156
37821G7763j408n94J68P75J188J433J585J723J883K066K229K333K334K188J868
$$ plain form
37921 97148 98740 100619 102713 104934 107206 109502 111868 114419 117324 120736 124738 129312 134373 139831
37907 139831 145631 151760 158194 164835 171506 177999 184153 189933 195444 200888 206465 212270 218217 224022
37893 224022 229244 233400 236093 237128 236533 234501 231293 227135 222180 216532 210288 203590 196638 189684
37879 189684 182999 176833 171380 166756 162988 160035 157797 156123 154811 153619 152310 150684 148636 146166
37865 146166 143364 140365 137306 134298 131416 128711 126240 124090 122368 121175 120558 120493 120905 121703 122817
37850 122817 124204 125826 127619 129469 131209 132642 133602 134011 133899 133368 132495 131271 129618 127457 124796
37835 124796 121741 118435 114997 111476 107874 104185 100424 96645 92912 89290 85844 82672 79919 77763
37821 77763 76355 75761 75929 76704 77892 79325 80910 82633 84516 86582 88811 91144 93478 95666 97534
37806I7534J387Q09K20k91o48q19q25p39o80p42r66j302j631j819j779j542j237
37789H4930j027j025j242j595j956k207k273k142j856j500j183j022j107j482
37775F3313k130k981l949m970o005p000p896q609r087r334r401r376r330r317
37761c6072r367r470r552r430q854p576n442k466J162N105Q977J2442J5253J7317
37747c7973J8638J9292J9362J8904J7936J6508J4710J2702J0661Q738P018N488
37735A31984M041K540Q70j006l034n081o963q493r520r926r679q809p408n583
37721F3933l423r97J614M307O936R342J1400J3044J4315J5320J6173J6960J7702
37708A86626J8372J8903J9221J9274J9042J8529J7722J6593J5099J3235J1052
$$ plain form
37806 97534 98921 99730 99950 99659 99011 98192 97367 96628 95948 95206 94240 92938 91307 89488 87709 86167 84930
37789 84930 83903 82878 81636 80041 78085 75878 73605 71463 69607 68107 66924 65902 64795 63313
37775 63313 61183 58202 54253 49283 43278 36278 28382 19773 10686 1352 -8049 -17425 -26755 -36072
37761 -36072 -45439 -54909 -64461 -73891 -82745 -90321 -95763 -98229 -97067 -91962 -82985 -70543 -55290 -37973
37747 -37973 -19335 -43 19319 38223 56159 72667 87377 100079 110740 119478 126496 131984
37735 131984 136025 138565 139435 138429 135395 130314 123351 114858 105338 95412 85733 76924 69516 63933
37721 63933 60510 59513 61127 65434 72370 81712 93112 106156 120471 135791 151964 168924 186626
37708 186626 204998 223901 243122 262396 281438 299967 317689 334282 349381 362616 373668
37697C73668Q668O234L884J717k15j892l300m433n269n806o036n956n573m883
37683C50808l902k668j254K22J643K922M040N042N991O928P855Q730R491J0070
37669D05918J0420J0520J0369R993R415Q645P685O521N147L601J974M22r02j874
37655D87854k462k702k685k485k136j632r69j78O92J598K539L557M711O033P501
37640D99236R034J0556J2024J3450J4861J6246J7523J8546J9158J9264J8847J7960
37628F86705J6672J5007J2936J0402P364L860jl994p829j1179j3737j5275j5681
37615F85250j4950j3165j0472p071l203Q73M933Q800J2377J5601J8433K0817K2702
37602G40925K4040K4820K5063K4824K4162K3084K1528J9357J6386J2454P462J434
$$ plain form
37697 373668 382336 388570 392454 394171 393956 392064 388764 384331 379062 373256 367220 361264 355691 350808
37683 350808 346906 344238 342984 343206 344849 347771 351811 356853 362844 369772 377627 386357 395848 405918
37669 405918 416338 426858 437227 447220 456635 465280 472965 479486 484633 488234 490208 490630 489728 487854
37655 487854 485392 482690 480005 477520 475384 473752 472783 472605 473297 474895 477434 480991 485702 491735 499236
37640 499236 508270 518826 530850 544300 559161 575407 592930 611476 630634 649898 668745 686705
37628 686705 703377 718384 731320 741722 749086 752946 752945 748951 741122 729943 716206 700931 685250
37615 685250 670300 657135 646663 639592 636389 637262 642195 650995 663372 678973 697406 718223 740925
37602 740925 764965 789785 814848 839672 863834 886918 908446 927803 944189 956643 964105 965539
37590I65539n481j2990k0670k7993l4378l9242m2141m2828m1348l8021l3340k7861
37578E99246k2051j6207j0453m763R48O755J2695J8757K4904L1093L7308M3588
37566G21820N0025N6763O3960P1791Q0427R0026J00702J12503J25443J39529J54796
37555A767785J71263J88877K07427K26448K45155K62380K76476K85229K85811
37546C916851K74915K49191K06096J45148O9119j5595j00038j75031k33656k72719
37536D064281k92653k96361k87799k70923k49125k25044k00603j77121j55450
37527A909202j36061j19151j04716r2601q2557p4303o7568o2126n7798n4408n1779
37516A006134m9735m8089m6663m5301m3874m2312m0575l8657l6560l4288l1854
$$ plain form
37590 965539 960058 947068 926398 898405 864027 824785 782644 739816 698468 660447 627107 599246
37578 599246 577195 560988 550535 545772 546720 553475 566170 584927 609831 640924 678232 721820
37566 721820 771845 828608 892568 964359 1044786 1134812 1235514 1348017 1473460 1612989 1767785
37555 1767785 1939048 2127925 2335352 2561800 2806955 3069335 3345811 3631040 3916851
37546 3916851 4191766 4440957 4647053 4792201 4861320 4845725 4745687 4570656 4337000 4064281
37536 4064281 3771628 3475267 3187468 2916545 2667420 2442376 2241773 2064652 1909202
37527 1909202 1773141 1653990 1549274 1456673 1374116 1299813 1232245 1170119 1112321 1057913 1006134
37516 1006134 956399 908310 861647 816346 772472 730160 689585 650928 614368 580080 548226
37505E48226k9283k6610k3867k1070j8241j5418j2667j0097p837o013m703l910
37493C68510l570l568l787m119m492m847n154n398n580n716n826n930o061o251
37479B98211o505o787p046p241p361p413p403p326p163o893o515o048n534n000
37465B03976m447l834l108k225j187n7J054K008K705L106L207L034K577J832Q41
37450B09482k86j385k301k937l276l354l244l024k755k475k190j893j564j182
37436A77616p29k00L85R77J501J862J980J825J432Q91L35j19m00n04m72l64k19
37419A85797m5J74M54P77J093J338J479J534J566J646J786J919J926J699J196
37404B04339M71l65j186j895k439k807k996l033k939k777k619k527k505k503k446
$$ plain form
37505 548226 518943 492333 468466 447396 429155 413737 401070 390973 383136 377123 372420 368510
37493 368510 364940 361372 357585 353466 348974 344127 338973 333575 327995 322279 316453 310523 304462 298211
37479 298211 291706 284919 277873 270632 263271 255858 248455 241129 233966 227073 220558 214510 208976 203976
37465 203976 199529 195695 192587 190362 189175 189118 190172 192180 194885 197991 201198 204232 206809 208641 209482
37450 209482 209196 207811 205510 202573 199297 195943 192699 189675 186920 184445 182255 180362 178798 177616
37436 177616 176887 176687 177072 178049 179550 181412 183392 185217 186649 187540 187875 187756 187356 186852 186380 186016 185797
37419 185797 185752 185926 186380 187157 188250 189588 191067 192601 194167 195813 197599 199518 201444 203143 204339
37404 204339 204810 204445 203259 201364 198925 196118 193122 190089 187150 184373 181754 179227 176722 174219 171773
37389A71773k292k040j711j322q72l67J58O16Q95R21O84K52k59p18j003j030p75
37372A62910k80L58R90J467J650J480J000L45k83p17q58p11l54J09N87J029J380
37355A70102J595J606J349P72j28j271k501l644m559n196n565n706n671n526n354
37340A30303n228n180n201n245n251n155m897m446l820l072k306j631j133q69
37326G6869q40j019j352j760k153k469k682k832k982l164l373l576l741l869m002
37311C7055m161m346m518m659m811n075n567o370p493q874j0427j2106j3919j5922
37297g1193j8171k0691k3451k6403k9520l2807l6304m0076m4180m8696n3693n9226
37285e04411o5304p1882p8888q6229r3775j01362j08764j15724j21950j27123
$$ plain form
37389 171773 169481 167441 165730 164408 163536 163169 163327 163943 164838 165759 166443 166695 166436 165718 164715 163685 162910
37372 162910 162630 162988 163978 165445 167095 168575 169575 169920 169637 168920 168062 167351 166997 167106 167693 168722 170102
37355 170102 171697 173303 174652 175424 175296 174025 171524 167880 163321 158125 152560 146854 141183 135657 130303
37340 130303 125075 119895 114694 109449 104198 99043 94146 89700 85880 82808 80502 78871 77738 76869
37326 76869 76029 75010 73658 71898 69745 67276 64594 61762 58780 55616 52243 48667 44926 41057 37055
37311 37055 32894 28548 24030 19371 14560 9485 3918 -2452 -9945 -18819 -29246 -41352 -55271 -71193
37297 -71193 -89364 -110055 -133506 -159909 -189429 -222236 -258540 -298616 -342796 -391492 -445185 -504411
37285 -504411 -569715 -641597 -720485 -806714 -900489 -1001851 -1110615 -1226339 -1348289 -1475412
37275a475412j30897j32871j32555j29323j22417j11017r4445p2465m5615j5357
37265b462374J6081M6189P2750R4283J10179J20549J25984J27316J25453J21276
37255a502314J15545J08874J01722R4406Q7118P9982P3102O6602O0601N5177N0353
37244f08832M6083M2284L8854L5706L2779L0072K7623K5493K3706K2242K1016
37233b62974J9938J8925J7950J7029J6197J5474J4847J4263J3669J3022J2318
37222h9342J1568J0801J0050R353Q749Q275P946P749P648P577P471P280O993O654
37208B8772O327O081N955N959O070O249O440O598O715O809O900O988P053P052
37194A19968O964O789O552O275N964N616N214M749M221L630K981K290J590R67
$$ plain form
37275 -1475412 -1606309 -1739180 -1871735 -2001058 -2123475 -2234492 -2328937 -2401402 -2447017 -2462374
37265 -2462374 -2446293 -2400104 -2327354 -2233071 -2122892 -2002343 -1876359 -1749043 -1623590 -1502314
37255 -1502314 -1386769 -1277895 -1176173 -1081767 -994649 -914667 -841565 -774963 -714362 -659185 -608832
37244 -608832 -562749 -520465 -481611 -445905 -413126 -383054 -355431 -329938 -306232 -283990 -262974
37233 -262974 -243036 -224111 -206161 -189132 -172935 -157461 -142614 -128351 -114682 -101660 -89342
37222 -89342 -77774 -66973 -56923 -47570 -38821 -30546 -22600 -14851 -7203 374 7845 15125 22118 28772
37208 28772 35099 41180 47135 53094 59164 65413 71853 78451 85166 91975 98875 105863 112916 119968
37194 119968 126932 133721 140273 146548 152512 158128 163342 168091 172312 175942 178923 181213 182803 183770
37180A83770N17L46N16J028J803K696L533M177M568M763M898N152N693O642Q082
37165B38184J0039J2522J5492J8881K2570K6423L0303L4112L7799M1336M4691
37154E32352M7777N0430N2398N3357N2929N0719M6343L9523L0186J8606N457q227
37142I71850k1253l2529m1277m7154n0217n0819m9489m6789m3253l9308l5307
37131E14455l1526k8156k5313k2977k1037j9318j7676j6032j4392j2789j1272
37120B93967r878q623p504o478n503m541l611k753k042j533j241j115j063r82
37106B37100q08n31k01R8K75K68P5k32n43p49q05p21n34k70Q0N22J039J578K054
37087B37695K335K300J831Q88m97k196m012n695p010p788p967p596o796n718m497
$$ plain form
37180 183770 184287 184633 185149 186177 187980 190676 194209 198386 202954 207717 212615 217767 223460 230102 238184
37165 238184 248223 260745 276237 295118 317688 344111 374414 408526 446325 487661 532352
37154 532352 580129 630559 682957 736314 789243 839962 886305 925828 956014 974620 980077 971850
37142 971850 950597 918068 876791 829637 779420 728601 679112 632323 589070 549762 514455
37131 514455 482929 454773 429460 406483 385446 366128 348452 332420 318028 305239 293967
37120 293967 284089 275466 267962 261484 255981 251440 247829 245076 243034 241501 240260 239145 238082 237100
37106 237100 236292 235761 235560 235658 235933 236201 236276 236044 235501 234752 233947 233226 232692 232422 232502 233024 234063 235641 237695
37087 237695 240030 242330 244161 245049 244552 242356 238344 232649 225639 217851 209884 202288 195492 189774 185277
37072A85277l245k027q95J16R66J622K077K365K554K680K737K665K417K003J531
37057B02843J178J116J463K225L308M528N695O658P364P855Q252Q689R269J0025
37043B80468J0904J1791J2558J3087J3285J3116J2595J1814J0872R844Q761P595
37031D16690O297M837L236J592N6j211k071k459k394j980j345n96K03J017J807
37016D23679K522L118L588L988M409M947N647O488P400Q281R016R492R611R299
37002E11485Q518P260N557L461J061j521m127o573q694j0362j1499j2060j2044
36989D70462j1484j0466r106p521n787l941j986O7K200M364O493Q496J0257J1679
36975D63727J2715J3385J3771J3980J4126J4326J4663J5188J5887J6726J7697
$$ plain form
37072 185277 182032 180005 179110 179226 180192 181814 183891 186256 188810 191490 194227 196892 199309 201312 202843
37057 202843 204021 205137 206600 208825 212133 216661 222356 229014 236378 244233 252485 261174 270443 280468
37043 280468 291372 303163 315721 328808 342093 355209 367804 379618 390490 400334 409095 416690
37031 416690 422987 427824 431060 432652 432708 431497 429426 426967 424573 422593 421248 420652 420855 421872 423679
37016 423679 426201 429319 432907 436895 441304 446251 451898 458386 465786 474067 483083 492575 502186 511485
37002 511485 520003 527263 532820 536281 537342 535821 531694 525121 516427 506065 494566 482506 470462
36989 470462 458978 448512 439406 431885 426098 422157 420171 420238 422438 426802 433295 441791 452048 463727
36975 463727 476442 489827 503598 517578 531704 546030 560693 575881 591768 608494 626191
36964F26191J8834K0205K1876K3886K6222K8796L1418L3803L5612L6511L6246
36953I39600L4679L1779K7596K2237J5861Q697J074o567j3691j9738k4203k6758
36941I90566k7313k6023k3224j9328j4731r755m614N94N875J1285J6888K2714
36929I22934K8765L5042M1565M8368N5484O2929P0694P8755Q7092R5689J04555
36918A631872J13710J23196J33060J43335J53982J64807J75355J84787J91771
36909C015875J94459J90562J77642J53600J17393O9759J3632m6112j03677j53732
36899C629401j92600k18757k32606k35847k30794k19860k05222j88671j71561
36890A733483j54825j39058j24587j11568j00030q9926q1123p3433o6650o0599
$$ plain form
36964 626191 645025 665230 687106 710992 737214 766010 797428 831231 866843 903354 939600
36953 939600 974279 1006058 1033654 1055891 1071752 1080449 1081523 1074956 1061265 1041527 1017324 990566
36941 990566 963253 937230 914006 894678 879947 870192 865578 866172 872047 883332 900220 922934
36929 922934 951699 986741 1028306 1076674 1132158 1195087 1265781 1344536 1431628 1527317 1631872
36918 1631872 1745582 1868778 2001838 2145173 2299155 2463962 2639317 2824104 3015875
36909 3015875 3210334 3400896 3578538 3732138 3849531 3919290 3932922 3886810 3783133 3629401
36899 3629401 3436801 3218044 2985438 2749591 2518797 2298937 2093715 1905044 1733483
36890 1733483 1578658 1439600 1315013 1203445 1103415 1013489 932366 858933 792283 731684
36880G31684n5143n0188m5633m1392l7380l3537k9833k6295k2989k0025j7518
36869C51751j5550j4157j3325j2977j2975j3133j3273j3252j2992j2491j1794
36858B05832j0979j0117r268q470p784p246o853o553o264n940n597n317n194n303
36844A04947n635o104o553o806o717o236n433m443l424k488j663r31k65L30P98
36829D9377J094J211J213J208J322J663K302L238M396N648O842P844Q553Q917
36815A04828Q908Q536P843O895N784M587L365K160J006p1j062j970k809l569m185
36800A40246m573m682m552m318m177m286m711n385o120o676o819o385n283l501
36786F8778j072J897N223Q631J1794J4385J6138J6886J6596J5377J3499J1296
$$ plain form
36880 731684 676541 626353 580720 539328 501948 468411 438578 412283 389294 369269 351751
36869 351751 336201 322044 308719 295742 282767 269634 256361 243109 230117 217626 205832
36858 205832 194853 184736 175468 166998 159214 151968 145115 138562 132298 126358 120761 115444 110250 104947
36844 104947 99312 93208 86655 79849 73132 66896 61463 57020 53596 51108 49445 48514 48249 48579 49377
36829 49377 50471 51682 52895 54103 55425 57088 59390 62628 67024 72672 79514 87358 95911 104828
36815 104828 113736 122272 130115 137010 142794 147381 150746 152906 153912 153841 152779 150809 148000 144431 140246
36800 140246 135673 130991 126439 122121 117944 113658 108947 103562 97442 90766 83947 77562 72279 68778
36786 68778 67706 69603 74826 83457 95251 109636 125774 142660 159256 174633 188132 199428
36774A99428R083P048N248L619K076N54r55k399l704m799n647o249o630o816o819
36759A83038o644o294n808n257m744m349m112m009l980l989m024m110m253m413
36745A17052m515m470m229l785l180k457j673q83j52M63R07J136J124Q46L17m38
36729I6063j337k265l079l677m028m194m287m410m606m848n067n197n205n105
36715C8758m943m787m696m700m801m977n194n435n717o104o698p580q776j0238
36701d5888j1860j3531j5163j6714j8190j9617k1026k2443k3887k5389k6972k8643
36689b89323l0380l2134l3816l5314l6493l7200l7292l6626l5045l2379k8453
36678f64455k3157j6513q741k63Q353J6493K3638K9435L3720L6482L7828L7962
$$ plain form
36774 199428 208511 215559 220807 224426 226502 227056 226101 223702 219998 215199 209552 203303 196673 189857 183038
36759 183038 176394 170100 164292 159035 154291 149942 145830 141821 137841 133852 129828 125718 121465 117052
36745 117052 112537 108067 103838 100053 96873 94416 92743 91860 91708 92171 93078 94214 95338 96184 96501 96063
36729 96063 94726 92461 89382 85705 81677 77483 73196 68786 64180 59332 54265 49068 43863 38758
36715 38758 33815 29028 24332 19632 14831 9854 4660 -775 -6492 -12596 -19294 -26874 -35650 -45888
36701 -45888 -57748 -71279 -86442 -103156 -121346 -140963 -161989 -184432 -208319 -233708 -260680 -289323
36689 -289323 -319703 -351837 -385653 -420967 -457460 -494660 -531952 -568578 -603623 -636002 -664455
36678 -664455 -687612 -704125 -712866 -713129 -704776 -688283 -664645 -635210 -601490 -565008 -527180 -489218
36666d89218L7162L5736L3964L2064L0179K8398K6799K5428K4294K3337K2461
36655a69396K1571K0602J9524J8296J6852J5120J3096J0896Q736O837N322M174
36643h370L297K587K010J595J422J556K006K712L557M399N129N674O005O145O153
36628D5877O099O049O027O006N939N785N517N158M741M309L882L466L055K679
36614A14589K394K256K295K498K813L166L472L626L556L228K672J980J266O39
36600A50450J89rJ00N34J244K105K926L510L711L481K862J959Q70l30j579k792
36584A69231l837m572m909m863m522m002l383k711k013j329p11k12J75M96Q10
36569A33648J138J447J677J790J784J693J573J461J360J245J075Q34N22J69j66
$$ plain form
36666 -489218 -452056 -416320 -382356 -350292 -320113 -291715 -264916 -239488 -215194 -191857 -169396
36655 -169396 -147825 -127223 -107699 -89403 -72551 -57431 -44335 -33439 -24703 -17866 -12544 -8370
36643 -8370 -5073 -2486 -476 1119 2541 4097 6103 8815 12372 16771 21900 27574 33579 39724 45877
36628 45877 51976 58025 64052 70058 75997 81782 87299 92457 97198 101507 105389 108855 111910 114589
36614 114589 116983 119239 121534 124032 126845 130011 133483 137109 140665 143893 146565 148545 149811 150450
36600 150450 150639 150630 150730 151264 152508 154613 157539 161049 164760 168241 171103 173062 173932 173602 172023 169231
36584 169231 165394 160822 155913 151050 146528 142526 139143 136432 134419 133090 132379 132167 132342 132838 133648
36569 133648 134786 136233 137910 139700 141484 143177 144750 146211 147571 148816 149891 150725 151247 151416 151250
36554A51250m12m63k13M15J404K619L818M746N207N151M676L966L216K559K081
36539A90020J816J770J884K029K022J702R84j13j467k883m152n111n681n871n767
36524A71182n452m989m421l784l143k552k037j563j074n14J10P54J366J908K361
36509A48152K708K951L115L239L346L407L371L197K898K557K299K247K444K844
36495A88775L306L664L794L644L228K604J843R93R0q37j736k539l164l570l758
36480A96337l790l757l735l783l888l992l994l796l344k645j780q84j08M15O18
36465A57874N00J48l06p27j012j123j036p38j98N95J605K724L796M656N178N303
36449A77239N021M396L558K714K078J811J956K427L073L719M220M468M430M144
$$ plain form
36554 151250 150838 150375 150162 150577 151981 154600 158418 163164 168371 173522 178198 182164 185380 187939 190020
36539 190020 191836 193606 195490 197519 199541 201243 202227 202114 200647 197764 193612 188501 182820 176949 171182
36524 171182 165730 160741 156320 152536 149393 146841 144804 143241 142167 141653 141763 142517 143883 145791 148152
36509 148152 150860 153811 156926 160165 163511 166918 170289 173486 176384 178941 181240 183487 185931 188775
36495 188775 192081 195745 199539 203183 206411 209015 210858 211851 211941 211104 209368 206829 203665 200095 196337
36480 196337 192547 188790 185055 181272 177384 173392 169398 165602 162258 159613 157833 156949 156841 157256 157874
36465 157874 158374 158522 158216 157489 156477 155354 154318 153580 153382 153977 155582 158306 162102 166758 171936 177239
36449 177239 182260 186656 190214 192928 195006 196817 198773 201200 204273 207992 212212 216680 221110 225254
36435B25254L705L241K857K641K625K790L084L425L738L944L980L813L444K902
36421B71443K218J433O02j77q01j168j209q89k03Q33K192L853N797P973J0282
36406C02179J2566J4608J6189J7142J7407J7023J6123J4885J3502J2137J0876
36395D64637R725Q617P468O231M908L546K204R45j75j106j784k157k175j821j127
36380D97936j78R18K069L184M202N080N821O480P141P889Q776R828J1023J2305
36366E82474J3566J4677J5479J5816J5540J4538J2785J0364P464M320J171j784
36354G06410m387o519q085r034r374r210q698q012p268o508n724m885l973k963
36340F11770j842o04P26K074L343M453N391O190O899P530Q038Q350Q381Q073P415
$$ plain form
36435 225254 228959 232200 235057 237698 240323 243113 246197 249622 253360 257304 261284 265097 268541 271443
36421 271443 273661 275094 275696 275519 274718 273550 272341 271452 271249 272082 274274 278127 283924 291897 302179
36406 302179 314745 329353 345542 362684 380091 397114 413237 428122 441624 453761 464637
36395 464637 474362 482979 490447 496678 501586 505132 507336 508281 508106 507000 505216 503059 500884 499063 497936
36380 497936 497758 498676 500745 503929 508131 513211 519032 525512 532653 540542 549318 559146 570169 582474
36366 582474 596040 610717 626196 642012 657552 672090 684875 695239 702703 707023 708194 706410
36354 706410 702023 695504 687419 678385 669011 659801 651103 643091 635823 629315 623591 618706 614733 611770
36340 611770 609928 609324 610050 612124 615467 619920 625311 631501 638400 645930 653968 662318 670699 678772 686187
36325F86187O431N199L832K469J246K96k68l45J44J229K870M954P290R677J1936
36310G43147J3993J5856J7593J9276K0964K2714K4599K6711K9128L1907L5037
36299A000925L8455M2076M5819M9640N3514N7419O1277O4925O8093P0405P1426
36288A623974P0797O8409O4471N9460N3885M8083M2132L5898K9176K1801J3740
36277B131826N151l623j2093j9726k6037l0650l3345l4056l2876l0044k5916k0943
36265A867668j5589j0289n378j089K438N102O834P574P250N787L085r75o523j3697
36251A852198k2626l3407m6055o0439p6197r2691j09031j24136j36863j46181
36241A004572j51321j51954j48247j40826j30617j18634j05807r2877q0402o8756
$$ plain form
36325 686187 692618 697817 701649 704118 705364 705660 705392 705047 705191 706420 709290 714244 721534 731211 743147
36310 743147 757140 772996 790589 809865 830829 853543 878142 904853 933981 965888 1000925
36299 1000925 1039380 1081456 1127275 1176915 1230429 1287848 1349125 1414050 1482143 1552548 1623974
36288 1623974 1694771 1763180 1827651 1887111 1940996 1989079 2031211 2067109 2096285 2118086 2131826
36277 2131826 2136977 2133354 2121261 2101535 2075498 2044848 2011503 1977447 1944571 1914527 1888611 1867668
36265 1867668 1852079 1841790 1836412 1835323 1837761 1842863 1849697 1857271 1864521 1870308 1873393 1872418 1865895 1852198
36251 1852198 1829572 1796165 1750110 1689671 1613474 1520783 1411752 1287616 1150753 1004572
36241 1004572 853251 701297 553050 412224 281607 162973 57166 -35711 -116113 -184869
36231a84869n8160m8711m0397l3164k6935k1639j7175j3408j0185p377m907k756
36219d69683r57M55J471K135K541K811L054L339L693M097M523M925N263N481N533
36204d21319N389N060M600M072L531L005K524K135J941K054K535L350M355N359
36190c71409O196O778P111P263P314P290P167O898O460N904N347M929M754M832
36176b83166N086N367N537N515N324N063M854M769M804M909N011N072N106N205
36162b11544N502O138P208Q722J0639J2873J5333J7947K0642K3323K5861K8109
36150b9247K9953L1327L2202L2555L2330L1420K9688K6995K3266J8539J2992O940
36138B78960P83n058j0200j4321j7233j8894j9407j8961j7748j5928j3619j0924
$$ plain form
36231 -184869 -243029 -291740 -332137 -365301 -392236 -413875 -431050 -444458 -454643 -462020 -466927 -469683
36219 -469683 -470640 -470185 -468714 -466579 -464038 -461227 -458173 -454834 -451141 -447044 -442521 -437596 -432333 -426852 -421319
36204 -421319 -415930 -410870 -406270 -402198 -398667 -395662 -393138 -391003 -389062 -387008 -384473 -381123 -376768 -371409
36190 -371409 -365213 -358435 -351324 -344061 -336747 -329457 -322290 -315392 -308932 -303028 -297681 -292752 -287998 -283166
36176 -283166 -278080 -272713 -267176 -261661 -256337 -251274 -246420 -241651 -236847 -231938 -226927 -221855 -216749 -211544
36162 -211544 -206042 -199904 -192696 -183974 -173335 -160462 -145129 -127182 -106540 -83217 -57356 -29247
36150 -29247 706 32033 64235 96790 129120 160540 190228 217223 240489 259028 272020 278960
36138 278960 279743 274685 264485 250164 232931 214037 194630 175669 157921 141993 128374 117450
36126A17450p949m799j567J686M926Q132J1284J4371J7377K0269K2973K5353K7213
36113B56719K8301K8348K7098K4384K0209J4772Q469J801m709j0611j5552j9319
36101C59910k1824k3111k3313k2638k1335j9663j7867j6143j4601j3269j2105
36090A54041j1048j0064r149q330p633p098o757o626o693o927p249p568p769p759
36076D3371p526p129o690o303n990n679n248m593l686k574j372j94Q45J671K237
36061h860K543K637K603K536K484K442K371K247K098J989K012K201K543K964L391
36046B8201L773M100M379M588M655M509M114L543K941K494K338K511K924L425
36032G8495L859M140M256M233M108L945L819L801L911M135M438M825N314N919
$$ plain form
36126 117450 109501 104702 103135 104821 109747 117879 129163 143534 160911 181180 204153 229506 256719
36113 256719 285020 313368 340466 364850 385059 399831 408300 410101 405392 394781 379229 359910
36101 359910 338086 314975 291662 269024 247689 228026 210159 194016 179415 166146 154041
36090 154041 142993 132929 123780 115450 107817 100719 93962 87336 80643 73716 66467 58899 51130 43371
36076 43371 35845 28716 22026 15723 9733 4054 -1194 -5787 -9473 -12047 -13419 -13613 -12768 -11097 -8860
36061 -8860 -6317 -3680 -1077 1459 3943 6385 8756 11003 13101 15090 17102 19303 21846 24810 28201
36046 28201 31974 36074 40453 45041 49696 54205 58319 61862 64803 67297 69635 72146 75070 78495
36032 78495 82354 86494 90750 94983 99091 103036 106855 110656 114567 118702 123140 127965 133279 139198
36018A39198O618P352Q049Q645R090R340R313Q900P987O492M425J896q87l663
36004B22755o175q205r623j0376j0490j0034r111p838o357m815l350k055r78q6
35990A33262P02J476K287L141L980M711N224N453N416N234N075N111N438O066
35976A92576O925P911Q908R807J0496J0873J0880J0525R909R198Q587Q236Q245
35963C13076Q643R429J0567J2019J3772J5830J8201K0858K3732K6750K9859L3059
35951E35795L6391L9931M3783M8066N2890N8347O4474P1283P8751Q6824R5385
35940A211920J04217J13034J21507J29308J36087J41455J44953J46044J44132
35931B392657J38569J28713J13933R3705O7751L6315M36l7894p5884j10433j38833
$$ plain form
36018 139198 145816 153168 161217 169862 178952 188292 197605 206505 214492 220984 225409 227305 226418 222755
36004 222755 216580 208375 198752 188376 177886 167852 158741 150903 144546 139731 136381 134326 133348 133262
35990 133262 133964 135440 137727 140868 144848 149559 154783 160236 165652 170886 175961 181072 186510 192576
35976 192576 199501 207412 216320 226127 236623 247496 258376 268901 278810 288008 296595 304831 313076
35963 313076 321719 331148 341715 353734 367506 383336 401537 422395 446127 472877 502736 535795
35951 535795 572186 612117 655900 703966 756856 815203 879677 950960 1029711 1116535 1211920
35940 1211920 1316137 1429171 1550678 1679986 1816073 1957528 2102481 2248525 2392657
35931 2392657 2531226 2659939 2773872 2867577 2935328 2971643 2972079 2934185 2858301 2747868 2609035
35920B609035j59364j71578j76153j74493j68262j59019j48047j36310j24488
35911A191321j13041j02245r2262q3147p4868o7310o0316n3753m7581m1818l6506
35900D18474l1659k7275k3347j9898j6966j4585j2747j1402j0455r791r296q868
35888B22185q429p927p350o751o225n887n830o103o720p657q843j0136j1349j2280
35874A10698j2770j2757j2280j1444j0374r179p909o573n161l700k288j075k07
35861A4981L05N81Q68J432K467M038O063Q379J0782J3074J5094J6709J7827J8412
35847A31012J8473J8061J7203J5890J4073J1700Q784N401J722k032n599q737j1262
35834B14689j3074j4155j4562j4420j3884j3118j2247j1342j0428r488q495p388
$$ plain form
35920 2609035 2449671 2278093 2101940 1927447 1759185 1600166 1452119 1315809 1191321
35911 1191321 1078280 976035 883773 800626 725758 658448 598132 544379 496798 454980 418474
35900 418474 386815 359540 336193 316295 299329 284744 271997 260595 250140 240349 231053 222185
35888 222185 213756 205829 198479 191728 185503 179616 173786 167683 160963 153306 144463 134327 122978 110698
35874 110698 97928 85171 72891 61447 51073 41894 33985 27412 22251 18551 16263 15188 14981
35861 14981 15286 15867 16735 18167 20634 24672 30735 39114 49896 62970 78064 94773 112600 131012
35847 131012 149485 167546 184749 200639 214712 226412 235196 240597 242319 240287 234688 225951 214689
35834 214689 201615 187460 172898 158478 144594 131476 119229 107887 97459 87971 79476 72088
35822G2088o099m564k773p89J280L295N131O678P878Q690R083R025Q543P718O705
35807A31889N679M777M066L531L090K642K116J519R25M37J30ol4m0p8j47k20k56
35789A60020k37j59l8J26L42O20R64J358J759K121K393K572K687K802K998L360
35773A83688L968M868O050P450Q978J0521J1970J3223J4215J4929J5389J5629
35761C10878J5699J5668J5661J5860J6470J7631J9378K1644K4329K7344L0601
35750E31163L3984L7308M0300M2621M3901M3784M1981L8284L2604K4993J5685
35739I26608N122o033j6976k6891l5097m1154m4904m6427m5939m3738m0160l5578
35727E48833l0362k4835j9214j3594p991k369L290Q969J4581J9986K5000K9413
$$ plain form
35822 72088 65989 61425 58652 57863 59143 62438 67569 74247 82125 90815 99898 108923 117466 125184 131889
35807 131889 137568 142345 146411 149942 153032 155674 157790 159309 160234 160671 160801 160795 160761 160721 160643 160496 160276 160020
35789 160020 159783 159624 159586 159712 160054 160674 161638 162996 164755 166876 169269 171841 174528 177330 180328 183688
35773 183688 187656 192524 198574 206024 215002 225523 237493 250716 264931 279860 295249 310878
35761 310878 326577 342245 357906 373766 390236 407867 427245 448889 473218 500562 531163
35750 531163 565147 602455 642755 685376 729277 773061 815042 853326 885930 910923 926608
35739 926608 931730 925697 908721 881830 846733 805579 760675 714248 668309 624571 584411 548833
35727 548833 518471 493636 474422 460828 452837 450468 453758 462727 477308 497294 522294 551707
35715E51707L3033L5716L7371L7929L7314L5425L2173K7541K1672J4904P758Q25
35703H73368n350j0378j4052j6315j7227j6946j5711j3842j1673r480p448n706
35691G29240m377l588l450l992n136o699q446j0145j1645j2858j3771j4395j4761
35678F15977j4888j4793j4472j3928j3171j2224j1112r855q483p048n656m452
35666D85895l589l201l369m137n514p500j0093j3299j7090k1372k5973l0667l5224
35653C04867l9447m3173m6252m8519m9811m9999m9053m7074m4253m0825l7017
35642a90556l3011k8969k5028k1299j7825j4589j1511q514n524k527M39L312O035
35629c49567Q576J0962J3263J5605J8151K1064K4471K8452L3079L8435M4620N1722
$$ plain form
35715 551707 584740 620456 657827 695756 733070 768495 800668 828209 849881 864785 872543 873368
35703 873368 868018 857640 843588 827273 810046 793100 777389 763547 751874 742394 734946 729240
35691 729240 724863 721275 717825 713833 708697 701998 693552 683407 671762 658904 645133 630738 615977
35678 615977 601089 586296 571824 557896 544725 532501 521389 511534 503051 496003 490347 485895
35666 485895 482306 479105 475736 471599 466085 458585 448492 435193 418103 396731 370758 340091 304867
35653 304867 265420 222247 175995 127476 77665 27666 -21387 -68461 -112714 -153539 -190556
35642 -190556 -223567 -252536 -277564 -298863 -316688 -331277 -342788 -351302 -356826 -359353 -358914 -355602 -349567
35629 -349567 -340991 -330029 -316766 -301161 -283010 -261946 -237475 -209023 -175944 -137509 -92889 -41167
35617d1167N9780O8775P8688Q9539J01370J14159J27699J41526J54889J66768
35607A062026J75999J81455J82278J78088J69052J55891J39736J21953J03935
35598B470413Q6957P2055N9934N0927M4978M1686M0432M0515M1298M2312M3269
35587C034776M4043M4600M4950M5096M4990M4502M3404M1374L8003L2852K5547
35576C484137J5851L738j0577k6646m3817o1260p8025r3102j05557j14687j20159
35565B849896j22069j20880j17278j11991j05665r8778r1650q4495p7465p0705
35555A848920o4355n8553n3425m9059m5500m2726m0627l9015l7654l6347l4985
35544A346674l3586l2236l1024k9972k9015k8037k6926k5609k4056k2263k0249
$$ plain form
35617 -41167 18613 87388 166076 255615 356985 471144 598843 740369 895258 1062026
35607 1062026 1238025 1419480 1601758 1779846 1948898 2104789 2244525 2366478 2470413
35598 2470413 2557370 2629425 2689359 2740286 2785264 2826950 2867382 2907897 2949195 2991507 3034776
35587 3034776 3078819 3123419 3168369 3213465 3258455 3302957 3346361 3387735 3425738 3458590 3484137
35576 3484137 3499988 3503726 3493149 3466503 3422686 3361426 3283401 3190299 3084742 2970055 2849896
35565 2849896 2727827 2606947 2489669 2377678 2272013 2173235 2081585 1997090 1919625 1848920
35555 1848920 1784565 1726012 1672587 1623528 1578028 1535302 1494675 1455660 1418006 1381659 1346674
35544 1346674 1313088 1280852 1249828 1219856 1190841 1162804 1135878 1110269 1086213 1063950 1043701
35533A043701j8049j5744j3429j1199r118p224n550m123k964k072j425r90p40
35520I51074o71q20j226j907k840l970n220o508p739q804r576r947r859r341q469
35505H64177p345o024m526k839r81R63K857M573O052P288Q313R155R858J0514
35491I02035J1232J2115J3200J4458J5822J7228J8652K0087K1532K2979K4423
35480A093763K5829K7138K8226K8912K8960K8096K6079K2759J8155J2486O163
35469A346566k69o229j1223j4934j7234j8166j7862j6487j4214j1208p638l693
35457A207409M54M610Q617J2364J5829J9079K2248K5457K8786L2208L5565L8563
35445A451189M0784M1739M0920L7840L2146K3684J2598o35j5205l0068m4098n6270
$$ plain form
35533 1043701 1025652 1009908 996479 985280 976162 968938 963388 959265 956301 954229 952804 951814 951074
35520 951074 950403 949583 948357 946450 943610 939640 934420 927912 920173 911369 901793 891846 881987 872646 864177
35505 864177 856832 850808 846282 843443 842462 843425 846282 850855 856907 864195 872508 881663 891521 902035
35491 902035 913267 925382 938582 953040 968862 986090 1004742 1024829 1046361 1069340 1093763
35480 1093763 1119592 1146730 1174956 1203868 1232828 1260924 1287003 1309762 1327917 1340403 1346566
35469 1346566 1346297 1340068 1328845 1313911 1296677 1278511 1260649 1244162 1229948 1218740 1211102 1207409
35457 1207409 1207863 1212473 1221090 1233454 1249283 1268362 1290610 1316067 1344853 1377061 1412626 1451189
35445 1451189 1491973 1533712 1574632 1612472 1644618 1668302 1680900 1680265 1665060 1634992 1590894 1534624
35433A534624o5827p2362p5842p6547p4944p1575o6965o1540n5656m9571m3501
35422H20294l7616l2071k7008k2533j8709j5556j3067j1212r941r173q804q706
35410F05898q744q772q648q272p621o738n712m620l509k408j376n18L1J89m7n96
35394E38537j311k027k587k862k772k289j453l58Q75K147L381M542N619O620P553
35379E53615Q400R098R561R728R624R360R109R048R301R907J0791J1802J2733
35366F82077J3395J3680J3599J3282J2958J2879J3243J4138J5525J7287J9286
35355H41349K1399K3544K5692K7888L0236L2863L5854L9161M2598M5876M8695
35344A215155N0793N1966N2057N0931M8469M4569L9159L2189K3669J3733K704
$$ plain form
35433 1534624 1468797 1396435 1320593 1244046 1169102 1097527 1030562 969022 913366 863795 820294
35422 820294 782678 750607 723599 701066 682357 666801 653734 642522 632581 623408 614604 605898
35410 605898 597154 588382 579734 571462 563841 557103 551391 546771 543262 540854 539478 538960 538991 539180 539133 538537
35394 538537 537226 535199 532612 529750 526978 524689 523236 522878 523753 525900 529281 533823 539442 546062 553615
35379 553615 562015 571113 580674 590402 600026 609386 618495 627543 636844 646751 657542 669344 682077
35366 682077 695472 709152 722751 736033 748991 761870 775113 789251 804776 822063 841349
35355 841349 862748 886292 911984 939872 970108 1002971 1038825 1077986 1120584 1166460 1215155
35344 1215155 1265948 1317914 1369971 1420902 1469371 1513940 1553099 1585288 1608957 1622690 1625394
35333A625394q875k0321l0929m0099m7398n2592n5653n6746n6194n4404n1761
35322A150422m8581m5069m1370l7582l3795l0079k6467k2975j9625j6449j3499
35311H14931j0818q426o294m350k501o53J235L148M987O634Q000R084R961J0735
35297H35673J1466J2129J2616J2796J2566J1893J0834R521Q154O926N991N429
35285I55994N266N472N979O688P488Q250Q829R091Q946Q391P476O299M967L599
35271A052735K355J399Q67P86J074J550J993K211K085J597Q24r2j000j792k439
35256A064153k978l471l967m471m947n367n712n994o255o552o952p508q244r138
35242I82597j0114j1057j1844j2379j2604j2497j2058j1301j0274r033p651o186
$$ plain form
35333 1625394 1616519 1596198 1565269 1525170 1477772 1425180 1369527 1312781 1256587 1202183 1150422
35322 1150422 1101841 1056772 1015402 977820 944025 913946 887479 864504 844879 828430 814931
35311 814931 804113 795687 789393 785043 782542 781889 783124 786272 791259 797893 805893 814977 824938 835673
35297 835673 847139 859268 871884 884680 897246 909139 919973 929494 937648 944574 950565 955994
35285 955994 961260 966732 972711 979399 986887 995137 1003966 1013057 1022003 1030394 1037870 1044169 1049136 1052735
35271 1052735 1055090 1056489 1057356 1058142 1059216 1060766 1062759 1064970 1067055 1068652 1069476 1069384 1068384 1066592 1064153
35256 1064153 1061175 1057704 1053737 1049266 1044319 1038952 1033240 1027246 1020991 1014439 1007487 999979 991735 982597
35242 982597 972483 961426 949582 937203 924599 912102 900044 888743 878469 869436 861785 855599
35230H55599m679l144j616j70J109K144K877L269L312L060K634K197J880J764
35216H70236J852K077K334K530K606K544K338J977J465Q18P3p35j598k527l546
35201H82444m662n870p151q473r796j1092j2370j3660j5008j6426j7922j9497
35189G40517k1167k2958k4881k6907k8940l0839l2430l3596l4302l4589l4541
35178D15367l4170l3366l1885k9472k5977k1451j6131j0360m516J034N952R928
35166B24953J2750J4369J4961J4889J4620J4582J5064J6153J7743J9616K1509
35155D01209K3179K4433K5131K5173K4450K2873K0405J7118J3208Q987M799R71
35143F11936k297m927o938q397r376r964j0233j0230r993r564r015q430p896p448
$$ plain form
35230 855599 850920 847776 846160 845990 847099 849243 852120 855389 858701 861761 864395 866592 868472 870236
35216 870236 872088 874165 876499 879029 881635 884179 886517 888494 889959 890777 890850 890115 888517 885990 882444
35201 882444 877782 871912 864761 856288 846492 835400 823030 809370 794362 777936 760014 740517
35189 740517 719350 696392 671511 644604 615664 584825 552395 518799 484497 449908 415367
35178 415367 381197 347831 315946 286474 260497 239046 222915 212555 208039 209073 215025 224953
35166 224953 237703 252072 267033 281922 296542 311124 326188 342341 360084 379700 401209
35155 401209 424388 448821 473952 499125 523575 546448 566853 583971 597179 606166 610965 611936
35143 611936 609639 604712 597774 589377 580001 570037 559804 549574 539581 530017 521002 512572 504676 497228
35129D97228p072o690o223n640m954m224l499k801k131j477q69l71o1nk36p71
35113D50204j580k607l765m929n937o596o742o268n187l627j794Q0J828L352M630
35098D11062N672O506P162P675Q082Q440Q814R259R796J0418J1105J1851J2690
35085E28532J3704J4997J6643J8673K1049K3692K6490K9314L2033L4518L6632
35074G96277L8203L9033L8908L7642L5074L1124K5809J9277J1826L854m166j1775
35062A061086j8584k4323k8870l2251l4588l6026l6658l6534l5678l4146l2045
35051G11383k9513k6679k3606k0312j6793j3058r136n074r63L068O826J0079J2595
35038E98817J4145J4549J3704J1619Q445M489J52m132p975j1060j3152j4083j3766
$$ plain form
35129 497228 490156 483466 477243 471603 466649 462425 458926 456125 453994 452517 451648 451277 451216 451211 450975 450204
35113 450204 448624 446017 442252 437323 431386 424790 418048 411780 406593 402966 401172 401252 403080 406432 411062
35098 411062 416734 423240 430402 438077 446159 454599 463413 472672 482468 492886 503991 515842 528532
35085 528532 542236 557233 573876 592549 613598 637290 663780 693094 725127 759645 796277
35074 796277 834480 873513 912421 950063 985137 1016261 1042070 1061347 1073173 1077027 1072861 1061086
35062 1061086 1042502 1018179 989309 957058 922470 886444 849786 813252 777574 743428 711383
35051 711383 681870 655191 631585 611273 594480 581422 572286 567212 566249 569317 576143 586222 598817
35038 598817 612962 627511 641215 652834 661279 665768 665920 661788 653813 642753 629601 615518 601752
35025F01752j2186r406n559q31M558J0364J6314K2107K7426L1975L5488L7730
35013G59732L8528L7820L5677L2312K8046K3272J8402J3828R874O769M621L417
35001A012298L050L338M036M868N579N990O051N827N441M997M522L930L050J723
34987A074700j74k711n926r841j4442j9637k5261l1048l6704m1925m6455n0103
34975G90473n2739n4320n4845n4366n2974n0828m8145m5196m2245l9536l7253
34964B58026l5507l4325l3654l3374l3318l3345l3360l3316l3200l3011l2799
34953a11183l2645l2625l2769l3027l3292l3418l3256l2658l1481k9572k6762
34942d62688k2889j7806j1401l624N463J5690K6723L8065M9067N8993O7135P2934
$$ plain form
35025 601752 589566 580160 574601 573770 578328 588692 605006 627113 654539 686514 722002 759732
35013 759732 798260 836080 871757 904069 932115 955387 973789 987617 997491 1004260 1008881 1012298
35001 1012298 1015348 1018686 1022722 1027590 1033169 1039159 1045210 1051037 1056478 1061475 1065997 1069927 1072977 1074700
34987 1074700 1074526 1071815 1065889 1056048 1041606 1021969 996708 965660 928956 887031 840576 790473
34975 790473 737734 683414 628569 574203 521229 470401 422256 377060 334815 295279 258026
34964 258026 222519 188194 154540 121166 87848 54503 21143 -12173 -45373 -78384 -111183
34953 -111183 -143828 -176453 -209222 -242249 -275541 -308959 -342215 -374873 -406354 -435926 -462688
34942 -462688 -485577 -503383 -514784 -518408 -512945 -497255 -470532 -432467 -383400 -324407 -257272 -184338
34930a84338P6075P6540P4593P0699O5420N9350N3036M6937M1368L6533L2544
34919D48757K9449K7257K5972K5606K6171K7652L0009L3201L7253M2263M8415
34908H02005N5910O4881P5316Q7006R9514J12153J23995J33978J41054J44365
34898A840177J43386J38019J28626J15969J01081Q5120O9183N4170M0690K9048
34888B745469J9304J1334M911k50m430p896j0861j3474j5806j7870j9623k1004
34876B669804k1934k2364k2310k1844k1054k0037j8895j7715j6550j5404j4236
34865B457461j2986j1597j0050q366o610m865l199j693m01O46J434J932K071J743
34851B405520Q21q03l158o160r599j3187j6618j9612k1979k3635k4575k4831k4439
$$ plain form
34930 -184338 -108263 -31723 42870 113569 178989 238339 291375 338312 379680 416213 448757
34919 448757 478206 505463 531435 557041 583212 610864 640873 674074 711327 753590 802005
34908 802005 857915 922796 998112 1085118 1184632 1296785 1420780 1554758 1695812 1840177
34898 1840177 1983563 2121582 2250208 2366177 2467258 2552378 2621561 2675731 2716421 2745469
34888 2745469 2764773 2776107 2781018 2780768 2776338 2768442 2757581 2744107 2728301 2710431 2690808 2669804
34876 2669804 2647870 2625506 2603196 2581352 2560298 2540261 2521366 2503651 2487101 2471697 2457461
34865 2457461 2444475 2432878 2422828 2414462 2407852 2402987 2399788 2398095 2397694 2398340 2399774 2401706 2403777 2405520
34851 2405520 2406341 2405538 2402380 2396220 2386621 2373434 2356816 2337204 2315225 2291590 2267015 2242184 2217745
34838B217745k3473k2036k0241j8213j6060j3860j1629r342o981m567k167J03
34826B069279K105L704M810N388N469N151M601L992L454L034K719K452K149J722
34812B120029J093J98j034k633m526o530q386r845j0767j1145j1086j0710j0043
34799B034615r001p456n344k690L69L633O881R917J2592J4816J6555J7842J8759
34786B111488J9391J9799K0018K0031J9776J9164J8105J6534J4403J1689Q430
34775B298828M721O86l539p818j1997j5901j9281k1782k2987k2538k0284j6328
34763B141780j1007m800J791Q323J4455J9950K4647K8465L1385L3429L4650L5143
34751B358211L5009L4343L3227L1778L0140K8424K6717K5093K3664K2569K1939
$$ plain form
34838 2217745 2194272 2172236 2151995 2133782 2117722 2103862 2092233 2082891 2075910 2071343 2069176 2069279
34826 2069279 2071384 2075088 2079898 2085286 2090755 2095906 2100507 2104499 2107953 2110987 2113706 2116158 2118307 2120029
34812 2120029 2121122 2121320 2120286 2117653 2113127 2106597 2098211 2088366 2077599 2066454 2055368 2044658 2034615
34799 2034615 2025614 2018158 2012814 2010124 2010493 2014126 2021007 2030924 2043516 2058332 2074887 2092729 2111488
34786 2111488 2130879 2150678 2170696 2190727 2210503 2229667 2247772 2264306 2278709 2290398 2298828
34775 2298828 2303549 2304235 2300696 2292878 2280881 2264980 2245699 2223917 2200930 2178392 2158108 2141780
34763 2141780 2130773 2125973 2127764 2136087 2150542 2170492 2195139 2223604 2254989 2288418 2323068 2358211
34751 2358211 2393220 2427563 2460790 2492568 2522708 2551132 2577849 2602942 2626606 2649175 2671114
34740B671114K1881K2418K3498K4979K6678K8392K9912L1063L1763L2037L1976
34729B975711L1702L1338L0991L0727L0564L0512L0585L0794L1148L1646L2277
34718C317995L3006L3808L4718L5820L7188L8832M0677M2577M4358M5871M7084
34707C751934M8073M8960M9849N0815N1910N3160N4566N6140N7891N9791O1766
34696D344855O3761O5740O7682O9571P1399P3189P4972P6773P8631Q0604Q2757
34685E149934Q5120Q7707R0472R3304R6032R8529J00766J02806J04760J06755
34675F116185J08898J11203J13598J15979J18241J20283J22015J23436J24685
34666G174523J26003J27695J30066J33373J37758J43223J49673J56973J64964
$$ plain form
34740 2671114 2692995 2715413 2738911 2763890 2790568 2818960 2848872 2879935 2911698 2943735 2975711
34729 2975711 3007413 3038751 3069742 3100469 3131033 3161545 3192130 3222924 3254072 3285718 3317995
34718 3317995 3351001 3384809 3419527 3455347 3492535 3531367 3572044 3614621 3658979 3704850 3751934
34707 3751934 3800007 3848967 3898816 3949631 4001541 4054701 4109267 4165407 4223298 4283089 4344855
34696 4344855 4408616 4474356 4542038 4611609 4683008 4756197 4831169 4907942 4986573 5067177 5149934
34685 5149934 5235054 5322761 5413233 5506537 5602569 5701098 5801864 5904670 6009430 6116185
34675 6116185 6225083 6336286 6449884 6565863 6684104 6804387 6926402 7049838 7174523
34666 7174523 7300526 7428221 7558287 7691660 7829418 7972641 8122314 8279287 8444251
34657H444251J73488J82431J91698K01186K10777K20454K30330K40601K51457
34648A0346673K63039K75423K88625L02656L17594L33582L50738L69106L88678
34639A3236114M09435M31318M54259M78272N03478N30077N58312N88495O21021
34630A7810781O56292O94678P36539P82226Q32011Q86078R44620J007955J076540
34621B5427720J150993J232136J320983J418666J526396J645523J777554J924087
34613C7424058K086834K267749K469187K693895K945055L226395L542240L897446
34605F0552859M297415M748193N256499N829590O475166P201378Q016672Q929292
34597A11307064R946616J1074340J2315259J3667499J5122414J6662029J8255443
$$ plain form
34657 8444251 8617739 8800170 8991868 9193054 9403831 9624285 9854615 10095216 10346673
34648 10346673 10609712 10885135 11173760 11476416 11794010 12127592 12478330 12847436 13236114
34639 13236114 13645549 14076867 14531126 15009398 15512876 16042953 16601265 17189760 17810781
34630 17810781 18467073 19161751 19898290 20680516 21512527 22398605 23343225 24351180 25427720
34621 25427720 26578713 27810849 29131832 30550498 32076894 33722417 35499971 37424058
34613 37424058 39510892 41778641 44247828 46941723 49886778 53113173 56655413 60552859
34605 60552859 64850274 69598467 74854966 80684556 87159722 94361100 102377772 111307064
34597 111307064 121253680 132328020 144643279 158310778 173433192 190095221 208350664
34590B08350664J9853657K1382844K2736294K3765755K4275152K4023156K2743343
34583C67130865K0190859J6218247J0866335M431602k539603r354756j5346181
34576C91597368k0033766k3208528k4916766k5377968k4888132k3744535k2202582
34569B27225091k0459805j8657135j6888261j5210736j3656023j2237843j0958559
34562A19156729r813535q794042p889298p087929o378715n750971n194877m701718
34554F3545644m263840l874483l527723l218449k942207k695055k473514k274585
34546C8275788k095612j934196j788211j655894j535785j426621j327307j236930
34538B5275232j154678j079758j011409r48938q91713q39095p90498p45447p03562
$$ plain form
34590 208350664 228204321 249587165 272323459 296089214 320364366 344387522 367130865
34583 367130865 387321724 403539971 414406306 418837908 416298305 406943549 391597368
34576 391597368 371563602 348355074 323438308 298060340 273172208 249427673 227225091
34569 227225091 206765286 188108151 171219890 156009154 142353131 130115288 119156729
34562 119156729 109343194 100549152 92659854 85571925 79193210 73442239 68247362 63545644
34554 63545644 59281804 55407321 51879598 48661149 45718942 43023887 40550373 38275788
34546 38275788 36180176 34245980 32457769 30801875 29266090 27839469 26512162 25275232
34538 25275232 24120554 23040796 22029387 21080449 20188736 19349641 18559143 17813696 17110134
34529A7110134o64524o28103n94166n62618n33325n06129m80882m57408m35471
34520A2247508m14826l95289l76718l58970l41930l25566l09907k94988k80832
34511I148482k67453k54825k42845k31365k20256k09389j98643j87966j77423
34502G158317j67192j57487j48519j40486j33501j27584j22664j18633j15327
34493E926924j12520j09949j07408j04763j01957r8971r5822r2522q9084q5562
34483D928366q2097p8868p6020p3659p1868p0679p0039o9818o9848o9964p0020
34472D125486o9923o9663o9266o8765o8172o7488o6700o5778o4689o3439o2067
34461C389536o0577n8950n7142n5116n2876n0494m8109m5856m3786m1871m0051
$$ plain form
34529 17110134 16445610 15817507 15223341 14660723 14127398 13621269 13140387 12682979 12247508
34520 12247508 11832682 11437393 11060675 10701705 10359775 10034209 9724302 9429314 9148482
34511 9148482 8881029 8626204 8383359 8151994 7931738 7722349 7523706 7335740 7158317
34502 7158317 6991125 6833638 6685119 6544633 6411132 6283548 6160884 6042251 5926924
34493 5926924 5814404 5704455 5597047 5492284 5390327 5291356 5195534 5103012 5013928 4928366
34483 4928366 4846269 4767401 4691381 4617722 4545854 4475175 4405136 4335318 4265470 4195506 4125486
34472 4125486 4055563 3985900 3916634 3847869 3779697 3712209 3645509 3579731 3515042 3451603 3389536
34461 3389536 3328959 3270009 3212867 3157751 3104875 3054381 3006272 2960416 2916630 2874759 2834708
34450B834708l8273l6550l4976l3717l2919l2619l2720l3029l3337l3465l3335
34439B459768l2980l2480l1915l1333l0762l0207k9639k9007k8310k7585k6905
34428B128645k6338k5965k5834k5947k6270k6785k7457k8223k8991k9679l0255
34417A826901l0736l1179l1662l2241l2911l3599l4201l4614l4765l4595l4079
34406A462319l3176l1827k9952k7477k4317k0351j5462r597k841M545J2108J9241
34394A303213K5303K9763L2285L2793L1459K8648K4811K0368J5627J0808O032
34383A561110J386l061p211j0977j4276j7040j9181k0590k1189k0942j9872j8077
34371A390080j5722j3023j0185p370m704k258n6J904L622N070O188O869O962O313
$$ plain form
34450 2834708 2796435 2759885 2724909 2691192 2658273 2625654 2592934 2559905 2526568 2493103 2459768
34439 2459768 2426788 2394308 2362393 2331060 2300298 2270091 2240452 2211445 2183135 2155550 2128645
34428 2128645 2102307 2076342 2050508 2024561 1998291 1971506 1944049 1915826 1886835 1857156 1826901
34417 1826901 1796165 1764986 1733324 1701083 1668172 1634573 1600372 1565758 1530993 1496398 1462319
34406 1462319 1429143 1397316 1367364 1339887 1315570 1295219 1279757 1270160 1267319 1271864 1283972 1303213
34394 1303213 1328516 1358279 1390564 1423357 1454816 1483464 1508275 1528643 1544270 1555078 1561110
34383 1561110 1562496 1559435 1552224 1541247 1526971 1509931 1490750 1470160 1448971 1428029 1408157 1390080
34371 1390080 1374358 1361335 1351150 1343780 1339076 1336818 1336762 1338666 1342288 1347358 1353546 1360415 1367377 1373690
34357A373690M860K686L7k730n214p054p986p885o734m646j827J476N029Q624
34343A352326J2062J5146J7698J9595K0793K1356K1433K1215K0828K0315J9647
34332A562414J8799J7771J6631J5506J4520J3768J3267J3022J3053J3421J4202
34321A726374J5473J7259J9521K2190K5199K8501L2046L5748L9500M3149M6513
34310B051473M9391N1622N3099N3751N3543N2486N0665M8237M5402M2355L9245
34299B591269L6175L3198L0361K7698K5261K3124K1384K0138J9407J9111J9098
34288B866224J9187J9220J9109J8855J8507J8091J7564J6832J5793J4373J2529
34277C056284J0244P509M277M44m177r859j6944k5801l6720m9828o4997q1783
$$ plain form
34357 1373690 1378550 1381236 1381273 1378543 1373329 1366275 1358289 1350404 1343670 1339024 1337197 1338673 1343702 1352326
34343 1352326 1364388 1379534 1397232 1416827 1437620 1458976 1480409 1501624 1522452 1542767 1562414
34332 1562414 1581213 1598984 1615615 1631121 1645641 1659409 1672676 1685698 1698751 1712172 1726374
34321 1726374 1741847 1759106 1778627 1800817 1826016 1854517 1886563 1922311 1961811 2004960 2051473
34310 2051473 2100864 2152486 2205585 2259336 2312879 2365365 2416030 2464267 2509669 2552024 2591269
34299 2591269 2627444 2660642 2691003 2718701 2743962 2767086 2788470 2808608 2828015 2847126 2866224
34288 2866224 2885411 2904631 2923740 2942595 2961102 2979193 2996757 3013589 3029382 3043755 3056284
34277 3056284 3066528 3074037 3078314 3078758 3074581 3064722 3047778 3021977 2985257 2935429 2870432 2788649
34265B788649r9425j16900j33001j46454j56053j60852j60362j54664j44396j30642
34255A385900j14747r8109q1979o7309n4700m4408l6409l0522k6505k4093k2991
34244G84128k2853k3332k4137k5084k6113k7298k8828l0937l3840l7660m2368
34233D61678m7764n3469n8976o3681o6936o8112o6724o2544n5692m6632l6120
34222a64972k5039j4228m340M193J1148J6482K0281K2711K3995K4412K4295K3971
34210c7091K3698K3622K3784K4126K4565K5024K5454K5826K6113K6307K6407K6422
34198B64257K6354K6218K6007K5715K5345K4917K4472K4043K3648K3278K2913
34187E37167K2484K1900K1061J9904J8417J6662J4763J2922J1350J0232R701R825
$$ plain form
34265 2788649 2689224 2572324 2439323 2292869 2136816 1975964 1815602 1660938 1516542 1385900
34255 1385900 1271153 1173044 1091065 1023756 969056 924648 888239 857717 831212 807119 784128
34244 784128 761275 737943 713806 688722 662609 635311 606483 575546 541706 504046 461678
34233 461678 413914 360445 301469 237788 170852 102740 36016 -26528 -82220 -128852 -164972
34222 -164972 -190011 -204239 -208579 -204386 -193238 -176756 -156475 -133764 -109769 -85357 -61062 -37091
34210 -37091 -13393 10229 34013 58139 82704 107728 133182 159008 185121 211428 237835 264257
34198 264257 290611 316829 342836 368551 393896 418813 443285 467328 490976 514254 537167
34187 537167 559651 581551 602612 622516 640933 657595 672358 685280 696630 706862 716563 726388
34175G26388J0606J1973J3801J5939J8249K0594K2870K5002K6947K8698L0274
34164I51341L1712L3029L4217L5249L6094L6723L7111L7253L7198L7039L6913
34153A343879L6966L7327L8066L9163M0533M2044M3571M5009M6285M7377M8275
34142A808495M8987M9540M9981N0405N0893N1493N2171N2798N3180N3094N2335
34131B373372N0715M8089M4409L9768L4434K8830K3476J8918J5601J3802J3601
34120B705015J4923J7565K1245K5643L0441L5362M0199M4824M9172N3223N6940
34109C094552O0257O3090O5332O6891O7727O7855O7360O6351O4932O3144O0943
34098C808434N8194N4710N0320M4939L8624L1610K4308J7254J0989N955K422M43
$$ plain form
34175 726388 736994 748967 762768 778707 796956 817550 840420 865422 892369 921067 951341
34164 951341 983053 1016082 1050299 1085548 1121642 1158365 1195476 1232729 1269927 1306966 1343879
34153 1343879 1380845 1418172 1456238 1495401 1535934 1577978 1621549 1666558 1712843 1760220 1808495
34142 1808495 1857482 1907022 1957003 2007408 2058301 2109794 2161965 2214763 2267943 2321037 2373372
34131 2373372 2424087 2472176 2516585 2556353 2590787 2619617 2643093 2662011 2677612 2691414 2705015
34120 2705015 2719938 2737503 2758748 2784391 2814832 2850194 2890393 2935217 2984389 3037612 3094552
34109 3094552 3154809 3217899 3283231 3350122 3417849 3485704 3553064 3619415 3684347 3747491 3808434
34098 3808434 3866628 3921338 3971658 4016597 4055221 4086831 4111139 4128393 4139382 4145337 4147759 4148202
34086D148202j05N51K177M565P561J1033J4841J8836K2843K6718L0371L3754L6867
34073D358214L9727M2383M4887M7292M9653N2037N4545N7299O0438O4084O8302
34062D938861P3086P8352Q3996Q9910R6021J02289J08706J15282J22027J28984
34052E937514J36216J43779J51701J59974J68601J77595J86998J96879K07326
34043G466583K18435K30287K42949K56490K71004K86615L03493L21826L41810
34034I939492L63618L87420M13382M41674M72484N06030N42568N82390O25829
34025A4274887O73303P25365P82691Q46035R16174R93893J080030J175542J281563
34016B2749483J399422J530629J676860J839979K022007K225064K451295K702784
$$ plain form
34086 4148202 4148097 4148648 4150825 4155390 4162951 4173984 4188825 4207661 4230504 4257222 4287593 4321347 4358214
34073 4358214 4397941 4440324 4485211 4532503 4582156 4634193 4688738 4746037 4806475 4870559 4938861
34062 4938861 5011947 5090299 5174295 5264205 5360226 5462515 5571221 5686503 5808530 5937514
34052 5937514 6073730 6217509 6369210 6529184 6697785 6875380 7062378 7259257 7466583
34043 7466583 7685018 7915305 8158254 8414744 8685748 8972363 9275856 9597682 9939492
34034 9939492 10303110 10690530 11103912 11545586 12018070 12524100 13066668 13649058 14274887
34025 14274887 14948190 15673555 16456246 17302281 18218455 19212348 20292378 21467920 22749483
34016 22749483 24148905 25679534 27356394 29196373 31218380 33443444 35894739 38597523
34008C8597523K981472L289027L626633L994714M392521M817584N265051N726885
34000G2691410O190870O639391P048019P384090P605663P661571P493681P042680
33992A29757375O258457N114613L624323J851650q8636k046745l866210n415225
33984A35189602o609606p420358p866554p999596p886053p593912p183945o705742
33976G5923836o197009n684704n186959m715138m275649l871423l503002l169378
33968C9320574k868587k598183k355526k137982j943046j768400j611951j471799
33960B2565100j346240j233726j132846j042318r60969q87733q21646p61814p07433
33951A3670375o57800o12318n70505n31966m96394m63522m33129m05015l79026
$$ plain form
34008 38597523 41578995 44868022 48494655 52489369 56881890 61699474 66964525 72691410
34000 72691410 78882280 85521671 92569690 99953780 107559443 115221014 122714695 129757375
33992 129757375 136015832 141130445 144754768 146606418 146517782 144471037 140604827 135189602
33984 135189602 128579996 121159638 113293084 105293488 97407435 89813523 82629578 75923836
33976 75923836 69726827 64042123 58855164 54140026 49864377 45992954 42489952 39320574
33968 39320574 36451987 33853804 31498278 29360296 27417250 25648850 24036899 22565100
33960 22565100 21218860 19985134 18852288 17809970 16849001 15961268 15139622 14377808 13670375
33951 13670375 13012575 12400257 11829752 11297786 10801392 10337870 9904741 9499726 9120700
33942I120700l55030l32932l12633k94026k76977k61321k46880k33518k21142
33933F586241k09697j99124j89373j80387j72118j64523j57557j51167j45269
33924E017026j39754j34498j29404j24412j19506j14707j10075j05687j01620
33915C937363r7935r4641r1697q9008q6485q4077q1810p9736p7907p6323p4934
33904C002810p3623p2262p0752o9087o7359o5716o4284o3094o2073o1086n9998
33893B273476n8705n7161n5369n3362n1176m8833m6372m3872m1466l9290l7446
33882A740424l5947l4737l3704l2752l1811l0854k9863k8813k7696k6527k5344
33871A402376k4205k3144k2194k1362k0674k0149j9803j9636j9636j9788k0073
$$ plain form
33942 9120700 8765670 8432738 8120105 7826079 7549102 7287781 7040901 6807383 6586241
33933 6586241 6376544 6177420 5988047 5807660 5635542 5471019 5313462 5162295 5017026
33924 5017026 4877272 4742774 4613370 4488958 4369452 4254745 4144670 4038983 3937363
33915 3937363 3839428 3744787 3653090 3564082 3477597 3393520 3311710 3231974 3154067 3077744 3002810
33904 3002810 2929187 2856925 2786173 2717086 2649727 2584011 2519727 2456633 2394560 2333474 2273476
33893 2273476 2214771 2157610 2102241 2048879 1997703 1948870 1902498 1858626 1817160 1777870 1740424
33882 1740424 1704477 1669740 1636036 1603284 1571473 1540619 1510756 1481943 1454247 1427720 1402376
33871 1402376 1378171 1355027 1332833 1311471 1290797 1270648 1250845 1231209 1211573 1191785 1171712
33860A171712k0450k0854k1189k1350k1235k0786j9994j8922j7675j6395j5216
33849I57646j4242j3541j3114j2919j2853j2765j2502j1964j1137j0087q917p703
33837H15902o465n180l819k396r68L81J551K446K980L106K820K148J118k48j928
33822H11448l887o055q314j0488j2371j3785j4652j4991j4918j4548j3962j3167
33810F70310j2106j0703q888o655m097j418J132L334N056O258O959P197P011O448
33796F69838N586M537L430K401J566R93P02O37O83P03N79K48l08j072k033l164
33780F85326m408n631o664p327p517p225o534n591m562l576k702j929j184l74
33766F20102N67J664K880M119N265O212O903P317P469P387P134O809O523O403
$$ plain form
33860 1171712 1151262 1130408 1109219 1087869 1066634 1045848 1025854 1006932 989257 972862 957646
33849 957646 943404 929863 916749 903830 890977 878212 865710 853746 842609 832522 823605 815902
33837 815902 809437 804257 800438 798042 797074 797455 799006 801452 804432 807538 810358 812506 813624 813376 811448
33822 811448 807561 801506 793192 782704 770333 756548 741896 726905 711987 697439 683477 670310
33810 670310 658204 647501 638613 631958 627861 626443 627575 630909 635965 642223 649182 656379 663390 669838
33796 669838 675424 679961 683391 685792 687358 688351 689053 689690 690373 691076 691655 691903 691595 690523 688490 685326
33780 685326 680918 675287 668623 661296 653779 646554 640020 634429 629867 626291 623589 621660 620476 620102
33766 620102 620669 622333 625213 629332 634597 640809 647712 655029 662498 669885 677019 683828 690351 696754
33752F96754O539O974P670Q549R516J0514J1554J2706J4098J5865J8115K0905
33740H39759K4223K8049L2353L7137M2414M8208N4517O1269O8276P5163Q1366
33729A392734Q6140Q8692Q8296Q4435P6916O5924N2056L6252J9706L694j0626
33718A984219k2365l1019l6467l8915l8804l6697l3178k8786k3956j8994j4090
33707A660948r336m799n29L430P057J0358J3336J5996J8334K0324K1932K3079
33695A780130K3626K3360K2034J9454J5566J0526M683j482p464j2849j7416k1149
33683A839019k4200k6785k9117l1372l3695l6209l9011m2149m5601m9275n2989
33672A428616n6501n9505o1676o2705o2367o0578n7434n3190m8196m2825l7406
$$ plain form
33752 696754 703293 710267 717937 726486 736002 746516 758070 770776 784874 800739 818854 839759
33740 839759 863982 892031 924384 961521 1003935 1052143 1106660 1167929 1236205 1311368 1392734
33729 1392734 1478874 1567566 1655862 1740297 1817213 1883137 1935193 1971445 1991151 1994845 1984219
33718 1984219 1961854 1930835 1894368 1855453 1816649 1779952 1746774 1717988 1694032 1675038 1660948
33707 1660948 1651612 1646813 1646284 1649714 1656771 1667129 1680465 1696461 1714795 1735119 1757051 1780130
33695 1780130 1803756 1827116 1849150 1868604 1884170 1894696 1899379 1897897 1890433 1877584 1860168 1839019
33683 1839019 1814819 1788034 1758917 1727545 1693850 1657641 1618630 1576481 1530880 1481605 1428616
33672 1428616 1372115 1312610 1250934 1188229 1125862 1065284 1007850 954660 906464 863639 826233
33661H26233l2188k7322k2879j8901j5438j2549j0286q657p618p072o878o901
33649F49544p022p172p314p426p518p620p787q043q363q624q657q304p498o258
33635E41938m660k757n70J910M670P649J0710J3679J6384J8722K0672K2304K3743
33622F74394K5119K6540K8077K9771L1633L3659L5833L8139M0569M3123M5819
33611A052676M8711N1865N5358N9241O3550O8322P3612P9474Q5936R2976J00542
33600A832263J08568J16945J25472J33775J41301J47324J51021J51559J48202
33591C056430J40435J28061J11331R0990O8242M4590K1604P03j7046l1033m1149
33580C573158m7701n1269n2543n2193n0785m8733m6312m3716m1134l8807l6999
$$ plain form
33661 826233 794045 766723 743844 724943 709505 696956 686670 678013 670395 663323 656445 649544
33649 649544 642522 635350 628036 620610 613092 605472 597685 589642 581279 572655 563998 555694 548196 541938
33635 541938 537278 534521 533951 535861 540531 548180 558890 572569 588953 607675 628347 650651 674394
33622 674394 699513 726053 754130 783901 815534 849193 885026 923165 963734 1006857 1052676
33611 1052676 1101387 1153252 1208610 1267851 1331401 1399723 1473335 1552809 1638745 1731721 1832263
33600 1832263 1940831 2057776 2183248 2317023 2458324 2605648 2756669 2908228 3056430
33591 3056430 3196865 3324926 3436257 3527247 3595489 3640079 3661683 3662386 3645340 3614307 3573158
33580 3573158 3525457 3474188 3421645 3369452 3318667 3269934 3223622 3179906 3138772 3099965 3062966
33569C062966l5964l5880l6865l9023m2491m7446n4056o2433p2533q4099r6623
33558B455553j09389j21536j32129j40263j45187j46424j43896j37900j29054
33549A249775j18155j06052r3510q1123o9299n8291m8270l9373l1721k5377k0288
33538E58316j6294j3142j0538q195n893l474q77J907M851P903J1003J4065J6984
33525E56616J9642K1954K3923K5635K7233K8838L0495L2184L3849L5444L6952
33514H72765L8380L9732M1012M2226M3376M4469M5517M6557M7639M8820N0143
33503A360636N1645N3397N5502N8126O1460O5711P1057P7626Q5483R4655J05143
33492B140441J16965J30162J44810J61010J78874J98541K20181K43986K70119
$$ plain form
33569 3062966 3027002 2991122 2954257 2915234 2872743 2825297 2771241 2708808 2636275 2552176 2455553
33558 2455553 2346164 2224628 2092499 1952236 1807049 1660625 1516729 1378829 1249775
33549 1249775 1131620 1025568 932058 850935 781636 723345 675075 635702 603981 578604 558316
33538 558316 542022 528880 518342 510147 504254 500780 499903 501810 506661 514564 525567 539632 556616
33525 556616 576258 598212 622135 647770 675003 703841 734336 766520 800369 835813 872765
33514 872765 911145 950877 991889 1034115 1077491 1121960 1167477 1214034 1261673 1310493 1360636
33503 1360636 1412281 1465678 1521180 1579306 1640766 1706477 1777534 1855160 1940643 2035298 2140441
33492 2140441 2257406 2387568 2532378 2693388 2872262 3070803 3290984 3534970 3805089
33483C805089K98669L29614L62787L97848M34235M71089N07161N40712N69382
33474G716586N90075N98891N91257N62328N07789M25012L14365J80226L1143j21260
33464A1396412k64448l87564m83432n49388n86829n99962n94320n75505n48408
33455F806556n16828m83439m49945m17272l85837l55764l27088k99854k74134
33446C296395k50007k27523k06655j87291j69238j52285j36256j21065j06714
33437A739361r3256q0731o9132n8399m8447l9214l0716k3062j6448j1083p165
33426A261708m896m476o111r912j5773k3338l1994m1005m9620n7190o3223o7432
33414H86738o9747p0294o9325o7131o3981o0130n5842n1405m7093m3120l9590
$$ plain form
33483 3805089 4103758 4433372 4796159 5194007 5628242 6099331 6606492 7147204 7716586
33474 7716586 8306661 8905552 9496809 10059137 10566926 10991938 11306303 11486529 11517672 11396412
33464 11396412 11131964 10744400 10260968 9711580 9124751 8524789 7930469 7354964 6806556
33455 6806556 6289728 5806289 5356344 4939072 4553235 4197471 3870383 3570529 3296395
33446 3296395 3046388 2818865 2612210 2424919 2255681 2103396 1967140 1846075 1739361
33437 1739361 1646105 1565374 1496242 1437843 1389396 1350182 1319466 1296404 1279956 1268873 1261708
33426 1261708 1256812 1252336 1246225 1236313 1220540 1197202 1165208 1124203 1074583 1017393 954170 886738
33414 886738 816991 746697 677372 610241 546260 486130 430288 378883 331790 288670 249080
33403B49080l6477l3640l0894k8074k5073k1878j8566j5257j2085r147o484m075
33391G430j861K16K168L922N375O450P125P449P488P305O948O464N927N393M926
33376H2725M568M349M289M382M603M914N246N507N595N417M927M129L081J875
33362A45607O24n59j572k338k815l011k965k739k403k014j598j142o25l6O25J324
33346A24363K023K658L147L406L422L272L133L208L639M474N666P135Q819J0662
33332A89027J2603J4532J6277J7643J8445J8571J7986J6708J4790J2296R315N956
33320C64149K376j241m693p788j0325j2108j2959j2789j1656r745p301m548j617
33307B69755J442M626P947J1393J4898J8328K1505K4204K6204K7230K6922K4830
$$ plain form
33403 249080 212603 178963 148069 119995 94922 73044 54478 39221 27136 17989 11505 7430
33391 7430 5569 5785 7953 11875 17250 23700 30825 38274 45762 53067 60015 66479 72406 77799 82725
33376 82725 87293 91642 95931 100313 104916 109830 115076 120583 126178 131595 136522 140651 143732 145607
33362 145607 146231 145672 144100 141762 138947 135936 132971 130232 127829 125815 124217 123075 122450 122414 123039 124363
33346 124363 126386 129044 132191 135597 139019 142291 145424 148632 152271 156745 162411 169546 178365 189027
33332 189027 201630 216162 232439 250082 268527 287098 305084 321792 336582 348878 358193 364149
33320 364149 366525 365284 360591 352803 342478 330370 317411 304622 292966 283221 275920 271372 269755
33307 269755 271197 275823 283770 295163 310061 328389 349894 374098 400302 427532 454454 479284
33295D79284K0519J3791M931n203j5336k4126l0580l4276l5346l4290l1772k8432
33283B79164k4802k1256j7981j5009j2255r586o909m196j497J101L514N717P767
33270A83772R788J1915J4228J6723J9323K1944K4561K7244L0133L3378L7064M1233
33258D71306M5879N1009N6656O2862O9652P7011Q4885R3204J01910J10931J20180
33247A345485J29482J38551J46928J53996J58986J60957J58804J51290J37256
33238B681735J15974Q7560N3293J5564k2531n7912q8153j11863j28684j39053
33228B405930j43889j44305j41400j36129j29291j21504j13243j04844r6529q8443
33218A186353q0707p3463o6869o1047n6047n1800m8151m4928m1991l9275l6770
$$ plain form
33295 479284 499803 513594 518525 513322 497986 473860 443280 409004 373658 339368 307596 279164
33283 279164 254362 233106 215125 200116 187861 178275 171366 167170 165673 166774 170288 176005 183772
33270 183772 193560 205475 219703 236426 255749 277693 302254 329498 359631 393009 430073 471306
33258 471306 517185 568194 624850 687712 757364 834375 919260 1012464 1114374 1225305 1345485
33247 1345485 1474967 1613518 1760446 1914442 2073428 2234385 2393189 2544479 2681735
33238 2681735 2797709 2885269 2938562 2954126 2931595 2873683 2785530 2673667 2544983 2405930
33228 2405930 2262041 2117736 1976336 1840207 1710916 1589412 1476169 1371325 1274796 1186353
33218 1186353 1105646 1032183 965314 904267 848220 796420 748269 703341 661350 622075 585305
33207E85305l4497l2483l0743k9253k7938k6678k5344k3837k2105k0166j8094
33196B94167j6009j4019j2194j0585r258q276p661p336p126o831o307n520m545
33183A78500l523k573j740r84k02P18J820L055M288N357O131O545O615O429O134
33168B16570N910N933O331P145Q310R661J0986J2094J2868J3289J3406J3277J2926
33155C48706J2311J1356J0002Q283O344M422K776J618J091J254K103L557N500
33142D19323P785J0274J2829J5313J7561J9373K0503K0712J9832J7847J4915J1355
33130F07622P568L933P22j942m052n686o950p940q744r417r984j0402j0568j0356
33116E33804r677q532p034n370l730k220q13O04K134L780N447O996Q328R417J0287
$$ plain form
33207 585305 550808 518325 487582 458329 430391 403713 378369 354532 332427 312261 294167
33196 294167 278158 264139 251945 241360 232102 223826 216165 208829 201703 194872 188565 183045 178500
33183 178500 174977 172404 170664 169680 169478 170196 172016 175071 179359 184716 190847 197392 204007 210436 216570
33168 216570 222480 228413 234744 241889 250199 259860 270846 282940 295808 309097 322503 335780 348706
33155 348706 361017 372373 382375 390658 397002 401424 404200 405818 406909 408163 410266 413823 419323
33142 419323 427108 437382 450211 465524 483085 502458 522961 543673 563505 581352 596267 607622
33130 607622 615190 619123 619845 617903 613851 608165 601215 593275 584531 575114 565130 554728 544160 533804
33116 533804 524127 515595 508561 503191 499461 497241 496428 497032 499166 502946 508393 515389 523717 533134 543421
33101E43421J0953J1383J1488J1207J0549R603Q519P457O553N942N738O018O785
33088F55616P949R390J1007J2759J4677J6842J9357K2332K5841K9899L4461L9440
33076H99570M4755N0356N6276O2608O9486P7040Q5381R4594J04759J15993J28478
33065A789296J42428J58029J75388J94485K15171K37157K60002K83061L05453
33056C760470L26021L43276L55368L59990L54356L35306K99736K45459J72356
33047F552338Q3434j4934j13949k04361k78652l32460l64893l77828l74812l59989
33037D213894l37313l10116k80926k51519k23056j96248j71510j49056j28974
33028B165176j11262r5849q2609p1388o2046n4498m8716m4663m2210m1086m0879
$$ plain form
33101 543421 554374 565757 577245 588452 599001 608604 617123 624580 631133 637075 642813 648831 655616
33088 655616 663565 672955 683962 696721 711398 728240 747597 769929 795770 825669 860130 899570
33076 899570 944325 994681 1050957 1113565 1183051 1260091 1345472 1440066 1544825 1660818 1789296
33065 1789296 1931724 2089753 2265141 2459626 2674797 2911954 3171956 3455017 3760470
33056 3760470 4086491 4429767 4785135 5145125 5499481 5834787 6134523 6379982 6552338
33047 6552338 6635772 6620838 6506889 6302528 6023876 5691416 5326523 4948695 4573883 4213894
33037 4213894 3876581 3566465 3285539 3034020 2810964 2614716 2443206 2294150 2165176
33028 2165176 2053914 1958065 1875456 1804068 1742022 1687524 1638808 1594145 1551935 1510849 1469970
33017A469970m1087m1197m0758l9438l7069l3662k9384k4497j9291j4000q797
33006A140790l817P96M838Q072J0275J1290J1037R500O716K821j930p161j2441
32993A180786j7340k1501k4679k6763k7788k7918k7398k6506k5493k4557k3825
32982I07018k3346k3103k3039k3075k3159k3281k3480k3805k4316k5068k6141
32971F45205k7603k9479l1712l4169l6655l8913m0654m1595m1509m0272l7838
32960B44806l4242k9587k4030j7764j0987l850L566J1250J9225K7436L5682M3555
32948B65060N0425N5434N7516N5506M8361L5574J7632l713k5671m5167n9780o8345
32936C82832p1001o8743o2840n4395m4156l2525j9692n754R214K5153M1974N9529
$$ plain form
33017 1469970 1428883 1387686 1346928 1307490 1270421 1236759 1207375 1182878 1163587 1149587 1140790
33006 1140790 1136973 1137769 1142607 1150679 1160954 1172244 1183281 1192781 1199497 1202318 1200388 1193227 1180786
32993 1180786 1163446 1141945 1117266 1090503 1062715 1034797 1007399 980893 955400 930843 907018
32982 907018 883672 860569 837530 814455 791296 768015 744535 720730 696414 671346 645205
32971 645205 617602 588123 556411 522242 485587 446674 406020 364425 322916 282644 244806
32960 244806 210564 180977 156947 139183 128196 124346 127912 139162 158387 185823 221505 265060
32948 265060 315485 370919 428435 483941 532302 567876 585508 581795 556124 510957 451177 382832
32936 382832 311831 243088 180248 125853 81697 49172 29480 23726 32940 58093 100067 159596
32924A59596P7530R5527J12896J28814J42280J52168J57437J57367J51821J41306
32914A476742J26911J10079R2369P5180N9539M5966L4423K4455J5444O942j082
32903B066968q283j4194j8517k1227k2463k2389k1116j8740j5409j1320o722j893
32891A884695K860P207J0764J3138J3943J2888R815M770j967r911j8464k7020
32879A902718l5032m2029m7631n1601n3848n4453n3612n1620m8809m5518m2052
32868A376513l8671l5588l2968l0880k9315k8212k7509k7162k7107k7210k7269
32857A044622k7088k6541k5648k4516k3277k2006k0712j9366j7944j6453j4903
32846H06168j3303j1638r883q019o028l906j676N79K729M573N908O568O464N590
$$ plain form
32924 159596 237126 332653 445549 574363 716643 868811 1026248 1183615 1335436 1476742
32914 1476742 1603653 1713732 1806101 1881281 1940820 1986786 2021209 2045664 2061108 2068050 2066968
32903 2066968 2058685 2044491 2025974 2004747 1982284 1959895 1938779 1920039 1904630 1893310 1886588 1884695
32891 1884695 1887555 1894762 1905526 1918664 1932607 1945495 1955310 1960080 1958113 1948202 1929738 1902718
32879 1902718 1867686 1825657 1778026 1726425 1672577 1618124 1564512 1512892 1464083 1418565 1376513
32868 1376513 1337842 1302254 1269286 1238406 1209091 1180879 1153370 1126208 1099101 1071891 1044622
32857 1044622 1017534 990993 965345 940829 917552 895546 874834 855468 837524 821071 806168
32846 806168 792865 781227 771344 763325 757297 753391 751715 752294 755023 759596 765504 772072 778536 784126
32832G84126L996J794q42l656o341q616j0307j1391j1991j2318j2616j3081j3821
32819F84936j4804j5891j6904j7696j8180j8324j8133j7655j6964j6149j5274
32808D98962j4359j3401j2396j1394j0484r753r237q887q645q461q352q373q584
32795C66636q993r530j0025j0272j0088r404q266o814n189l484j729N0J808L501
32781B88201N144O825Q655J0694J2862J4926J6507J7136J6363J3866R579L759
32769D24517l006r922j6177k1149k4527k6322k6782k6292k5243k3964k2677k1498
32757A76958k0452j9505j8574j7574j6400j4942j3085j0738p895m687j356J823
32745C3573M651P082R170J0978J2472J3500J3875J3469J2274J0424Q166N787L554
$$ plain form
32832 784126 788122 789916 789074 785418 779077 770461 760154 748763 736772 724454 711838 698757 684936
32819 684936 670132 654241 637337 619641 601461 583137 565004 547349 530385 514236 498962
32808 498962 484603 471202 458806 447412 436928 427175 417938 409051 400406 391945 383593 375220 366636
32795 366636 357643 348113 338088 327816 317728 308324 300058 293244 288055 284571 282842 282892 284700 288201
32781 288201 293345 300170 308825 319519 332381 347307 363814 380950 397313 411179 420758 424517
32769 424517 421511 411589 395412 374263 349736 323414 296632 270340 245097 221133 198456 176958
32757 176958 156506 137001 118427 100853 84453 69511 56426 45688 37793 33106 31750 33573
32745 33573 38224 45306 54476 65454 77926 91426 105301 118770 131044 141468 149634 155421 158975
32732A58975J627L4j312k557l841n238o712q116r274j0064j0482j0623j0612j0529
32718G1276j0376j0103r653q989q090o938n537l924k195n02R90K151K898L213
32704A4221L113K645J878R14j09j036j726k096k116j775j032J72J887M075O570
32689B5585R097J1332J3018J4030J4389J4205J3601J2676J1525J0234Q912P666
32677A66270O603N813N376N334N692O417P486Q896J0669J2812J5238J7799K0318
32664B94723K2684K4882K6979K9067L1194L3318L5357L7212L8831M0174M1189
32653F55610M1769M1712M0743L8565L4950K9776K3012J4718N058n680j7079k8647
32641H74507l9917n0520o0228o8908p6419q2459q6442q7450q4377p6450o3857
$$ plain form
32732 158975 160602 160636 159324 156767 152926 147688 140976 132860 123586 113522 103040 92417 81805 71276
32718 71276 60900 50797 41144 32155 24065 17127 11590 7666 5471 4969 5959 8110 11008 14221
32704 14221 17334 19979 21857 22771 22662 21626 19900 17804 15688 13913 12881 13053 14940 19015 25585
32689 25585 34682 46014 59032 73062 87451 101656 115257 127933 139458 149692 158604 166270
32677 166270 172873 178686 184062 189396 195088 201505 208991 217887 228556 241368 256606 274405 294723
32664 294723 317407 342289 369268 398335 429529 462847 498204 535416 574247 614421 655610
32653 655610 697379 739091 779834 818399 853349 883125 906137 920855 925913 920233 903154 874507
32641 874507 834590 784070 723842 654934 578515 496056 409614 322164 237787 161337 97480
32630I7480m8109l1658j6957n560K179O786R124J0017J0088R751R234Q623P913
32617F8911P059O041M907L767K759J982J484J248J194J192J118R15O11K81pk47
32601A03215n09r09j516k285l056l616l803l574k997k206j321m08N23J486K485
32586H1509L487M411N167N699O006O125O084N876N491M931M229L445K647J917
32572A47024J321Q99O35M48K08k03q44j670k565l413m147m767n312n809o233o526
32556A09046o636o552o334o073n872n771n756n766n751n689n575n377n028m471
32542B8395l718k884k185j835j961k547l441m422n264n798n941n682n072m199
32528b6554l177k105j059q6P76J477J979K293K478K630K823L090L411L731L995
$$ plain form
32630 97480 49371 17713 756 -4804 -2625 4161 13285 23302 33390 43141 52375 60998 68911
32617 68911 75970 82011 86918 90685 93444 95426 96910 98158 99352 100544 101662 102577 103188 103469 103462 103215
32601 103215 102706 101797 100281 97996 94940 91324 87521 83947 80950 78744 77423 77015 77538 79024 81509
32586 81509 84996 89407 94574 100273 106279 112404 118488 124364 129855 134786 139015 142460 145107 147024
32572 147024 148345 149244 149879 150327 150535 150332 149488 147818 145253 141840 137693 132926 127614 121805 115572 109046
32556 109046 102410 95858 89524 83451 77579 71808 66052 60286 54535 48846 43271 37894 32866 28395
32542 28395 24677 21793 19608 17773 15812 13265 9824 5402 138 -5660 -11601 -17283 -22355 -26554
32528 -26554 -29731 -31836 -32895 -32981 -32205 -30728 -28749 -26456 -23978 -21348 -18525 -15435 -12024 -8293 -4298
32513d298M136M092L824L330K692K043J529J272J329J705K342L167M112N112O088
32498D2475O944P555P823P681P138O255N123L830K455J059l04j570k647l431l844
32483H6542l872l577l060k413j674q40J00J131K204L276M335N385O419P394Q250
32468A09600Q926R347R416R023Q085O589M623K361Lk285m395o269p857r086r855
32453A28226j0056r635q639p224n627m132k984k344k227k503k958l366l556l432
32439E9543k972k234j330m06M02R76J242J159P13o8j133k402l782n190o536p718
32423C0264q631r214r463r431r191q782q215p482o602n646m711l880l165k535
32409f6684j940j371q45l93k2K84N72Q89J277J760K350L035L775M489N066N410
$$ plain form
32513 -4298 -162 3930 7754 11084 13776 15819 17348 18620 19949 21654 23996 27163 31275 36387 42475
32498 42475 49419 56974 64797 72478 79616 85871 90994 94824 97279 98338 98034 96464 93817 90386 86542
32483 86542 82670 79093 76033 73620 71946 71106 71206 72337 74541 77817 82152 87537 93956 101350 109600
32468 109600 118526 127873 137289 146312 154397 160986 165609 167970 167973 165688 161293 155024 147167 138081 128226
32453 128226 118170 108535 99896 92672 87045 82913 79929 77585 75358 72855 69897 66531 62975 59543
32439 59543 56571 54337 53007 52601 53003 53979 55221 56380 57093 57025 55892 53490 49708 44518 37982 30264
32423 30264 21633 12419 2956 -6475 -15666 -24448 -32663 -40145 -46747 -52393 -57104 -60984 -64149 -66684
32409 -66684 -68624 -69995 -70840 -71233 -71255 -70971 -70399 -69510 -68233 -66473 -64123 -61088 -57313 -52824 -47758 -42348
32393d2348N468N249M791M149L361K426J311o2j782l927o498r384j2360j5118
32379f4724j7348j8802j9328j8897j7602j5635j3241j0647q035n536l229j149
32367b14173P36K491M155N678O933P775Q120P969P398O521N484M416L412K487
32353a40598J613P06l11j478k769m074n234o051o335n926m742k814k91K604N663
32338a70037Q792J2027J5507J9377K3714K8479L3503L8505M3138M7042M9908N1525
32326B01480N1788N0681M8282M4711M0169L4928K9321K3696J8364J3556R385N859
32314E72220K914M96j406k766l581l908l866l588l187k725k200j584q31Q3J133
32299E47204K243L282M087M478M269L336J650o88l480o478r460j2253j4773j6995
$$ plain form
32393 -42348 -36880 -31631 -26840 -22691 -19330 -16904 -15593 -15655 -17437 -21364 -27862 -37246 -49606 -64724
32379 -64724 -82072 -100874 -120202 -139099 -156701 -172336 -185577 -196224 -204259 -209795 -213024 -214173
32367 -214173 -213437 -210946 -206791 -201113 -194180 -186405 -178285 -170316 -162918 -156397 -150913 -146497 -143085 -140598
32353 -140598 -138985 -138279 -138590 -140068 -142837 -146911 -152145 -158196 -164531 -170457 -175199 -178013 -178304 -175700 -170037
32338 -170037 -161245 -149218 -133711 -114334 -90620 -62141 -28638 9867 53005 100047 149955 201480
32326 201480 253268 303949 352231 396942 437111 472039 501360 525056 543420 556976 566361 572220
32314 572220 575134 575630 574224 571458 567877 563969 560103 556515 553328 550603 548403 546819 545988 546071 547204
32299 547204 549447 552729 556816 561294 565563 568899 570549 569861 566381 559903 550443 538190 523417 506422
32285E06422j8950k0692k2262k3676k4900k5867k6502k6707k6383k5452k3931
32274B41100k1928j9635j7255j4957j2843j0971r388q120p169o451n790m929l616
32261I8048j681Q98L996P391J0863J4252J7499K0614K3609K6460K9064L1239L2742
32248C14994L3321L2773L1009K8081K4171J9539J4493R358M464J14l465o131p828
32235D94893q543q291p114n097k370R01M550Q457J2549J6800K1180K5623K9983
32222E83521L4026L7431L9886M1140M1084L9708L7039L3102K7932K1629J4439
32211I50937O758r23q128j4503j9874k4222k7620l0149l1880l2865l3155l2810
32199G01566l1931l0634k9033k7199k5145k2842k0285j7523j4673j1924r483p545
$$ plain form
32285 506422 487472 466780 444518 420842 395942 370075 343573 316866 290483 265031 241100
32274 241100 219172 199537 182282 167325 154482 143511 134123 126003 118834 112383 106593 101664 98048
32261 98048 96367 97265 101261 108652 119515 133767 151266 171880 195489 221949 251013 282252 314994
32248 314994 348315 381088 412097 440178 464349 483888 498381 507739 512203 512317 508852 502721 494893
32235 494893 486350 478059 470945 465848 463478 464379 468929 477386 489935 506735 527915 553538 583521
32222 583521 617547 654978 694864 736004 777088 816796 853835 886937 914869 936498 950937
32211 950937 957695 956772 948644 934141 914267 890045 862425 832276 800396 767531 734376 701566
32199 701566 669635 639001 609968 582769 557624 534782 514497 496974 482301 470377 460894 453349
32187D53349o245n632n676o275p285q539r883j1178j2329j3250j3870j4125j3985
32174C25077j3465j2636j1600j0465r335q290p402o734o322o160o199o358o537
32161B13574o639o575o280n733m967m064l134k271j544r75n54k41K3K88N67Q40
32145A72315J058J193J246J258J275J328J413J497J545J541J510J499J533J602
32131A91813J653J632J513J287R33M03l63j402k694m158n658p026q086q689q728
32116A52430q163p030n470l720k072q00j04o3o29j666k970m315n496o370o869
32101I6693o999o802o351n741n062m401l801l292k870k520k206j864j414p86M5
32086D2629J045K144L267M356N369O267P012P562P869P902P649P133O392N465
$$ plain form
32187 453349 447104 441472 435796 429521 422236 413697 403814 392636 380307 367057 353187 339062 325077
32174 325077 311612 298976 287376 276911 267576 259286 251884 245150 238828 232668 226469 220111 213574
32161 213574 206935 200360 194080 188347 183380 179316 176182 173911 172367 171392 170838 170597 170620 170908 171475 172315
32145 172315 173373 174566 175812 177070 178345 179673 181086 182583 184128 185669 187179 188678 190211 191813
32131 191813 193466 195098 196611 197898 198831 199234 198871 197469 194775 190617 184959 177933 169847 161158 152430
32116 152430 144267 137237 131767 128047 125975 125175 125071 125008 124379 122713 119743 115428 109932 103562 96693
32101 96693 89694 82892 76541 70800 65738 61337 57536 54244 51374 48854 46648 44784 43370 42584 42629
32086 42629 43674 45818 49085 53441 58810 65077 72089 79651 87520 95422 103071 110204 116596 122061
32072A22061M365L106J731L19j012k146l008l578l889m020m045m000l862l557
32058I8465l035k327j573r72o91p86j177j722k300k833l266l527l523l198k558
32043F4977j695p52J26Q10J236J398J338J122P98L84r6o14j106j530j864k117
32027F2415k312k465k608k777l025l371l792m199m491m584m434m061l533k953
32013A3810k447k130k085k348k888l610m376n008n347n273m756l837k647j338
31999c4280n8J078J988K638L036L227L282L275L266L282L333L413L505L612L737
31984H334L909M167M529M970N408N719N761N421M640L420J817n9k066m017n745
31969D6208p128q087q602q690q405p856p202o620o244o121o203o378o521o546
$$ plain form
32072 122061 126426 129532 131263 131582 130570 128424 125416 121838 117949 113929 109884 105884 102022 98465
32058 98465 95430 93103 91530 90558 89867 89081 87904 86182 83882 81049 77783 74256 70733 67535 64977
32043 64977 63282 62530 62656 63466 64702 66100 67438 68560 69358 69742 69646 69032 67926 66396 64532 62415
32027 62415 60103 57638 55030 52253 49228 45857 42065 37866 33375 28791 24357 20296 16763 13810
32013 13810 11363 9233 7148 4800 1912 -1698 -6074 -11082 -16429 -21702 -26458 -30295 -32942 -34280
31999 -34280 -34338 -33260 -31272 -28634 -25598 -22371 -19089 -15814 -12548 -9266 -5933 -2520 985 4597 8334
31984 8334 12243 16410 20939 25909 31317 37036 42797 48218 52858 56278 58095 58036 55970 51953 46208
31969 46208 39080 30993 22391 13701 5296 -2560 -9762 -16382 -22626 -28747 -34950 -41328 -47849 -54395
31955e4395o405o092n640n098m539m047l703l559l626l865m225m673n191n759
31941a20817o328o832p203p398p438p373p295p318p584q234r382j1058j3186j5600
31927b43046j8106k0554k2881k5089k7232k9371l1572l3895l6418l9223m2415
31916e69802m6095n0354n5241o0759o6835p3354q0179q7179r4206j01061j07471
31905a392536j13105j17642j20765j22156j21420j18043j11383j00736q5480o5250
31895b468516m0200j1205K0024N1137P9593J03262J20884J32192J37726J38477
31885a736626J35569J30066J22907J14868J06562R8411R0649Q3342P6451O9900
31875g07901O3641N7670N2002M6650M1643L7035L2929K9434K6630K4498K2932
$$ plain form
31955 -54395 -60800 -66892 -72532 -77630 -82169 -86216 -89919 -93478 -97104 -100969 -105194 -109867 -115058 -120817
31941 -120817 -127145 -133977 -141180 -148578 -156016 -163389 -170684 -178002 -185586 -193820 -203202 -214260 -227446 -243046
31927 -243046 -261152 -281706 -304587 -329676 -356908 -386279 -417851 -451746 -488164 -527387 -569802
31916 -569802 -615897 -666251 -721492 -782251 -849086 -922440 -1002619 -1089798 -1184004 -1285065 -1392536
31905 -1392536 -1505641 -1623283 -1744048 -1866204 -1987624 -2105667 -2217050 -2317786 -2403266 -2468516
31895 -2468516 -2508716 -2519921 -2499897 -2448760 -2369167 -2265905 -2145021 -2012829 -1875103 -1736626
31885 -1736626 -1601057 -1470991 -1348084 -1233216 -1126654 -1028243 -937594 -854252 -777801 -707901
31875 -707901 -644260 -586590 -534588 -487938 -446295 -409260 -376331 -346897 -320267 -295769 -272837
31864b72837K1770K0838K0000J9184J8369J7561J6778J6034J5332J4642J3907
31853g8422J3058J2042J0850R548Q248P065O079N283M608L940L196K335J406N29
31839I765j52n23n31k08L64J076J846K650L514M469N493O482P273P732P815P573
31823F4638P142O656O212N856N597N445N426N582N936O466P096P692Q101Q185
31809A56030P867P158O145M955L735K615J685R82M73O9l42q84j649k704m039n585
31793A76511p190q663r803j0470j0606j0237r472q478p440o501n713n046m421
31780G2471l757k998k106j089l0R06J530J707J427Q00qq27j537k078k432k637
31764E9342k751k870l077l416l860m323m700m903m888m651m235l710l153k624
$$ plain form
31864 -272837 -251067 -230229 -210229 -191045 -172676 -155115 -138337 -122303 -106971 -92329 -78422
31853 -78422 -65364 -53322 -42472 -32924 -24676 -17611 -11532 -6249 -1641 2299 5495 7830 9236 9765
31839 9765 9613 9090 8559 8351 8715 9791 11637 14287 17801 22270 27763 34245 41518 49250 57065 64638
31823 64638 71780 78436 84648 90504 96101 101546 106972 112554 118490 124956 132052 139744 147845 156030
31809 156030 163897 171055 177200 182155 185890 188505 190190 191172 191645 191714 191372 190488 188839 186135 182096 176511
31793 176511 169321 160658 150855 140385 129779 119542 110070 101592 94152 87651 81938 76892 72471
31780 72471 68714 65716 63610 62521 62491 63397 64927 66634 68061 68861 68853 68026 66489 64411 61979 59342
31764 59342 56591 53721 50644 47228 43368 39045 34345 29442 24554 19903 15668 11958 8805 6181
31750F181k158j764j438j177r57p26m11N0O63J382K125K829L450L986M457M889
31734B1381N305N696O039O298O429O396O173N763N201M564L944L425L066K889
31720I2569K907L103L436L811M102M195M006L520K774J842P79l62j542k711l824
31705A18605m848n763o557p192p643p879p894p702p339o838o221n497m673l791
31691B8768k909k099j409q75m97k51r2L0J40K14K08P7j96n82j041j523j989k418
31673A3556k825l221l611l931m075l927l424k591j508k87R92K288L578M842O025
31658A881P064P883Q421Q625Q441P814O721N222L455J599j69j715k937l760m128
31643E4417m022l468k532j301J43J745L460N245P040Q756J0292J1557J2466J2955
$$ plain form
31750 6181 4023 2259 821 -356 -1313 -2039 -2450 -2400 -1737 -355 1770 4599 8049 12035 16492 21381
31734 21381 26686 32382 38421 44719 51148 57544 63717 69480 74681 79245 83189 86614 89680 92569
31720 92569 95476 98579 102015 105826 109928 114123 118129 121649 124423 126265 127044 126682 125140 122429 118605
31705 118605 113757 107994 101437 94245 86602 78723 70829 63127 55788 48950 42729 37232 32559 28768
31691 28768 25859 23760 22351 21476 20979 20728 20636 20666 20806 21020 21228 21305 21109 20527 19486 17963 15974 13556
31673 13556 10731 7510 3899 -32 -4107 -8034 -11458 -14049 -15557 -15844 -14852 -12564 -8986 -4144 1881
31658 1881 8945 16828 25249 33874 42315 50129 56850 62072 65527 67126 66957 65242 62305 58545 54417
31643 54417 50395 46927 44395 43094 43237 44982 48442 53687 60727 69483 79775 91332 103798 116753
31629A16753J2973J2504J1581J0294Q778P197N698M375L237K211J194J03j079
31616A95819k315l551m741n879o979q058r103j0061j0842j1346j1500j1268j0665
31603H9511r748q589p278n894m507l166j898p00M44J556K648L734M858O087P498
31588G4556R157J1128J3466J6249J9565K3500K8077L3217L8700M4178M9235N3396
31576D14424N6168N7073N5714N1878M5638L7402K7867J7865Q208m79p802j3592
31564G50364j7837k0629k2145k2616k2304k1444k0220j8748j7100j5320j3443
31553E38558j1478r411p207m815k198O59L703O771R597J1838J3148J3263J2061
31540E74489R591O069J848k656p039j0970j4238j6762j8558j9701k0267k0314
$$ plain form
31629 116753 129726 142230 153811 164105 172883 180080 185778 190153 193390 195601 196795 196898 195819
31616 195819 193504 189953 185212 179333 172354 164296 155193 145132 134290 122944 111444 100176 89511
31603 89511 79763 71174 63896 58002 53495 50329 48431 47731 48175 49731 52379 56113 60971 67058 74556
31588 74556 83713 94841 108307 124556 144121 167621 195698 228915 267615 311793 361028 414424
31576 414424 470592 527665 583379 635257 680895 718297 746164 764029 772237 771758 763956 750364
31564 750364 732527 711898 689753 667137 644833 623389 603169 584421 567321 552001 538558
31553 538558 527080 517669 510462 505647 503449 504108 507811 514582 524179 536017 549165 562428 574489
31540 574489 584080 590149 591997 589341 582302 571332 557094 540332 521774 502073 481806 461492
31528D61492j9888j9039j7853j6450j4969j3548j2303j1317j0636j0249j0077
31517C05163j0001r897r670r297q796q229p651p105o608o173n813n529n325n190
31503A99879n111n065n023m968m891m796m680m510m241l842l313k687k002j302
31489A43448o33o4L31M82L52n9o94j432k130k670k985l065k947k690k376k084
31473A20784j879j805j876k060k290k468k520k419k190j893j592j328j111r34
31459I4419p92p39q65j279k020l008m063m984n638n993o083n963n674n221m593
31444C7504l745k618j157O44K730M984P267R433J1333J2818J3741J4015J3621
31431A20570J2664J1319R766Q137O462M708K812P35j526l935o421q889j1267j3512
$$ plain form
31528 461492 441604 422565 404712 388262 373293 359745 347442 336125 325489 315240 305163
31517 305163 295162 285265 275595 266298 257502 249273 241622 234517 227909 221736 215923 210394 205069 199879
31503 199879 194768 189703 184680 179712 174821 170025 165345 160835 156594 152752 149439 146752 144750 143448
31489 143448 142815 142751 143082 143564 143916 143857 143163 141731 139601 136931 133946 130881 127934 125244 122868 120784
31473 120784 118905 117100 115224 113164 110874 108406 105886 103467 101277 99384 97792 96464 95353 94419
31459 94419 93627 92888 92023 90744 88724 85716 81653 76669 71031 65038 58955 52992 47318 42097 37504
31444 37504 33759 31141 29984 30628 33358 38342 45609 55042 66375 79193 92934 106949 120570
31431 120570 133234 144553 154319 162456 168918 173626 176438 177173 175647 171712 165291 156402 145135 131623
31417A31623j5614j7563j9300k0693k1571k1748k1088j9515j7026j3712r755n449
31405g1411j159K749O013Q519J0298J1489J2282J2860J3355J3801J4140J4265
31393D7201J4097J3612J2868J1968J1007J0049R101Q127P068N870M529L101J693
31380A60291M03p16j667k470l130l634l967m145m209m220m232m285m390m526m625
31365A10478m602m375l911l239k440j633r27m09j05j4j07l72q14j449k293l346
31349H0442m567n861p106q192r030r581r824r791r565r273r053q997r147r520
31335c9065j0098j0843j1706j2641j3616j4597j5554j6453j7267j7973j8570j9091
31323b17474j9598k0191k1002k2166k3771k5812k8176l0667l3059l5126l6659
$$ plain form
31417 131623 116009 98446 79146 58453 36882 15134 -5954 -25469 -42495 -56207 -65962 -71411
31405 -71411 -72570 -69821 -63808 -55289 -44991 -33502 -21220 -8360 4995 18796 32936 47201
31393 47201 61298 74910 87778 99746 110753 120802 129903 138030 145098 150968 155497 158598 160291
31380 160291 160694 159978 158311 155841 152711 149077 145110 140965 136756 132536 128304 124019 119629 115103 110478
31365 110478 105876 101501 97590 94351 91911 90278 89351 88942 88837 88823 88716 88344 87530 86081 83788 80442
31349 80442 75875 70014 62908 54716 45686 36105 26281 16490 6925 -2348 -11401 -20398 -29545 -39065
31335 -39065 -49163 -60006 -71712 -84353 -97969 -112566 -128120 -144573 -161840 -179813 -198383 -217474
31323 -217474 -237072 -257263 -278265 -300431 -324202 -350014 -378190 -408857 -441916 -477042 -513701
31312e13701l7483l7466l6516l4555l1497k7233k1654j4726o570K486J1928K1135
31300g25852K9483L6469M1774M5301M7155M7594M6950M5550M3667M1478L9065
31289b61366L6443L3620L0648K7649K4790K2239K0100J8398J7055J5957J4985
31278E18J4074J3189J2318J1437J0519R553Q543P521O520N555M607L637K603J500
31264A12094L73o96j603k249k550k485k095j498q37k60J23K46J01k43o69j054
31248I6698j321j457j487j443j357j255j147j016q32n47j26M25J061J706K274
$$ plain form
31312 -513701 -551184 -588650 -625166 -659721 -691218 -718451 -740105 -754831 -761401 -758915 -746987 -725852
31300 -725852 -696369 -659900 -618126 -572825 -525670 -478076 -431126 -385576 -341909 -300431 -261366
31289 -261366 -224923 -191303 -160655 -133006 -108216 -85977 -65877 -47479 -30424 -14467 518
31278 518 14592 27781 40099 51536 62055 71608 80151 87672 94192 99747 104354 107991 110594 112094
31264 112094 112467 111771 110168 107919 105369 102884 100789 99291 98454 98194 98317 98563 98664 98421 97752 96698
31248 96698 95377 93920 92433 90990 89633 88378 87231 86215 85383 84836 84710 85135 86196 87902 90176
$$ [...]
##END NTUPLES=NMR SPECTRUM
##END=
