##TITLE=31Pdec_DMAA0912
 CDCl3, 24 sc
 10.12.2021
##JCAMPDX= 6.0         $$ Bruker NMR JCAMP-DX V2.0
##DATA TYPE= NMR SPECTRUM
##DATA CLASS= NTUPLES
##ORIGIN= UXNMR, Bruker Analytische Messtechnik GmbH
##OWNER= root
$$ XWIN-NMR		Version 3.5
$$ Fri Dec 10 11:11:25 2021 Russian Standard Time (UT+4h)  she@DPX200
##.OBSERVE FREQUENCY= 81.013821
##.OBSERVE NUCLEUS= ^31P
##.ACQUISITION MODE= SIMULTANEOUS
##.ACQUISITION SCHEME= undefined
##.AVERAGES= 24
##.DIGITISER RES= 16
##SPECTROMETER/DATA SYSTEM= spect
##.PULSE SEQUENCE= zgpg30
##.SOLVENT NAME= CDCl3
##.SHIFT REFERENCE= (INTERNAL, CDCl3, 0, 248.564)
##AUDIT TRAIL= $$ (NUMBER, WHEN, WHO, WHERE, WHAT)
$$ ##TITLE= Audit trail, XWIN-NMR		Version 3.5
$$ ##JCAMPDX= 5.01
$$ ##ORIGIN= Bruker BioSpin GmbH
$$ ##OWNER= she
$$ F:/spectra/data/she/nmr/P31/1/pdata/1/auditp.txt
$$ ##AUDIT TRAIL=  $$ (NUMBER, WHEN, WHO, WHERE, WHAT)
(   1,<2021-12-10 11:10:00.15 +0400>,<she>,<DPX200>,
      <created by zg, POWCHK disabled, PULCHK disabled
       configuration hash MD5:
       00 E9 B6 7A A2 85 ED C7 34 08 36 98 17 FE 4E 26
       data hash MD5: 32K
       89 22 B2 63 05 EC F3 05 C8 F2 B6 36 B8 D5 E6 27>)
(   2,<2021-12-10 11:10:03.28 +0400>,<she>,<DPX200>,
      <Start of raw data processing
       efp BC_mod = 2 LB = 1 FT_mod = 6 PKNL = 1 PHC0 = -9017.377 PHC1 = -282.5305 SI = 64K 
       data hash MD5: 64K
       02 11 9F E5 75 21 0C 63 FA 5B 00 02 F2 8D 07 1A>)
(   3,<2021-12-10 11:10:33.96 +0400>,<she>,<DPX200>,
      <pk PHC0 = -29.98761 PHC1 = 68.20045 
       data hash MD5: 64K
       BB 51 85 3F 45 50 7E 9F 42 04 0B 09 C3 D8 17 14>)
(   4,<2021-12-10 11:10:59.39 +0400>,<she>,<DPX200>,
      <pk PHC0 = -71.6641 PHC1 = 168 
       data hash MD5: 64K
       3F 7A 7D 22 AB 5F BD 83 6A EE A5 A4 70 AC 0B B8>)
(   5,<2021-12-10 11:11:03.21 +0400>,<she>,<DPX200>,
      <abs ABSG = 5 
       data hash MD5: 64K
       3E FF DD A4 1A 86 93 F6 71 46 6A 50 99 82 C6 B9>)
$$ ##END=
$$ 
$$ hash MD5
$$ 4F B8 8F 14 88 57 55 C5 30 60 7A 36 3E 93 A6 70
##$RELAX= 
##$RELAX= 
##$RELAX= 
##$RELAX= 
##$RELAX= 
##$RELAX= 
##$RELAX= 
##$RELAX= 
$$ Bruker specific parameters
$$ --------------------------
##$DU= <F:/spectra>
##$EXPNO= 1
##$NAME= <P31>
##$PROCNO= 1
##$TYPE= <nmr>
##$USER= <she>
##$AMP= (0..31)
100 100 100 100 100 100 100 100 100 100 100 100 100 100 100 100 100 100 
100 100 100 100 100 100 100 100 100 100 100 100 100 100 
##$AQSEQ= 0
##$AQ_mod= 1
##$AUNM= <au_zg>
##$AUTOPOS= <>
##$BF1= 81.014009
##$BF2= 200.13
##$BF3= 200.13
##$BF4= 200.13
##$BF5= 200.13
##$BF6= 200.13
##$BF7= 200.13
##$BF8= 200.13
##$BYTORDA= 1
##$CFDGTYP= 0
##$CFRGTYP= 5
##$CHEMSTR= <none>
##$CNST= (0..31)
1 1 145 1 1 1 1 1 1 1 1 1 1 1 1 1 1 1 1 1 1 1 1 1 1 1 1 1 1 1 1 1 
##$CPDPRG= <waltz16>
##$CPDPRG1= <>
##$CPDPRG2= <waltz16>
##$CPDPRG3= <>
##$CPDPRG4= <mlev>
##$CPDPRG5= <mlev>
##$CPDPRG6= <mlev>
##$CPDPRG7= <mlev>
##$CPDPRG8= <mlev>
##$CPDPRGB= <>
##$CPDPRGT= <>
##$D= (0..31)
$$ [...]
##$SUBNAM3= <"">
##$SUBNAM4= <"">
##$SUBNAM5= <"">
##$SUBNAM6= <"">
##$SUBNAM7= <"">
##$SUBNAM8= <"">
##$SUBNAM9= <"">
##$SW= 501.771253377433
##$SWIBOX= (0..15)
0 1 3 0 0 0 0 0 0 0 0 0 0 0 0 0 
##$SW_h= 40650.406504065
##$TD= 32768
##$TD0= 1
##$TE= 0
##$TE2= 300
##$TE3= 300
##$TEG= 300
##$TL= (0..7)
0 120 53 12 22 120 120 120 
##$TP= (0..7)
150 150 150 150 150 150 150 150 
##$TP07= 0
##$TPNAME0= <>
##$TPNAME1= <>
##$TPNAME2= <>
##$TPNAME3= <>
##$TPNAME4= <>
##$TPNAME5= <>
##$TPNAME6= <>
##$TPNAME7= <>
##$TPOAL= (0..7)
0.5 0.5 0.5 0.5 0.5 0.5 0.5 0.5 
##$TPOFFS= (0..7)
0 0 0 0 0 0 0 0 
##$TUNHIN= 0
##$TUNHOUT= 0
##$TUNXOUT= 0
##$USERA1= <user>
##$USERA2= <user>
##$USERA3= <user>
##$USERA4= <user>
##$USERA5= <user>
##$V9= 5
##$VALIST= <valist>
##$VCLIST= <CCCCCCCCCCCCCCC>
##$VD= 0
##$VDLIST= <DDDDDDDDDDDDDDD>
##$VPLIST= <PPPPPPPPPPPPPPP>
##$VTLIST= <TTTTTTTTTTTTTTT>
##$WBST= 1024
##$WBSW= 4
##$XGAIN= (0..3)
0 0 0 0 
##$XL= 0
##$YL= 0
##$YMAX_a= 1261
##$YMIN_a= -1676
##$ZGOPTNS= <>
##$ZL1= 120
##$ZL2= 120
##$ZL3= 120
##$ZL4= 120
##$ABSF1= 248.5645
##$ABSF2= -253.2056
##$ABSG= 5
##$ABSL= 3
##$ALPHA= 0
##$AQORDER= 0
##$ASSFAC= 0
##$ASSFACI= 0
##$ASSFACX= 0
##$ASSWID= 0
##$AUNMP= <proc_1d>
##$AZFE= 0.1
##$AZFW= 0.5
##$BCFW= 0
##$BC_mod= 2
##$BYTORDP= 0
##$COROFFS= 0
##$CY= -3
##$DATMOD= 1
##$DC= 0
##$DFILT= <>
##$DTYPP= 0
##$F1P= 0
##$F2P= 0
##$FCOR= 1
##$FTSIZE= 65536
##$FT_mod= 6
##$GAMMA= 0
##$GB= 0
##$INTBC= 1
##$INTSCL= 5.30512e-09
##$ISEN= 30
##$LB= 1
##$LEV0= 0
##$LPBIN= 0
##$MAXI= 10000
##$MC2= 0
##$MEAN= 0
##$ME_mod= 0
##$MI= 50
##$NCOEF= 0
##$NC_proc= -8
##$NLEV= 6
##$NOISF1= 182.463
##$NOISF2= 159.3651
##$NSP= 0
##$NTH_PI= 0
##$NZP= 0
##$OFFSET= 248.5645
##$PC= 4
##$PHC0= -9119.028
##$PHC1= -46.33
##$PH_mod= 1
##$PKNL= yes
##$PPARMOD= 0
##$PSCAL= 0
##$PSIGN= 0
##$REVERSE= no
##$SF= 81.014009
##$SI= 65536
##$SIGF1= 159.3651
##$SIGF2= -187.1042
##$SINO= 113.3802
##$SIOLD= 16384
##$SREGLST= <1H.CDCl3>
##$SSB= 0
##$STSI= 65536
##$STSR= 0
##$SW_p= 40650.406504065
##$SYMM= 0
##$S_DEV= 0
##$TDeff= 32768
##$TDoff= 0
##$TI= <>
##$TILT= no
##$TM1= 0
##$TM2= 0
##$TOPLEV= 0
##$USERP1= <user>
##$USERP2= <user>
##$USERP3= <user>
##$USERP4= <user>
##$USERP5= <user>
##$WDW= 1
##$XDIM= 65536
##$YMAX_p= 284924888
##$YMIN_p= -218017764
$$ End of Bruker specific parameters
$$ ---------------------------------
##NTUPLES= NMR SPECTRUM
##VAR_NAME=  FREQUENCY,     SPECTRUM/REAL,   SPECTRUM/IMAG
##SYMBOL=    X,             R,               I
##VAR_TYPE=  INDEPENDENT,   DEPENDENT,       DEPENDENT
##VAR_FORM=  AFFN,          ASDF,            ASDF
##VAR_DIM=   65536,         65536,           65536
##UNITS=     HZ,            ARBITRARY UNITS, ARBITRARY UNITS
##FACTOR=    0.620285442955139, 1,           1
##FIRST=     20137.2065510759, 0,            0
##LAST=      -20513.1999529892, 0,           0
##MIN=       -20513.1999529892, -218017764,  0
##MAX=       20137.2065510759, 284924888,    0
$$ Real data points
##PAGE= N=1
##DATA TABLE= (X++(R..R)), XYDATA
$$ [...]
13059F011937l733571m053103q6580L278500K328561k58663q82697p62984j808064
$$ 6011937 2278366 -1774737 -1861317 1417183 3745744 3487081 2604384 1841400 33336
13050C3336j632811J590517L586191J33574m640112l941163K39160L41241l304905
$$ 33336 -1599475 -8958 3577233 3710807 -929305 -4870468 -4631308 -4290067 -7594972
13041g594972k532140M054391P301090K210690l612359k374113J759378Q92129
$$ -7594972 -10127112 -6072721 1228369 3439059 -173300 -2547413 -788035 104094
13033A04094l216455l364260L05441J680222J55710Q07869L914372L875215m89412
$$ 104094 -3112361 -6476621 -6171180 -4490958 -4335248 -3527379 386993 4262208 3772796
13024C772796l301635j447472P51251k67665j410372P72070L697862L339330Q45831
$$ 3772796 471161 -976311 -225060 -492725 -1903097 -1131027 2566835 5906165 6751996
13015F751996r8718N79915K16192j669216l064885k758278j152222R66732K480020
$$ 6751996 6653278 7233193 7449385 5780169 2715284 -42994 -1195216 -228484 2251536
13006B251536K313806J314415J701593L254334K789120o96593l483260k409401
$$ 2251536 4565342 5879757 7581350 10835684 13624804 12928211 9444951 7035550
12998G035550J79317P0064k497295l744286k061144O34604K271016K348910J090010
$$ 7035550 7214867 7284931 4787636 1043350 -1017794 -383190 1887826 4236736 5326746
12989E326746n25494p06290Q57942J788688L88277j317813o42242J226663J073434
$$ 5326746 4801252 4094962 4952904 6741592 7129869 5812056 5169814 6396477 7469911
12980G469911j037429j881093j26893J989887K046946k22541l721503o497079
$$ 7469911 6432482 4551389 4424496 6414383 8461329 8238788 4517285 -1979794
12972a979794n917069j229552M232879O078209L862025P21722j079726j378996
$$ -1979794 -7896863 -9126415 -4893536 1184673 5046698 5768420 4688694 3309698
12964C309698j48406J884302J599959k964955p739048o377051N27387N264796
$$ 3309698 3161292 5045594 6645553 3680598 -4058450 -10435501 -9908114 -4643318
12956d643318L445338p32152j908958q60782q12540j264623k05464J049581K86652
$$ -4643318 -1197980 -1930132 -3839090 -4699872 -5512412 -6777035 -6982499 -5932918 -5646266
12947e646266q13484O47340L079097K556593k74317p41812K284450M433534K650992
$$ -5646266 -6459750 -5812410 -2733313 -176720 -451037 -1192849 1091601 5525135 8176127
12938H176127m55814j228779m21959j164618l545910m309834j585375K297235
$$ 8176127 7720313 6491534 6069575 4904957 1359047 -2950787 -4536162 -2238927
12930b238927L455831J061024j739655j852871j82977J26955j085748o06962K325141
$$ -2238927 1216904 2277928 538273 -1314598 -1497575 -1370620 -2456368 -3063330 -738189
12921g38189L500857K7591m075391l142677J355161K899100O8571j695817N67484
$$ -738189 2762668 2790259 -1285132 -4427809 -3072648 -173548 -104977 -1800794 -1233310
12912a233310K703798J007879j403347k99820K139103J156958k135632k288231
$$ -1233310 1470488 2478367 1075020 775200 2914303 4071261 1935629 -352602
12904c52602J597395M283789K117902k413038m893401l959981r69602K072460
$$ -352602 1244793 5528582 7646484 5233446 340045 -3619936 -4589538 -2517078
12896b517078L167254J714906P7022J029834L202863K348398k067560n281886
$$ -2517078 650176 2365082 2442104 3471938 6674801 9023199 6955639 1673753
12888A673753l808597k9569J870893J234513k22439j642967k211657j69172L898770
$$ 1673753 -2134844 -2164413 -293520 940993 718554 -924413 -3136070 -3305242 593528
12879E93528N473853J711452l582560m742971k056244j38282j36693Q94294L300564
$$ 593528 6067381 7778833 4196273 -546698 -2602942 -2741224 -2877917 -1983623 1316941
12870A316941L472959L55636j964197m03629K519920K728588q16l009278m530928
$$ 1316941 4789900 5145536 3181339 2777710 5297630 8026218 8025402 5016124 485196
12861D85196m387783l006299j392324m13636N48348K180707K755381M08744k380243
$$ 485196 -3902587 -6908886 -8301210 -8714846 -8166498 -5985791 -3230410 -2821666 -5201909
12852e201909j259133K640506L475438K18828j111717K367551M971226J936698
$$ -5201909 -6461042 -3820536 -345098 -126270 -1237987 1129564 6100790 8037488
12844H037488k300414j802875P17711n95828l743872k593587J457016J558761
$$ 8037488 5737074 3934199 4651910 4056082 312210 -2281377 -824361 734400
12836G34400k155425k576665J542561L213180j17674j727501K382402N997484
$$ 734400 -1421025 -3997690 -2455129 758051 640377 -1087124 1295278 7292762
12828G292762L168041j656555j221467K697852K859906j840271n775023n459116
$$ 7292762 10460803 8804248 7582781 10280633 13140539 11300268 5525245 66129
12820F6129k586361M72441K627948K443723n67698l626627l642933j529443o2979
$$ 66129 -2520232 -2047791 580157 3023880 2456182 -1170445 -4813378 -6342821 -6405800
12811f405800Q05765K493620L578645J823871r83978j211594N79007R21914O1580
$$ -6405800 -5600035 -3106415 472230 2296101 1312123 100529 679536 1601450 1663030
12802A663030J499020M714884M461140r66717o227198o440679l650990k401575
$$ 1663030 3162050 7876934 12338074 11371357 5144159 -1296520 -4947510 -7349085
12794g349085k531986o00068L545977N914423M000780J88052j396800K17759K243401
$$ -7349085 -9881071 -10481139 -6935162 -1020739 2980041 3168093 1771293 1989052 4232453
12785D232453J982714J27892o80991m7875n38042l381021n678864m079305K36818
$$ 4232453 6215167 6343059 5662068 5614193 5076151 1695130 -3983734 -8063039 -7826221
12776g826221K885334J850042p81809k118562j052742J935728N015887N462559
$$ -7826221 -4940887 -3090845 -3872654 -5991216 -7043958 -5108230 -92343 5370216
12768E370216K449768j041820j673891l11262p3340q62348K5221K257465K374081
$$ 5370216 7819984 6778164 5104273 4793011 4719671 3857323 3882544 6140009 8514090
12759H514090j3639j071225N49954J024864j821294l910641j285959K837850K526745
$$ 8514090 8500451 7429226 7979180 9004044 7182750 3272109 1986150 4824000 7350745
12750G350745j818179m298193k466892j95644j007776k944694j941829K389662
$$ 7350745 5532566 1234373 -1232519 -1428163 -2435939 -5380633 -7322462 -4932800
12742d932800O365151O459453K748930j414031k799792j576543p45654k006862
$$ -4932800 1432351 7891804 10640734 9226703 6426911 4850368 4104714 2097852
12734B097852l466554k561709J19030J777945J267634p315n00933J56749J816423
$$ 2097852 -1368702 -3930411 -3811381 -2033436 -765802 -773117 -1274050 -1117301 699122
12725F99122L604504L282638o45828n701088o792155k175852L721319N103775
$$ 699122 4303626 7586264 6940436 1239348 -5552807 -7728659 -4007340 1096435
12717A096435J360203k834727l373254q76485J214164J177008N05056J330393
$$ 1096435 2456638 -378089 -3751343 -4627828 -3413664 -2236656 -1731600 -401207
12709d01207L549952N011522M001726Q82435k510565m337270l689888j114049
$$ -401207 3148745 8160267 12161993 13044428 10533863 6196593 2506705 1392656
12701A392656J323381J423086p52755k441516j269128J490914K175151m53636
$$ 1392656 2716037 4139123 3386368 944852 -324276 1166638 3341789 2888153
12693B888153l247085k762575n9074Q05366j233551k629857p74809J700033R85525
$$ 2888153 -358932 -3121507 -3180581 -2375215 -3608766 -6238623 -7013432 -5313399 -4327874
12684d327874j544515j171630K450371M161383J186076k338171j572825J903535
$$ -4327874 -5872389 -7044019 -4593648 -432265 753811 -1584360 -3157185 -1253650
12676a253650L017917P37090j571321j876583j356711j076900o24494n3089n162
$$ -1253650 1764267 2501357 930036 -946547 -2303258 -3380158 -4004652 -4057741 -4062903
12667d062903J9485P44777J070222j21045j139870N4635J813105J370581J46340
$$ -4062903 -4043418 -3298641 -2228419 -2349464 -3489334 -3434699 -1621594 -251013 -104673
12658a04673J294648K991146O41131m161303m350239J174550M521664Q32072l873885
$$ -104673 1189975 4181121 4822252 660949 -3689290 -2514740 2006924 2838996 -1034889
12649a034889k217211L145594M268444Q83l532209k428748J014259K960640K105111
$$ -1034889 -3252100 -106506 4161938 4162821 630612 -1798136 -783877 2176763 4281874
12640D281874l70896j888836p07311J160418J09778k456311p53934N258966O973184
$$ 4281874 3910978 2022142 1314831 2475249 2585027 128716 -625218 4633748 11606932
12631A1606932k28995p965820o276100J394976M089987K29477k160819m1092J312724
$$ 11606932 11377937 3412117 -2863983 -1469007 2620980 2850457 689638 648546 1961270
12622A961270k16204N114L274265M028498j98561m156070l875844k171212j529417
$$ 1961270 1745066 1750180 5024445 9052943 8854382 4698312 822468 -1348744 -2878161
12613b878161L31390L676254L677556q80496l516412k78643L226081J232474k682437
$$ -2878161 -2546771 1129483 4807039 3926543 410131 131488 3357569 4590043 1907606
12604A907606k490639J61320L74136q60533N2672J509652L56241q12153J498036
$$ 1907606 -583033 -421713 -47577 -908110 -855438 654214 1010455 198302 1696338
12595A696338L359633o56025o200179m165612M241812Q047090K766657l923766
$$ 1696338 5055971 4399946 -1800233 -5965845 -1724033 6323057 9089714 5165948
12587E165948m864029k383372j102665r9082K780818N086355L559435l52297l042127
$$ 5165948 301919 -2081453 -3184118 -3283200 -502382 4583973 8143408 7791111 4748984
12578D748984l676250l445447k836582k084281j485449K85139M637883Q635083
$$ 4748984 1072734 -2372713 -5209295 -7293576 -8779025 -8493886 -3856003 4779080
12570D779080O779818o83238o264711n061013j196240n47973j783988K2697M349514
$$ 4779080 11558898 10875660 4610949 -450064 -1646304 -2194277 -3978265 -3955568 393946
12561C93946N988287L275199j76720j634681k101702k591518k039625k22915Q11335
$$ 393946 6382233 9657432 9480712 7846031 5744329 3152811 1113186 890271 1701606
12552A701606J0494o14782Q46561K786384K002844j701685m842114m408609j265271
$$ 1701606 1712100 1097318 1943879 4730263 6733107 5031422 189308 -4219301 -5484572
12543e484572J434667K189253J955883J455906L6163j970497k272959n9559J731500
$$ -5484572 -4049905 -1860652 95231 1551137 1587300 -383197 -2656156 -2715715 -984215
12534i84215M86276j490883k73487K877110K743630j545607m423438j835154L060794
$$ -984215 -497939 -1988822 -2262309 614801 3358431 1812824 -2610614 -4445768 -1384974
12525a384974M789398K683167N9577j076733j305678j457054j757275k216483
$$ -1384974 3404424 6087591 6147168 5070435 3764757 2307703 550428 -1666055
12517a666055k022242K7624L001059L755612J194576j533575j239857Q72808J320876
$$ -1666055 -3688297 -3660673 -659614 3095998 4290574 2756999 1517142 2389950 3710826
12508C710826p69086l139182l438499j046098K600970M219698J469608l150584
$$ 3710826 2941740 -197442 -3635941 -4682039 -2081069 2138629 3608237 457653
12500D57653m177200o14429K278035J031439p72996Q08641K835278O71563l320001
$$ 457653 -3719547 -4333976 -2055941 -1024502 -1797498 -988857 1846421 2517984 -802017
12491h02017l322436L5131R76574j265270j684814P55056R87683k481040l857312
$$ -802017 -4124453 -4089322 -3112748 -4378018 -6062832 -5307776 -4320093 -6801133 -10658445
12482a0658445J55459M061089K330559j487630q39957K991414L366371o56182
$$ -10658445 -10502986 -6441897 -4111338 -5598968 -6438925 -3447511 -81140 -737322
12474g37322l051770n89239K519160J434458k561629m664287k923870M86907K766742
$$ -737322 -3789092 -4378331 -1859171 -424713 -2986342 -7650629 -10574499 -10087592 -7320850
12465g320850L063299K066873O30252p47355j574364j257786J20028J351451J458800
$$ -7320850 -4257551 -2190678 -1560426 -2307781 -3882145 -5139931 -5019903 -3668452 -2209652
12456b209652J211032J795766K238771N07358k491091l124505o60892P34117j617114
$$ -2209652 -998620 797146 3035917 3543275 1052184 -2072321 -2733213 -1999096 -3616210
12447c616210l745349o00454N375503O780752J984065k517591j831205Q52536
$$ -3616210 -7361559 -7962013 -2586510 4194242 6178307 3660716 1829511 2682047
12439B682047N35934j735106j900934k36467p4269j119290n9984K585839K398326
$$ 2682047 3217981 1482875 -418059 -654526 -728795 -1848085 -1908069 677770 3076096
12430C076096j159004k898769k33892K331192O82460k162575j770873j66358j564530
$$ 3076096 1917092 -981677 -1215569 1115623 1798083 -364492 -2135365 -2301723 -3866253
12421c866253l696459j139364M418881N622548J129464k615642k460680k475081
$$ -3866253 -7562712 -8702076 -4283195 1339353 2468817 -146825 -2607505 -5082586
12413e082586m128718k104671M887807Q217094J980982n907220m640570L099608
$$ -5082586 -9211304 -11315975 -6428168 1788926 3769908 -2137312 -6777882 -3678274
12405c678274O028791J637003k404359k181942j437148j639215N08648M003638
$$ -3678274 2350517 3987520 1583161 -598781 -2035929 -3675144 -3166496 837142
12397H37142K771737l087599n458014j465671J355529j857830m813954j260033
$$ 837142 3608879 521280 -4936734 -6402405 -5046876 -6904706 -11718660 -12978693
12389a2978693M240225M697725K217176K274940L009066n5198l794107k386909
$$ -12978693 -8738468 -4040743 -1823567 451373 3460439 3405241 -388866 -2775775
12381b775775J336934K02197m083794l212171K915045N000300n54792n882946
$$ -2775775 -1438841 -1236644 -5320438 -8532609 -5617564 -617264 -1172056 -7055002
12373g055002m176998J102094L651135L177799K204947O64149j351606r23649
$$ -7055002 -11232000 -10129906 -6478771 -3300972 -1096025 -431876 -1783482 -2707131
12365b707131K646945M690646J778550k527957l081606o04429Q93174P88298J001861
$$ -2707131 -60186 4630460 6409010 3881053 799447 195018 1088192 1876490 2878351
12356B878351J157774l84369k495589k883368k201020k228259j568245K037311
$$ 2878351 4036125 3651756 1156167 -1727201 -3928221 -6156480 -7724725 -5687414
12348e687414O151340N597597J15590m619970m446675j138210J606757K683754
$$ -5687414 463926 6061523 6177113 1557143 -2889532 -4027742 -2420985 262769
12340B62769K519085J025504j119134j787519l40969P19326p43884l009186k860382
$$ 262769 2781854 3807358 2688224 900705 559736 1279062 535178 -2474008 -5334390
12331e334390k63691J736018J210472p32890j968519j378994R13951L405381L477157
$$ -5334390 -5598081 -3862063 -2651591 -3384481 -5353000 -6731994 -5818043 -2412662 1064495
12322A064495R1695l607098l025049J687760M961720L012006j069854k161497
$$ 1064495 1156190 -2450908 -5475957 -3788197 1173523 4185529 3115675 954178
12314I54178n56642m76344k477176k436641J255961M354150K891673j047816k680766
$$ 954178 397536 -78808 -2555984 -4992625 -3736664 617486 3509159 2461343 -219423
12305b19423j023458J017873J170427n23508l090884m886414l677635P27167M815560
$$ -219423 -1242881 -225008 945419 421911 -2668973 -7555387 -11233022 -10505855 -5690295
12296e690295M952023J901799n90164q27804k17636r7069k14463k4312O77417
$$ -5690295 -738272 1163527 573363 -254441 -472077 -569146 -783609 -807921 -130504
12287a30504J864566K366367L51525l276518m351033j250596J647043N30430r55669
$$ -130504 1734062 4100429 4451954 1175436 -3175597 -4426193 -2779150 -2248720 -3204389
12278c204389K485943P522808N887423j978341o154745k290403J788840q51270
$$ -3204389 -718446 6804362 12691785 10713444 4558699 2268296 4057136 3205866
12270C205866n111828k955344L093750M573128J041546l62013K276912L063314
$$ 3205866 -1905962 -4861306 -1767556 2805572 3847118 3485105 5762017 8825331
12262H825331n62481l137136q53302J633448r28706n247341m304699J772141N833216
$$ 8825331 8262850 5125714 4272412 5905860 4977154 -270187 -4574886 -2802745 3030471
12253C030471L889893k34821j381935M6096j2365k868282n331815m029238L27105
$$ 3030471 6920364 6685543 5303608 5349704 5337339 2469057 -2862758 -6891996 -6564891
12244f564891L647682K996551j39992j591930L93300K723763J301774l272887
$$ -6564891 -2917209 79342 -60650 -1652580 -1259280 1464483 2766257 -506630
12236e06630n889459l317338J763030M541308L853595J949945L55456p78236m54749
$$ -506630 -6396089 -9713427 -7950397 -3409089 444506 2394451 2749907 1971671 1516922
12227A516922J896477L353843N10099l990801l474359K474288N882992K012256
$$ 1516922 3413399 6767242 7277341 3286540 -187819 2286469 8169461 10181717
12219A0181717l150589k459099J073313O2129m455747n159679j160654J160783
$$ 10181717 7031128 4572029 5645342 5707471 1251724 -3907955 -5068609 -3907826
12211c907826k53496m95998K055418K559258l88192j145725K360504L518165j546101
$$ -3907826 -4161322 -4657320 -2601902 -42644 -430836 -1576561 783943 4302108 2756007
12202B756007n828164k392492L637848L163210k086899k992110J670604L870889
$$ 2756007 -3072157 -5464649 -1826801 1336409 -750490 -3742600 -2071996 1798893
12194A798893o4262m209156l367651n39432n32192k133903j070090K732255N036593
$$ 1798893 1734631 -2474525 -5842176 -6381608 -6913800 -9047703 -10117793 -7385538 -2348945
12185b348945L386651M71342P01700M109697N173997k89405p974083r123775k604292
$$ -2348945 1037706 1509048 2210748 6320445 11494442 11205037 3230954 -5892821 -8497113
12176h497113K745260R86423j986335J563147P790643O773446j398020o203924
$$ -8497113 -5751853 -4765430 -6751765 -5188618 2602025 9375471 7977451 1773527
12168A773527k654379K149208J269484j914822r00831L115246M022622P14763
$$ 1773527 -880852 1268356 2537840 623018 -277813 2837433 6860055 7574818
12160G574818k012424j228951N39814n3957k386323l171280j149534J080075L93472
$$ 7574818 5562394 4333443 4873257 4819300 2432977 -738303 -1887837 -807762 -414290
12151d14290k452748l500457j110984J502372Q82602j758804k623169m48614K958599
$$ -414290 -2867038 -6367495 -7478479 -5976107 -5093505 -6852309 -9475478 -9924092 -6965493
12142f965493N408601N060895R90234m022567m395781P43081M532658J769044
$$ -6965493 -1556892 3504003 4494237 471670 -3924111 -3181030 1351628 3120672
12134C120672k706253j691670K146356P27835m997746n726643P21583N483360
$$ 3120672 414419 -1277251 869105 1596940 -3400806 -9127449 -8405866 -2922506
12126b922506K915596j406813j322740O17103K29761j69533K392437M364066J758056
$$ -2922506 -6910 -1413723 -2736463 -2119360 -1889599 -2059132 333305 4697371 6455427
12117F455427j941590j413262J289669N97329k896628l998383j788984P2363L59313
$$ 6455427 4513837 3100575 4390244 4987573 2090945 -1907438 -3696422 -3624059 -3264746
12108c264746J093262K284935J771301j23839q42532j02582K35456P8496P18324
$$ -3264746 -2171484 113451 1884752 1760913 918381 815799 1051255 1129751 1848075
12099A848075J444567N43222j304858k298265k754279l419771k575042R65922
$$ 1848075 3292642 3835864 2531006 232741 -2521538 -5941309 -8516351 -7550429
12091g550429M111527L469324R94948N90082J272666l35546k648769j245508K500171
$$ -7550429 -3438902 30422 1025370 1615452 2888118 2552572 -96197 -1341705 1158466
12082A158466K430459k220705m999103k274273J680529K202092O76242K04760
$$ 1158466 3588925 1368220 -3630883 -5905156 -4224627 -2022535 -1346293 -1141533
12074a141533K21288o92845r32362J112290L309458K779564L10619j300318j318507
$$ -1141533 -920245 -1613090 -2545452 -1433162 1876296 4655860 4966479 3666161 2347654
12065B347654q53743l87645J59112M06503L12452M64903M63325r29573l021118
$$ 2347654 1493911 1106266 1265378 1671881 1984333 2449236 2912561 1982988 -1038130
12056a038130l157670p53359J389595J300851N21041P90169J036094o6198j234379
$$ -1038130 -4195800 -4949159 -3559564 -2258713 -1737672 -947503 88591 22393 -1211986
12047a211986q05835M35442R78579R37747O44103m95024j581265O1276L861108
$$ -1211986 -2017821 -1582379 -603800 333947 978050 483026 -1098239 -1036963 2824145
12038B824145M381305j012643o219289l862638L435229N923565M85610n363979
$$ 2824145 7205450 6192807 -26482 -3889120 -453891 5469674 5955284 591305
12030E91305m718551j24199J996284O13219n58413L71484J971947K744925K235260
$$ 591305 -4127246 -4251445 -2255161 -1641942 -2200355 -1828871 143076 2888001 5123261
12021E123261K01379k303569k481157N36709L114556J661417j672471j924808
$$ 5123261 5324640 3021071 539914 1076623 4191179 5852596 4180125 2255317
12013B255317R74498K147923n44022l722421m434936l955304l677187k016790
$$ 2255317 3229815 5377738 4833716 1111295 -3323641 -7278945 -10956132 -12972922
12005a2972922J576754L814667K512694N92815R89073J256890j552756l969046
$$ -12972922 -11396168 -7581501 -5068807 -4475992 -3486919 -2230029 -3782785 -7751831
11997g751831p22067N566869O729856J061320m211959l732368m57031J011202
$$ -7751831 -8473898 -2907029 3822827 4884147 672188 -3060180 -3517211 -2506009
11989b506009J091555J731544J759073p8578j733592j485951j115908j796836
$$ -2506009 -1414454 317090 2076163 1997585 263993 -1221958 -2337866 -4134702
11981d134702r90417K392186M036523O18469l606299k620979J800359K901894
$$ -4134702 -5125119 -2732933 1303590 1922059 -1684240 -4305219 -2504860 397034
11973C97034m96610l065475j991070k44804k23900k46943J015826J751502O46404
$$ 397034 -99576 -3165051 -5156121 -5400925 -5624825 -5871768 -4855942 -3104440 -2458036
11964b458036p66761j144702j129894p53853J245246L992777M140925J009118
$$ -2458036 -3224797 -4369499 -5499393 -6253246 -5008000 -1015223 3125702 4134820
11956D134820j367578J66099L109969K999658j98106k437911j362477J013097
$$ 4134820 2767242 2933341 6043310 9042968 8844862 6406951 5044474 6057571
11948F057571J453361n21000k501200k282215l10503J171158Q89737m30091j510709
$$ 6057571 7510932 6989932 4488732 2206517 1896014 3067172 3956909 3526818 2016109
11939B016109j563509m9399K457560L103232m34677n202556n022490P63899M987277
$$ 2016109 452600 403201 2860761 5963993 5529316 326760 -4695730 -3931831 1055446
11930A055446K344540k960077l809855m38506J642323Q30721m143k2017o29939
$$ 1055446 3399986 439909 -3369946 -3808452 -2166129 -1335408 -1339551 -1361568 -1991507
11921a991507n77056K161715M477547J483783m444345n699452j094439K366925
$$ -1991507 -2568563 -406848 4070699 5554482 1110137 -4589315 -5683754 -3316829
11913c316829P24368j879568j577216l17934O1481J674801M584294M187813p37528
$$ -3316829 -2592461 -4472029 -6049245 -6367179 -6305698 -4630897 -46603 4141210 3403682
11904C403682m006175j210958L061349K695247p64090k246773j614344j811353
$$ 3403682 -602493 -1813451 1247898 3943145 3179055 932282 -682062 -2493415
11896b493415k530880j704731j18818O53908J616125K983868J611918l068395
$$ -2493415 -5024295 -6729026 -6847844 -6193936 -4577811 -1593943 17975 -3050420
11888c050420n170546o08167N163314M731544J31666j282859Q18587N21887k861902
$$ -3050420 -8220966 -8829133 -3665819 1065725 1197391 -85468 733119 1255006 -1606896
11879a606896l547085R1401K381224o7538k943206j364161L142189N784847M552904
$$ -1606896 -5153981 -5062580 -2681356 -2748894 -5692100 -7056261 -3914072 1870775 6423679
11870F423679P56242l224668m952088l313247q9173J767263J523908N46363k15028
$$ 6423679 7179921 3955253 -996835 -4310082 -4399255 -2631992 -1108084 -561721 -776749
11861g76749l63910O80346J924111O03892l056387l943396P45399N631350M095776
$$ -776749 -1140659 -460313 1463798 2067690 -988697 -4932093 -4186694 1444656 5540432
11852E540432j692477m184449j694808R09502J200650J132107P36842k006800
$$ 5540432 3847955 -336494 -2031302 -1121800 78850 1210957 1947799 -59001
11844e9001m819282k756955K819843M824998J387006j674781j027284k41717j528427
$$ -59001 -4878283 -7635238 -4815395 9603 1396609 -278172 -1305456 -1547173 -3075600
11835c075600j425003J622564L209199Q34121j319462J5834J594203L32862j061849
$$ -3075600 -4500603 -2878039 331160 1165281 -154181 -138347 1455856 1788718 726869
11826G26869j07818L62575j544107j916354J749870M763542K914506k45516m66201
$$ 726869 619051 981626 -562481 -2478835 -728965 4034577 6949083 6703567 6237366
11817F237366p09711m239174o111288r33205O035453N889730M23181j388678J334569
$$ 6237366 5527655 1288481 -4822807 -5756012 279441 6169171 6592352 5203674 6538243
11808F538243J187887l248301m799431q19494K078322l49991l143372j181895
$$ 6538243 7726130 4477829 -321602 -1141096 937226 587235 -2556137 -3738032
11800c738032K817123L899634K089404j40864k112634l091381j357122J760371
$$ -3738032 -920909 2978725 5068129 4927265 2814631 -276750 -1633872 126499
11792A26499K032556q01962j911640K34375Q28222k324444l739335O71431N756360
$$ 126499 2159055 1357093 -554547 -320172 508050 -1816394 -5555729 -4884298 872062
11783H72062M769711k16585k415074p80248O81326P64529R62701O3891l640501
$$ 872062 5641773 5425188 3010114 2229866 2911192 3675721 4638422 4702313 1061812
11774A061812o486065l465852K764598M699224J639183L81023L298766M335121
$$ 1061812 -5424253 -8890105 -6125507 -1426283 212900 593923 3892689 8227810
11766H227810j78612m735206l505255N45538J291255p08394n23553K136473K864419
$$ 8227810 8049198 3313992 -191263 354275 1645530 937136 413583 2550056 5414475
11757E414475J75110k729678l614213l518151k972337n30330L575474N986764
$$ 5414475 5589585 2859907 -754306 -4272457 -7244794 -7775124 -4199650 1787114
11749A787114M339064M65529k095120k091823q38948P4757J12767m03187r28162
$$ 1787114 6126178 6591707 4496587 2404764 1565816 1640573 1753340 1350153 421991
11740D21991j266679j485863j129646N41503K757234L000961J21274l424880m338870
$$ 421991 -844688 -2330551 -3460197 -2918694 -161460 2839501 2960775 -464105 -4802975
11731d802975k544193m30383Q67814J817601K032613O76007j008895q82589L71066
$$ -4802975 -7347168 -7777551 -6909737 -5092136 -3059523 -2383516 -3392411 -4275000 -3903934
11722c903934J35106j346205r04910K060803M037421K754307K68184j052444j794503
$$ -3903934 -3768828 -5115033 -6019943 -3959140 78281 2832588 3100772 2048328 253825
11713B53825k613195j967716M95809J894677N39123r60240k75689M36881j264377
$$ 253825 -2359370 -4327086 -3831277 -1936600 -1397477 -2357717 -2633406 -2196525 -3460902
11704c460902l103655j781910J222552K325673J692966J405092M44074k630820
$$ -3460902 -6564557 -8346467 -7123915 -4798242 -3105276 -1700184 -1256110 -3886930
11696c886930m254509L8574P105178Q865587L635196j924656k889002j446675
$$ -3886930 -8141439 -8102865 -997687 7867900 11503096 9578440 6689438 5242763
11688E242763q14269l92001N37728R1004k218551l478479k102947m50870n75912
$$ 5242763 4428494 4036493 4574221 4665225 2446674 -1031805 -3134752 -3585622 -4161534
11679d161534j401724j780103k075422j503644J205606L585090J813363j634000
$$ -4161534 -5563258 -7343361 -9418783 -10922427 -9716821 -6131731 -4318368 -5952368
11671e952368m0074N878431O957205j1204o056029m072278M1768j530180m611880
$$ -5952368 -5992442 -114011 6843194 6831990 775961 -3296317 -3254549 -4784729 -9396609
11662i396609q79016O487334P129148L03885m604000l267848q06507o54777J44963
$$ -9396609 -10275625 -3788291 3340857 3644742 -959258 -4227106 -5033613 -5688390 -5543427
11653e543427K669991K948115L7160j171080J485020L501258J599803j280453
$$ -5543427 -2873436 74679 111839 -1059241 425779 3927037 5526840 4246387
11645D246387k103231k304310k922205j530413K277541M272067K307940J48564
$$ 4246387 2143156 -161154 -3083359 -4613772 -2336231 1935836 4243776 4392340
11637D392340Q13635J632810k4531j563294k64568J460999O88013q09791p28663
$$ 4392340 5205975 6838785 6814254 5250960 4986392 6447391 7135404 6325613 5596950
11628E596950r64271l089013l751303l18557L172058J965386j326976j293408
$$ 5596950 4632679 1543666 -2207637 -2526194 645864 2611250 1284274 -9134
11620i134J030450Q19247j359044j001665J368732J053919j540839j007295K915094
$$ -9134 1021316 1840563 481519 -520146 848586 1902505 361666 -645629 2269465
11611B269465L735179r87142n029470l176633J284929K929739K082348J469869
$$ 2269465 6004644 5017502 -11968 -3188601 -1903672 1026067 3108415 4578284
11603D578284J55137l398141n978334l562792J568006L538246J565332L12441
$$ 4578284 4733421 1335280 -4643054 -8205846 -6637840 -3099594 -1534262 -1221821
11595a221821J807401K651456N05146j632325k70363K920440L500689M41876k985776
$$ -1221821 585580 3237036 3742182 2109857 1839494 4759934 8260623 8702499 5716723
11586E716723l693596j799140N45747J442956L58984j448499j487664J435703
$$ 5716723 2023127 223987 769734 2212690 2571674 1123175 -364489 1071214
11578A071214M918893M863578N21817l910888m146739j013627J080784J09592
$$ 1071214 5990107 10853685 11375502 7464614 3317875 2304248 3385032 3494624
11570C494624j554501j173989P25594J756063Q65746j107122k702436k499582
$$ 3494624 1940123 766134 1491728 3247791 4113537 3006415 303979 -2195603
11562b195603J16352L481480M223019R93657l240685m317416j652115J602309
$$ -2195603 -2079251 1402229 5625248 6618905 3378220 -939196 -2591311 -989002
11554i89002K453186N20706k621809m609514l338056R54986M795931M766360J702146
$$ -989002 1464184 1984890 -636919 -5246433 -8584489 -7629503 -2833572 1932788 3634934
11545C634934m75332n5623Q79271M76099l18297m53266j077592k896664l590844
$$ 3634934 3159602 3103979 3983250 4459349 4141052 3687786 2610194 -286470 -3877314
11536c877314q78379L210031M336509J723517j016775j169828j62459n32324k107789
$$ -3877314 -4755693 -1545662 2790847 4514364 3497589 2327761 2165302 1632978 -474811
11527d74811k866445j977735k56970J376651K305065J848491R3759j360043r59222
$$ -474811 -3341256 -5318991 -5575961 -4199310 -1894245 -45754 48005 -1312038 -2271260
11518b271260P56105J967840K079633J871756J448087J1833j982619k464400n41201
$$ -2271260 -1515155 452685 2532318 4404074 5852161 5863994 3881375 1416975 875774
11509H75774J870605K425793J224919J06087l909K17288j87763j463244k915919
$$ 875774 2746379 5172172 6397091 6503178 6499269 6716557 6528794 5065550 2149631
11500B149631l022429p64921K343648K996230K34256k536599j598349K045387
$$ 2149631 -872798 -1637719 705929 3702159 3936415 1399816 -198533 1846854
11492A846854L914826J767850k172381m487974l925647j454884J059295J989929
$$ 1846854 5761680 7529530 5357149 869175 -3056472 -4511356 -3452061 -1462132
11484a462132J262672N00981O56318L90676j346095k467960m67476K875564L220630
$$ -1462132 -199460 301521 957839 1348515 2420 -2465540 -2933016 -57452 3163178
11475C163178R8971k255982j169258J220507K087829J481358K19280j923628l866360
$$ 3163178 3262149 1006167 -163091 1057416 3145245 4626603 4845883 2922255 -944105
11466i44105k824694J142161L659697J979453r40305j370538l11604l29796m11397
$$ -944105 -3768799 -2626638 1033059 3012512 2072207 701669 390065 60269 -351128
11457c51128J298566K565104M11367k636172j675187K202614K939142r07593l751893
$$ -351128 947438 3512542 3923909 1287737 -387450 1815164 4754306 3846713 94820
11448I4820j592622K398104L240890P62003j764786k266833q03997J500503K597011
$$ 94820 -1497802 900302 4141192 4903195 3138409 871576 67579 1568082 4165093
11439D165093R53109j825084k328455j88336J469604J250032J300590K407920
$$ 4165093 5118202 3293118 964663 776327 2245931 3495963 4796553 7204473
11431G204473J695693j988668m447730j834208K933379L722432n62358n121890
$$ 7204473 8900166 6911498 2463768 629560 3562939 7285371 6723013 1601123
11423A601123n617284k208564J855257L102428M63234k856877k124133K092922
$$ 1601123 -4016161 -6224725 -4369468 -1267040 -803806 -3660683 -5784816 -3691894
11415c691894L114905k222245p040484l492781M622796O416557K40095l875132
$$ -3691894 -576989 -2799234 -9839718 -13332499 -8709703 -2293146 -2053051 -5928183
11407e928183j07179M405970J970400k915125j516841M176576M598815j645486
$$ -5928183 -6035362 -1629392 341008 -2574117 -4090958 85618 4684433 3038947
11399C038947n587150k200084K664569K726022K87746p9617J36897k161085m146607
$$ 3038947 -2548203 -4748287 -2083718 642304 930050 850433 987330 -1173755 -5320362
11390e320362j466645L072597L023216j090970k561767K59122J560045j466542
$$ -5320362 -6787007 -3714410 -691194 -1782164 -4343931 -4084809 -2524764 -3991306
11382c991306l532025j80703M767363N450970K437019k32792k072896m409517
$$ -3991306 -7523331 -7704034 -2936671 2514299 4951318 4718526 2645630 -1763887
11374a763887n091861j508259L150452L256950m34960j687071J398732L599817
$$ -1763887 -6855748 -8364007 -5213555 -1956605 -2391565 -4078636 -2679904 919913
11366I19913Q77641l868475n368736k311534K547022N393151L769596o84799k119387
$$ 919913 1797554 -2070921 -7439657 -9751191 -7204169 -1811018 1958578 1273779 -845608
11357h45608K601846P561175M479760m269264p299355q21740N346841K954374
$$ -845608 1756238 9317413 13797173 9527909 2228554 1406814 6753655 9708029
11349I708029k533118k453356L48150k178413p658657o405811J672364N961261
$$ 9708029 7174911 4721555 5069705 2891292 -4767365 -11173176 -9500812 -3539551
11341c539551K264889r88692K311965N775879J975053m733712n444450p26180
$$ -3539551 -1274662 -2263354 48611 5824490 7799543 3065831 -2378619 -3104799
11333c104799J735599j03736j335629O0696P84091k07160K60675K327228J276059
$$ -3104799 -1369200 -1472936 -2808565 -2747869 -1963778 -2170938 -1910263 416965 1693024
11324A693024l950531o854234k539789M169117N296402J167702q34419K280313
$$ 1693024 -2257507 -9111741 -11651530 -7482413 -2186011 -1018309 -1852728 427585
11316D27585N165435K790511k153675l592114p03378J586496j47071l500551m049124
$$ 427585 5593020 8383531 6229856 2637742 1934364 3520860 3373789 -126762 -4175886
11307d175886j229980J514419J757284J053544K002995L967148L865893R38324
$$ -4175886 -5405866 -3891447 -2134163 -1080619 922376 4889524 8755417 9693741
11299I693741j840093k083368j330783j920047k521643k60943L462054L577088
$$ 9693741 7853648 5770280 4439497 2519450 -2193 -263136 3198918 6776006
11291F776006j134980n174124l622049R16422K423797K64355r32605N55732R42899
$$ 6776006 5641026 466902 -3155147 -2238725 185072 449427 -483178 72554 1015453
11282A015453k051457m489482j929207L382261N271715K147113j413875j470410
$$ 1015453 -1036004 -5525486 -7454693 -4072432 1199283 3346396 1932521 462111
11274D62111O51861J542485M69511q74663j414122j421677j183182o57010o0707
$$ 462111 1113972 2656457 3125968 2251305 837183 -584494 -1767676 -2424686 -2485393
11265b485393M18602J118280K103717K401173J182351p09792j704085j690334
$$ -2485393 -2066791 -948511 1155206 3556379 4738730 4028938 2324853 634519
11257F34519j858945k494755k564287j646537m75492Q35177K949276M796603L551061
$$ 634519 -1224426 -3719181 -6283468 -7930005 -8405497 -7570320 -4621044 175559 3726620
11248C726620q16712l493999p16084M021528M011707j010433m381726k512939
$$ 3726620 2909908 -584091 -1300175 2721353 6733060 5722627 1340901 -1172038
11240a172038K09812p25688k570117o75551K820368K243847j640826k168513K375192
$$ -1172038 -962226 -1687914 -4258031 -4933582 -2113214 130633 -1510193 -3678706 -1303514
11231a303514N425880K025897l893201n767837l217975k26350J718640L486666
$$ -1303514 4122366 6148263 2255062 -3512775 -6730750 -6957100 -5238460 -1751794
11223a751794L887110J164647k127735j546942J699527J409345l724338o504558
$$ -1751794 2135316 3299963 1172228 -374714 1324813 2734158 -990180 -7494738
11215g494738j240930P000082Q550316K333403l156096k130547J275361N97438
$$ -7494738 -8735668 -1735586 6814730 9148133 5992037 3861490 5136851 5734289
11207E734289l142635l927044l03450L069621K950641J329653O38710p3220j830439
$$ 5734289 2591654 -1335390 -1638840 1430781 4381422 5711075 6349785 6276565 4446126
11198D446126k653812j060321N45928l59459j962464j486532n19980j993577l742012
$$ 4446126 1792314 731993 1277921 918462 -1044002 -2530534 -3050514 -5044091 -8786103
11189h786103j115439M565263O628387K945613j118952j490147q16191k069699
$$ -8786103 -9901542 -5336279 1292108 4237721 3118769 1628622 812431 -1257268
11181a257268k725925J41099L769110L899936J490085J82677J34789n13620p89314
$$ -1257268 -3983193 -3842094 -72984 3826952 5317037 5499714 5634503 5120883 4331569
11172D331569R43704K173966m82215m614173m637511m70966K214625M12986k998447
$$ 4331569 5275273 7449239 6967024 2352851 -2284660 -2755626 -541001 -128015 -3126462
11163c126462m697175m329109k139320J541283L943117K369710l47581J302296
$$ -3126462 -7823637 -12152746 -14292066 -12750783 -8807666 -6437956 -6785537 -5483241
11155e483241O309298P297117J786034l512907k900080L31151N32348j539009
$$ -5483241 826057 8123174 9909208 6396301 3496221 3827372 4359720 2820711
11147B820711k032660j286301j830341k751616j922678q70484j686620j921530
$$ 2820711 788051 -498250 -2328591 -5080207 -7002885 -7873369 -9559989 -11481519
11139a1481519J322349M762827L255396j033641j254478K913973M508327O29512
$$ -11481519 -10159170 -5396343 -2140947 -3174588 -4429066 -1515093 2993234 3622746
11131C622746l152489k194945M52691N30555j42890K032829N068805M018303j013438
$$ 3622746 470257 -1724688 -1271997 -741442 -884332 1148497 6217302 10235605 9222167
11122I222167m545993l092329Q16294K420392L03362k500549k259408P87374K267956
$$ 9222167 4676174 1583845 2400139 4820531 5123893 2623344 363936 1151310 3419266
11113C419266m89674l763144j894561M022836O639895K682617k357208k657452
$$ 3419266 2929592 -833552 -2728113 1294723 7934618 10617235 8260027 5602575
11105E602575k76138n44516l221277l809213j310600J027388J513740J253315
$$ 5602575 5326437 4781921 1560644 -2248569 -3559169 -2531781 -1018041 235274
11097B35274L41734j902464l291831q73112L163795L471387K45796l35882L635344
$$ 235274 577008 -1325456 -4617287 -5490399 -2326604 1144783 1390579 1054697 4690041
11088D690041N686397R61711n469767n820411r29594J880936j19599k558899j817443
$$ 4690041 10376438 11338149 5868382 47971 -881623 999313 879714 -1679185 -3496628
11079c496628N01988J665366J592581J193838N17032j30133K7168M96541J38639
$$ -3496628 -2994640 -1329274 263307 1457145 1974177 1844044 1871212 2367753 2506392
11070B506392j69356J448307L720028K718599k126580n935001m508946O7040K415653
$$ 2506392 2337036 3785343 7505371 10223970 8097390 2162389 -2346557 -2279517 136136
11061A36136N97367k454587k978950l9600L850007M563571K12415n853741p781882
$$ 136136 733503 -1721084 -4700034 -4739634 -889627 3673944 3886359 -1967382 -9749264
11052i749264m067720O82273K266152K106910L404543N182502M263408J278748
$$ -9749264 -13816984 -13134711 -10868559 -8761649 -5357106 -174604 4088804 5367552
11044E367552L1959J397203K253987Q15876r66402j168163n35351k69479k72878
$$ 5367552 5399511 6796714 9050701 9866577 8900175 7732012 7196661 6927182 6654304
11035F654304o45328j896230k714122r36176K000699J507781l074331n852808
$$ 6654304 6008976 4112746 1398624 462448 2463147 3970928 896597 -4956211
11027d956211k235757L988367N699476K064949j664488k282086j297355k02924
$$ -4956211 -7191968 -3203601 2495875 4560824 2896336 614250 -683105 -886029
11019h86029J322155K003765n54664m252165k878406M652677J0335638P024250
$$ -886029 436126 2439891 1885227 -2366938 -5245344 -592667 9742971 16767221
11011A6767221j264203m743459j503276Q70933k451339o380339m111365K423909
$$ 16767221 15503018 10759559 9256283 10127216 7675877 1295538 -2815827 -391918
11003c91918N286408J629815k934660k415011K014760M440948J959213k431091
$$ -391918 4894490 6524305 3589645 1174634 3189394 7630342 9589555 7158464
10995G158464m100437j881677J621224L414867K661654M30688j753053k834508
$$ 7158464 3058027 1176350 2797574 6212441 8874095 9304783 7551730 4717222
10987D717222k586718j591006n59943L70992J214748J325936J60550j273880j354207
$$ 4717222 2130504 539498 -20445 350547 1565295 2891231 3051781 1777901 423694
10978D23694m50970n28906j519612q50338J830496K663586o44131m001391k377764
$$ 423694 -27276 -556182 -2075794 -2926132 -1095636 1567950 923819 -3077572 -5455336
10969e455336K075408L072243M04917K62405M418096O414250J797785m426416
$$ -5455336 -3379928 -307685 97232 359637 4777733 11191983 12989768 8563352
10961H563352n570944l108697k597693l892901k551108J392163L383363K270245
$$ 8563352 2992408 -116289 -2713982 -6606883 -9157991 -7765828 -4382465 -2112220
10953b112220J391487J680871L24118k731628l295795M0514K951667J932071r55629
$$ -2112220 -720733 960138 1284256 -1447372 -4743167 -4702653 -1750986 181085 -774544
10944g74544k360864k225088j506364L46749K716504K648815l89903k244015K283
$$ -774544 -3135408 -5360496 -6866860 -6520111 -3803607 -1154792 -1544695 -3788710 -3786427
10935c786427L147453K583464r79760l200890k107802J037355M523815O460390
$$ -3786427 -638974 1944490 964730 -2236160 -4343962 -3306607 1217208 7677598
10927G677598M653264k49504l733828k956449q04760q65833j468558N71692L200015
$$ 7677598 12330862 12081358 8347530 5391081 4586321 3720488 2251930 2823622 6023637
10918F023637K037929j769179k978086p53813O60219k07655j21539J921371K343366
$$ 6023637 8061566 6292387 3314301 2560488 3220707 3013052 2891513 4812884 7156250
10909G156250k43054j925841j79081J733071O61367j055701m69682J79942k074866
$$ 7156250 6913196 4987355 4808274 6541345 7202712 6147011 5677329 5857271 3782405
10900C782405m150268j020123N106888O456486Q08854n174480n462124k143701
$$ 3782405 -367863 -1387986 3718902 10175388 10984242 5809762 347638 -1796063
10892a796063m35028o38640M64318K788298K630260j052149m334438l493739M42884
$$ -1796063 -2231091 -2869731 -2405413 382885 3013145 1960996 -2373442 -5867181 -5424297
10883e424297L725596M241116K438011j68425j823874j402147J17281M66867n96883
$$ -5424297 -1698701 2542415 4980426 4812001 2988127 1585980 1703261 2170128 1573245
10874A573245r23717k7697k28957j562183J72058O013246Q872856K804812n885267
$$ 1573245 649528 621831 392874 -1169309 -997251 5015995 13888851 16693663 10808396
10865A0808396n877532J747082M052668l653794r682874l914882O348707P829627
$$ 10808396 4930864 6677946 10730614 7076820 -2606054 -6520936 -172229 7657398
10857G657398R81332l076221q29970O62607k015627l267718N95286M807326M233653
$$ 7657398 8638730 5562509 4732539 5395146 3379519 111801 707087 5514413 9748066
10848I748066N93763k181906l720673m630624l478528k65495J388832o98859l529110
$$ 9748066 10341829 8159923 4439250 -191374 -3669902 -3935397 -2546565 -3245424 -6774534
10839f774534l526205j640159o14116j70698J516154L723748M034030K167888
$$ -6774534 -10300739 -11940898 -12555014 -12725712 -11209558 -7485810 -3451780 -1283892
10831a283892L15638K03207J428729K138253O67707k495351m335848k537165J118054
$$ -1283892 -968254 -765047 663682 2801935 3469642 974291 -3361557 -5898722 -4780668
10822d780668K810672J835669P41959M50696r87719l927908n244588k736960J540481
$$ -4780668 -1969996 -134327 607632 1058328 70609 -3857299 -9101887 -11838847 -10298366
10813a0298366M196174M347299L023975J107584m73658m76764J049739K141349
$$ -10298366 -6102192 -1754893 1269082 2376666 1903008 1426244 2475983 4617332
10805D617332J005299j956885m314808l304199J371082N473441L654039k865941
$$ 4617332 5622631 3665746 -649062 -3953261 -2582179 2891262 6545301 3679360
10797C679360n743420o15138N438534L757431k401397k963490K547684M359844
$$ 3679360 -2064060 -2679198 2759336 6516767 4115370 1151880 3699564 8059408
10789H059408j221672o005715l766034N31585P43559m27872J629091M037680J820153
$$ 8059408 6837736 832021 -2934013 -2402428 -1658869 -2086741 -457650 3580030 5400183
10780E400183k842059m266437k030314N22461K597227M520758L883498n87308
$$ 5400183 2558124 -1708313 -3738627 -3216166 -618939 3901819 7785317 7198009
10772G198009m794700m823612l023337k776428j724512K902677O702324M140405
$$ 7198009 2403309 -2420303 -5443640 -8220068 -9944580 -7041903 -339579 3800826
10764C800826j218023j477330K780400L716612o64286l958053k440673R6001L62369
$$ 3800826 2582803 1105473 3885873 7602485 6938199 2980146 539473 635474 997843
10755I97843M53959J905505J723278j926333n209676l662176J527973N213511
$$ 997843 1451802 3357307 5080585 3154252 -2055424 -5717600 -4189627 1023884
10747A023884M200552j63463l659905k935477R39885L274180J725225n06816J8570
$$ 1023884 5224436 5060973 1401068 -1534409 -594524 2679656 4404881 3898065 3916635
10738C916635J421608L21110j691779q67285J582594J457704o27060j63394K853906
$$ 3916635 5338243 5659353 3967574 3100289 4682883 6140587 5513527 5350133 8204039
10729H204039L396361M4828k492901j243648O44396k16460k286458k605344j512359
$$ 8204039 11600400 11645228 9152327 7908679 8553075 8336615 6050157 3444813 1932454
10720A932454j185976k180553l246971k745591J33669L638665L959285K43811
$$ 1932454 746478 -1434075 -4681046 -7426637 -7292968 -3654303 304982 548793
10712E48793k694377n42978L727805M133232O24282k068723k567182k968340k518556
$$ 548793 -2145584 -2688562 1039243 5172475 5796757 3728034 1160852 -1807488 -4326044
10703d326044Q23615L485740Q8174n724702m374000M069159Q168709K655900l200228
$$ -4326044 -3502429 -16689 71485 -5653217 -10027217 -5958058 2210651 4866551 1666323
10694A666323p49988M613779L524544k053558l491299M8300J939374j62968k222553
$$ 1666323 916335 5530114 9054658 7001100 3509801 3558101 5497475 5334507 3111954
10685C111954k139376k023205k412951j149781J590634K749916J321053n94589
$$ 3111954 972578 -1050627 -3463578 -4613359 -3022725 -272809 1048244 453655
10677D53655j545385j653063n70493J511679J970980q36635l538841j930447J899296
$$ 453655 -1091730 -2744793 -3315286 -1803607 167373 -669262 -4208103 -6138550 -4239254
10668d239254K188344j048623j418344L640686P989738N367056j574492n060697
$$ -4239254 -2050910 -3099533 -4517877 -877191 7112547 12479603 10905111 5844414
10660E844414k580144R37010Q04335j539352j814674M80041J603544n98494l306363
$$ 5844414 3264270 4201280 5005615 3466263 1651589 2131630 3735174 3136680 -169683
10651a69683k744476M69012K602311K259955J345903R98001K38801q50531m45620
$$ -169683 -2914159 -2445147 157164 2417119 3763022 4761023 4999824 4149293 3703673
10642C703673J266995J416779o08354j334438J061446K856586K70619m087535
$$ 3703673 4970668 6387447 5779093 4444655 5506101 8362687 8633306 4545771
10634D545771m628068q67044K323172J849983k54094p57021P91026K550993K543512
$$ 4545771 -82297 -949341 1373831 3223814 2969720 2212699 3003725 5554718 8098230
10625H098230M8534l364603m550156k335154M62270P77764m2326J498405M682649
$$ 8098230 8146764 4782161 232005 -2103149 -1640879 -863115 -905441 592964 5275613
10616E275613M532766q08107o317418o162007j141045K821635K357134k19686
$$ 5275613 9808379 9000272 2682854 -3479153 -4620198 -1798563 558571 338885
10608C38885j294166m50178N69470J060914J379641J027081p81704k911102l055088
$$ 338885 -955281 -1405459 -835989 224925 1604566 2631647 1849943 -1061159 -4116247
10599d116247r65044J310871K724835M007716M442999J547902l846090n996088
$$ -4116247 -5081291 -3770420 -1045585 2962131 7405130 8953032 5106942 -889146
10591h89146j666261L728807K533771m110441p415986l162524L137000M945620
$$ -889146 -2555407 1173400 3707171 -403270 -7819256 -10981780 -7844780 -2899160
10583b899160L107345K216556K836156K000947o21498j867429l91901R79767l58007
$$ -2899160 208185 2424741 5260897 7261844 6640346 4772917 4381016 5360783 5002776
10574E002776k596305k077015R84674K259852m28082l356187j980186K137897
$$ 5002776 2406471 329456 1314130 3573982 3145900 -210287 -2190473 -52576
10566e2576L378036L85153k369209k014372j089194j843656j981634L61376K119131
$$ -52576 3325460 3710613 1341404 -672968 -1762162 -3605818 -5587452 -5226076 -3106945
10557c106945M00041j833154m59644K510226J997710j869050m050475k023315
$$ -3106945 -2706904 -4540058 -4999702 -2489476 -491766 -2360816 -6411291 -8434606
10549h434606J745259L868228L000180J00950j624500M08114L356329J579057
$$ -8434606 -6689347 -2821119 179061 280011 -1344489 -936375 2419954 3999011
10541C999011l544285l380851M065096Q543132K888321m879089m501161n6219
$$ 3999011 454726 -2926125 1138971 9682103 12570424 7691335 3190174 3133955
10533C133955j206710n182341k409239M822955N533353n42607k985359N40680
$$ 3133955 1927245 -3255096 -5664335 -841380 4691973 4149366 1164007 1704687
10525A704687J630333k093185l325846P9153J758920L13997J251583L706652O84675
$$ 1704687 3335020 1241835 -2084011 -2004858 -245938 68059 1319642 5026294 5710969
10516E710969n593280m966423J809649K875574l190109m209616L198380P426483
$$ 5710969 117689 -4848734 -3039085 -163511 -3353620 -7563236 -4364856 3061627
10508C061627L273836k10421R97130o07315n179369k342806O271362N415347n120430
$$ 3061627 6335463 6125042 7122172 6514857 1335488 -1007318 5264044 10679391 5558961
10499E558961p021614K359973K991961q887406j0077701M824374Q157729p834480
$$ 5558961 -1462653 897320 3889281 -4998125 -15075826 -10251452 -2093723 -9928203
10491i928203q762680J5449745J1746823n2270106j08089011o6164332M5307868
$$ -9928203 -18690883 -3241138 8505685 -43764421 -151853432 -218017764 -172709896
10484a72709896J05252664O3530919k600862j3550115J0869009J3160197n990194
$$ -172709896 -67457232 -3926313 -6527175 -20077290 -9208281 3951916 -2038278
10477b038278r237920M742876Q137873j357209l191017L414972K077718n516122
$$ -2038278 -11276198 -6533322 1604551 247342 -2943675 471297 2549015 -2967107
10469b967107l907337M171107L041023m928903l967469M515796M840322k962464
$$ -2967107 -6874444 -2703337 337686 -4591217 -8558686 -4042890 797432 -2165032
10461b165032l657370M281423O304823j244771n751702j817609J505508l20207
$$ -2165032 -5822402 -1540979 4763844 3519073 -2232629 -4050238 -2544730 -2864937
10453b864937o85440K663693L098311o75090j696810J170659R51428l373639m628467
$$ -2864937 -3550377 -886684 2211627 1536537 -160273 1010386 1961814 -1411825 -6040292
10444f040292j391064m63180l180261k625490K812139N797979L059828L54989
$$ -6040292 -7431356 -7894536 -11074797 -13700287 -10888148 -5090169 -2030341 -1675352
10436a675352J349500K375133J261856J238102L073701K664490q49249k999007
$$ -1675352 -325852 2049281 3311137 4549239 7622940 10287430 9438181 6439174
10428F439174j992058q55064n23771J141718K917095J116953k756243l592527
$$ 6439174 4447116 3592052 3068281 4209999 7127094 8244047 5487804 1895277
10420A895277j689566j520368k303349M49063M579482L282872k287722l680921
$$ 1895277 205711 -1314657 -3618006 -3168943 1410539 4693411 2405689 -1275232
10412a275232M71010K349693o83162j641474K474856M410882m06522n117145k559542
$$ -1275232 -804222 1545471 862309 -779165 1695691 6106573 5700051 582906 -1976636
10403a976636L279111M256091J03867l378106l355836j260651J247503K775817
$$ -1976636 1302475 5558566 5662433 2284327 -1071509 -2332160 -1084657 1691160
10395A691160J607431j751192l991365l258140j231575K12914J003430Q92837
$$ 1691160 3298591 1547399 -2443966 -5702106 -6933681 -6720767 -5717337 -4824500
10387d824500n38486j510494O4908K366394K026245J58350N28354K453778K044087
$$ -4824500 -5362986 -6873480 -6808572 -4442178 -2415933 -2257583 -1729229 724549 2768636
10378B768636N1767J017760M308804M088511m52229k996765m95564K209796J161928
$$ 2768636 2820403 3838163 8146967 12235478 11783249 8786484 8290920 10500716 11662644
10369A1662644p21539r4788J004681k00059k298798l019838k761770k177568r12738
$$ 11662644 10941105 10846317 11850998 11650939 9352141 6332303 3570533 1392965 480227
10360D80227m12234k633524m804874j880945M393788O154862J175687l746493
$$ 480227 67993 -2565531 -7370405 -9251350 -4857562 1297300 2472987 -1273506
10352a273506l725337j875537j123324J222155N805693O735814J199298l913732
$$ -1273506 -4998843 -6874380 -7997704 -6775549 -969856 5765958 6965256 3051524
10344C051524k137841K333556K134060j326262j745108P16860P97631j788293
$$ 3051524 913683 3247239 5381299 4055037 2309929 3026789 3824420 2036127
10336B036127k082568J175719L540934K073454r01069j806309J33587K879624
$$ 2036127 -46441 1129278 4670212 6743666 5842597 4036288 4169875 7049499
10328G049499L244294k88634m671947m718767l06456K437751k73691m312870m099869
$$ 7049499 10293793 10005159 5333212 614445 307989 2745740 2472049 -1840821 -5940690
10319e940690l53509K787001M203692M545964K477352k281681n370566l046982
$$ -5940690 -6294199 -3507198 696494 5242458 7719810 5438129 67563 -2979419
10311b979419J400247K027525j119576l141579k060349j6678J518926K296531
$$ -2979419 -1579172 448353 -671223 -3812802 -5873151 -5889829 -4370903 -2074372
10303b074372P44577l512083o133317l008674K451697L266958n12876j926010
$$ -2074372 -1329795 -4841878 -10975195 -13983869 -11532172 -8265214 -8778090 -10704100
10295a0704100J747872M874687K566834k096334l217298j56306K950023L010108
$$ -10704100 -8956228 -4081541 -1514707 -3611041 -6828339 -6984645 -4034622 -1024514
10287a024514N36268j903034k003762J84047J796780M56539j989994j607975J621616
$$ -1024514 -488246 -2391280 -4395042 -4210995 -2414215 -1957676 -3947670 -5555645 -3934029
10278c934029L287014J040948j827606j324272J607020L036519J660341m64503
$$ -3934029 -647015 393933 -1433673 -2757945 -1150925 1885594 3545935 3081432
10270C081432j689743k300392k428289j215119J086951K253105Q01714j628930
$$ 3081432 1391689 -908703 -3336992 -4552111 -3465160 -1212055 -410341 -2039271
10262b039271k214982o15768R67388J138856P79649Q47345P58089R269l67219
$$ -2039271 -4254253 -4870021 -3902633 -2763777 -1984128 -1136783 -378694 -369425 -736644
10253g36644N31543J711656J671877M11950j179528k495936k602176n06361K399632
$$ -736644 -205101 1506555 3178432 3590382 2410854 -85082 -2687258 -3193619 -793987
10244g93987K672311l39246k836297k269872j128806j562121n65594M075432P209016
$$ -793987 1878324 1539078 -1297219 -3567091 -4695897 -6258018 -6823612 -2748180 4460836
10235D460836L135229l916184m918498j99700J328194k684927m240724J035289
$$ 4460836 7596065 3679881 -1238617 -1438317 -110123 -2795050 -7035774 -6000485
10227f000485O362279M992025P4385k405985k854149l896459l731127m72223K416053
$$ -6000485 361794 5353819 5428204 3022219 168070 -3728389 -7459516 -7931739 -5515686
10218e515686J658953K19716J525463K661431J8799l036316j430278K629470L208470
$$ -5515686 -3856733 -3637017 -2111554 549877 568676 -2467640 -3897918 -1268448 1940022
10209A940022j03311l305110m973400n406142k575433L678192P157457L165598
$$ 1940022 1836711 -1468399 -6441799 -11847941 -14423374 -10745182 -3587725 -422127
10201d22127k541426j478448L984538M699031K01019j125291K827347M189710
$$ -422127 -2963553 -4442001 -457463 4241568 4442587 3317296 6144643 10334353
10193A0334353j085218o192182m463634J087480M012844L497175K452223J807243
$$ 10334353 9249135 3056953 -1406681 -319201 3693643 7190818 9643041 11450284
10185A1450284R90759J89994r67307l518046o096092n643044k458455j74417K75437
$$ 11450284 12441043 12631037 11663730 8145684 2049592 -3593452 -6051907 -6226324 -5950887
10176e950887J648424M284699M605657J429631j663107k166941j569112q58357
$$ -5950887 -4302463 -17764 4587893 6017524 4354417 2187476 618364 -239993
10168b39993J045581K627790R0293n155326o150179r21483L567497K267881j83331
$$ -239993 805588 3433378 3523671 -1631655 -7781834 -8703317 -5135820 -2867939 -3051270
10159c051270J791956M759753K433656l108190m582514j096918J392202J57651
$$ -3051270 -1259314 3500439 5934095 2825905 -1756609 -2853527 -1461325 -1303674
10151a303674j078986N09783K435595J549542j171230k558385j542523R9679L19846
$$ -1303674 -2382660 -1872877 562718 2112260 941030 -1617355 -3159878 -3060199 -2740353
10142b740353o67321o77331J147507K415972R78217r18147K13239K619117J422027
$$ -2740353 -3407674 -4085005 -2937498 -521526 456691 -461456 -248217 2370900 3792927
10133C792927k636585l353978L91652J963513j647268l830545N51776N690241
$$ 3792927 1156342 -2197636 -1805984 157529 -1489739 -5320284 -4768508 921733
10125I21733M138004q37755j357553J654330J396399j903915k013243R82110O02868
$$ 921733 5059737 4221982 2864429 4518759 5915158 4011243 1998000 2980110 3582978
10116C582978l591145m506988k00144K475810m9319k290712k29608J765445p1231
$$ 3582978 -8167 -4515155 -4715299 -2239489 -2288808 -4579520 -4809128 -3043683 -3114914
10107c114914j609088R32298L075412N0440l678695j355973M299099N099189J49243
$$ -3114914 -4724002 -3791704 -716292 -665852 -4344547 -5700520 -1401421 3697768 3847011
10098C847011l931290l721500j812468L7666K549588L909890J031909l372074
$$ 3847011 -84279 -3805779 -5618247 -5580581 -3030993 878897 1910806 -1461268
10090a461268k655641L109541N822681J467454l686775l127662K61515L23157
$$ -1461268 -4116909 -1007368 4815313 6282767 2595992 -531670 -270155 53002
10082E3002j870923p57166L448578M683707P77918l216908k607022J029546L309784
$$ 53002 -1817921 -2575087 873491 5557198 6335116 3118208 511186 1540732 4850516
10073D850516K614005J88817k378745l710366k790136m38660R34489M45054k4653
$$ 4850516 7464521 7653338 5274593 1564227 -1225909 -1664569 -730080 -285026 -309679
10064c09679J011469K141250J482197j48333p77733o76118j517736k814774k145267
$$ -309679 701790 2843040 4325237 4176904 3399171 2723053 1205317 -1609457 -3754724
10055c754724P82664K990165K182358k45547j497623j041210l79155k95616j52482
$$ -3754724 -2972060 18105 2200463 1954916 457293 -583917 -963072 -1258688 -1411170
10046a411170M65334J005560R94766P40817P34206J039056J403037J404432M71781
$$ -1411170 -945836 59724 1054490 1795307 2529513 3568569 4971606 6376038 6847819
10037F847819j571190l745345m267745k237340J027965K785584J522090j154615
$$ 6847819 5276629 1531284 -2736461 -4973801 -3945836 -1160252 361838 -792777
10029g92777k029242k35532J235706o21466m174612m726104j034377K567282K118306
$$ -792777 -2822019 -3057551 -1821845 -2443311 -6617923 -11344027 -12378404 -9811122 -7692816
10020g692816n70203j156686O85287J651495O48302k9450N27714K96605j218316
$$ -7692816 -8263019 -9419705 -8734418 -7082923 -6434621 -6464071 -5936357 -5639752 -6858068
10011f858068j208713J519638L684493K602635P05124J226499K428917Q46865
$$ -6858068 -8066781 -6547143 -2862650 -260015 445109 1671608 4100525 4947390
10003D947390k001184j754946J104242J855700j66488m55164K090152K320621
$$ 4947390 2946206 1191260 2295502 4151202 3984714 3529550 5619702 7940323
9995G940323k137165n421481k197870L226543L081211j991345m442202j508127
$$ 7940323 5803158 381677 -1816193 1410350 4491561 2500216 -1941986 -3450113
9987c450113J968865K326124J515324J357528O547l083196m273123j415834K014754
$$ -3450113 -1481248 844876 2360200 3717728 3724275 641079 -3632044 -5047878 -3033124
9978c033124K147149K77105m70086l66449p99037k15924K660899M390422J307324
$$ -3033124 -885975 -608870 -1078956 -1445405 -2244442 -2460366 200533 4590955 5898279
9969E898279l456885l737670j67770P04691k479384l273459J478465N285585J914477
$$ 5898279 2441394 -1296276 -1464046 -759355 -3238739 -6512198 -5033733 251852 2166329
9960B166329m098432l886921K103470M829918M31030m443663l148541J601807
$$ 2166329 -1932103 -5819024 -3715554 1114364 1545394 -2898269 -6046810 -4445003
9952d445003K979265J32380k137430j449746k25863k94869O2598K296371M374740
$$ -4445003 -1465738 -1333358 -3470788 -4920534 -5146397 -5441266 -5378668 -3082297 1292443
9943A292443L595979M40785k448660l597409l078966r55269K332407M751996M256878
$$ 1292443 4888422 5329207 2880547 -716862 -3795828 -4751097 -2418690 2333306 6590184
9934F590184J520855q60198j807018k324014k695165j793718J02593O72818o34535
$$ 6590184 8111039 7250841 5443823 3119809 424644 -1369074 -1266481 -593663 -1228198
9925a228198q67770J744800L742762R42544m243109m896137L38470M351993J530602
$$ -1228198 -2095968 -351168 3391594 4334138 91029 -4805108 -4466638 -114645 1415957
9916A415957l752808l459602K011936M504438P53429k691571j63322L770858J571181
$$ 1415957 -2336851 -5796453 -3784517 719921 1473350 -1218221 -1381543 2389315 3960496
9907C960496m687916n892772j86273L781229L82560l917693p13655O542326O849580
$$ 3960496 -727420 -6620192 -6806465 -3025236 -2642676 -6560369 -7274024 -731698 6117882
9898F117882j946882r112303n229964N573739J1405164P179494q66532m297065
$$ 6117882 4171000 -4941303 -10171267 -4597528 6807636 13987130 13120598 8823533
9890H823533k262356n13475k457181m527912k154306K339368K519716j746912
$$ 8823533 6561177 6047702 3590521 -937391 -3091697 -752329 1767387 20475
9882B0475l070604J509736M265416j284892q225759n781218K535482K801152o814982
$$ 20475 -3050129 -1540393 2725023 1440131 -6785628 -12566846 -10031364 -7230212 -14045194
9873a4045194j1050020m04009J3306391J3710039K973877l742551j237023J475409
$$ -14045194 -25095214 -25499223 -12192832 1517207 4491084 748533 -488490 986919
9865I86919j719293n311842k977542K735954N650859M125826L13752l527405m980447
$$ 986919 -732374 -6044216 -9021758 -6285804 -634945 3490881 3804633 277228 -4703219
9856d703219k270708K242948L383212P6036k938910k008938J044275L131430L847471
$$ -4703219 -6973927 -4730979 -1347767 -1271731 -4210641 -6219579 -5175304 -2043874 1803597
9847A803597L081198m38204n230884o229593j456445M189344N288292K591706
$$ 1803597 4884795 4446591 -784293 -7013886 -8470331 -4280987 1007305 3599011
9839C599011P9326r33121j014047L25544K467115K002451k032518m473716r79568
$$ 3599011 3678337 2745216 1731169 2056713 4523828 6526279 4493761 20045 -959523
9830i59523M213153L775028j516030m143315j664248M46606j214002k612497O5391
$$ -959523 3253630 7028658 5512628 1369313 -294935 151671 -1062331 -3674828 -3609437
9821c609437L686035L582752J142063Q17408K343794J319823l211096o558312
$$ -3609437 76598 3659350 4801413 5618821 7962615 9282438 6071342 -486970
9813d86970m836658l40400J651560k1521r69229K482290P476080P622772J723824
$$ -486970 -5323628 -5664028 -4012468 -4033989 -5003218 -2520928 4955152 12577924 14301748
9804A4301748l846671l407726N28808J645423p58850j967630m94752k98048l220956
$$ 14301748 10455077 7047351 7576159 9221582 8462732 6495102 6000350 5702302 2481346
9795B481346n244309l124269K89450J023232p308m7577K67566n70102n61449K236260
$$ 2481346 -2762963 -5887232 -5597782 -4574550 -4581858 -4629435 -4361869 -4931971 -5493420 -3257160
9785c257160M416409J621476l414106l827320Q07351L632008J056524k418982
$$ -3257160 1159249 2780725 -633381 -4460701 -3653350 -21342 1035182 -1383800
9777a383800k039948N10947J440139Q97231Q92019R52402k32670j537307j211617
$$ -1383800 -3423748 -2912801 -1472662 -575431 316588 1268990 1036320 -500987 -1712604
9768a712604P4344O76794M58333j84766j284391j599540P64662M169782L994683
$$ -1712604 -1638260 -961466 -503133 -687899 -1972290 -3571830 -2807168 1362614 5357297
9759E357297j19941k401578J78696K575657K38087k568748o9515M159375K604027
$$ 5357297 5237356 2835778 3014474 5590131 5828218 3259470 3189955 7349330 9953357
9750I953357k960736l878387O25132J832901l692419p992989m253172L235941
$$ 9953357 6992621 3114234 3739366 5572267 1879848 -6113141 -10366313 -7130372
9742g130372O617591M830096J259448k601378n530206m142860J842480O224370
$$ -7130372 -512781 4317315 5576763 2975385 -2554821 -6697681 -4855201 1369169
9734A369169L996675j243137k965640j158151l87682j610176j989325p08725O22193
$$ 1369169 5365844 4122707 1157067 -1084 -388766 -1998942 -3988267 -4696992 -4074799
9725d074799J638002K447853J340046j942444l255509K27513M038747K364764
$$ -4074799 -2436797 11056 1351102 -591342 -3846851 -3619338 419409 2784173
9717B784173k319940k627499K044162M702316J723992k516966l121255n03515
$$ 2784173 464233 -2163266 -119104 4583212 6307204 3790238 668983 165468
9709A65468K681864M847290M275500n8452m951176n290117j345482J217314j46714
$$ 165468 2847332 7694622 11970122 11911670 6960494 1670377 324895 1542209 1395495
9700A395495j821530j183868p76168k399238k728537R88858N370605N672984K782698
$$ 1395495 -426035 -1609903 -2386071 -4785309 -7513846 -6524988 -1154383 4518601 7301299
9691G301299Q01937J78428j847549n156879n928648k501583J471496J521606j657735
$$ 7301299 8103236 8281664 6434115 1277236 -4651412 -7152995 -5681499 -4159893 -5817628
9682e817628k875864O78750N132043M701598p2008k720312l52846K095143J45580
$$ -5817628 -8693492 -8014742 -2882699 1818899 1746891 -973421 -1326267 768876 914456
9673I14456k792888j588130J443071P35678k291220j710250J896378K264516r13037
$$ 914456 -1878432 -3466562 -2023491 -1287813 -3579033 -5289283 -3392905 -1128389 -2041426
9664b041426j143706K696924L666781o56525l138982M53195L671968O47215l590426
$$ -2041426 -3185132 -488208 3178573 2522048 -616934 -163739 3508229 4155444 565018
9655E65018k057324K190832J951248j858094l073121j357204j265317k935429
$$ 565018 -1492306 698526 2649774 791680 -2281441 -3638645 -4903962 -7839391
9647g839391k359118O35813K416442K408379K970616L614524K028427k91074K921
$$ -7839391 -10198509 -9562696 -7146254 -4737875 -1767259 1847265 3875692 3584618 3587539
9638C587539J552613J44371l756686n580468l971818j546723O12881L130803M290075
$$ 3587539 5140152 5284523 1527837 -4052631 -8024449 -9571172 -8958291 -5827488 -1537413
9629a537413K254426j2471J138593K598380j016703o693706n903499J733224P082514
$$ -1537413 717013 704542 1843135 4441515 3424812 -3268894 -9172393 -7439169 -356655
9620c56655N216150J174072l32272j452793l632176k790224K337707N069999P18535
$$ -356655 4859495 6033567 5701295 4248502 616326 -2173898 163809 5233808 5952343
9611E952343m830525l735511J679729L088752r53864l966652j989605J671705
$$ 5952343 1121818 -2613693 -933964 2154788 1200924 -2765728 -4755333 -3083628
9603c083628K483594N26445q90937K45477K456654K509589k25128j981413K79918
$$ -3083628 -600034 -73589 -964526 -719049 1737605 4247194 4022066 2040653 2320571
9594B320571L060614N32679n529907o713479p29867M192826J720728k993224k172874
$$ 2320571 5381185 5913864 383957 -6329522 -7059389 -2866563 -1145835 -4139059 -6311933
9585f311933K356575L444186M82909j422354j143058j716643k436671N54134N852050
$$ -6311933 -3955358 -511172 -28263 -1450617 -2593675 -4310318 -6746989 -6192855 -340805
9576c40805P134208K913654j394403k485049k977345m241880k898073J959918
$$ -340805 6793403 9707057 8312654 5827605 2850260 -1391620 -4289693 -2329775
9568b329775M720658J327290l793312m199301q00981R24909J25926O90242L346418
$$ -2329775 2390883 3718173 -75139 -4274440 -5075421 -4150512 -4024586 -3334344 12074
9559A2074L859907N8030m225332m352855q23590K302216K855138K032378J416261
$$ 12074 3871981 3930011 -295321 -4648176 -5471766 -3169550 -314412 1717966 3134227
9550C134227Q82687k23995j434991j699209r94612l96548n47467r03407p45679
$$ 3134227 4016914 3792919 2357928 658719 -335893 -732441 -1279908 -2183315 -2928994
9541b928994j09395P59697J965620L157330L031589R22240j602936k201450p50507
$$ -2928994 -3038389 -2278692 -313072 2844258 5875847 6798087 5195151 2993701 2243194
9532B243194N22833J40840p29144j26338J896245L190499J974683j141904l642844
$$ 2243194 2766027 2906867 2177723 2051385 3947630 7138129 9112812 7970908 4328064
9523D328064l548812j312831R40568J852368J705597R35164o56094k351942j918274
$$ 4328064 779252 -533579 406989 2259357 3964954 4900118 4244024 1892082 -26192
9514b6192J499764M841029L909571j239472n721593n180046l02515M425977N242771
$$ -26192 1473572 6314601 10224172 8984700 3263107 -1916939 -2219454 2206523 7449294
9505G449294K072138j859155l093881j514537n04760k292880m118714j728316
$$ 7449294 9521432 7662277 4568396 3053859 2549099 256219 -3862495 -5590811
9497e590811L636070N599182J425652l372807k331984K861526M840838Q45330
$$ -5590811 -1954741 3644441 5070093 1697286 -634698 2226828 7067666 7912996
9489G912996m174953n081061k701731o80093J22408J102605K167966J860629K14363
$$ 7912996 3738043 -1343018 -4044749 -4724842 -4602434 -3499829 -1331863 528766 743129
9480G43129j345685k384034l200962k808249j01424L097565L475467J299659O16238
$$ 743129 -602556 -2986590 -6187552 -8995801 -9097225 -5999660 -2524193 -1224534 -608296
9471f08296K976714M483581J649478k872002m033872j728688j02132o26219n28891
$$ -608296 2368418 6851999 8501477 5629475 1595603 -133085 -235217 -861436 -1390327
9462a390327J653738L444595K650776M43648j426068k990078l727768j553844
$$ -1390327 263411 3708006 6358782 6802430 5376362 2386284 -1341484 -2895328
9454b895328L007651M991186J187820m271605m889463p62776K166986J094531
$$ -2895328 112323 5103509 6291329 2019724 -2869739 -3632515 -1465529 -370998
9446c70998o41804j60391O56103j89460l93606K480131N364604L053377l626383
$$ -370998 -1012802 -1173193 -517090 -706550 -1100156 1379975 6744579 9797956 6171573
9437F171573p649821m833296P01229K444248K08407p12473J818116L442437L60027
$$ 6171573 -1478248 -6311544 -5610315 -3166067 -2957660 -3670133 -1852017 1590420 1950447
9428A950447m010096l478806J494169L923075L78515m159225m005135p53667O32578
$$ 1950447 -2059649 -5538455 -4044286 -121211 257304 -3901921 -7907056 -8660723 -8028145
9419h028145J74225J635815M742657N004889J475286j366253r47656k36440j618376
$$ -8028145 -7853920 -6218105 -1475448 3529441 5004727 3638474 2690818 2454378 836002
9410H36002k420868j50517K298272J191894j668474j978111J27029J106452K09856
$$ 836002 -1584866 -1735383 562889 1754783 86309 -1891802 -1764773 -658321 -448465
9401d48465m12791n91439j907653l123009j157846L110375N123058L409186J108863
$$ -448465 -861256 -1452695 -3360348 -6483357 -7641203 -4530828 592230 4001416 5110279
9392E110279j29781k282331n239329m783883M69625N207941M633671J317538L04927
$$ 5110279 4980498 2698167 -2541162 -7325045 -6855420 -1647479 2986192 4303730 4608657
9383D608657J160367J85412k347293k994635j390236k1490R90696L114249M273650
$$ 4608657 5769024 5954436 3607143 612508 -777728 -799218 191478 3305727 7579377
9374G579377R05898m633532n390666j05522M171176K374607j684842k477493j223499
$$ 7579377 8485275 3851743 -1538923 -1644445 2526731 4901338 3216496 739003 -484496
9365d84496j945945l348085j135873L610800M878965N95993m246781m522130j038603
$$ -484496 -2430441 -5778526 -6914399 -3303599 1575366 2171359 -2075422 -6597552 -7636155
9356g636155J869586J908519K91099n48140O14979K679770L079552O09500k824370
$$ -7636155 -5766569 -3858050 -3566951 -4115091 -3500112 -820342 2259210 2868710 44340
9347D4340m400962l686630k176534m56670J721227L011461J343353k052006k600660
$$ 44340 -4356622 -8043252 -10219786 -10676456 -8955229 -5943768 -4600415 -6652421 -9253081
9338i253081J692681O526991O122856O60339l870824l273642Q1152J360253j6690
$$ -9253081 -7560400 -1033409 5089447 5749786 1878962 -1394680 -1313528 46725 30035
9329C0035n05365J380538K555988N03091k165984j473037J483889J971662j071746
$$ 30035 -475330 905208 3461196 3964287 1798303 325266 1809155 3780817 2709071
9320B709071l610763k869878o25551J047149K596378L612722J689637k342882
$$ 2709071 -901692 -3771570 -4397121 -3349972 -753594 2859128 4548765 2205883
9312B205883l241757N23513K809970o40594m161245j091174M116440K465848l972822
$$ 2205883 -1035874 -512361 2297609 1657015 -2504230 -3595404 521036 2986884 -985938
9303i85938m642386J657952M051803k361914p885486l678138M659035P052979
$$ -985938 -5628324 -3970372 81431 -2280483 -10165969 -13844107 -9185072 -2132093
9295b132093L980256K123637J715508j208897m294235j641626M702784O310291
$$ -2132093 1848163 3971800 5687308 4478411 184176 -1457450 3245334 9555625
9287I555625J325591l320438l336829k029205k261963j754393P74097J986428
$$ 9555625 10881216 7560778 4223949 2194744 -67219 -1821612 -1047515 938913
9279I38913p740j945704j258758k84917j176685j692325J15332J685847O00173
$$ 938913 931173 -1014531 -2273289 -2558206 -3734891 -5427216 -5311884 -3626037 -3025864
9270c025864p28164N18754K121848O56795k251208k630634q64073m22620j410434
$$ -3025864 -3754028 -3235274 -1113426 -456631 -2707839 -5338473 -6202546 -6625166 -8035600
9261h035600p91188J482801J933860k77014j557406J69023J921644N74347j846994
$$ -8035600 -8826788 -7343987 -5410127 -5687141 -7244547 -7075524 -5153880 -4579533 -6426527
9252f426527j067991K787406M855310K070710k560027l788151r00185J673279
$$ -6426527 -7494518 -4707112 148198 2218908 -341119 -4129270 -5029455 -3356176
9244c356176P18352j440489j012406R69697K75003l014596l352129J980930P519938
$$ -3356176 -2637824 -4078313 -5090719 -4121022 -3846019 -6860615 -10212744 -8231814 -711876
9235g11876O288319n80446n164855k944725K287677M205110J448625k091529k664829
$$ -711876 5576443 4995997 -168858 -3113583 -825906 3379204 4827829 2736300 71471
9226G1471o94211L81938j291993l259839j828414K323463M150518J097911k824560
$$ 71471 -622740 -240802 -1532795 -4792634 -6621048 -4297585 -147067 950844 -1873716
9217a873716k453648J293047L176474J257573j321433j796138q68621J82031J540329
$$ -1873716 -4327364 -3034317 142157 1399730 78297 -1717841 -2586462 -2404431 -864102
9208h64102K730855J976017m79000j403953Q00428K973994J304699l099220n445462
$$ -864102 1866753 3842770 3363770 1959817 2760245 5734239 7038938 3939718 -1505744
9199a505744l308352Q59343L138493K330730L86826m17790j32632o25424k369947
$$ -1505744 -4814096 -3954753 -816260 1514470 1901296 1483506 1350874 725450 -1644497
9190a644497l032646q02008K029812J645533j409262k437654M89319L556538L068165
$$ -1644497 -4677143 -5479151 -3449339 -1803806 -3213068 -5650722 -5161403 -1604865 1463300
9181A463300O92300j59445n0670j494589l328682k010093K052515M255573K529976
$$ 1463300 2155600 1996155 1945485 450896 -2877786 -4887879 -2835364 1420209 3950185
9172C950185L2461k91335J20817r51147k107115r19037J198603O58485k315992
$$ 3950185 3982646 3691311 3812128 2860981 753866 -165171 1033432 1691917 -624075
9163f24075l182543M88539N050680N250275Q83021l411620m252352k776266j464845
$$ -624075 -3806618 -3318079 1732601 6982876 7865897 4454277 201925 -2574341 -4039186
9154d039186m52116J113919J948031j6165l402203l744331O51780N655510O194071
$$ -4039186 -4491302 -3377383 -1429352 -1445517 -4847720 -8592051 -7940271 -2284761 3909310
9145C909310K567355n98348q40770m23961k054749m620310m769587j433123K886095
$$ 3909310 6476665 5878317 5037547 4613586 2558837 -2061473 -6831060 -8264183 -5378088
9136e378088M962211L753420N31282k685538m273364l437058o69442K163631L160398
$$ -5378088 -415877 3337543 3868825 1183287 -3090077 -6527135 -7196577 -5032946 -1872548
9127a872548K298486J348817J386865J243694o60712l692089n448151m402574
$$ -1872548 425938 1774755 3161620 4405314 3744602 52513 -5395638 -9798212
9119i798212j008930L139829N849470M988148Q74860k479163j238585K979275
$$ -9798212 -10807142 -7667313 -1817843 3170305 4045165 1566002 327417 3306692
9111C306692M471528P11289m521364o255383l865463j95462K223787K451976R53522
$$ 3306692 7778220 8489509 3968145 -2287238 -6152701 -6348163 -4124376 -1672400 -718878
9102g18878k36968Q00084K893141K932382Q00720k71067N41260n3000l176207
$$ -718878 -955846 -155762 2737379 5669761 6470481 6199414 6740674 6687674 3511467
9093C511467m664503j801264J508320Q66920j622949j770474n19403n90969J9959
$$ 3511467 -1153036 -2954300 -1445980 -579060 -2202009 -3972483 -4491886 -5082855 -5062896
9084e062896L680640N746852O17615o906055o441684J981427P163203L471738
$$ -5062896 -1382256 4364596 4982211 -1923844 -8365528 -6384101 779102 4250840
9076D250840k097048k742965j379264k159827k077888J786850M466445Q90077
$$ 4250840 2153792 -589173 -1968437 -4128264 -6206152 -4419302 47143 937220
9068I37220m358188l674443J370880L110578L51627p27366K567496N431197L342668
$$ 937220 -3420968 -7095411 -5724531 -2613953 -2262326 -2989692 -422196 5009001 8351669
9059H351669j878818n219834m012463L24285L664374K760643p78106j870967R69612
$$ 8351669 6472851 1253017 -2759446 -2435161 1229213 3989856 3211750 1340783 2310395
9050B310395L167719J183533k038613k436991j292672j495965j607714M75251
$$ 2310395 5478114 6661647 4623034 2186043 893371 -602594 -2210308 -1735057
9042a735057J787535r55414m071150j901148L273870M273443M34855k237152j548537
$$ -1735057 52478 -902936 -4974086 -6875234 -3601364 672079 1106934 -1130218 -2678755
9033b678755j223867k402671j650207J324182K191785J06093n36011J494580K029384
$$ -2678755 -3902622 -6305293 -7955500 -6631318 -4439533 -4333440 -4869451 -3374871 -1345487
9024a345487K01202R28748M956874M981042k632872r766273p313819J544174O307856
$$ -1345487 -1144285 -215537 4741337 9722379 7089507 -2676766 -9990585 -8446411 -2138555
9015b138555L533034j029673k243367p14958R57777J540546R09448J78533J260292
$$ -2138555 1394479 364806 -1878561 -2593519 -1635742 -95196 814252 992785 2253077
9006B253077L452401K576155l022617q111573o636836k74794L879102K998581
$$ 2253077 5705478 8281633 5259016 -2852557 -9489393 -9764187 -5885085 -2886504
8998b886504Q94791R71884J885990J412547M74644J002727K266519J824134p28265
$$ -2886504 -1991713 -1019829 866161 2278708 2753352 3756079 6022598 7846732 7118467
8989G118467k926460k758078j576839k093770l536949j581113M825787R365487
$$ 7118467 4192007 1433929 -142910 -2236680 -5773629 -7354742 -2528955 6836532
8981F836532N488902l672908q078652l752000K801178M549768K198458k44934
$$ 6836532 12325434 8652526 573874 -3178126 -376948 4172820 6371278 6126344
8973F126344k058028l656916l096223Q1875J683554j088145m130885k598449R86725
$$ 6126344 4068316 411400 -2684823 -2602948 -919394 -2007539 -6138424 -8736873 -7750148
8964g750148J110210j307917j101201J563378J694395j003561j118641K944238
$$ -7750148 -6639938 -7947855 -9049056 -7485678 -5791283 -6794844 -7913485 -4969247
8956d969247N829507L823970J34129j226476j115114j558633j466529J31829Q06223
$$ -4969247 860260 4684230 4818359 3591883 2476769 918136 -548393 -416564 389659
8947C89659j215418l169323k131613k68936j066030k666223m67542M467712N434240
$$ 389659 -825759 -3995082 -6126695 -6395631 -7461661 -10127884 -10595426 -6127714 -693474
8938f93474j30704n798318m233259K968460P451691M859975o12408k833048j127856
$$ -693474 -824178 -6622496 -10855755 -7887295 -435604 4424371 3811963 978915 -148941
8929a48941J003749J722747K034409K397932J748965j5520j592500k681750l997894
$$ -148941 854808 2577555 4611964 7009896 8758861 8743341 7150841 4469091 471197
8920D71197m568527k416595J207976K109946n99816k433408l36668K257153R51266
$$ 471197 -4097330 -6513925 -5305949 -3196003 -3795819 -6229227 -6565895 -4308742 -3357476
8911c357476k250574j916362K351397N435034M109352M60462k184530k803785
$$ -3357476 -5608050 -7524412 -5173015 262019 4371371 4831833 2647303 -156482
8903a56482j706744M57094J896459Q16682j741303k582870o06784J745508J955052
$$ -156482 -1863226 -1406132 490327 1307009 -434294 -3017164 -3623948 -1878440 76612
8894G6612M55252n88814j87562N27147j89476k255447l025004l05230L891490
$$ 76612 531864 -56950 -244512 282635 93159 -2162288 -5187292 -5492522 -1601032
8885a601032N066888K357711l19747n96240r40860k995134l385925K83985L616183
$$ -1601032 3465856 5823567 5503820 4907580 3966720 971586 -2414339 -2130354 1485829
8876A485829J707329k116639j170431L134198L044984k629150o007793k305675
$$ 1485829 3193158 1076519 -93912 3040286 6085270 3456120 -2551673 -4857348
8868d857348L311649M235061J217671j165724j461918o80617R38630K570863J741438
$$ -4857348 -1545699 2689362 3907033 2741309 1279391 598774 1537404 4108267 5849705
8859E849705j914764m847133m286161j623101J047225L817194N953809M556907
$$ 5849705 3934941 -912192 -5198353 -6821454 -5774229 -1957035 3996774 8553681
8851H553681l70760l829049k685766n16006j340678k825553j024438J919717J221506
$$ 8553681 8182921 4353872 1668106 1152100 -188578 -3014131 -4038569 -2118852 -897346
8842h97346j982572k325114Q13164K690113J309978k42670j53882m76028j934460
$$ -897346 -2879918 -5205032 -4391868 -1701755 -391777 -634447 -788329 -1264357 -3198817
8833c198817j744323J130515L350368K483740P78949Q13740J171811k05919j653674
$$ -3198817 -4943140 -3812625 -462257 2021483 2800432 3614172 4785983 4580064 2926390
8824B926390p40854P91939n59766l938291m753316j375936K638821L706262K292307
$$ 2926390 2185536 2977475 2417709 -1520582 -6273898 -7649834 -5011013 -1304751 987556
8815I87556P09354k06274n33229J04360J190407N93351k336047m536069k992285
$$ 987556 1696910 1490636 957407 1061767 2252174 2845525 509478 -4026591 -7018876
8806g018876M06781J160854j160492k382578l34611K125865K291177J739708K464719
$$ -7018876 -6612095 -5451241 -6611733 -8994311 -9328922 -7203057 -4911880 -3172172 -707453
8797g07453K494160m84293l623012k049696L325870O034961K653584k947776n284284
$$ -707453 1786707 1302414 -2320598 -4370294 -1044424 4990537 7644121 4696345 -587939
8788e87939l811276j887418j538451j459649N16594M166807O235757L678803j921502
$$ -587939 -4399215 -6286633 -7825084 -9284733 -8768139 -4601332 1634425 5313228 3391726
8779C391726m869148k038361K784722L902707J237275p72637l42912K16780k44085
$$ 3391726 -1477422 -3515783 -731061 3171646 4408921 3636284 3293372 3510152 3266067
8770C266067o1948J024270P86006j080537j801273k88596J017838N53226k43243
$$ 3266067 3204119 4228389 5014395 3933858 2132585 1843989 2861827 3415053 3171810
8761C171810o43252j957707l409095j705607K706376M145440r242m411174l508399
$$ 3171810 2528558 570851 -2838244 -4543851 -1837475 2307965 2298723 -2112451 -5620850
8752e620850K10252R34218j163556j342707J251314K670885J048712q34668k68502
$$ -5620850 -5410598 -4476380 -5639936 -6982643 -5731329 -3060444 -2011732 -2846400 -3114902
8743c114902J814051K492363J1809m213143n665288j097275N840585P301183K027324
$$ -3114902 -1300851 1191512 1203321 -3009822 -8675110 -9772385 -3931800 3369383 5396707
8734E396707j738576J568934N569458J861780n706029o276867Q92951N224689
$$ 5396707 3658131 5227065 10796523 12658303 6952274 675407 1568358 6793047
8726F793047J249600m097216l573759J84517J385824M61914P56951J347843n57835
$$ 6793047 8042647 3945431 371672 556189 1942013 2403927 3160878 4508721 3950886
8717C950886l567771m034438j789520N07567J761788K388505J920659K62532o26449
$$ 3950886 383115 -3651323 -5440843 -4933276 -3171488 -782983 1137676 1400208 773759
8708G73759L49521R27013p29062k127585k78706K775679K858364N40749P0085
$$ 773759 1123280 2050293 1321231 -806354 -1085060 1690619 4548983 5089732 5159817
8699E159817K013782K243335j045507m126467l413925o08196K24838j759844l788271
$$ 5159817 7173599 9416934 8371427 4244960 831035 222839 447677 -1312167 -5100438
8690e100438l195622Q7188L784214N080745L183049M63822k46959N22668j47559
$$ -5100438 -8296060 -8208872 -4424658 656087 3839136 4302958 4055999 4578667 4431108
8681D431108k655817l863158k093766K781j94244q98541Q82965L908451M482071
$$ 4431108 1775291 -2087867 -4181633 -4178852 -4373096 -5271637 -4388672 -480221 4001850
8672D001850K536356J450305J910617Q65615k151882k721394J359734M923113
$$ 4001850 6538206 7988511 9899128 10764743 8612861 5891467 7251201 12174314
8664A2174314K045988m821414p706884m096638M10267R07909o90157m55827J111349
$$ 12174314 14220302 9398888 1692004 -2404634 -1994367 -1086458 -1776615 -2232442 -1121093
8655a121093R96971p38234j190380N49816J998136Q51452k022202l546523j613269
$$ -1121093 -124122 -862356 -2052736 -1502920 495216 1346668 -675534 -4222057 -5835326
8646e835326K500110M740289K392862k250737m120427j652562J594749K465380
$$ -5835326 -3335216 1405073 3797935 1547198 -2573229 -4225791 -2631042 -165662
8638a65662K130956K473734J974312j140433m103767k597728K349498M953632
$$ -165662 1965294 4439028 6413340 5272907 1169140 -1428588 920910 5874542
8630E874542K443642j611580k620028m25690J723117J255305j664318m351589
$$ 5874542 8318184 6706604 4086576 3660886 5384003 6639308 4974990 623401
8622F23401l585955P18072M132517K596385j737587l025701j74168J601858j029101
$$ 623401 -2962554 -2244482 1888035 4484420 2746833 -278868 -453036 1148822 119721
8613A19721m317296l261306J156494M350890M945733M840207M224416J362782
$$ 119721 -4197575 -7458881 -6302387 -1951497 2994236 7834443 12058859 13421641
8605A3421641k877979m762465k957531n60885m72422j715600k118810j993385
$$ 13421641 10543662 5781197 2823666 2262781 1790359 74759 -2044051 -4037436
8597d037436k670736l250448j748556J274652L004464K282287Q28148K53630K03221
$$ -4037436 -6708172 -9958620 -11707176 -10432524 -7428060 -5145773 -4317625 -4063995 -3860774
8588c860774J45236N64720J112613L8122k536087l124020M29104M615310M340223
$$ -3860774 -3715538 -3150818 -2038205 -2000083 -4536170 -7660190 -7231086 -2615776 1724447
8579A724447K62966k169680p49742J098917N88966p15936j099516j619415k291011
$$ 1724447 1987413 -182267 -932009 166908 755874 39938 -1059578 -2678993 -4970004
8570d970004m08663L728874M511969n95642n109410k442074L154962K630928l295810
$$ -4970004 -5378667 -1649793 2862176 2266534 -2842876 -5284950 -2129988 500940 -2794870
8561b794870n013308N56339N137428K337580l108412l964458j079297N50469P24068
$$ -2794870 -7808178 -7251839 -2114411 223169 -2885243 -6849701 -7928998 -7378529 -6654461
8552f654461K388479M637924L922483N16395j731571j282512j77344r7508p60218
$$ -6654461 -4265982 371942 4294425 4810820 3079249 1796737 1619393 1521885 761667
8543G61667j568126j942109r83202Q30508J276454l4415k43900J884537K932052
$$ 761667 -806459 -2748568 -3731770 -2901262 -1624808 -1659223 -1903123 -18586 2913466
8534B913466L45599k475994j420754J267704J018772p78910M85980L560686K999712
$$ 2913466 3259065 783071 -637683 630021 1648793 869883 1355863 4916549 7916261
8525G916261o77213j181587K198188K442834l113817p198309l885113K036533
$$ 7916261 7239048 6057461 8255649 10698483 7584666 386357 -3498756 -1462223
8517a462223L027114n5834j551134p35680o24770p95962R29476K242448m11107
$$ -1462223 1564891 1509057 -42077 -777757 -1402527 -2198489 -1269013 973435 562328
8508E62328l944149k018062M085087O083703J170057l907608l452532k46423J029493
$$ 562328 -3381821 -5399883 -1314796 4768907 5938964 2031356 -1421176 -1667599 -638106
8499f38106J223724K880338M222864K393347r09382k212073j941829k379166k408752
$$ -638106 585618 3465956 7688820 10082167 9172785 6960712 5018883 2639717 230965
8490B30965K16695L020462J291057l650770m655218J070873O912094N055169l348584
$$ 230965 447660 3468122 4759179 1108409 -3546809 -2475936 4436158 9491327 6142743
8481F142743r569736p479985L64226O471318O250316J636801k117374k293877
$$ 6142743 -3426993 -10906978 -10542752 -4071434 2178882 3815683 1698309 -595568
8473e95568p43855l53304j132777j133790n253N99860j23906j082015j302614
$$ -595568 -1339423 -1692727 -2825504 -3959294 -3964547 -3364687 -3488593 -4570608 -5873222
8464e873222j004462k62623J295623K740175J990245q83852k407908J77307M652805
$$ -5873222 -6877684 -7140307 -5844684 -3104509 -1114264 -1998116 -4406024 -4228717 424088
8455D24088O028297K873084p85002p76568J648726J508390k933063p136879n789556
$$ 424088 6452385 9325469 8540467 7763899 9412625 10921015 7987952 851073 -4938483
8446d938483O7716M139630L049843J29166l76955N61193l22511k173984j346656
$$ -4938483 -4870767 -731137 2318706 2447872 2070917 2632110 2309599 135615 -1211041
8437a211041J745363K451292n51161k612555l88134K665587J629826k337930m031944
$$ -1211041 534322 2985614 2434453 -178102 -566236 2099351 3729177 1391247 -2640697
8428b640697j749009J456250L003341L115059K180264k15163k999519l749965
$$ -2640697 -4389706 -2933456 69885 3184944 5365208 5150045 2150526 -1599439
8420a599439k198304q88070j308628j918750j132853K85854J251473K252932L332797
$$ -1599439 -3797743 -4685813 -5994441 -7913191 -9046044 -8760190 -7508717 -5255785 -1922988
8411a922988K597324o31616l118713j455136K606491M151974K118573L95415J251005
$$ -1922988 674336 42720 -3075993 -4531129 -1924638 2227336 4345909 4741324 5992329
8402E992329J840960n31581l343901k631846O00006J976568M94265q06361n67905
$$ 5992329 7833289 7301708 3957807 1325961 1925967 3902535 4396800 3590439 3022534
8393C022534p68932j939145j577193P69204J492177j053110k803619k94830L009011
$$ 3022534 2253602 314457 -1262736 -493532 998645 -54465 -2858084 -3152914 -143903
8384a43903J849461k064844k499169J328225L597904J124975k231130k099627
$$ -143903 1705558 -359286 -2858455 -1530230 2067674 3192649 961519 -1138108
8376a138108M90013K095503J746091M14736j118969j754838m00416J445100O28130
$$ -1138108 -648095 1447408 3193499 3608235 2489266 734428 334012 1779112 2407242
8367B407242k460497l293890o642L092649J830441j566973k254330N0208J795548
$$ 2407242 -53255 -3347145 -3353787 -261138 1569303 2330 -2252000 -2201792 -406244
8358d06244J528679R65899J191861J364337P25388p11075k728154m142899k957395
$$ -406244 1122435 2088334 3280195 4644532 5369920 4658845 1930691 -2212208 -5169603
8349e169603N58624K842549J611955o57069p02016N10274M68386M88427L426351
$$ -5169603 -4610979 -1768430 -156475 -813544 -1515560 -1005286 -536900 -48473 3377878
8340C377878P127229N717600j727508q437628p868097j346572M190385M186701
$$ 3377878 10505107 16222707 14495199 6057571 -1810526 -3157098 1033287 5219988
8332E219988L96636k289948j520509M86894N06882j239586k010492j263684j177985
$$ 5219988 5616624 3326676 1806167 2293061 2799943 1560357 -450135 -1713819 -2891804
8323b891804k023061j140109J724679K531592n67373l130922r19634L307692M284821
$$ -2891804 -4914865 -6054974 -4330295 -1798703 -2366076 -5496998 -6416632 -3108940 1175881
8314A175881K181057P21524L52972p71980j466858L57802K090395k53523m394526
$$ 1175881 3356938 4078462 4431434 3659454 2192596 2550398 4640793 4387270 -7256
8305g256m557303j044074M62567j058832o93208K787522M279538J482034j122658
$$ -7256 -4564559 -5608633 -5146066 -6204898 -6898106 -4110584 168954 1650988 528330
8296E28330m59728K44512j525502k465777J47769K870388J795894j074142j918608
$$ 528330 68602 313114 -1212388 -3678165 -3530396 -660008 1135886 61744 -1856864
8287a856864j191533j028444n78928J444203L063506K277287Q32658P98594O76121
$$ -1856864 -3048397 -4076841 -4655769 -3211566 -148060 2129227 2961885 3760479 4436600
8278D436600j164012k617869j543080L5436l89556j251500l61851M95424q67646
$$ 4436600 3272588 654719 -888361 -852925 -1242481 -2493981 -2855832 -2360408 -3228054
8269c228054k141710k95358K645613K893132J351838J274943J857759J01002k729490
$$ -3228054 -5369764 -5665122 -3019509 -126377 1225461 2500404 4358163 4459165 1729675
8260A729675k630203K17509J905051J416134J058648R28072j021860l480681k561405
$$ 1729675 -900528 -683019 1222032 2638166 3696814 4624886 3603026 122345 -2439060
8251b439060J244449K912451R75108j31617K088763L625427N25707m440169n621045
$$ -2439060 -1194611 1717840 2692948 2561331 4650094 8275521 8801228 4361059 -1259986
8242a259986k130769J950032L264453K056699L11074o53993r09425j307788k005579
$$ -1259986 -3390755 -1440723 1823730 3880429 4191503 3537510 2628085 1320297 -685282
8233f85282j814836p0142J548828J077202l69565J3098K033446K383681j09990
$$ -685282 -2500118 -2570260 -1021432 55770 -313795 -300697 1732749 4116430 4006440
8224D006440k345428j576124N89647R31083o61531j536254k39907J908614K764660
$$ 4006440 1661012 84888 674535 1605618 944087 -592167 -832074 1076540 3841200
8215C841200J453167j230824l505329l797115j896579R94608L321625M027711
$$ 3841200 5294367 4063543 558214 -3238901 -5135480 -4140872 -819247 3208464
8207C208464K768873J59616k244419l054005k309111j183918n65991l72479p35
$$ 3208464 5977337 6136953 3892534 838529 -1470582 -2654500 -3220491 -3592970 -3593705
8198c593705R67958K216787K729512K016475J159881J371338J669046O9738k657532
$$ -3593705 -2625747 -408960 2320552 4337027 5496908 6868246 8537292 8607030 5949498
8189E949498l223321q47580J053161O1079j595058j251159l86911j314258k262402
$$ 5949498 2726177 1878597 2931758 2992837 1397779 146620 -240291 -1554549 -3816951
8180c816951m82990J990115J188081j513695j042517K658229M000261R78814j367555
$$ -3816951 -4299941 -2309826 -1121745 -2635440 -3677957 -1019728 2980533 3959347 2591792
8171B591792O42356L261701J615334k538988m106065k448490q88498n28411L41480
$$ 2591792 3234148 6495849 8111183 5572195 1466130 -982360 -1870858 -2399269 -2057789
8162b057789J600884J015511j139018j578005O28912J875661p50871m769736n399428
$$ -2057789 -456905 558606 -580412 -2158417 -1529505 346156 -404715 -5174451 -10573879
8153a0573879j807749K283852L603062K547069J297773Q89061J051479J392983
$$ -10573879 -12381628 -10097776 -6494714 -3947645 -2649872 -1760811 -709332 683651
8145F83651J424739L85701j634788l096568k850042j889778j712039j633044R4255
$$ 683651 2108390 2494091 859303 -2237265 -5087307 -6977085 -8689124 -10322168 -10227913
8136a0227913K765521L465542J389372n77071K26109K774085M137251L039615
$$ -10227913 -7462392 -3996850 -2607478 -3184549 -2958440 -184355 3952896 6992511
8128F992511M27249k009348k888450k160745j595260k456981k792173N893L881790
$$ 6992511 7419760 5410412 2521962 361217 -1234043 -3691024 -6483197 -6477304 -2595514
8119b595514L759955l24138j999052J743788N058293J988191m121033n894389
$$ -2595514 1164441 840303 -1158749 585039 5643332 7631523 3510490 -2383899
8111b383899k880472m64398m64911j52120P92465j01790j836884p25924K175647
$$ -2383899 -5264371 -5728769 -6193680 -6345800 -5553335 -5655125 -7492009 -8217933 -6042286
8102f042286J851421j442086j511533L061255N459905J543528l170765k462821
$$ -6042286 -4190865 -5632951 -7144484 -4083229 1376676 2920204 -250561 -2713382
8094b713382J036955J300490j219786j897761m38479j23026q13297M90688L093504
$$ -2713382 -1676427 -375937 -1595723 -3493484 -3931963 -4054989 -4868286 -4377598 -1284094
8085a284094K984772j02328j751890k1516J441963o77686m249530m939682j995390
$$ -1284094 1700678 1598350 -153540 -175056 1266907 589221 -3660309 -8599991 -10595381
8076a0595381J616360L395495L492644L118637K410005O00002k024663l363555
$$ -10595381 -8979021 -5583526 -2090882 1027755 3437760 4037762 2013099 -1350456
8068a350456j755757J362259K681556J198556o02229m65621O13155L86221j175889
$$ -1350456 -3106213 -1743954 937602 2136158 1533929 1068308 1681463 2067684 891795
8059H91795k039514q85042J502235L116710K539040N86972r4192J457157K176682
$$ 891795 -1147719 -2032761 -530526 2586184 5125224 5712196 5618004 7075161 9251843
8050I251843j095194n798970n853862m26821M095930K980971n43682j083652R50575
$$ 9251843 8156649 2357679 -3496183 -3923004 172926 3153897 2610215 1526563 2477138
8041B477138J466448m01832k241588k973780k953300j373839J869649L536417
$$ 2477138 3943586 3541754 1300166 -1673614 -4626914 -6000753 -4131104 -594687
8033e94687J088047k245011j615568J701859K490905L31326n19525L71923j175978
$$ -594687 493360 -1751651 -3367219 -1665360 825545 1156871 637346 1009269 -166709
8024a66709n053790n046160J018760O520877N745073J877916J91586o18835l681982
$$ -166709 -5220499 -10266659 -9247899 -2727022 3018051 4895967 5087553 4468718 786736
8015G86736n754006k025192M037044M462307p55322l624305r12023J739644M69151
$$ 786736 -4967270 -6992462 -2955418 1506889 751567 -2872738 -3784761 -2045117 -1575966
8006a575966n56560K250725M463822R42760m798265n486370r90288K570066K487598
$$ -1575966 -2132526 118199 4582021 5524781 726516 -4759854 -5750142 -3180076 -692478
7997f92478J253149k03134l494885o411563l309469N232740R886507M418331m920413
$$ -692478 560671 357537 -3137348 -9548911 -12858380 -7625640 2260867 6679198 1758785
7988A758785p375604j626892M209212M442174J296220j163608k408321l149066
$$ 1758785 -5616819 -7243711 -3034499 1407675 2703895 1540287 -868034 -4017100
7980d017100k563777l83248J520182J846176J576276J345237P7943j840000j378128
$$ -4017100 -6580877 -6964125 -5443943 -3597767 -2021491 -676254 -598311 -2438311 -3816439
7971c816439K266118M688140K051598k497881k878787P86390K415489n26335l322849
$$ -3816439 -1550321 3137819 5189417 2691536 -187251 599139 3014628 2488293 -834556
7962h34556j715079J644638J905378n23050j664714r20493j357865l505390l618988
$$ -834556 -2549635 -904997 1000381 477331 -1187383 -2107876 -3465741 -6971131 -10590119
7953a0590119M98056N424668O069294J815315l097614m288500j159756L003603
$$ -10590119 -10092063 -4667395 1401899 3217214 119600 -4168900 -5328656 -2325053
7945b325053M091901J178534k273827k435489j37002M44394j637458k272518J153462
$$ -2325053 1766848 2945382 671555 -1763934 -1900936 -1456542 -3094000 -5366518 -4213056
7936d213056M856357L803535n96185k353285M62892L447082K614935o12986k571731
$$ -4213056 643301 4446836 3850651 1497366 1960258 5407340 8022275 7409289 4837558
7927D837558k314764j520829j504859k012805j896442k58987K120030K842377
$$ 4837558 2522794 1001965 -502894 -2515699 -4412141 -4671128 -2551098 291279
7919B91279J018051n65970R12996L414701K572155j249211l121901j317232L49050
$$ 291279 1309330 743360 1656356 5071057 7643212 6394001 3272100 1954868 2303918
7910B303918n09287j102348N55318J481053m72959j828111M85292K958663J350405
$$ 2303918 1794631 692283 1247601 2728654 2255695 427584 912876 3871539 5221944
7901E221944j364784M8442L282229J731221m008264o409546k895244R00659J160364
$$ 5221944 3857160 3905602 7187831 8919052 4910788 -1498758 -4394002 -3493343 -2332979
7892b332979J016523K838462L082561p26132m299852l225462k49086k38528j909222
$$ -2332979 -1316456 1522006 4604567 3878435 -421417 -3646879 -3895965 -4134493 -6043715
7883f043715p56882K564377L310107Q17286o60757O18727J375580m62183k040442
$$ -6043715 -6800597 -4236220 -926113 -108827 -769584 -150857 1224723 762540 -1277902
7874a277902o20262J528574P21856k026945k410576M06179K408001J069680n60063
$$ -1277902 -1898164 -369590 352266 -1674679 -4085255 -3679076 -1271075 -201395 -761458
7865g61458J106434L732668K191292k603399l708184J185604M858688Q39620o066751
$$ -761458 344976 4077644 6268936 3665537 -42647 1142957 6001645 6841265 774514
7856G74514o256754L01142M316822J650898j203419J159422M050215J016652m931660
$$ 774514 -5482240 -5181098 -864276 786622 -416797 742625 4792840 5809492 877832
$$ [...]
##END NTUPLES=NMR SPECTRUM
##END=
