##TITLE=31Pdec_DMAA0812
 , 24 sc
 9.12.2021
##JCAMPDX= 6.0         $$ Bruker NMR JCAMP-DX V2.0
##DATA TYPE= NMR SPECTRUM
##DATA CLASS= NTUPLES
##ORIGIN= UXNMR, Bruker Analytische Messtechnik GmbH
##OWNER= root
$$ XWIN-NMR		Version 3.5
$$ Thu Dec  9 11:31:08 2021 Russian Standard Time (UT+4h)  she@DPX200
##.OBSERVE FREQUENCY= 81.013821
##.OBSERVE NUCLEUS= ^31P
##.ACQUISITION MODE= SIMULTANEOUS
##.ACQUISITION SCHEME= undefined
##.AVERAGES= 124
##.DIGITISER RES= 16
##SPECTROMETER/DATA SYSTEM= spect
##.PULSE SEQUENCE= zgpg30
##.SOLVENT NAME= CDCl3
##.SHIFT REFERENCE= (INTERNAL, CDCl3, 0, 248.564)
##AUDIT TRAIL= $$ (NUMBER, WHEN, WHO, WHERE, WHAT)
$$ ##TITLE= Audit trail, XWIN-NMR		Version 3.5
$$ ##JCAMPDX= 5.01
$$ ##ORIGIN= Bruker BioSpin GmbH
$$ ##OWNER= she
$$ F:/spectra/data/she/nmr/P31/1/pdata/1/auditp.txt
$$ ##AUDIT TRAIL=  $$ (NUMBER, WHEN, WHO, WHERE, WHAT)
(   1,<2021-12-09 11:30:00.18 +0400>,<she>,<DPX200>,
      <continue with go, POWCHK disabled, PULCHK disabled
       configuration hash MD5:
       00 E9 B6 7A A2 85 ED C7 34 08 36 98 17 FE 4E 26
       data hash MD5: 32K
       F6 E3 2E E8 4B 18 F7 64 49 F7 58 08 94 BF 02 38>)
(   2,<2021-12-09 11:30:02.85 +0400>,<she>,<DPX200>,
      <Start of raw data processing
       efp BC_mod = 2 LB = 1 FT_mod = 6 PKNL = 1 PHC0 = -8863.316 PHC1 = -471.9306 SI = 64K 
       data hash MD5: 64K
       16 5B 78 D5 3E E9 92 2D 3D 1D 64 B0 7A 14 5D 52>)
(   3,<2021-12-09 11:30:35.09 +0400>,<she>,<DPX200>,
      <pk PHC0 = -139.7292 PHC1 = 189.4001 
       data hash MD5: 64K
       4B B6 5E 2E 19 25 4E 1F 74 BC FE B0 38 DA 19 7B>)
(   4,<2021-12-09 11:30:38.79 +0400>,<she>,<DPX200>,
      <abs ABSG = 5 
       data hash MD5: 64K
       12 F6 B4 A2 47 57 DF 73 45 0C A1 1B 05 CE 1F ED>)
$$ ##END=
$$ 
$$ hash MD5
$$ AC 7E 0D A2 8F D8 73 60 01 F2 2F 2C 98 1B 8E 33
##$RELAX= 
##$RELAX= 
##$RELAX= 
##$RELAX= 
##$RELAX= 
##$RELAX= 
##$RELAX= 
##$RELAX= 
$$ Bruker specific parameters
$$ --------------------------
##$DU= <F:/spectra>
##$EXPNO= 1
##$NAME= <P31>
##$PROCNO= 1
##$TYPE= <nmr>
##$USER= <she>
##$AMP= (0..31)
100 100 100 100 100 100 100 100 100 100 100 100 100 100 100 100 100 100 
100 100 100 100 100 100 100 100 100 100 100 100 100 100 
##$AQSEQ= 0
##$AQ_mod= 1
##$AUNM= <au_zg>
##$AUTOPOS= <>
##$BF1= 81.014009
##$BF2= 200.13
##$BF3= 200.13
##$BF4= 200.13
##$BF5= 200.13
##$BF6= 200.13
##$BF7= 200.13
##$BF8= 200.13
##$BYTORDA= 1
##$CFDGTYP= 0
##$CFRGTYP= 5
##$CHEMSTR= <none>
##$CNST= (0..31)
1 1 145 1 1 1 1 1 1 1 1 1 1 1 1 1 1 1 1 1 1 1 1 1 1 1 1 1 1 1 1 1 
##$CPDPRG= <waltz16>
##$CPDPRG1= <>
##$CPDPRG2= <waltz16>
##$CPDPRG3= <>
##$CPDPRG4= <mlev>
##$CPDPRG5= <mlev>
##$CPDPRG6= <mlev>
##$CPDPRG7= <mlev>
##$CPDPRG8= <mlev>
##$CPDPRGB= <>
##$CPDPRGT= <>
##$D= (0..31)
0 1 0 0 0 0 0 0 0 0 0 0.03 2e-05 3e-06 0 0 0 0 0 0 0 0 0 0 0 0 0 0 0 0 
0 0 
##$DATE= 1639034796
##$DBL= (0..7)
120 120 120 11 120 120 24 19 
##$DBP= (0..7)
150 150 150 150 150 150 150 150 
##$DBP07= 0
##$DBPNAM0= <>
##$DBPNAM1= <>
##$DBPNAM2= <>
$$ [...]
##$SUBNAM3= <"">
##$SUBNAM4= <"">
##$SUBNAM5= <"">
##$SUBNAM6= <"">
##$SUBNAM7= <"">
##$SUBNAM8= <"">
##$SUBNAM9= <"">
##$SW= 501.771253377433
##$SWIBOX= (0..15)
0 1 3 0 0 0 0 0 0 0 0 0 0 0 0 0 
##$SW_h= 40650.406504065
##$TD= 32768
##$TD0= 1
##$TE= 0
##$TE2= 300
##$TE3= 300
##$TEG= 300
##$TL= (0..7)
0 120 53 12 22 120 120 120 
##$TP= (0..7)
150 150 150 150 150 150 150 150 
##$TP07= 0
##$TPNAME0= <>
##$TPNAME1= <>
##$TPNAME2= <>
##$TPNAME3= <>
##$TPNAME4= <>
##$TPNAME5= <>
##$TPNAME6= <>
##$TPNAME7= <>
##$TPOAL= (0..7)
0.5 0.5 0.5 0.5 0.5 0.5 0.5 0.5 
##$TPOFFS= (0..7)
0 0 0 0 0 0 0 0 
##$TUNHIN= 0
##$TUNHOUT= 0
##$TUNXOUT= 0
##$USERA1= <user>
##$USERA2= <user>
##$USERA3= <user>
##$USERA4= <user>
##$USERA5= <user>
##$V9= 5
##$VALIST= <valist>
##$VCLIST= <CCCCCCCCCCCCCCC>
##$VD= 0
##$VDLIST= <DDDDDDDDDDDDDDD>
##$VPLIST= <PPPPPPPPPPPPPPP>
##$VTLIST= <TTTTTTTTTTTTTTT>
##$WBST= 1024
##$WBSW= 4
##$XGAIN= (0..3)
0 0 0 0 
##$XL= 0
##$YL= 0
##$YMAX_a= 2189
##$YMIN_a= -11718
##$ZGOPTNS= <>
##$ZL1= 120
##$ZL2= 120
##$ZL3= 120
##$ZL4= 120
##$ABSF1= 248.5645
##$ABSF2= -253.2056
##$ABSG= 5
##$ABSL= 3
##$ALPHA= 0
##$AQORDER= 0
##$ASSFAC= 0
##$ASSFACI= 0
##$ASSFACX= 0
##$ASSWID= 0
##$AUNMP= <proc_1d>
##$AZFE= 0.1
##$AZFW= 0.5
##$BCFW= 0
##$BC_mod= 2
##$BYTORDP= 0
##$COROFFS= 0
##$CY= -3
##$DATMOD= 1
##$DC= 0
##$DFILT= <>
##$DTYPP= 0
##$F1P= 0
##$F2P= 0
##$FCOR= 1
##$FTSIZE= 65536
##$FT_mod= 6
##$GAMMA= 0
##$GB= 0
##$INTBC= 1
##$INTSCL= 5.30512e-09
##$ISEN= 30
##$LB= 1
##$LEV0= 0
##$LPBIN= 0
##$MAXI= 10000
##$MC2= 0
##$MEAN= 0
##$ME_mod= 0
##$MI= 50
##$NCOEF= 0
##$NC_proc= -9
##$NLEV= 6
##$NOISF1= 182.463
##$NOISF2= 159.3651
##$NSP= 0
##$NTH_PI= 0
##$NZP= 0
##$OFFSET= 248.5645
##$PC= 4
##$PHC0= -9003.046
##$PHC1= -282.5305
##$PH_mod= 1
##$PKNL= yes
##$PPARMOD= 0
##$PSCAL= 0
##$PSIGN= 0
##$REVERSE= no
##$SF= 81.014009
##$SI= 65536
##$SIGF1= 159.3651
##$SIGF2= -187.1042
##$SINO= 113.3802
##$SIOLD= 16384
##$SREGLST= <1H.CDCl3>
##$SSB= 0
##$STSI= 65536
##$STSR= 0
##$SW_p= 40650.406504065
##$SYMM= 0
##$S_DEV= 0
##$TDeff= 32768
##$TDoff= 0
##$TI= <>
##$TILT= no
##$TM1= 0
##$TM2= 0
##$TOPLEV= 0
##$USERP1= <user>
##$USERP2= <user>
##$USERP3= <user>
##$USERP4= <user>
##$USERP5= <user>
##$WDW= 1
##$XDIM= 65536
##$YMAX_p= 553110403
##$YMIN_p= -234035902
$$ End of Bruker specific parameters
$$ ---------------------------------
##NTUPLES= NMR SPECTRUM
##VAR_NAME=  FREQUENCY,     SPECTRUM/REAL,   SPECTRUM/IMAG
##SYMBOL=    X,             R,               I
##VAR_TYPE=  INDEPENDENT,   DEPENDENT,       DEPENDENT
##VAR_FORM=  AFFN,          ASDF,            ASDF
##VAR_DIM=   65536,         65536,           65536
##UNITS=     HZ,            ARBITRARY UNITS, ARBITRARY UNITS
##FACTOR=    0.620285442955139, 1,           1
##FIRST=     20137.2065510759, 0,            0
##LAST=      -20513.1999529892, 0,           0
##MIN=       -20513.1999529892, -234035902,  0
##MAX=       20137.2065510759, 553110403,    0
$$ Real data points
##PAGE= N=1
##DATA TABLE= (X++(R..R)), XYDATA
$$ [...]
##PAGE= N=2
##DATA TABLE= (X++(I..I)), XYDATA
$$ plain form
12823 -18729599 -19498280 -11405541 1134655 9946783 8987615 -526417 -11094676 -16311625
12815 -16311625 -14718988 -5019518 15107199 38386019 44341155 20880218 -13080336
12808 -13080336 -23582413 -3099784 20629880 23436135 14670535 16179523 26990320
12801 26990320 27715626 12414044 -2717004 -1364944 15975438 36603840 46174713 36405695
12793 36405695 13105452 -4899375 -4508562 6626966 13167378 14418099 19940106 27564680
12785 27564680 23882043 7521901 -5474850 -4347487 2886987 4617547 1836334 2549681
12777 2549681 10186160 23292031 37835469 45939878 42251807 34783947 37578958 48480755
12769 48480755 48090355 27811795 4483149 -3617600 -2199922 -8129569 -21139426 -25428251
$$ packed form
12823a8729599p68681Q092739J2540196Q812128r59168r514032j0568259n216949
12815a6311625J592637R699470K0126717K3278820N955136k3460937l3960554
12808a3080336j0502077K0482629K3729664K806255q765600J508988J0810797
12801B6990320P25306j5301582j5131048J352060J7340382K0628402R570873r769018
12793C6405695k3300243j8004827L90813J1135528O540412J250721N522007P624574
12785B7564680l682637j6360142j2996751J127363P234474J730560k781213P13347
12777B549681P636479J3105871J4543438Q104409l688071p467860K795011J0901797
12769D8480755l90400k0278560k3328646q100749J417678n929647j3009857m288825
$$ plain form
12761 -25428251 -15051520 -1111273 6738082 11790549 19590418 26742406 26995605 22669379
12753 22669379 23360693 33952331 47423209 50921471 38371083 15922961 -4592345
12746 -4592345 -14472471 -10125339 6472734 23464172 22379531 -3136378 -34859549 -47646707
12738 -47646707 -37665839 -21378793 -10100671 -2170703 1501830 -3616833 -7003785 12010046
12730 12010046 48808281 66014471 39651172 -5925334 -30198822 -27211192 -19236158
12723 -19236158 -13384221 3632479 30652192 43637847 29421172 4604067 -8253420
12716 -8253420 -5462110 4561285 16234065 25574556 27473318 23739370 23893390 30793684
12708 30793684 35085021 30060665 22031011 19397194 21040818 22518122 24724890 28670395
$$ packed form
12761b5428251J0376731J3940247P849355N052467P799869P151988K53199m326226
12753B2669379O91314J0591638J3470878L498262j2550388k2448122k0515306
12746d592345r880126M347132J6598073J6991438j084641k5515909l1723171j2787158
12738d7646707R980868J6287046J1278122P929968L672533n118663l386952J9013831
12730A2010046L6798235J7206190k6363299m5576506k4273488K987630P975034
12723a9236158N851937J7016700K7019713J2985655j4216675k4817105j2857487
12716h253420K791310J0023395J1672780R340491J898762l733948J54020O900294
12708C0793684M291337n024356q029654k633817J643624J477304K206768L945505
$$ plain form
12700 28670395 29221472 21866762 10140232 204201 -6664243 -11532210 -14034223 -15702634
12692 -15702634 -20253814 -25735152 -23590220 -10823403 4407980 15040341 24370931 35377481
12684 35377481 39715578 29224125 13124550 10179558 23972856 37994511 38215126 30019236
12676 30019236 26077791 25195188 14754059 -5975029 -17219299 -2670632 24265750
12669 24265750 32725345 14270001 -5619124 -4723821 3538970 -6883819 -30754999 -36590099
12661 -36590099 -13852411 12648934 22384103 26057771 37931529 45480256 30441766
12654 30441766 3817222 -7882972 -3310212 -4851871 -17630439 -18267175 7957569 42749658
12646 42749658 60721019 61285219 58641490 53951595 37806368 14520634 3244946 11799927
$$ packed form
12700B8670395N51077p354710j1726530r936031o868444m867967k502013j668411
12692a5702634m551180n481338K144932J2766817J5231383J0632361R330590J1006550
12684C5377481M338097j0491453j6099575k944992J3793298J4021655K20615q195890
12676C0019236l941445q82603j0441129k0729088j1244270J4548667K6936382
12669B4265750Q459595j8455344j9889125Q95303Q262791j0422789k3871180n835100
12661c6590099K2737688K6501345R735169L673668J1873758P548727j5038490
12654C0441766k6624544j1700194M572760j541659j2778568o36736K6224744L4792089
12646D2749658J7971361N64200k643729m689895j6145227k3285734j1275688Q554981
$$ plain form
12638 11799927 24931521 25697660 17622949 16223931 25384208 33554061 32109147 27032862
12630 27032862 29399424 41742077 57791925 69332943 68665291 51161988 22943748
12623 22943748 999536 -2912529 5337776 14325822 25210908 44042826 60574073
12616 60574073 54884226 28180478 6379007 3687992 1946398 -18722881 -45176152
12609 -45176152 -47975775 -23169725 4412628 15424860 13099314 7449312 2786447 3556966
12601 3556966 14020207 26668294 26609408 13232864 3063739 5221378 8939685 3164082
12593 3164082 -6125841 -8358321 -5026555 -1948254 3729471 15010238 22576035 16164776
12585 16164776 2937553 -517405 8168044 15358368 12245254 4323609 -631816 -1779079
$$ packed form
12638A1799927J3131594P66139q074711j399018R160277Q169853j444914n076285
12630B7032862K366562J2342653J6049848J1541018o67652j7503303k8218240
12623B2943748k1944212l912065Q250305Q988046J0885086J8831918J6531247
12616F0574073n689847k6703748k1801471k691015j741594k0669279k6453271
12609d5176152k799623K4806050K7582353J1012232k325546n650002m662865P70519
12601C556966J0463241J2648087n8886j3376544j0169125K157639L718307n775603
12593C164082r289923k232480L331766L078301N677725J1280767P565797o411259
12585A6164776j3227223l454958Q685449P190324l113114p921645m955425j147263
$$ plain form
12577 -1779079 81868 6140115 13836236 16072987 10580332 3590379 524411 -1267874
12569 -1267874 -6914446 -15843679 -22498922 -21973036 -12988202 1781360 17254261 29998064
12561 29998064 39763390 44529923 38420236 21179211 5587779 5035662 15059798 18687115
12553 18687115 10227369 521565 -3624227 -9456975 -20772282 -25889459 -15068495 2256900
12545 2256900 11508440 14268671 20372806 27424157 26048591 19642881 19232976 21537142
12537 21537142 13012404 -4221976 -12752625 -9591805 -11791277 -24107113 -25782841 -5144378
12529 -5144378 14765724 7597439 -15048995 -19648941 820934 20963625 22609869 14642712
12521 14642712 10518140 9548096 8266228 11227815 20318592 27384381 26361799 20990568
$$ packed form
12577a779079J860947O058247P696121K236751n492655o989953l065968j792285
12569a267874n646572q929233o655243N25886Q984834J4769562J5472901J2743803
12561B9998064R765326M766533o109687j7241025j5591432n52117J0024136L627317
12553A8687115q459746r705804m145792n832748j1315307n117177J0820964J7325395
12545B256900R251540K760231O104135P051351j375566o405710m09905K304166
12537B1537142q524738j7234380q530649L160820k199472j2315836j675728K0638463
12529e144378J9910102p168285k2646434m599946K0469875K0142691J646244p967157
12521A4642712m124572r70044j281868K961587R090777P065789j022582n371231
$$ plain form
12513 20990568 14118483 3035643 -7112941 -983216 23742139 44252771 39207415
12506 39207415 18189645 8718802 20275268 37536860 45681738 45329032 41646490 34056792
12498 34056792 21350131 6077872 -10244811 -27129705 -37197366 -28994106 -4619981
12491 -4619981 13858146 6105948 -20374824 -35049881 -18399008 14183335 28554817
12484 28554817 11187382 -14982232 -18863105 1278303 19684715 20030072 14319810 19035270
12476 19035270 28465320 26279343 13574157 7244850 13500773 20116663 16450526 6776863
12468 6776863 669586 2395967 12784393 29590108 42745364 41730102 31755572 29203212
12460 29203212 35382495 30171852 1955641 -30592458 -41757216 -33299707 -27756149 -32805252
$$ packed form
12513B0990568o872085j1082840j0148584O129725K4725355K0510632n045356
12506C9207415k1017770r470843J1556466J7261592Q144878l52706l682542p589698
12498C4056792j2706661j5272259j6322683j6884894j0067661Q203260K4374125
12491d619981J8478127p752198k6480772j4675057J6650873L2582343J4371482
12484B8554817j7367435k6169614l880873K0141408J8406412L45357n710262M715460
12476A9035270R430050k185977j2705186o329307O255923O615890l666137r673663
12468F776863o107277J726381J0388426J6805715J3155256j015262r974530k552360
12460B9203212O179283n210643k8216211l2548099j1164758Q457509N543558n049103
$$ plain form
12452 -32805252 -31736654 -10621899 21406755 44044163 46223652 30030747 4860386
12445 4860386 -16253373 -22778403 -15953069 -7137132 -3313641 -406955 5728249 10303928
12437 10303928 8299018 4725320 7069995 12497943 12775144 9028121 10172002 16434820
12429 16434820 16200203 3485817 -11213103 -14504902 -7739314 -3017580 -5633503 -9019195
12421 -9019195 -6348082 68682 2506334 -3245751 -13752431 -20585250 -17971548 -9641829
12413 -9641829 -5231409 -7423675 -7968415 -1417201 4482180 1968337 287751 13932269
12405 13932269 35660516 40212684 20166172 40661 3843849 23446845 33252544
12398 33252544 24594402 9653627 184910 -217827 10995374 31210285 44003873 33388721
$$ packed form
12452c2805252J068598K1114755L2028654K2637408K179489j6192905k5170361
12445D860386k1113759o525030O825334Q815937L823491K906686O135204M575679
12437A0303928k004910l573698K344675N427948K77201l747023J143881O262818
12429A6434820k34617j2714386j4698920l291799O765588M721734k615923l385692
12421i019195K671113O416764K437652n752085j0506680o832819K613702Q329719
12413i641829M410420k192266n44740O551214N899381k513843j680586J3644518
12405A3932269K1728247M552168k0046512k0125511L803188J9602996R805699
12398C3252544q658142j4940775r468717m02737J1213201K0214911J2793588j0615152
$$ plain form
12390 33388721 7720878 -6913664 1246132 19154022 30768772 32423391 25358064
12383 25358064 12411576 6354688 21193274 47936726 59454025 48768659 40150573
12376 40150573 48305415 50930859 25002993 -9697709 -14288398 12397119 33045176
12369 33045176 25656227 6741573 -3564947 -9373594 -19673170 -26331836 -20064942 -11358470
12361 -11358470 -15239692 -24775690 -18677543 8545728 39560574 55844926 53182944 36402518
12353 36402518 12895835 -5076504 -4700878 11641686 22661602 11255961 -11640982
12346 -11640982 -18298492 -868876 16232420 8745631 -14368932 -25653469 -19769929
12339 -19769929 -17449474 -27571907 -30703193 -13268039 4422083 -3106877 -24593594
$$ packed form
12390C3388721k5667843j4634542Q159796J7907890J1614750J654619p065327
12383B5358064j2946488o056888J4838586K6743452J1517299j0685366q618086
12376D0150573Q154842K625444k5927866l4700702m590689K6685517K0648057
12369C3045176p388949j8914654j0306520n808647j0299576o658666O266894Q706472
12361a1358470l881222r535998O098147K7223271L1014846J6284352k661982j6780426
12353C6402518k3506683j7972339L75626J6342564J1019916j1405641k2896943
12346a1640982o657510J7429616J7101296p486789k3114563j1284537N883540
12339a9769929K320455j0122433l131286J7435154J7690122p528960k1486717
$$ plain form
12332 -24593594 -26425846 -2640715 18021640 15949640 3597867 -2755340 -7994765 -20601671
12324 -20601671 -30910537 -25375405 -9231862 2256524 5736224 7703409 8752730 5160930
12316 5160930 155566 -884433 -2042587 -10276886 -20896937 -22436629 -13207816 -1232312
12308 -1232312 9088178 18205196 22873779 19872788 15968511 19742041 24270602 13593242
12300 13593242 -11426919 -29306906 -25533774 -10079894 697217 7412877 20773512
12293 20773512 38227385 41614737 20332198 -11441952 -27028444 -16590171 626043
12286 626043 -1034727 -20169081 -27975452 -6584810 23985578 30481824 10455138 -6545700
12278 -6545700 -566344 15758833 21414107 16177030 13822858 18669546 23085152 22354132
$$ packed form
12332b4593594j832252K3785131K0662355k072000j2351773o353207n239425j2606906
12324b0601671j0308866N535132J6143543J1488386L479700J967185J049321l591800
12316E160930n005364j039999j158154q234299j0620051j539692R228813J1975504
12308a232312J0320490R117018M668583l000991l904277L773530M528561j0677360
12300A3593242k5020161j7879987L773132J5453880J0777111O715660J3360635
12293B0773512J7453873L387352k1282539l1774150j5586492J0438273J7216214
12286F26043j660770j9134354p806371K1390642L0570388O496246k0026686j7000838
12278f545700N979356J6325177N655274n237077k354172M846688M415606p31020
$$ plain form
12270 22354132 19721851 18616620 18533401 17963050 16335841 14557906 15697582 20608040
12262 20608040 21624387 9247461 -11008057 -19121766 -5865393 12322105 14698222
12255 14698222 3987541 -1084770 4794728 8373624 1843425 -4186599 2876079 19535280
12247 19535280 31334565 29367784 16909833 4740705 3071850 13169038 24262968
12240 24262968 23160664 8867019 -6384552 -11152563 -4756322 6363812 14679174 12902462
12232 12902462 -1281675 -17270339 -17108797 3230226 24384160 25038162 9604773 3539679
12224 3539679 19864085 40936732 40199440 15498860 -9068629 -13443861 -3363252 2436987
12216 2436987 -2481992 -9774732 -13850522 -17563702 -19083163 -8347308 14984064 32125378
$$ packed form
12270B2354132k632281j105231q3219n70351j627209j777935J139676M910458
12262B0608040J016347j2376926k0255518q113709J3256373J8187498K376117
12255A4698222j0710681n072311N879498L578896o530199o030024P062678J6659201
12247A9535280J1799285j966781j2457951j2169128j668855J0097188J1093930
12240B4262968j102304j4293645j5251571m768011O396241J1120134Q315362j776712
12232A2902462j4184137j5988664J61542K0339023K1153934O54002j5433389o065094
12224C539679J6324406K1072647p37292k4700580k4567489m375232J0080609N800239
12216B436987m918979p292740m075790l713180j519461J0735855K3331372J7141314
$$ plain form
12208 32125378 26318427 5864952 -7262689 -6474900 -3726248 -6995429 -11024426 -10859281
12200 -10859281 -8268806 -1680031 13865480 30884449 29985728 6345940 -17688995 -18547495
12192 -18547495 -9407 15947582 18352571 14976547 17196018 28663570 44402284
12185 44402284 52184565 41229177 18129772 4951003 10879378 17523151 7697303 -3813086
12177 -3813086 8772228 38011594 47654362 21992031 -15655323 -38953331 -46905703
12170 -46905703 -46508053 -33581150 -8891203 7260994 -1108960 -19892645 -23504652 -9864214
12162 -9864214 2836937 6541474 9676243 17026026 23356478 26888571 31812600 36393247
12154 36393247 33679452 24964266 18743602 16293054 12028747 6796265 4887657 -649560
$$ packed form
12208C2125378n806951k0453475j3127641P87789K748652l269181m028997J65145
12200a0859281K590475O588775J5545511J7018969q98721k3639788k4034935q58500
12192a8547495J8538088J5956989K404989l376024K219471J1467552J5738714
12185D4402284P782281j0955388k3099405j3178769N928375O643773r825848j1510389
12177c813086J2585314K9239366R642768k5662331l7647354k3298008p952372
12170d6905703L97650J2926903K4689947J6152197q369954j8783685l612007J3640438
12162i864214J2701151L704537L134769P349783O330452L532093M924029M580647
12154C6393247k713795q715186o220664k450548m264307n232482j908608n537217
$$ plain form
12146 -649560 -20049127 -42764996 -43779973 -20678288 -2360207 -9622285 -27759562 -33231907
12138 -33231907 -27809900 -25946968 -24313279 -9209931 14355601 26419724 22096075 15065791
12130 15065791 11874120 5717151 -1800511 3474348 22320389 32925184 20363629 -621359
12122 -621359 -6688474 1994024 5878761 -5025511 -20717252 -26471873 -17125492 2261477
12114 2261477 21233441 30731434 31364158 32395475 37830920 39321376 29807383 17334851
12106 17334851 14878914 21276681 24388405 20865091 19948628 27068322 35755992 38588348
12098 38588348 35540495 28068534 15551440 3055602 2615413 18145803 35501541 36826658
12090 36826658 21991343 7977458 7984316 17865840 24223669 21050784 15532537 18314946
$$ packed form
12146f49560j9399567k2715869j014977K3101685J8318081p262078j8137277n472345
12138c3231907N422007J862932J633689J5103348K3565532J2064123m323649p030284
12130A5065791l191671o156969p517662N274859J8846041J0604795j2561555k0984988
12122f21359o067115Q682498L884737j0904272j5691741n754621R346381J9386969
12114B261477J8971964R497993O32724J031317N435445J490456r513993j2472532
12106A7334851k455937O397767L111724l523314r16463P119694Q687670K832356
12098C8588348l047853p471961j2517094j2495838m40189J5530390J7355738J325117
12090C6826658j4835315j4013885O858R881524O357829l172885n518247K782409
$$ plain form
12082 18314946 29804022 38423902 34105768 20569403 9434764 4665764 1272172 -711811
12074 -711811 6907121 23543169 31031444 14125676 -15569418 -29348006 -14365945 14261735
12066 14261735 34193267 36526475 23877464 2432001 -15479961 -12657885 14827276
12059 14827276 45045926 49652345 26979580 4502047 4953981 20235910 25914575 13809533
12051 13809533 -879692 -3348985 1186093 -2439951 -14976636 -17374289 6780402 47225326
12043 47225326 72138862 60596934 26356666 3413272 8698338 26592932 32404694
12036 32404694 21559506 7625797 -432149 -4850238 -5048527 6283613 27204413 40375903
12028 40375903 33636115 17722667 11658118 16681968 17706619 7400715 -4877164 -8463480
$$ packed form
12082A8314946J1489076Q619880m318134j3536365j1134639m769000l393592j983983
12074g11811P618932J6636048P488275j6905768k9695094j3778588J4982061K8627680
12066A4261735J9931532K333208j2649011k1445463j7911962K822076K7485161
12059A4827276L0218650M606419k2672765k2477533M51934J5281929N678665j2105042
12051A3809533j4689225k469293M535078l626044j2536685k397653K4154691M0444924
12043D7225326K4913536j1541928l4240268k2943394N285066J7894594N811762
12036C2404694j0845188j3933709q057946m418089j98289J1332140K0920800J3171490
12028D0375903o739788j5913448o064549N023850J024651j0305904j2277879l586316
$$ plain form
12020 -8463480 -3548990 3963286 9073442 7049844 -3112143 -11725878 -5827527 12421747
12012 12421747 25495908 23234913 14325585 9464710 6307161 160020 -3739867 -1630989
12004 -1630989 -3324857 -16827589 -29812883 -24726030 -6214095 6464511 10516231 20156687
11996 20156687 35601398 37066801 17931274 328189 3466352 16074460 18320075
11989 18320075 14484865 20916220 32598326 28664178 8686190 -3172591 4572377 13282955
11981 13282955 5695047 -5318483 2082245 21728280 26436570 8958070 -6426156
11974 -6426156 545275 17428660 19735388 8389268 7028095 23868787 36821378 25434250
11966 25434250 1930498 -5798071 5972788 13461481 1750850 -15271964 -19233848
$$ packed form
12020h463480M914490P512276N110156k023598j0161987q613735N898351J8249274
12012A2421747J3074161k260995q909328m860875l157549o147141l899887K108878
12004a630989j693868j3502732j2985294N086853J8511935J2678606M051720R640456
11996B0156687J5444711J465403j9135527j7603085L138163J2608108K245615
11989A8320075l835210O431355J1682106l934148j9977988j1858781P744968Q710578
11981A3282955p587908j1013530P400728J9646035M708290j7478500j5384226
11974f426156O971431J6883385K306728j1346120j361173J6840692J2952591j1387128
11966B5434250k3503752p728569J1770859P488693j1710631j7022814l961884
$$ plain form
11959 -19233848 -14742563 -17703705 -26378208 -22353203 1300116 28712593 41241448 36793583
11951 36793583 24679949 11806112 1098189 -4056292 -2617853 511701 1165246 3643537
11943 3643537 13835529 25493244 23253783 3954134 -12923062 -5643894 21393039
11936 21393039 40822022 36680360 24158861 26217575 40315906 44130058 30474829
11929 30474829 16892613 16660771 20106479 15617299 11240167 18021750 25612818 16442503
11921 16442503 -3993206 -14782567 -13298911 -15234759 -20925903 -11095369 15856036 31759733
11913 31759733 19927282 2277442 3099961 8690288 -7431582 -35490950 -41199005 -20677260
11905 -20677260 -7521272 -20850944 -38966106 -36020988 -17066825 -816912 9046565
$$ packed form
11959a9233848M491285k961142q674503M025005K3653319K7412477J2528855m447865
11951C6793583j2113634j2873837j0707923n154481J438439L129554O53545K478291
11943C643537J0191992J1657715k239461j9299649j6877196P279168K7036933
11936B1393039J9428983m141662j2521499K058714J4098331L814152j3655229
11929C0474829j3582216k31842L445708m489180m377132O781583P591068r170315
11921A6442503k0435709j0789361J483656j935848n691144R830534K6951405J5903697
11913C1759733j1832451j7649840Q22519N590327j6121870k8059368n708055K0521745
11905b0677260J3155988j3329672j8115162K945118J8954163J6249913R863477
$$ plain form
11898 9046565 16023082 13244627 -3391339 -17048162 -8614434 12702594 19743475 6652549
11890 6652549 -3000870 9672198 34229331 46970813 39058994 21176993 8391410
11883 8391410 7021446 12116717 13909555 8791823 3448986 4740695 8973677 8213997
11875 8213997 3801755 3559008 7397608 7871943 5591290 10154786 21178701 22157037
11867 22157037 2684540 -23119747 -31757787 -18440332 169338 7726527 2775904
11860 2775904 -7036809 -15435989 -19444533 -16959057 -7132076 6773911 16159619 11504754
11852 11504754 -7975855 -29672249 -37966646 -30087080 -16331428 -5219768 2584053
11845 2584053 4917598 -3780672 -18373187 -20496274 -2429967 16741442 14266521 -3661809
$$ packed form
11898I046565O976517k778455j6635966j3656823Q433728K1317028P040881j3090926
11890F652549r653419J2673068K4557133J2741482p911819j7882001j2785583
11883H391410j369964N095271J792838n117732n342837J291709M232982p59680
11875H213997m412242k42747L838600M74335k280653M563496J1023915R78336
11867B2157037j9472497k5804287q638040J3317455J8609670P557189m950623
11860B775904r812713q399180m008544K485476R826981J3905987R385708m654865
11852A1504754j9480609k1696394q294397P879566J3755652J1111660P803821
11845B584053K333545q698270j4592515k123087J8066307J9171409k474921j7928330
$$ plain form
11837 -3661809 -9910998 5564404 24116885 27063819 18620388 13404227 15027186 16803993
11829 16803993 14708378 10259518 5536793 2013744 1000157 1628323 2045282 3514878
11821 3514878 7551928 9260690 2152995 -10110825 -17400199 -19114928 -22777727 -24510314
11813 -24510314 -9346528 20622769 37967003 25610259 4621807 5457847 23226852
11806 23226852 26678606 6324485 -13529740 -13062486 -1889716 2698270 732491 -310497
11798 -310497 -3549499 -14459057 -24493627 -18766215 3644164 28339361 42133494 42701248
11790 42701248 34691674 24159255 15690201 9641008 3083984 -4460210 -9858171 -12313356
11782 -12313356 -14459145 -15726858 -12782889 -9433593 -15539468 -30269579 -37581453 -26960222
$$ packed form
11837c661809o249189J5475402J8552481K946934q443431n216161J622959J776807
11829A6803993k095615m448860m722725l523049j013587O28166M16959J469596
11821C514878M037050J708762p107695j2263820p289374j714729l662799j732587
11813b4510314J5163786K9969297J7344234j2356744k0988452Q36040J7769005
11806B3226852L451754k0354121j9854225M67254J1172770M587986j965779j042988
11798c10497l239002j0909558j0034570N727412K2410379K4695197J3794133N67754
11790D2701248q009574j0532419q469054o049193o557024p544194n397961k455185
11782a2313356k145789j267713K943969L349296o105875j4730111p311874J0621231
$$ plain form
11774 -26960222 -7988879 5843453 15860906 26692720 28523873 12118330 -5732815
11767 -5732815 2204891 31597010 46127003 27353979 1193327 -67392 17846721
11760 17846721 25677911 16251105 10449688 20593682 31628448 25530212 7954403 -176172
11752 -176172 10717993 29955912 40453018 34579124 17904737 2696539 -1845314 3694358
11744 3694358 10271186 9233408 747968 -6638551 -5209450 3581373 11348135 13181578
11736 13181578 12533112 13969477 15805203 15114958 15501122 20777844 23425266 12065414
11728 12065414 -7840014 -15478057 -4065962 5706587 -5385340 -24632940 -24394760 -3023285
11720 -3023285 13440665 11612861 10032957 27850562 52134182 53417775 25578279 -6202209
$$ packed form
11774b6960222J8971343J3832332J0017453J0831814J831153j6405543j7851145
11767e732815P937706K9392119J4529993j8773024k6160652j260719J7914113
11760A7846721P831190r426806n801417J0143994J1034766o098236j7575809q130575
11752a76172J0894165J9237919J0497106n873894j6674387j5208198m541853N539672
11744C694358O576828j037778q485440p386519J429101Q790823P766762J833443
11736A3181578o48466J436365J835726o90245L86164N276722K647422j1359852
11728A2065414j9905428p638043J1412095R772549j1091927j9247600K38180K1371475
11720c023285J6463950j827804j579904J7817605K4283620J283593k7839496l1780488
$$ plain form
11712 -6202209 -16071181 -3755965 11665187 15438617 10356971 9528031 18504217 25999410
11704 25999410 16082456 -9859418 -30685405 -30218178 -17289348 -11972759 -17095756 -16747794
11696 -16747794 -3054716 10287200 8078210 -3983474 -8047843 513126 8353821 3525732
11688 3525732 -11312168 -26636922 -36663744 -37700471 -25741408 -4623946 9868555
11681 9868555 5654274 -7802492 -9026854 6745397 20195410 14055033 -4705142 -17492784
11673 -17492784 -19339084 -18840444 -18621421 -11603172 2463084 11295520 7036569 -1254112
11665 -1254112 106316 10830992 18074128 13624470 3490058 247644 8397263 17957386
11657 17957386 14748302 -280278 -6843944 10592656 37110171 39719913 9185035
$$ packed form
11712f202209r868972J2315216J5421152L773430n081646q28940Q976186P495193
11704B5999410r916954k5941874k0825987M67227J2928830N316589n122997L47962
11696a6747794J3693078J3341916k208990j2061684m064369Q560969P840695m828089
11688C525732j4837900j5324754j0026822j036727J1959063K1117462J4492501
11681I868555m214281j3456766j224362J5772251J3450013o140377j8760175j2787642
11673a7492784j846300M98640K19023P018249J4066256Q832436m258951q290681
11665a254112J360428J0724676P243136m449658j0134412l242414Q149619R560123
11657A7957386l209084j5028580o563666J7436600K6517515K609742l0534878
$$ plain form
11650 9185035 -24659863 -28486078 -4747796 16913714 18468576 7975125 -610231 -5085482
11642 -5085482 -9640711 -14442974 -16325353 -13626976 -7676171 -3277938 -5445700 -9228538
11634 -9228538 2132748 36534811 73042283 79256057 52022813 24103905 22202455
11627 22202455 34353369 32324055 12740246 -3359634 -4710474 -1672023 -3529576 -4831509
11619 -4831509 -1315131 -1528788 -10247402 -13673930 2573620 27974441 37023799 23243835
11611 23243835 6823595 5112526 10425519 4907420 -14068548 -33558834 -42303294 -37741219
11603 -37741219 -21350614 1560395 19993180 26005501 24775377 26788729 31123204 26836088
11595 26836088 11161844 -4720702 -10516756 -7635650 -2517169 1140170 361297 -6733855
$$ packed form
11650I185035l3844898l826215K3738282K1661510J554862j0493451q585356m475251
11642e085482m555229m802263j882379K698377N950805M398233k167762l782838
11634i228538J1361286L4402063L6507472O213774k7233244k7918908j901450
11627B2202455J2150914k029314j9583809j6099880j350840L038451j857553j301933
11619d831509L516378k13657q718614l426528J6247550K5400821R049358j3779964
11611B3243835j6420240j711069N312993n518099j8975968j9490286q744460M562075
11603c7741219J6390605K2911009J8432785O012321j230124K013352M334475m287116
11595B6836088j5674244j5882546n796054K881106N118481L657339p78873p095152
$$ plain form
11587 -6733855 -14273854 -12298574 -1907224 3506216 -2315169 -9070591 -7430841 -4473025
11579 -4473025 -11098044 -23570874 -29498086 -25052628 -14783275 -564134 17726801 35501192
11571 35501192 47571433 53564483 50859726 31678814 -771501 -23685169 -18718394
11564 -18718394 2954662 17078565 20413276 27787679 40565840 42765629 29279550
11557 29279550 14017810 5320302 -4437475 -17637616 -21094494 -7301437 11778772
11550 11778772 22870140 27635808 30783085 28055361 18082249 11602521 15520007 20015057
11542 20015057 14699542 6558287 8374136 18808348 27173711 29715373 28429520 21358470
11534 21358470 7140349 -6456825 -10345754 -6214692 -1896888 -213523 -66884 -1078000
$$ packed form
11587f733855p539999J975280J0391350N413440n821385o755422J639750K957816
11579d473025o625019j2472830n927212M445458J0269353J4219141J8290935J7774391
11571C5501192J2070241N993050k704757j9180912l2450315k2913668M966775
11564a8718394K1673056J4123903L334711P374403J2778161K199789j3486079
11557B9279550j5261740q697508r757777j3200141l456878J3793057J9080209
11550A1778772J1091368M765668L147277k727724r973112o479728L917486M495050
11542B0015057n315515q141255J815849J0434212Q365363K541662j285853p071050
11534B1358470j4218121j3597174l888929M131062M317804J683365J46639j011116
$$ plain form
11526 -1078000 765969 12759573 31560078 40123176 30198607 18065940 24427366 46680542
11518 46680542 64499646 65311801 50880742 27212930 3913984 -3370376 12251414
11511 12251414 34691193 40837661 27851297 10563849 -3058862 -16290057 -26567576
11504 -26567576 -24006235 -9586923 1829228 1123507 -5739001 -11700738 -19240346 -31593575
11496 -31593575 -43003297 -43693474 -30236147 -9562187 4479029 2235259 -9467935
11489 -9467935 -13112004 -5160396 -3946104 -20921321 -36642030 -25406053 4248920 17942507
11481 17942507 2621945 -19143578 -25107187 -19572249 -15433105 -11740328 -3175900 2973960
11473 2973960 -5306525 -26521863 -45411898 -47388236 -29311314 -1534446 18774134
$$ packed form
11526a078000J843969J1993604J8800505Q563098r924569j2132667O361426K2253176
11518D6680542J7819104Q12155j4431059k3667812k3298946p284360J5621790
11511A2251414K2439779O146468j2986364j7287448j3622711j3231195j0277519
11504b6567576K561341J4419312J1416151p05721o862508n961737p539608j2353229
11496c1593575j1409722o90177J3457327K0673960J4041216k243770j1703194
11489i467935l644069P951608J214292j6975217j5720709J1235977K9654973J3693587
11481A7942507j5320562k1765523n963609N534938M139144L692777Q564428O149860
11473B973960q280485k1215338j8890035j976338J8076922K7776868K0308580
$$ plain form
11466 18774134 22796994 18652583 17797770 16533600 3043759 -19953693 -34986842 -32627988
11458 -32627988 -19757267 -4728535 9819874 18473884 14764357 4087371 -1655360
11451 -1655360 -3721595 -12144115 -21046116 -12400094 10517410 20167326 6397234 -5029821
11443 -5029821 7927113 29037474 30030957 12309948 -1080155 -1249729 2257538 3366345
11435 3366345 3770797 1935338 -3079855 -2699317 9082718 21188661 19737770 9775775
11427 9775775 5568139 6740079 3237443 -2189459 2481510 15520048 22426022 19258619
11419 19258619 15733658 14592551 7241408 -6766764 -13861752 -6558848 4295637 4421809
11411 4421809 -6034285 -14633924 -10365245 6830888 25640829 34026912 34194064 40290269
$$ packed form
11466A8774134M022860m144411q54813j264170j3489841k2997452j5033149K358854
11458c2627988J2870721J5028732J4548409Q654010l709527j0676986n742731
11451a655360k066235q422520q902001Q646022K2917504R649916j3770092j1427055
11443e029821J2956934K1110361R93483j7721009j3390103j69574L507267J108807
11435C366345M04452j835459n015193L80538J1782035J2105943j450891r961995
11427I775775m207636J171940l502636n426902M670969J3038538O905974l167403
11419A9258619l524961j141107p351143j4008172p094988P302904J0854485J26172
11411D421809j0456094q599639M268679J7196133J8809941Q386083J67152O096205
$$ plain form
11403 40290269 55118571 60966594 46309007 28947118 32690002 50415982 55088453
11396 55088453 42646545 35305120 40392577 36173950 9336944 -19563341 -24205280 -6245445
11388 -6245445 15331281 31330445 40998751 38445022 21072379 2209809 -4004147 -3349657
11380 -3349657 -8622027 -13034574 1057158 28891025 43068290 31930621 16053346
11373 16053346 15501304 20368772 11573025 -3789344 -2329174 15595495 22866986 8700159
11365 8700159 -445446 20052096 51439200 53774828 21120116 -12589439 -22995143
11358 -22995143 -22725838 -29965106 -35524071 -20988151 7051698 23726049 19132889 5442663
11350 5442663 -4334919 -6994045 -2088363 8504024 15635391 13081043 10500820 20335731
$$ packed form
11403D0290269J4828302N848023j4657587j7361889L742884J7725980M672471
11396E5088453j2441908p341425N087457m218627k6837006k8900285m641939J7959835
11388f245445K1576726J5999164R668306k553729j7372643j8862570o213956O54490
11380c349657n272370m412547J4091732K7833867J4177265j1137669j5877275
11373A6053346n52042M867468q795747j5362369J460170J7924669P271491j4166827
11365H700159r145605K0497542L1387104K335628l2654712l3709555j0405704
11358b2995143K69305p239268n558965J4535920K8039849J6674351m593160j3690226
11350E442663r777582k659126M905682J0592387P131367k554348k580223R834911
$$ plain form
11342 20335731 34708759 34163845 18470038 7633154 9655997 9634256 -1632476 -9762504
11334 -9762504 -269363 17433118 24731713 19964913 14868170 14203186 13329489 9834853
11326 9834853 5321635 573505 -1355934 6339335 22851711 34459835 32051608 26621346
11318 26621346 33606688 47663933 49426592 35417262 24011644 28528082 39487485
11311 39487485 40379128 29163227 15081058 2742237 -9347893 -18141202 -15641845 -1593894
11303 -1593894 11362792 10619065 -1853843 -12956597 -14538747 -10136059 -5804276 -1566996
11295 -1566996 4462135 9679793 10712398 9577287 10229659 12488594 15229281 20925339
11287 20925339 29381674 32243035 24356889 16234767 21678681 35250011 37986799 26374855
$$ packed form
11342B0335731J4373028n44914j5693807j0836884K022843k1741j1266732q130028
11334i762504R493141J7702481P298595m766800n096743o64984q73697l494636
11326I834853m513218m748130j929439P695269J6512376J1608124k408227n430262
11318B6621346O985342J4057245J762659j4009330j1405618M516438J0959403
11311C9487485Q91643j1215901j4082169j2338821j2090130q793309K499357J4047951
11303a593894J2956686p43727j2472908j1102754j582150M402688M331783M237280
11295a566996O029131N217658J032605j135111O52372K258935K740687N696058
11287B0925339Q456335K861361p886146q122122N443914J3571330K736788j1611944
$$ plain form
11279 26374855 17937556 22847081 27653914 17188845 -2052322 -12324607 -6658091 10969133
11271 10969133 35484124 57312701 60545701 41515382 21894855 26037361 49414237
11264 49414237 65513359 60788786 46516298 37670430 36549479 38270253 37876536 30459360
11256 30459360 16937466 9296624 16133511 24594380 14355259 -9986600 -21144853
11249 -21144853 -8222973 8227648 8962550 1584543 -537384 -3143500 -14233227 -20008064
11241 -20008064 -3854996 21208455 26828138 11480170 680106 5356267 8907243
11234 8907243 1543768 -1489302 10405601 20487289 11034344 -7230868 -14202595 -13213976
11226 -13213976 -19200631 -24859109 -8336286 27338687 51561267 48232870 34821549
$$ packed form
11279B6374855q437299M909525M806833j0465069j9241167j0272285N666516J7627224
11271A0969133K4514991K1828577L233000j9030319j9620527M142506K3376876
11264D9414237J6099122m724573j4272488q845868j120951J720774l93717p417176
11256C0459360j3521894p640842O836887Q460869j0239121k4341859j1158253
11249b1144853J2921880J6450621P34902p378007k121927k606116j1089727n774837
11241b0008064J6153068K5063451N619683j5347968j0800064M676161L550976
11234H907243p363475l033070J1894903J0081688r452945j8265212o971727R88619
11226a3213976n986655n658478J6522823L5674973K4222580l328397j3411321
$$ plain form
11219 34821549 29780063 25236700 8371289 -9802056 -9261938 6499885 15491000 10720446
11211 10720446 7654600 16855679 28064032 28412982 22099220 21260809 25500193 22198053
11203 22198053 5716027 -12845809 -18141916 -8136058 5188425 10867743 9057622
11196 9057622 4846574 -1026892 -9258412 -15583671 -17034293 -20699857 -33254361 -43467634
11188 -43467634 -32577292 -5720916 6723698 -10057198 -31545311 -27555985 -4273079
11181 -4273079 9107181 4879379 1785586 8934918 12038705 922019 -12075718 -11401862
11173 -11401862 337767 10397513 12914012 9143307 1045706 -7429943 -10832826 -9612212
11165 -9612212 -9297803 -9239038 -1949297 13307621 27239291 34023023 36147440 32799067
$$ packed form
11219C4821549n041486m543363j6865411j8173345N40118J5761823Q991115m770554
11211A0720446l065846R201079J1208353L48950o313762q38411M239384l302140
11203B2198053j6482026j8561836n296107J0005858J3324483N679318j810121
11196I057622m211048n873466q231520o325259j450622l665564j2554504j0213273
11188d3467634J0890342K6856376J2444614j6780896k1488113L989326K3282906
11181d273079J3380260m227802l093793P149332L103787j1116686j2997737O73856
11173a1401862J1739629J0059746K516499l770705q097601q475649l402883J220614
11165i612212L14409N8765P289741J5256918J3931670O783732K124417l348373
$$ plain form
11157 32799067 18252368 -2107576 -9496977 4789520 25916481 34869922 29601724
11150 29601724 18023726 3392627 -11247141 -15982694 -5838883 8163064 12095084
11143 12095084 6328421 -525551 -6086267 -11652877 -14468562 -14367591 -18796772 -28852008
11135 -28852008 -30489041 -13743583 9380474 21696011 25035543 29930449 31927222 20625206
11127 20625206 4811886 3271431 13344891 14208147 2075190 -3678138 6271518 17248952
11119 17248952 17595721 15284983 16525323 11360112 -3724992 -9985716 6007574 24598680
11111 24598680 16485044 -14684528 -36260714 -30100240 -10656529 1795017 5708333
11104 5708333 8550348 8794384 929614 -9381965 -9029275 3823804 15311526 14123641
$$ packed form
11157C2799067j4546699k0359944p389401J4286497K1126961Q953441n268198
11150B9601724j1577998j4631099j4639768m735553J0143811J4001947L932020
11143A2095084n766663o853972n560716n566610k815685J00971m429181j0055236
11135b8852008j637033J6745458K3124057J2315537L339532M894906J996773j1302016
11127B0625206j5813320j540455J0073460Q63256j2132957n753328R949656J0977434
11119A7248952L46769k310738J240340n165211j5085104o260724J5993290J8591106
11111B4598680q113636l1169572k1576186O160474J9443711J2451546L913316
11104E708333K842015K44036p864770j0311579L52690J2853079J1487722j187885
$$ plain form
11096 14123641 6565420 6476990 15362247 22992079 26273595 33935421 48198413 56146136
11088 56146136 49710206 41565215 45754155 52513623 42427725 19855639 8535245 13890672
11080 13890672 15270596 2191054 -7454060 763470 10801102 1987847 -14699432 -11376804
11072 -11376804 13910531 34100489 31854876 19129557 13814109 15404859 12666167 2964791
11064 2964791 -6080425 -8104798 -3738776 2397837 6169452 6675605 5875936 4552829
11056 4552829 587619 -5641987 -7241281 1637680 15081458 18916096 6859429 -10861721
11048 -10861721 -17236025 -5609442 13110164 20431457 9595526 -5385724 -4649038 13285026
11040 13285026 29654751 30139278 21490085 17347886 18043078 15665685 11301063 12866030
$$ packed form
11096A4123641p558221q8430Q885257P629832L281516P661826J4262992P947723
11088E6146136o435930q144991M188940O759468j0085898k2572086j1320394N355427
11080A3890672J379924j3079542r645114Q217530J0037632q813255j6687279L322628
11072a1376804K5287335K0189958k245613j2725319n315448J590750k738692r701376
11064B964791r045216k024373M366022O136613L771615N06153p99669j323107
11056D552829l965210o229606j599294Q878961J3443778L834638j2056667j7721150
11048a0861721o374304J1626583J8719606P321293j0835931j4981250P36686J7934064
11040A3285026J6369725M84527q649193m142199O95192k377393m364622J564967
$$ plain form
11032 12866030 19183669 20239093 12919355 4266108 -1224095 -6016744 -10718724 -12173875
11024 -12173875 -11170072 -10867603 -7494740 4274198 15878924 10759736 -9796063 -22932260
11016 -22932260 -14711686 273846 654105 -13262334 -26086131 -31798504 -35668294 -37920857
11008 -37920857 -31998444 -18379318 -6963306 -3875329 -4652490 -1444087 9348145 25540895
11000 25540895 39359857 41446554 30610502 16646606 8241922 3489980 -1020045 324466
10992 324466 12387148 25369608 25138169 15017174 12873853 26160279 42899359 48838171
10984 48838171 41562402 26279456 9821752 770749 3277223 8330639 3402146 -7303858
10976 -7303858 -6699850 7345332 14570024 1203326 -18667373 -22637103 -9440318 4459862
$$ packed form
11032A2866030O317639J055424p319738q653247n490203m792649m701980j455151
11024a2173875J003803L02469L372863J1768938J1604726n119188k0555799j3136197
11016b2932260Q220574J4985532L80259j3916439j2823797n712373l869790k252563
11008c7920857N922413J3619126J1416012L087977p77161L208403J0792232J6192750
11000B5540895J3818962K086697j0836052j3963896q404684m751942m510025J344511
10992C24466J2062682J2982460k31439j0120995k143321J3286426J6739080N938812
10984D8838171p275769j5282946j6457704r051003K506474N053416m928493j0706004
10976g303858O04008J4045182P224692j3366698j9870699l969730J3196785J3900180
$$ plain form
10968 4459862 9633241 11243826 15730251 21660810 23485073 17821451 7269715 512561
10960 512561 3616648 9661618 5841259 -6555721 -11449908 -2577185 5418067 -250777
10952 -250777 -10678280 -10652299 -1036860 8870287 19509469 34450591 45455408 42998255
10944 42998255 34518098 33399473 36058650 29578150 16535721 10833522 12530244 9421510
10936 9421510 1966743 2910991 11239735 10846326 -1044801 -7874654 -1899143 4947603
10928 4947603 5488845 8644363 16494850 14374254 -1870596 -10782522 5140857 33014729
10920 33014729 50320100 55496383 59229161 60524753 52584519 41344250 37529139 38342275
10912 38342275 35433506 32750202 37515824 41041570 29270846 8471806 518191 13004704
$$ packed form
10968D459862N173379J610585M486425N930559J824263n663622j0551736o757154
10960E12561L104087O044970l820359j2396980m894187Q872723P995252n668844
10952b50777j0427503K5981R615439R907147J0639182J4941122J1004817k457153
10944D2998255q480157j118625K659177o480500j3042429n702199J696722l108734
10936I421510p454767R44248Q328744l93409j1891127o829853N975511O846746
10928D947603N41242L155518P850487k120596j6244850q911926J5923379K7873872
10920C3014729J7305371N176283L732778J295592p940234j1240269l815111Q13136
10912C8342275k908769k683304M765622L525746j1770724k0799040p953615J2486513
$$ plain form
10904 13004704 30453385 35535521 25851416 10474309 1082009 4115290 12219487 9093171
10896 9093171 -7563554 -17755129 -6813104 10815067 13633095 7303745 12881164 28580960
10888 28580960 30909071 12484384 -8071834 -16124139 -15410048 -9006238 7297911 25126474
10880 25126474 23414051 415411 -17154827 -10801449 5088936 10494376 10577111 19233836
10872 19233836 29419426 24545211 9681794 7062070 23183845 40658517 43849590
10865 43849590 36647396 31783643 34302779 39539820 40490245 34598482 26053037 20324373
10857 20324373 15598689 5309437 -8874307 -15494334 -9365299 505029 5221235 7471067
10849 7471067 10797887 9728242 2110747 -683562 9102816 18657429 12529887 -1085910
$$ packed form
10904A3004704J7448681N082136r684105j5377107r392300L033281Q104197l126316
10896I093171j6656725j0191575J0942025J7628171K818028o329350N577419J5699796
10888B8580960K328111j8424687k0556218q052305P14091O403810J6304149J7828563
10880B5126474j712423k2998640j7570238O353378J5890385N405440Q2735Q656725
10872A9233836J0185590m874215j4863417k619724J6121775J7474672L191073
10865D3849590p202194m863753K519136N237041R50425n891763q545445n728664
10857B0324373m725684j0289252j4183744o620027O129035R870328M716206K249832
10849G471067L326820j069645p617495k794309R786378R554613o127542j3615797
$$ plain form
10841 -1085910 -2875514 4778358 2260039 -10776043 -11114658 8049964 19412870 780352
10833 780352 -28084681 -30698770 -5089505 14558601 6129264 -12583071 -11915753 8646749
10825 8646749 20779406 5130014 -22028740 -25503806 7344314 48261041 56880906
10818 56880906 25589593 -12818065 -23611590 -5773567 16959510 29563712 36223011
10811 36223011 42144659 42217536 32526497 20822284 17337105 21946241 27341318 29920898
10803 29920898 31148211 32163456 33349724 36033574 38518108 33618554 17440967 -1171007
10795 -1171007 -7948170 -474603 8836767 8581599 621343 -6418805 -9936485 -14053522
10787 -14053522 -19926825 -21245696 -11840986 4001188 12688922 5867908 -8098124 -13149097
$$ packed form
10841a085910j789604P653872k518319j3036082l38615J9164622J1362906j8632518
10833G80352k8865033k614089K5609265J9648106q429337j8712335O67318K0562502
10825H646749J2132657j5649392k7158754l475066L2848120M0916727Q619865
10818E6880906l1291313l8407658j0793525J7838023K2733077J2604202O659299
10811C6223011N921648P2877r691039j1704213l485179M609136N395077K579580
10803B9920898J227313J015245J186268K683850K484534m899554j6177587j8611974
10795a171007o777163P473567R311370k55168p960256p040148l517680m117037
10787a4053522n873303j318871R404710J5842174Q687734o821014j3966032n050973
$$ plain form
10779 -13149097 -6460288 -1758094 -7561895 -12723096 -4157525 9873176 10564594 -1063538
10771 -1063538 -4188504 8281107 15685138 -540355 -27939110 -38026431 -21329614
10764 -21329614 5886360 24331887 28620420 24115483 17648972 11876413 3443140 -11397447
10756 -11397447 -26581306 -28227810 -11935954 9685184 23338342 29874737 34341226
10749 34341226 31916405 17133908 -985339 -8681711 -7443503 -8861013 -13708969 -13310830
10741 -13310830 -9727704 -15671940 -31963322 -42495358 -36589241 -21381308 -7061940
10734 -7061940 5237763 14908179 16751932 13103016 16797144 31235420 40155164 30020402
10726 30020402 11788028 5647536 12618497 18398923 20375609 30845504 51145171 61113563
$$ packed form
10779a3149097O688809M702194n803801n161201Q565571J4030701O91418j1628132
10771a063538l124966J2469611P404031j6225493k7398755j0087321J6696817
10764b1329614K7215974J8445527M288533m504937o466511n772559q433273j4840587
10756a1397447j5183859j646504J6291856K1621138J3653158O536395M466489
10749C4341226k424821j4782497j8119247p696372J238208j417510m847956L98139
10741a3310830L583126n944236j6291382j0532036N906117J5207933J4319368
10734g061940J2299703R670416J843753l648916L694128J4438276Q919744j0134762
10726C0020402j8232374o140492O970961N780426J976686J0469895K0299667R968392
$$ plain form
10718 61113563 44085996 10815435 -12820995 -15408964 -6106261 4901785 18384183
10711 18384183 35775272 49031641 49825834 42746388 39440228 42025795 42021483 35374836
10703 35374836 28155052 24795655 20771179 12465253 6066470 9185412 18699941 23652877
10695 23652877 17192294 1445474 -15434735 -23601543 -17939665 -3752655 8636053
10688 8636053 16164181 22531506 25473686 17363748 2181413 -3263541 6808176 16603726
10680 16603726 12582658 3533076 4204560 12875186 19746965 23865551 25533013 16463455
10672 16463455 -3488753 -14670797 -5145879 5085168 -5392793 -18649925 -1629091
10665 -1629091 36708858 51324189 25539045 -7808019 -17045480 -8676523 -1930141 1346194
$$ packed form
10718F1113563j7027567l3270561k3636430k587969R302703J1008046J3482398
10711A8384183J7391089J3256369P94193p079446l306160K585567m312o646647
10703C5374836p219784l359397m024476q305926o398783L118942R514529M952936
10695B3652877o460583j5746820j6880209q166808N661878J4187010J2388708
10688H636053P528128O367325K942180q109938j5182335n444954J0071717R795550
10680A6603726m021068r049582O71484Q670626O871779M118586J667462r069558
10672A6463455j9952208j1182044R524918J0231047j0477961j3257132J7020834
10665a629091L8337949J4615331k5785144l3347064r237461Q368957O746382L276335
$$ plain form
10657 1346194 4823588 2717340 -5453467 -6761974 3194105 10578935 8675524 10960295
10649 10960295 24564587 33443220 24965744 11783635 8482025 6652107 -5899500 -18738496
10641 -18738496 -14002059 5200145 21900846 29642824 32262128 31122417 29122030 35060953
10633 35060953 47927595 50222185 33320329 14854352 13054446 19379728 17198526 12350948
10625 12350948 20575793 36116663 38935646 26467470 14142880 8904079 4792140 2138493
10617 2138493 9875926 28362560 46345777 55016591 53493896 44447315 34552465 31470024
10609 31470024 30420579 16332883 -8532354 -16461947 7837206 38755034 42989106
10602 42989106 25770663 15916495 17495725 9377990 -12765681 -27406244 -21682601 -6975767
$$ packed form
10657A346194L477394k106248q170807j308507R956079P384830j903411K284771
10649A0960295J3604292Q878633q477476j3182109l301610j829918j2551607j2838996
10641a8738496M736437J9202204J6700701P741978K619304j139711k000387N938923
10633C5060953J2866642K294590j6901856j8465977j799906O325282k181202m847578
10625A2350948Q224845J5540870K818983j2468176j2324590n238801m111939k653647
10617B138493P737433J8486634J7983217Q670814j522695r046581r894850l082441
10609C1470024j049445j4087696k4865237p929593K4299153L0917828M234072
10602D2989106j7218443r854168J579230q117735k2143671j4640563N723643J4706834
$$ plain form
10594 -6975767 3148277 6727196 3419837 -6597648 -12594169 -3578080 11824301 17099868
10586 17099868 16110307 24668392 37252024 32080155 10625880 612753 13272317 27583391
10578 27583391 26584115 20987858 24444639 31629550 35288326 41226906 50822932 50472686
10570 50472686 35076738 22173097 25048048 29756683 18051797 -2076011 -9257695
10563 -9257695 -943019 7460597 8577905 9512497 15332952 21518830 22842898 19496192
10555 19496192 14609049 11822070 12893208 13739378 8039434 -1417837 -2385673 10479054
10547 10479054 26418855 32120348 27550879 21555735 18420200 16958455 17913920 23163034
10539 23163034 29369745 30220318 25533410 22563328 26619877 34590699 40828973 46188865
$$ packed form
10594f975767J0124044L578919l307359j0017485n996521R016089J5402381N275567
10586A7099868r89561Q558085J2583632n171869k1454275j0013127J2659564J4311074
10578B7583391r99276n596257L456781P184911L658776N938580R596026l50246
10570E0472686j5395948j2903641K874951M708635j1704886k0127808p181684
10563i257695Q314676Q403616J117308R34592N820455O185878J324068l346706
10555A9496192m887143k786979J071138Q46170n699944r457271r67836J2864727
10547A0479054J5939801N701493m569469n995144l135535j461745R55465N249114
10539B3163034O206711Q50573m686908k970082M056549P970822O238274N359892
$$ plain form
10531 46188865 54766342 61688846 54149905 31396146 13940545 19593418 37055509 40704116
10523 40704116 27495573 18004565 22138486 28839966 32042757 38509001 44059376 33951178
10515 33951178 17141687 24637498 57773768 76371428 60502959 43258904 52652565
10508 52652565 64079482 49804170 33034512 43074370 55634671 36199247 8979103
10501 8979103 17344269 44189494 42688072 22000624 25756571 46778186 47254572 43738371
10493 43738371 76267374 111401596 92794592 78897467 180727675 335276109 310669574
10486 310669574 25164687 -287102379 -357517422 -216904832 -100337264 -106370610 -128987838
10479 -128987838 -90664313 -54487308 -77146946 -104944081 -78260747 -30345506 -17273408
$$ packed form
10531D6188865Q577477O922504p538941k2753759j7455601N652873J7462091L648607
10523D0704116j3208543r491008M133921O701480L202791O466244N550375j0108198
10515C3951178j6809491P495811L3136270J8597660j5868469j7244055R393661
10508E2652565J1426917j4275312j6769658J0039858J2560301j9435424k7220144
10501H979103Q365166K6845225j501422k0687448L755947K1021615M76386l516201
10493D3738371L2529003L5134222j8607004j3897125J01830208J54548434k4606535
10486C10669574k85504887l12267066p0415043J40612590J16567568o033346k2617228
10479a28987838L8323525L6177005k2659638k7797135K6683334M7915241J3072098
$$ plain form
10472 -17273408 -29227931 -30377307 -24759402 -28971431 -28815904 -10782909 3393709 -5743458
10464 -5743458 -18639311 -12760002 -1881910 -6080952 -13783592 -7027074 2798311 -2718081
10456 -2718081 -13310112 -7539418 11248497 23308912 22854585 17765119 11727557 5538122
10448 5538122 4610132 9852400 12026185 6294784 155584 -1006124 -1698712 -3635113
10440 -3635113 -2299068 -1400071 -11272379 -27343971 -31447947 -20707758 -12625367 -15038591
10432 -15038591 -15517816 -8406668 -6127055 -13131578 -15002262 -6278242 -3703714 -17670818
10424 -17670818 -34798869 -42981736 -48773781 -54892787 -47047556 -21725153 -1518969 -1692665
10416 -1692665 -5858988 1677442 3808825 -19490629 -48311257 -44475832 -7856538 20932680
$$ packed form
10472a7273408j1954523j149376N617905m212029J55527J8032995J4176618r137167
10464e743458j2895853N879309J0878092m199042p702640O756518R825385n516392
10456b718081j0592031N770694J8787915J2060415m54327n089466o037562o189435
10448E538122r27990N242268K173785n731401o139200j161708o92588j936401
10440c635113J336045Q98997r872308j6071592m103976J0740189Q082391k413224
10432a5038591m79225P111148K279613p004523j870684Q724020K574528j3967104
10424a7670818j7128051q182867n792045o119006P845231K5322403K0206184j73696
10416a692665m166323P536430K131383k3299454k8820628L835425L6619294K8789218
$$ plain form
10408 20932680 14817963 -7799650 -11556011 11222161 32717171 22727118 -13766269
10401 -13766269 -38011972 -24022701 5248243 7805126 -17231807 -29347722 -9147750
10394 -9147750 14529472 13884132 3314357 7377572 17704889 12714138 -1618485 -3108255
10386 -3108255 9306244 19578907 24297098 30178673 31803093 19581122 2385606 -3824321
10378 -3824321 -3255360 -11338042 -25633028 -31223919 -28880700 -31154458 -34754791 -24457771
10370 -24457771 -3419406 7423615 2340484 -1425145 7408524 19842958 25815123 27123134
10362 27123134 25669338 17644096 6121492 3345181 13351109 24792460 26363344 19080200
10354 19080200 10310065 5038706 4270831 3932337 -2858555 -14393692 -16976907 -3619193
$$ packed form
10408B0932680o114717k2617613l756361K2778172K1495010r990053l6493387
10401a3766269k4245703J3989271K9270944K556883k5036933j2115915K0199972
10394i147750K3677222o45340j0569775M063215J0327317m990751j4332623j489770
10386c108255J2414499J0272663M718191N881575J624420j2221971j7195516o209927
10378c824321N68961q082682j4294986n590891K343219k273758l600333J0297020
10370b4457771K1038365J0843021n083131l765629Q833669J2434434N972165J308011
10362B7123134j453796q025242j1522604k776311J0005928J1441351J570884p283144
10354A9080200q770135n271359p67875l38494o790892j1535137k583215J3357714
$$ plain form
10346 -3619193 11599783 11786886 1622395 -3256130 -2707967 -7387684 -14752440 -13822702
10338 -13822702 -9770080 -17657105 -32730175 -34638706 -23491150 -22430445 -37388618 -43821998
10330 -43821998 -26059009 -2697560 3880054 -640459 -550350 1185974 -4908967 -10623353
10322 -10623353 -2793687 10993074 13587075 7378885 8466939 16960143 17895397 10706924
10314 10706924 12311843 25950454 30714409 13006536 -10787496 -17353666 -7501348 2092388
10306 2092388 6940661 14996633 24334111 21764507 5535486 -9367577 -14211253 -17304960
10298 -17304960 -22733995 -15950085 13408901 47290570 57773212 42978933 25128980
10291 25128980 17989954 17674074 22826273 38510891 56454961 56233460 34567088 12006252
$$ packed form
10346c619193J5218976J87103j0164491m878525N48163m679717p364756R29738
10338a3822702M052622p887025j5073070j908531J1147556J060705j4958173o433380
10330d3821998J7762989K3361449O577614m520513R0109J736324o094941n714386
10322a0623353P829666J3786761K594001o208190J088054Q493204R35254p188473
10314A0706924J604919J3638611M763955j7707873k3794032o566170R852318R593736
10306B092388M848273Q055972R337478k569604j6229021j4903063m843676l093707
10298a7304960n429035O783910K9358986L3881669J0482642j4794279j7849953
10291B5128980p139026l15880N152199J5684618J7944070k21501k1666372k2560836
$$ plain form
10283 12006252 2593323 -142597 1415297 18895228 47388693 54688445 26075114 -5242037
10275 -5242037 -2265313 22344756 30455789 17855365 10235888 12042430 3313335 -15159203
10267 -15159203 -17552444 151843 9316549 -4169960 -18146087 -13759113 -3175857
10260 -3175857 -667159 2771607 15284783 21914992 9411939 -8792961 -14218681 -10316406
10252 -10316406 -7449959 -1064209 12717570 18467955 3396080 -16990097 -19677806 -7935074
10244 -7935074 -834356 -1722266 -2006638 -4567515 -15820335 -22880976 -7351898 22313077
10236 22313077 39272785 36352627 29120913 23608190 10705625 -5487883 -5064161 13360308
10228 13360308 24168541 13512239 1129070 6814910 17687280 10855444 -7376514
$$ packed form
10283A2006252r412929k735920J557894J7479931K8493465P299752k8613331l1317151
10275e242037K976724K4610069Q111033j2600424p619477J806542q729095j8472538
10267a5159203k393241J7704287R164706j3486509j3976127M386974J0583256
10260c175857K508698L438766J2513176O630209j2503053j8204900n425720L902275
10252a0316406K866447O385750J3781779N750385j5071875k0386177k687709J1742732
10244g935074P100718q87910k84372k560877j1252820p060641J5529078K9664975
10236B2313077J6959708k920158p231714n512723j2902565j6193508M23722J8424469
10228A3360308J0808233j0656302j2383169N685840J0872370o831836j8231958
$$ plain form
10221 -7376514 -10242585 8336835 24808575 19587927 1943215 -4499505 9632922 31621396
10213 31621396 42046554 33106622 13340515 -2572717 -7118243 -3386136 1198127 679054
10205 679054 -7292207 -18564737 -22405741 -12041539 3701366 7721606 -3650756 -15070577
10197 -15070577 -12837564 -1905060 5076770 6867756 10536903 15191823 13157432 6572443
10189 6572443 7800895 18594671 22221574 6087277 -17344466 -25113538 -14341423 -4083834
10181 -4083834 -7218200 -15280659 -15515195 -8958177 -2565558 5238334 18727140 32277824
10173 32277824 37167664 36032526 36654015 35168157 21497048 276717 -11396562 -9653972
10165 -9653972 -9542669 -19430871 -27220905 -21064500 -7785473 628344 4401696 7219138
$$ packed form
10221g376514k866071J8579420J6471740n220648j7644712o442720J4132427K1988474
10213C1621396J0425158q939932j9766107j5913232m545526L732107M584263n19073
10205F79054p971261j1272530l841004J0364202J5742905M020240j1372362j1419821
10197a5070577K233013J0932504O981830J790986L669147M654920k034391o584989
10189F572443J228452J0793776L626903j6134297k3431743p769072J0772115J0257589
10181d083834l134366q062459k34536O557018O392619P803892J3488806J3550684
10173C2277824M889840j135138O21489j485858j3671109k1220331j1673279J742590
10165i653972J11303r888202p790034O156405J3279027Q413817L773352K817442
$$ plain form
10157 7219138 4177890 -6415860 -11927313 -3401346 6324594 1852669 -6905377 1452806
10149 1452806 23983517 35815755 27499689 16099682 16312046 23486135 31138516 42791292
10141 42791292 56211077 55942884 35762223 13687531 9841204 20018824 24918306 17206471
10133 17206471 6045171 403992 317178 2293560 4039506 4605553 4988932 6634464
10125 6634464 7505143 4889730 2966779 8598213 17391448 15767025 2250131 -5792144
10117 -5792144 4871437 24794532 35788477 32572996 20196856 2130326 -14637427
10110 -14637427 -13587455 13152121 46139638 57327360 45477901 34203188 34711859
10103 34711859 31806013 14010721 -1946902 7594960 37487461 56292509 44337697
$$ packed form
10157G219138l041248j0593750n511453Q525967R725940m471925q758046Q358183
10149A452806K2530711J1832238q316066j1400007K12364P174089P652381J1652776
10141D2791292J3419785k68193k0180661k2074692l846327J0177620M899482p711835
10133A7206471j1161300n641179q6814J976382J745946N66047L83379J645532
10125F634464Q70679k615413j922951N631434Q793235j624423j3516894q042275
10117e792144J0663581J9923095J0993945l215481j2376140j8066530j6767753
10110a4637427J049972K6739576L2987517J1187722j1849459j1274713N08671
10103C4711859k905846j7795292j5957623R541862K9892501J8805048j1954812
$$ plain form
10096 44337697 16863879 3753054 12927701 23416468 16147891 1354800 3411354
10089 3411354 21622944 24231353 -9624136 -56541355 -73926273 -51368816 -19028759
10082 -19028759 -6421373 -11587257 -16254661 -15033819 -16982688 -25506110 -29403418 -16140797
10074 -16140797 10529933 29876966 23944609 -1559802 -21020509 -16652464 3511589
10067 3511589 20053576 25559885 23577464 13224579 -8095708 -29293704 -31410271 -12578610
10059 -12578610 7600088 13239516 8127233 1625066 -6227444 -16041560 -17943027 -2200436
10051 -2200436 24398101 42641287 39332213 17609912 -6284813 -13807476 900627
10044 900627 22719919 29157500 15341735 -2122005 -7506466 -1133784 9858424 21300439
$$ packed form
10096D4337697k7473818j3110825R174647J0488767p268577j4793091K056554
10089C411354J8211590K608409l3855489m6917219j7384918K2557457L2340057
10082a9028759J2607386n165884m667404J220842j948869q523422l897308J3262621
10074a6140797K6670730J9347033n932357k5504411j9460707M368045K0164053
10067C511589J6541987N506309j982421j0352885k1320287k1197996k116567J8831661
10059a2578610K0178698N639428n112283o502167p852510r814116j901467J5742591
10051b200436K6598537J8243186l309074k1722301k3894725p522663J4708103
10044I00627K1819292O437581j3815765j7463740n384461O372682J0992208J1442015
$$ plain form
10036 21300439 26909870 19195859 4826301 4169424 23994197 45151989 50449819 48532576
10028 48532576 52140911 48769673 18936062 -25128494 -47624340 -35762974 -13101814
10021 -13101814 -3238793 -3641818 -2511579 -590381 -4845834 -14916282 -25721563 -32960664
10013 -32960664 -30150484 -12243057 11971908 23450260 15336674 483788 -8471939
10006 -8471939 -13306686 -18439393 -19885590 -15493341 -13004143 -16912626 -18531495 -9941306
9998 -9941306 2997601 12461048 21944629 35022356 42156237 34195096 20117958 15103231
9990 15103231 18436296 20343849 23612415 37679247 54384081 52353621 28884904 7548675
9982 7548675 7223381 20085121 28493372 29145105 30179426 35414034 42260494 47946975
$$ packed form
10036B1300439N609431p714011j4369558o56877J9824773K1157792N297830j917243
10028D8532576L608335l371238k9833611m4064556k2495846J1861366K2661160
10021a3101814R863021m03025J130239J921198m255453j0070448j0805281p239101
10013c2960664K810180J7907427K4214965J1478352q113586j4852886q955727
10006h471939m834747n132707j446197M392249K489198l908483j618869Q590189
9998i941306J2938907R463447R483581J3077727P133881p961141j4077138n014727
9990A5103231L333065J907553L268566J4066832J6704834k030460k3468717k1336229
9982G548675l25294J2861740Q408251O51733J034321N234608O846460N686481
$$ plain form
9974 47946975 48953475 40217796 22179246 3250580 -10149989 -19477302 -25161169 -20908710
9966 -20908710 -4685626 12764888 19725202 17288729 12451448 5115341 -6600615 -15138289
9958 -15138289 -12025861 -3274528 -669254 -470619 10850076 28915535 30657962 8807710
9950 8807710 -12778911 -11880048 663362 636052 -10953110 -12207637 1853560 10874977
9942 10874977 2335717 -8763183 -3599503 13303783 23527787 20370488 11467148 2743111
9934 2743111 -6113854 -11611005 -3817555 22165537 56239725 77171167 68103133 32845002
9926 32845002 -3233572 -16096565 -8824017 -5500827 -16968607 -26570711 -18145186 -2671224
9918 -2671224 -694559 -9345476 -8035433 7655990 20085964 18740932 14192159 16773067
$$ packed form
9974D7946975J006500q735679j8038550j8928666j3400569r327313n683867M252459
9966b0908710J6223084J7450514O960314k436473m837281p336107j1715956q537674
9958a5138289L112428Q751333K605274J98635J1320695J8065459J742427k1850252
9950H807710k1586621Q98863J2543410k7310j1589162j254527J4061197R021417
9942A0874977q539260j1098900N163680J6903286J0224004l157299q903340q724037
9934B743111q856965n497151P793450K5983092L4074188K0931442r068034l5258131
9926C2845002l6078574j2862993P272548L323190j1467780r602104Q425525J5473962
9918b671224J976665q650917J310043J5691423J2429974j345032m548773K580908
$$ plain form
9910 16773067 19920475 15236934 10526583 20477012 45884663 70177694 73146075 47203792
9902 47203792 7587699 -14946833 -3967692 20525279 25252844 8450829 61116
9895 61116 13711042 26072257 17192044 3461101 7408997 18032182 11369144 -5829918
9887 -5829918 -6916686 9662145 21329467 23207450 32268480 48104549 47907505 29426597
9879 29426597 20637963 30897743 31574310 11290747 12523573 71035744 143529227 147441639
9871 147441639 68336551 -19964412 -49668884 -30385677 -10013092 -5002249 -1101887
9864 -1101887 3937844 -1511249 -11433895 -5217933 15563701 23567653 7158549 -10053716
9856 -10053716 -4531917 13197785 17693595 6426825 -2383897 -585852 3233065 4535364
$$ packed form
9910A6773067L147408m683541m710351R950429K5407651K4293031K968381k5942283
9902D7203792l9616093k2534532J0979141K4492971M727565j6802015q389713
9895F1116J3649926J2361215q880213j3730943L947896J0623185o663038j7199062
9887e829918j086768J6578831J1667322J877983R061030J5836069j97044j8480908
9879B9426597q788634J0259780O76567k0283563J232826N8512171P2493483L912412
9871A47441639p9105088q8300963k9704472J9283207K0372585N010843L900362
9864a101887N039731n449093r922646O215962K0781634Q003952j6409104j7212265
9856a0053716N521799J7729702M495810j1266770q810722J798045L818917J302299
$$ plain form
9848 4535364 8924897 16076030 17326088 13631154 16920011 26480149 23289100 -428580
9840 -428580 -23786324 -25584917 -15468409 -17189560 -31785415 -39914802 -34234810 -24701045
9832 -24701045 -12981146 12107434 47226715 65810527 49240388 11070720 -20772700
9825 -20772700 -32231495 -23768030 1373151 34329557 57131061 58456788 47247470
9818 47247470 38419796 32376099 21952716 11730367 13085969 23699395 29642615 27616744
9810 27616744 27887546 32355270 26863902 3284764 -23819215 -33090360 -21429122 -4231262
9802 -4231262 4517034 4765747 5957845 15964444 32819885 44270618 38600513 18924913
9794 18924913 2798925 3608488 15677240 22109687 14498688 -31442 -9580604 -10027031
$$ packed form
9848D535364M389533P151133J250058l694934L288857R560138l191049k3717680
9840d28580k3357744j798593J0116508j721151j4595855q129387N679992R533765
9832b4701045J1719899K5088580L5119281J8583812j6570139l8169668l1843420
9825b0772700j1458795Q463465K5141181L2956406K2801504J325727j1209318
9818D7247470q827674o043697j0423383j0222349J355602J0613426N943220k025871
9810B7616744K70802M467724n491368k3579138k7103979r271145J1661238J7197860
9802d231262Q748296K48713J192098J0006599J6855441J1450733n670105j9675600
9794A8924913j6125988Q09563J2068752O432447p610999j4530130r549162m46427
$$ plain form
9786 -10027031 -6437783 -5503173 -8223424 -9749568 -6630048 -3247969 -7965052 -22028193
9778 -22028193 -35792213 -38220602 -27718987 -11988326 -306025 2376042 -1828798 -3624980
9770 -3624980 6025678 23264052 30522510 15387507 -12608621 -32054726 -34570938 -29816763
9762 -29816763 -25696541 -16430030 3281853 22764741 25445288 10326934 -7049759 -14486722
9754 -14486722 -15164924 -18335512 -25087563 -26968894 -15684156 7495449 30241964 37949595
9746 37949595 27081963 8857273 -2951354 -5075358 -2159668 3074882 8718517 7593372
9738 7593372 -4760559 -17046164 -12517848 4104714 6531549 -16768790 -40907185 -34399482
9730 -34399482 -901151 26364145 26966473 11796511 -208981 -4938060 -6700030 -4515833
$$ packed form
9786a0027031L589248R34610k720251j526144L119520L382079m717083j4063141
9778b2028193j3764020k428389J0501615J5730661J1682301K682067m204840j796182
9770c624980R650658J7238374P258458j5135003k7996128j9446105k516212M754175
9762b9816763M120222R266511J9711883J9482888K680547j5118354j7376693p436963
9754a4486722o78202l170588o752051j881331J1284738K3179605K2746515P707631
9746C7949595j0867632j8224690j1808627k124004K915690N234550N643635j125145
9738G593372j2353931j2285605M528316J6622562K426835k3300339k4138395O507703
9730c4399482L3498331K7265296O02328j5169962j2005492m729079j761970K184197
$$ plain form
9722 -4515833 3939063 12734304 12441170 1962740 -10366194 -15544664 -10464536 1105163
9714 1105163 10712650 11096258 2848307 -6408524 -10514191 -9938082 -8330264 -7774681 -8214604
9705 -8214604 -7789192 -3186458 6343232 15187770 16385724 10891761 6589176 7130411 7318547
9696 7318547 1518242 -8170498 -14581155 -13341845 -7186844 -4475264 -11293177 -21524840
9688 -21524840 -19456389 559151 21801488 23210767 6670147 -6402990 -4001431 6012288
9680 6012288 14626875 22688933 28073481 20267937 -1825323 -21476911 -25006425 -18528881
9672 -18528881 -13257103 -8089839 114880 3142043 -5043384 -13497353 -11582631 -10092047
9664 -10092047 -23411261 -39086046 -30823786 544020 24815751 23918648 11715682 6026537
$$ packed form
9722d515833Q454896Q795241k93134j0478430j2328934n178470N080128J1569699
9714A105163R607487L83608q247951r256831m105667N76109J607818N55583m39923
9705h214604M25412M602734R529690Q844538J197954n493963m302585N41235J88136
9696G318547n800305r688740o410657J239310O155001K711580o817913j0231663
9688b1524840K068451K0015540K1242337J409279j6540620j3073137K401559J0013719
9680F012288Q614587Q062058N384548p805544k2093260j9651588l529514O477544
9672a8528881N271778N167264Q204719L027163q185427q453969J914722J490584
9664a0092047j3319214j5674785Q262260L1367806K4271731q97103j2202966n689145
$$ plain form
9656 6026537 3699337 -4996111 -15726340 -18367134 -13485135 -7501014 -871888 7224941
9648 7224941 10747179 5547222 684862 9092083 29015526 44313512 43421041 31509568
9640 31509568 22575168 22877312 23951429 12742899 -11234595 -32688461 -37898897 -30156812
9632 -30156812 -21136762 -12663685 1309145 17267015 20676845 4247915 -22944161 -46089686
9624 -46089686 -54866571 -44306506 -18355360 7207931 18877350 22489048 31641659 41131696
9616 41131696 32594229 7937098 -7721705 -3556906 2311896 -2814470 -4517987 7688136
9608 7688136 13809367 -5946359 -34136645 -39497884 -23420255 -13069815 -18480215 -27069461
9600 -27069461 -33316100 -41571273 -42900712 -22654295 7265261 16114608 -281420 -12583794
$$ packed form
9656F026537k327200q695448j0730229k640794M881999N984121O629126Q096829
9648G224941L522238n199957m862360Q407221J9923443J5297986q92471j1911473
9640C1509568q934400L02144J074117j1208530k3977494k1453866n210436P742085
9632c0156812R020050Q473077J3972830J5957870L409830j6428930k7192076k3145525
9624d6089686q776885J0560065K5951146K5563291J1669419L611698R152611R490037
9616D1131696q537467k4657131j5658803M164799N868802n126366j703517J2206123
9608G688136O121231j9755726k8190286n361239J6077629J0350440n410400q589246
9600b7069461o246639q255173j329439K0246417K9919556Q849347j6396028j2302374
$$ plain form
9592 -12583794 -4141255 6759708 2790170 -4275548 1095976 10143895 7576740 -2682880
9584 -2682880 -9477414 -14710236 -21863467 -20148798 -1223558 21026584 27974244 22856578
9576 22856578 20643680 22231611 19388312 15765954 20441019 26926969 21051519 6127169
9568 6127169 -806341 4654187 12090158 18332430 30193256 44723022 48052091 37380859
9560 37380859 25525023 20447508 18379925 19493644 29429014 40148122 31963616 5144366
9552 5144366 -11305347 2770330 29370723 37714354 25282236 14027032 14714173 16562432
9544 16562432 10559875 3513824 4065838 8344279 6954895 -1157497 -8523994 -9713539
9536 -9713539 -7071026 -6025641 -7967316 -10336490 -12592402 -16728633 -19348508 -10158709
$$ packed form
9592a2583794Q442539J0900963l969538p065718N371524R047919k567155j0259620
9584b682880o794534n232822p153231J714669J8925240K2250142O947660n117666
9576B2856578k212898J587931k843299l622358M675065O485950n875450j4924350
9568F127169o933510N460528P435971O242272J1860826J4529766L329069j0671232
9560C7380859j1855836n077515k067583J113719R935370J0719108q184506k6819250
9552E144366j6449713J4075677K6600393Q343631j2432118j1255204O87141J848259
9544A6562432o002557p046051N52014M278441j389384q112392p366497j189545
9536i713539K642513J045385j941675k369174k255912m136231k619875R189799
$$ plain form
9528 -10158709 14015194 38945100 47248635 39440239 28656076 18329952 2505984
9521 2505984 -12372144 -8576097 13075093 26863784 18329640 5713253 8129476 13408367
9513 13408367 2529886 -11322066 -1110582 25179939 30670526 6478453 -13142911
9506 -13142911 -3019714 18267918 23590530 18279519 20977190 25892067 14973518 -5248725
9498 -5248725 -11282678 -2614026 -2692642 -17409073 -22455998 -2560119 22045608 24644654
9490 24644654 8505558 -4515386 -7755548 -10573901 -13322586 -4413287 17443037 36975236
9482 36975236 42005476 34668792 20282606 937889 -14572641 -11474347 9495388 24918392
9474 24918392 16252631 -6034619 -19689530 -21454275 -22856722 -23595908 -12297130 7328808
$$ packed form
9528a0158709K4173903K4929906Q303535p808396j0784163j0326124j5823968
9521B505984j4878128L796047K1651190J3788691q534144j2616387K416223N278891
9513A3408367j0878481j3851952J0211484K6290521N490587k4192073j9621364
9506a3142911J0123197K1287632N322612n311011K697671M914877j0918549k0222243
9498e248725o033953Q668652p8616j4716431n046925J9895879K4605727K599046
9490B4644654j6139096j3020944l240162k818353k748685Q909299K1856324J9532199
9482C6975236N030240p336684j4386186j9344717j5510530L098294K0969735J5423004
9474B4918392q665761k2287250j3654911j764745j402447p39186J1298778J9625938
$$ plain form
9466 7328808 15050814 4591844 -5765697 -2666445 1573762 -8733096 -25895360 -30942918
9458 -30942918 -20310473 -3550356 15066428 33971193 41863605 29509208 10330680
9451 10330680 7690627 21648499 29173728 19811135 9707828 13507524 22605795 22628058
9443 22628058 15869022 12604524 12757438 10788028 9695846 15602528 24152974 25513771
9435 25513771 19233180 12385780 5707139 -6672232 -23841807 -34747080 -31222761 -18951654
9427 -18951654 -12649208 -20750155 -33850807 -30591016 -1788617 32565588 42347650 25619654
9419 25619654 12182617 21119599 33057176 21065987 -6851202 -20761840 -15237506
9412 -15237506 -13233465 -22997927 -21641557 6277596 38265041 41283377 15102516 -10810934
$$ packed form
9466G328808P722006j0458970j0357541L099252M240207j0306858j7162264n047558
9458c0942918J0632445J6760117J8616784J8904765P892412j2354397j9178528
9451A0330680k640053J3957872P525229r362593j0103307L799696R098271K2263
9443B2628058o759036l264498J52914j969410j092182N906682Q550446J360797
9435B5513771o280591o847400o678641j2379371j7169575j0905273L524319J2271107
9427a8951654O302446q100947j3100652L259791K8802399L4354205R782062j6727996
9419B5619654j3437037Q936982J1937577j1991189k7917189j3910638N524334
9412a5237506K004041r764462J356370K7919153L1987445L018336k6180861k5913450
$$ plain form
9404 -10810934 -15334304 -2953969 12479699 23784392 28714596 25657651 16614718 8057654
9396 8057654 5061147 7211351 10668880 11735605 9223338 5460827 3281462 1022830
9388 1022830 -5199870 -12602359 -12130505 -2354347 4758373 -104426 -8569843 -6551393
9380 -6551393 3399462 5295745 -5537627 -15324226 -12830384 -4044779 955162 3925095
9372 3925095 11037871 18606096 19009359 15692200 18383870 24873981 21881745 6477321
9364 6477321 -7287414 -9375270 -8561452 -15988556 -24813045 -21197485 -9139304 -6213196
9356 -6213196 -15279931 -19802682 -12701996 -10569457 -26502521 -44607730 -40245615 -16341438
9348 -16341438 1377105 1764006 -741626 5841298 13771797 14581001 16537821 29633441
$$ packed form
9404a0810934m523370J2380335J5433668J1304693M930204l056945r042933q557064
9396H057654k996507K150204L457529J066725k512267l762511k179365k258632
9388A022830o222700p402489M71854R776158P112720m862799q465417K018450
9380f551393R950855J896283j0833372r786599K493842Q785605M999941K969933
9372C925095P112776P568225M03263l317159K691670O490111k992236j5404424
9364F477321j3764735k087856Q13818p427104q824489L615560J2058181K926108
9356f213196r066735m522751P100686K132539j5933064j8105209M362115K3904177
9348a6341438J7718543L86901k505632O582924P930499Q09204J956820J3095620
$$ plain form
9340 29633441 45899996 49097911 36292630 17998882 4017614 -37500 9306533 25474254
9332 25474254 29442873 11173209 -11671905 -14008442 224169 1843130 -20570535 -41135207
9324 -41135207 -29484496 10914795 47829892 54248341 28705305 -9398764 -34996109
9317 -34996109 -33915483 -13483438 5724952 12543248 14376529 21442641 31807117 38334453
9309 38334453 40336341 38782672 28584362 7525907 -12977474 -18546600 -10350950 -2146208
9301 -2146208 -1450230 -4207645 -5563007 -4300846 2266088 15791072 28507862 28627337
9293 28627337 16315902 4627573 2618215 7050375 12743338 20673794 31846425 42174682
9285 42174682 47885361 48560904 41997735 24994699 3016988 -10603567 -10947298 -8574150
$$ packed form
9340B9633441J6266555L197915j2805281j8293748j3981268m055114R344033J6167721
9332B5474254L968619j8269664k2845114k336537J4232611J618961k2413665k0564672
9324d1135207J1650711M0399291L6915097O418449k5543036l8104069k5597345
9317c4996109J080626K0432045J9208390O818296J833281P066112J0364476O527336
9309C8334453K001888j553669j0198310k1058455k0503381n569126Q195650Q204742
9301b146208O95978k757415j355362J262161O566934J3524984J2716790J19475
9293B8627337j2311435j1688329k009358M432160N692963P930456J1172631J0328257
9285D2174682N710679O75543o563169j7003036k1977711j3620555l43731K373148
$$ plain form
9277 -8574150 -13764639 -21028942 -16593283 3854116 30663055 48883162 48133623 30830779
9269 30830779 14104386 14662942 27294542 29149790 11501171 -5909138 -2294359 15960076
9261 15960076 29065927 33579755 39266794 45225689 41948390 33233783 31878788 33057266
9253 33057266 17170086 -15191516 -36148104 -29473376 -13788226 -11584225 -16196466 -10451920
9245 -10451920 -966259 -7167721 -25074591 -29633866 -12194896 8655334 16327921 14277396
9237 14277396 10071476 3273527 -2073468 6288168 26526456 34615621 16368990 -6169148
9229 -6169148 -1799427 24424368 36500434 17262346 -10232278 -17148434 -4794899 5610007
9221 5610007 4332767 -1186699 -4249892 -6860533 -10926629 -13398960 -11956006 -7807606
$$ packed form
9277h574150n190489p264303M435659K0447399K6808939J8220107p49539j7302844
9269C0830779j6726393N58556J2631600J855248j7648619j7410309L614779J8254435
9261A5960076J3105851M513828N687039N958895l277299q714607j354995J178478
9253C3057266j5887180l2361602k0956588O674728J5685150K204001m612241N744546
9245a0451920R485661o201462j7906870m559275J7438970K0850230P672587k050525
9237A4277396m205920o797949n346995Q361636K0238288Q089165j8246631k2538138
9229f169148M369721K6223795J2076066j9238088k7494624o916156J2353535J0404906
9221E610007j277240n519466l063193k610641m066096k472331J442954M148400
$$ plain form
9213 -7807606 -1586042 7336547 16451501 20540366 17792002 11458180 5204930 716918
9205 716918 -861767 28286 -533691 -5558262 -11357821 -11638794 -6495950 -914778 4411292
9196 4411292 12205803 18830502 16154588 5783358 407200 6068936 13739894 15018049
9188 15018049 15204901 21538641 28511655 26816105 19308515 15572590 16830296 18920881
9180 18920881 23681830 32384754 33692987 16395230 -8679836 -19280261 -14045253 -12484038
9172 -12484038 -19606901 -15434785 9472553 31464477 25116714 93001 -14186313 -9023752
9164 -9023752 200108 3606409 6535932 11097218 9803584 2181753 917913 14552347
9156 14552347 35364079 49780132 51990842 43985501 31102963 21147206 20011146 24451831
$$ packed form
9213g807606O221564Q922589R114954M088865k748364o333822o253250m488012
9205G16918j578685Q90053n61977n024571n799559k80973N142844N581172N326070
9196D411292P794511O624699k675914j0371230n376158N661736P670958J278155
9188A5018049J86852O333740O973014j695550p507590l735925J257706K090585
9180A8920881M760949Q702924J308233j7297757k5075066j0600425N235008J561215
9172a2484038p122863M172116K4907338K1991924o347763k5023713j4279314N162561
9164i023752R223860L406301K929523M561286j293634p621831j263840J3634434
9156A4552347K0811732J4416053K210710q005341j2882538r955757j136060M440685
$$ plain form
9148 24451831 24777296 16102941 1923142 -11763723 -18875202 -13545099 1213810 8280312
9140 8280312 -6069961 -30342608 -39615731 -30428197 -25211186 -36480720 -46830193 -36490164
9132 -36490164 -13275386 1303725 2792831 2758379 6258062 8866728 10683396 15619555
9124 15619555 19643244 15879904 9280010 10393949 15982073 12107364 -3344993 -17283131
9116 -17283131 -21524551 -20097753 -14961296 -2524788 11344298 11969732 -106735 -3718548
9108 -3718548 12476942 30220167 27569032 11720747 7621543 21126927 32152397 23587984
9100 23587984 2558896 -9233173 1961402 28758260 46527247 34819397 1190405
9093 1190405 -23126336 -19041097 -1831819 3326991 -3375568 -3275836 7140055 12613681
$$ packed form
9148B4451831L25465q674355j4179799j3686865p111479N330103J4758909P066502
9140H280312j4350273k4272647r273123R187534N217011j1269534j0349473J0340029
9132c6490164K3214778J4579111J489106l4452L499683K608666J816668M936159
9124A5619555M023689l763340o599894J113939N588124l874709j5452357j3938138
9116a7283131m241420J426798N136457J2436508J3869086O25434j2076467l611813
9108c718548J6195490J7743225k651135j5848285m099204J3505384J1025470q564413
9100B3587984k1029088j1792069J1194575K6796858J7768987j1707850l3628992
9093A190405k4316741M085239J7209278N158810o702559R9732J0415891N473626
$$ plain form
9085 12613681 7105007 1217306 -1696715 -12489611 -30360971 -33429860 -10682356 15596477
9077 15596477 19143072 7892517 10258882 30642151 42676632 27611045 -1599375
9070 -1599375 -20856855 -23002770 -15612448 -3095612 15213629 33347670 38052091 23497928
9062 23497928 457352 -13750940 -12301581 -2408496 6219809 10439072 9867648 1629362
9054 1629362 -14050839 -27384060 -27462060 -16150556 -4736319 2586012 11192463 20990155
9046 20990155 21715736 8503680 -9281249 -21712918 -29867818 -35204472 -28993388 -5603709
9038 -5603709 21420884 31518716 22208747 9071580 2836871 -223246 -4889721 -7182968
9030 -7182968 -2151634 7554953 15425969 17865904 14652922 7367692 -437433 -4649084
$$ packed form
9085A2613681n508674n887701k914021j0792896j7871360l068889K2747504K6278833
9077A5596477L546595j1250555K366365K0383269J2034481j5065587k9210420
9070a599375j9257480k145915P390322J2516836J8309241J8134041M704421j4554163
9062B3497928k3040576j4208292J449359R893085Q628305M219263n71424q238286
9054A629362j5680201j3333221p8000J1311504J1414237P322331Q606451R797692
9046B0990155P25581j3212056j7784929j2431669q154900n336654O211084K3389679
9038e603709K7024593J0097832r309969j3137167o234709l060117m666475k293247
9030g182968N031334R706587P871016K439935l212982p285230p805125m211651
$$ plain form
9022 -4649084 -3601179 1063933 5059020 2975097 -6064090 -13412271 -8898324 4307124
9014 4307124 12986817 15406714 25047282 44387869 51894782 31506106 1135008 -9501342
9006 -9501342 542085 9186101 10470457 19044646 35885942 40285501 24605796 10175843
8998 10175843 15000833 27867409 30456750 26350984 29445155 37448390 36468586 23851617
8990 23851617 9479655 -717647 -8592111 -14764465 -17150460 -15577188 -9705265 2919974
8982 2919974 19318951 27769885 20257452 2817247 -13085804 -22090491 -20896065 -2783564
8974 -2783564 31932085 66231695 79505160 68499726 47529698 31315600 24326696
8967 24326696 22587888 18913881 9561054 -21616 -824968 6493180 12760255 16512410
$$ packed form
9022d649084J047905M665112L995087k083923r039187p348181M513947J3205448
9014D307124Q679693K419897R640568J9340587P506913k0388676l0371098j0636350
9006i501342J0043427Q644016J284356Q574189J6841296M399559j5679705j4429953
8998A0175843M824990J2866576K589341m105766L094171Q003235r79804j2616969
8990B3851617j4371962j0197302p874464o172354k385995J573272N871923J2625239
8982B919974J6398977Q450934p512433j7440205j5903051r004687J194426J8112501
8974b783564L4715649L4299610J3273465j1005434k0970028j6214098o988904
8967B4326696j738808l674007r352827r582670q03352P318148O267075L752155
$$ plain form
8959 16512410 25537738 37133419 33865413 10619179 -9676892 -3710319 19929402 32956743
8951 32956743 23554748 4274646 -8726180 -8239663 5306157 21110750 19827629 -5184014
8943 -5184014 -33391163 -39803807 -26375658 -14198849 -11830337 -11774535 -12570068 -20245014
8935 -20245014 -28947042 -24365933 -9083869 -1887981 -7604510 -9900128 -386488 7291528
8927 7291528 1965686 -6592627 -5479835 2247455 8347285 13672003 19191645 17287866
8919 17287866 5496562 -4132638 -3418478 -3375763 -15651793 -30212769 -30255581 -21114159
8911 -21114159 -22890482 -36799235 -40649129 -22379215 270174 3526923 -11310840 -22639545
8903 -22639545 -17933650 -5791668 806791 2070746 6905997 17429613 26115112 27229948
$$ packed form
8959A6512410R025328J1595681l268006k3246234k0296071N966573K3639721J3027341
8951C2956743r401995j9280102j3000826M86517J3545820J5804593j283121k5011643
8943e184014k8207149o412644J3428149J2176809K368512N5802p95533p674946
8935b0245014q702028M581109J5282064P195888n716529k295618R513640P678016
8927G291528n325842q558313J112792P727290O099830N324718N519642j903779
8919A7287866j1791304r629200P14160M2715j2276030j4560976m2812R141422
8911b1114159j776323j3908753l849894J8269914K2649389L256749j4837763j1328705
8903b2639545M705895J2141982O598459J263955M835251J0523616Q685499J114836
$$ plain form
8895 27229948 23573328 19577797 13854187 3323952 -8603501 -12877792 -3452938 16205278
8887 16205278 33481076 34481186 17248183 -2447960 -5968975 5855468 13734317 5020219
8879 5020219 -13340195 -29666463 -40047715 -39458972 -19151225 13541051 31008538 20657092
8871 20657092 8612274 23458107 49298757 46197524 11494152 -14214751 -6183378
8864 -6183378 12671209 11330722 -5902808 -13814501 -4705615 6775664 6351458 -7188860
8856 -7188860 -25619090 -38338957 -40575564 -37390129 -33032076 -20093668 6723487 30705464
8848 30705464 28956506 8286590 47278 14423782 26984608 20289213 10694763 17728624
8840 17728624 32185926 35020918 27109755 19218880 10806937 147437 -1830370 9612638
$$ packed form
8895B7229948l656620l995531n723610j0530235j1927453m274291R424854J9658216
8887A6205278J7275798J000110j7233003j9696143l521015J1824443P878849q714098
8879E020219j8360414j6326268j0381252N88743K0307747L2692276J7467487j0351446
8871B0657092j2044818J4845833K5840650l101233l4703372k5708903Q031373
8864f183378J8854587j340487j7233530p911693R108886J1481279m24206j3540318
8856g188860j8430230j2719867k236607L185435M358053J2938408K6817155K3981977
8848C0705464j748958k0669916q239312J4376504J2560826o695395r594450P033861
8840A7728624J4457302K834992p911163p890875q411943j0659500j977807J1443008
$$ plain form
8832 9612638 16557525 4881172 -7895462 2165647 25042316 31127540 18026645 12586478
8824 12586478 28529730 50461898 61760763 63029064 58774394 48126949 34532884
8817 34532884 26057305 20720063 7508893 -14051953 -30298769 -32475844 -25196868 -14089208
8809 -14089208 -365206 9556391 5095537 -11925212 -24591787 -20795031 -6052258 7308530
8801 7308530 13954093 14701353 10716409 3426386 -4138873 -7353683 118063 20852758
8793 20852758 43506677 47580375 27632245 2910631 -8686551 -13884775 -24658004
8786 -24658004 -29366274 -9185331 23885053 35803330 18762960 1828583 6543924
8779 6543924 19144438 18890480 9607192 5974847 7197743 3745054 -1802172 904053
$$ packed form
8832I612638O944887j1676353j2776634J0061109K2876669O085224j3100895n440167
8824A2586478J5943252K1932168J1298865J268301m254670j0647445j3594065
8817C4532884q475579n337242j3211170k1560846j6246816k177075P278976J1107660
8809a4089208J3724002R921597m460854j7020749j2666575L796756J4742773J3360788
8801G308530O645563P47260l984944p290023p565259l214810P471746K0734695
8793B0852758K2653919M073698j9948130k4721614j1597182n198224j0773229
8786b4658004m708270K0180943L3070384J1918277j7040370j6934377M715341
8779F543924J2600514k53958r283288l632345J222896l452689n547226K706225
$$ plain form
8771 904053 11451129 19681465 21695725 23036081 27399176 30150012 22721884 1172541
8763 1172541 -25918031 -38524182 -23120598 8708189 30189750 31017890 26884587 32172064
8755 32172064 37557622 26585461 4312078 -6008055 7285820 29570508 36954645
8748 36954645 21469401 -2826195 -15774044 -11194272 -803705 1012374 -7441795 -17378718
8740 -17378718 -22066512 -21409684 -17640293 -12999908 -9325818 -5297043 1199811 4098196
8732 4098196 -7485628 -29099542 -37255019 -19854621 2372442 3753286 -8679582 -9540011
8724 -9540011 2184964 4514606 -7245951 -14424315 -11382656 -14279324 -25868649 -25400590
8716 -25400590 -6774307 5745322 -2398969 -11080561 -2328216 7122928 -2830853 -17268219
$$ packed form
8771I04053J0547076Q230336K014260J340356M363095K750836p428128k1549343
8763A172541k7090572j2606151J5403584L1828787K1481561Q28140m133303N287477
8755C2172064N385558j0972161k2273383j0320133J3293875K2284688P384137
8748C6954645j5485244k4295596j2947849M579772J0390567J816079q454169r936923
8740a7378718m687794O56828L769391M640385L674090M028775O496854K898385
8732D098196j1583824k1613914q155477J7400398K2227063J380844j2432868q60429
8724i540011J1724975K329642j1760557p178364L041659k896668j1589325M68059
8716b5400590J8626283J2519629q144291q681592Q752345R451144r953781j4437366
$$ plain form
8708 -17268219 -10906804 8061328 12051841 -1051573 -9048497 -2245181 10912604 27486894
8700 27486894 49494219 64892325 58282595 37713325 23782766 16190097 231693
8693 231693 -17153391 -11997545 13198708 24979477 7983369 -11622322 -5458098 19596352
8685 19596352 37808867 36572218 17584632 -13368068 -41768616 -47346815 -28838265
8678 -28838265 -11892280 -16770361 -30569399 -26436694 498288 30128172 40362435
8671 40362435 21624778 -19435287 -57551120 -62668815 -32085145 847378 4906632
8664 4906632 -12464275 -22790338 -18923456 -17658836 -26398995 -31781916 -23551915 -9762129
8656 -9762129 -2770928 -4664435 -11048657 -17021101 -15987053 -4217672 10129799 13379918
$$ packed form
8708a7268219O361415J8968132L990513j3103414p996924O803316J3157785J6574290
8700B7486894K2007325J5398106o609730k0569270j3930559p592669j5958404
8693B31693j7385084N155846K5196253J1780769j6996108j9605691O164224K5054450
8685A9596352J8212515j236649j8987586l0952700k8400548n578199J8508550
8678b8838265J6945985m878081j3799038M132705K6934982K9629884J0234263
8671D0362435j8737657m1060065l8115833n117695L0583670L2932523M059254
8664D906632j7370907j0326063L866882J264620q740159n382921Q230001J3789786
8656i762129O991201j893507o384222n972444J034048J1769381J4347471L250119
$$ plain form
8648 13379918 4456925 -3977950 -4363796 -2036212 -1373067 1921701 8382069 7701346 -6075416
8639 -6075416 -21504784 -22121141 -6260605 13210689 23704229 21272490 10768346 4513829
8631 4513829 13877035 34139884 44161058 29913794 2610164 -15605483 -17699545 -12716650
8623 -12716650 -6926942 1636233 11824049 16737490 13989887 7857794 1051449 -4818494
8615 -4818494 -1918432 16341291 39119492 44793890 28318286 7566373 -2907847 -8690450
8607 -8690450 -18156835 -25285678 -23026180 -19274652 -22676075 -23609207 -8487848 14330560
8599 14330560 23570904 17069937 14362864 26146621 40348331 43251098 37298823 30283974
8591 30283974 21217221 6979173 -6993176 -12663658 -10075603 -4703313 861292 6278340
$$ packed form
8648A3379918q922993q434875l85846K327584O63145L294768O460368o80723j3776762
8639f075416j5429368o16357J5860536J9471294J0493540k431739j0504144o254517
8631D513829R363206K0262849J0021174j4247264k7303630j8215647k094062M982895
8623a2716650N789708Q563175J0187816M913441k747603o132093o806345n869943
8615d818494K900062J8259723K2778201N674398j6475604k0751913j0474220n782603
8607h690450r466385p128843K259498L751528l401423r33132J5121359K2818408
8599A4330560R240344o500967k707073J1783757J4201710K902767n952275p014849
8591C0283974r066753j4238048j3972349n670482K588055N372290N564605N417048
$$ plain form
8583 6278340 8567071 3903067 -6720246 -16268484 -16020700 -3282119 12286438 14286760
8575 14286760 -2151601 -22110406 -29397696 -28167819 -33754472 -45903040 -47470378 -30321716
8567 -30321716 -6221841 11240452 20243856 22618272 18251662 12661497 13798236 15776846
8559 15776846 4198653 -14980982 -13797416 16840184 45533320 39338268 7959823
8552 7959823 -13058864 -10575998 -1135089 1546767 844934 910773 -1778723 -8779215 -17406263
8543 -17406263 -26917109 -33258128 -24057313 3260662 26017934 22414393 7779589 15987008
8535 15987008 44597840 51548738 16596231 -25241343 -31183830 -7699210 4383164
8528 4383164 -13203749 -38901132 -44316071 -23474874 9151519 33896116 39263572 31424137
$$ packed form
8583F278340K288731m664004j0623313r548238K47784J2738581J5568557K000322
8575A4286760j6438361j9958805p287290J229877n586653j2148568j567338J7148662
8567c0321716K4099875J7462293R003404K374416m366610n590165J136739J978610
8559A5776846j1578193j9179635J183566L0637600K8693136o195052l1378445
8552G959823k1018687K482866R440909K681856p01833O5839k689496p000492q627048
8543a7406263r510846o341019R200815K7317975K2757272l603541j4634804Q207419
8535A5987008K8610832O950898l4952507m1837574n942487K3484620J2082374
8528D383164j7586913k5697383n414939K0841197L2626393K4744597N367456p839435
$$ plain form
8520 31424137 29212891 41149788 51879441 41880305 16108435 -140832 6881509 23996642
8512 23996642 29916690 19534147 4983189 -973339 3149331 10645424 17119243 24046851
8504 24046851 30769474 28911979 13640124 -1823055 3381984 28625507 47044615 39475052
8496 39475052 20832938 18607870 34303224 44225217 34660140 16870490 5251006 -949703
8488 -949703 -6727224 -7310150 3295329 18905438 28000130 29122351 29438267 31025504
8480 31025504 28361881 18852194 7152426 -2366101 -10282841 -16822401 -18249044 -12791083
8472 -12791083 -5579101 -2256335 -153448 8206366 23184796 35654912 38414944 34719000
8464 34719000 31860946 30626555 26501226 18818755 12392953 10357985 11111687 12932207
$$ packed form
8520C1424137k211246J1936897J0729653r999136k5771870j6249267P022341J7115133
8512B3996642N920048j0382543j4550958n956528M122670P496093O473819O927608
8504B4046851O722623j857495j5271855j5463179N205039K5243523J8419108p569563
8496C9475052j8642114k225068J5695354R921993r565077j7789650j1619484o200709
8488i49703n777521n82926J0605479J5610109R094692J122221L15916J587237
8480C1025504k663623r509687j1699768r518527p916740o539560j426643N457961
8472a2791083P211982L322766K102887Q359814J4978430J2470116K760032l695944
8464C4719000k858054j234391m125329p682471o425802k034968P53702J820520
$$ plain form
8456 12932207 15961141 18233443 15756777 9568027 7384223 13955960 23802036 27964013
8448 27964013 24365689 16422551 4829398 -12016709 -29944631 -38656225 -32478218 -17488597
8440 -17488597 -4919512 119672 523515 -98721 -1591951 -2372093 4895338 25504250
8432 25504250 49766316 56333652 35944803 7261500 -1207526 15531968 34139206
8425 34139206 33332128 17704025 5974400 6967298 16718164 29967704 41556974 42150338
8417 42150338 27117104 8177470 2702656 10812169 15856773 9169895 312174 -1855073
8409 -1855073 -3721907 -12812370 -20360888 -11403178 12569459 32857578 34322641 18615159
8401 18615159 -1664562 -13839567 -11240244 2788904 15216518 14196011 2036975
$$ packed form
8456A2932207L028934K272302k476666o188750k183804O571737R846076M161977
8448B7964013l598324p943138j1593153j6846107j7927922q711594O178007J4989621
8440a7488597J2569085N039184M03843o22236j493230p80142P267431K0608912
8432B5504250K4262066O567336k0388849k8683303q469026J6739494J8607238
8425C4139206q07078j5628103j1729625R92898R750866J3249540J1589270N93364
8417D2150338j5033234j8939634n474814Q109513N044604o686878q857721k167247
8409a855073j866834r090463p548518Q957710K3972637K0288119J465063j5707482
8401A8615159k0279721j2175005K599323J4029148J2427614j020507j2159036
$$ plain form
8394 2036975 -7146399 -4320733 4305236 6249693 -1710790 -10457378 -9883437 -180618
8386 -180618 9833208 14334558 16602233 21453421 26088218 24702513 19270190 16188592
8378 16188592 12624180 -1174044 -22099714 -31053041 -19242932 -4593401 -7227742 -18760902
8370 -18760902 -14924716 6977259 24957033 26360827 22340250 22859982 19431693 5013350
8362 5013350 -7055359 -1181199 14841728 19978290 9714019 -427273 1448377 10837936
8354 10837936 18128204 20609699 20351342 18338707 14263100 8371592 2430958 126114
8346 126114 3611603 7758316 3661576 -7725541 -12224205 -42420 18538890 23934946
8338 23934946 10929080 -6481813 -12486901 -4901063 6325144 11280535 10759547 15315032
$$ packed form
8394B036975r183374K825666Q625969J944457p960483q746588N73941R702819
8386a80618J0013826M501350K267675M851188M634797j385705n432323l081598
8378A6188592l564412j3798224k0925670q953327J1810109J4649531k634341j1533160
8370a8760902L836186K1901975J7979774J403794m020577N19732l428289j4418343
8362E013350j2068709N874160J6022927N136562j0264271j0141292J875650R389559
8354A0837936P290268K481495k58357k012635m075607n891508n940634k304844
8346A26114L485489M146713m096740j1387117m498664J2181785J8581310N396056
8338B3934946j3005866j7410893o005088P585838J1226207M955391n20988M555485
$$ plain form
8330 15315032 30198070 43129879 36984692 15306953 930589 4070407 8239828 -1771824
8322 -1771824 -14598835 -10882650 6391465 18845262 20133834 17916310 16969576 18575081
8314 18575081 27868454 42880260 46486923 30488786 15840039 23079974 34896220 20920826
8306 20920826 -9220758 -16973401 3468748 17534628 9190402 2250339 9518011 6350040
8298 6350040 -21217479 -42788881 -29313762 656660 13761494 12325843 16532205 21181587
8290 21181587 9991099 -5057112 538377 19642112 23155680 6560644 -8999270
8283 -8999270 -16359002 -27017142 -38832677 -34845187 -16175209 -3436243 -2011742 3376344
8275 3376344 15688250 18165743 6613091 -223009 8167094 18446309 18163401 11737382
$$ packed form
8330A5315032J4883038J2931809o145187k1677739j4376364L139818M169421j0011652
8322a771824j2827011L716185J7274115J2453797J288572k217524r46734J605505
8314A8575081R293373J5011806L606663j5998137j4648747P239935J1816246j3975394
8306B0920826l0141584p752643K0442149J4065880q344226o940063P267672l167971
8298F350040k7567519k1571402J3475119K9970422J3104834j435651M206362M649382
8290B1181587j1190488j5048211N595489J9103735L513568j6595036j5559914
8283h999270p359732j0658140j1815535L987490J8669978J2738966J424501N388086
8275C376344J2311906K477493j1552652o836100Q390103J0279215k82908o426019
$$ plain form
8267 11737382 2977410 -13730787 -34398081 -41474890 -31196323 -22850902 -27573138 -29003689
8259 -29003689 -10557788 16600316 30345395 28339137 24996506 27588326 30637442 28580128
8251 28580128 23040788 20534225 27194169 40411714 45881806 32962624 11967026 2871546
8243 2871546 8119462 13189016 12912361 16037609 22022982 18006540 5656751 5794662
8235 5794662 24225055 36095882 20513623 -7815426 -18680413 -4131451 18838704
8228 18838704 31545287 27064058 11617790 2509551 13226211 33766747 40005024 27549895
8220 27549895 17254852 20953495 25327166 19907707 15169627 18031422 15732644 3153670
8212 3153670 417325 20039946 40304944 37370228 21830768 15013772 10602462 -6881558
$$ packed form
8267A1737382q759972j6708197k0667294p076809J0278567Q345421m722236j430551
8259b9003689J8445901K7158104J3745079k006258l342631K591820L049116k057314
8251B8580128n539340k506563O659944J3217545N470092j2919182k0995598r095480
8243B871546N247916N069554k76655L125248N985373m016442j2349789J37911
8235E794662J8430393J1870827j5582259k8329049j0864987J4548962K2970155
8228A8838704J2706583m481229j5446268r108239J0716660K0540536O238277j2455129
8220B7549895j0295043L698643M373671n419459m738080K861795k298778j2578974
8212C153670k736345J9622621K0264998k934716j5539460o816996m411310j7484020
$$ plain form
8204 -6881558 -24039321 -17191898 3224574 6271480 -7822688 -8855099 11138373 24754234
8196 24754234 13948239 -5021492 -10177052 -457905 14255194 26575186 28693486 16781847
8188 16781847 2378189 297569 5507791 3338515 -998095 9504987 28111890 29038946
8180 29038946 9956050 -4382796 -6640114 -17347231 -38755696 -38437590 -2554214 29519879
8172 29519879 16218371 -25391606 -44626007 -27186089 -5265238 -4842759 -15742030
8165 -15742030 -16563028 -3793244 11608306 20267023 19408963 11171293 1495355 -3144423
8157 -3144423 -124916 8043791 14326849 10688996 -2434957 -12114650 -8136790 236507
8149 236507 -3216957 -14092032 -11395390 8638329 24569817 22259038 12972026 9040396
$$ packed form
8204f881558j7157763O847423K0416472L046906j4094168j032411J9993472J3615861
8196B4754234j0805995j8969731n155560R719147J4713099J2319992K118300j1911639
8188A6781847j4403658k080620N210222k169276m336610J0503082J8606903R27056
8180B9038946j9082896j4338846k257318j0707117k1408465L18106L5883376L2074093
8172B9519879j3301508m1609977j9234401J7439918K1920851M22479j0899271
8165a5742030q20998J2769784J5401550Q658717q58060q237670r675938m639778
8157c144423L019507Q168707O283058l637853j3123953r679693L977860Q373297
8149B36507l453464j0875075K696642K0033719J5931488k310779r287012l931630
$$ plain form
8141 9040396 4799144 -3737051 -3271010 12898008 25022343 13601210 -9584171 -19871738
8133 -19871738 -15489143 -11611564 -11179716 -6769718 -1786802 -4260155 -6968369 1391455
8125 1391455 12274808 10163038 2752668 10633932 31431207 43063537 39724382 34208287
8117 34208287 26455372 4628287 -19724289 -15757129 16653556 37724603 25301061
8110 25301061 6650104 10545598 21343988 11903139 -5425183 482030 24379432 30817770
8102 30817770 10100159 -9257550 -6684871 4315716 4607677 -2724193 -5214167 -1995332
$$ packed form
8141I040396m241252q536195M66041J6169018J2124335j1421133k3185381j0287567
8133a9871738M382595L877579M31848M409998M982916k473353k708214Q359824
8125A391455J0883353k111770p410370P881264K0797275J1632330l339155n516095
8117C4208287p752915k1827085k4352576L967160L2410685K1071047j2423542
8110B5301061j8650957L895494J0798390r440849j7328322N907213K3897402O438338
8102C0817770k0717611j9357709K572679J1000587K91961p331870k489974L218835
$$ [...]
##END NTUPLES=NMR SPECTRUM
##END=
