##TITLE=31Pdec_DMAA0612
 CDCl3, 24 sc
 7.12.2021
##JCAMPDX= 6.0         $$ Bruker NMR JCAMP-DX V2.0
##DATA TYPE= NMR SPECTRUM
##DATA CLASS= NTUPLES
##ORIGIN= UXNMR, Bruker Analytische Messtechnik GmbH
##OWNER= root
$$ XWIN-NMR		Version 3.5
$$ Tue Dec  7 10:57:48 2021 Russian Standard Time (UT+4h)  she@DPX200
##.OBSERVE FREQUENCY= 81.013821
##.OBSERVE NUCLEUS= ^31P
##.ACQUISITION MODE= SIMULTANEOUS
##.ACQUISITION SCHEME= undefined
##.AVERAGES= 24
##.DIGITISER RES= 16
##SPECTROMETER/DATA SYSTEM= spect
##.PULSE SEQUENCE= zgpg30
##.SOLVENT NAME= CDCl3
##.SHIFT REFERENCE= (INTERNAL, CDCl3, 0, 248.564)
##AUDIT TRAIL= $$ (NUMBER, WHEN, WHO, WHERE, WHAT)
$$ ##TITLE= Audit trail, XWIN-NMR		Version 3.5
$$ ##JCAMPDX= 5.01
$$ ##ORIGIN= Bruker BioSpin GmbH
$$ ##OWNER= she
$$ F:/spectra/data/she/nmr/P31/1/pdata/1/auditp.txt
$$ ##AUDIT TRAIL=  $$ (NUMBER, WHEN, WHO, WHERE, WHAT)
(   1,<2021-12-07 10:56:27.59 +0400>,<she>,<DPX200>,
      <created by zg, POWCHK disabled, PULCHK disabled
       configuration hash MD5:
       00 E9 B6 7A A2 85 ED C7 34 08 36 98 17 FE 4E 26
       data hash MD5: 32K
       BC 52 60 19 5D B2 1C DF D3 93 38 0D D7 9B EB 49>)
(   2,<2021-12-07 10:56:37.50 +0400>,<she>,<DPX200>,
      <Start of raw data processing
       efp BC_mod = 2 LB = 1 FT_mod = 6 PKNL = 1 PHC0 = -9151.906 PHC1 = 31.86943 SI = 64K 
       data hash MD5: 64K
       1C 99 A4 7C C7 7D 60 4B D1 3A B6 60 30 D8 28 23>)
(   3,<2021-12-07 10:57:15.56 +0400>,<she>,<DPX200>,
      <pk PHC0 = 18.46146 PHC1 = -160.2 
       data hash MD5: 64K
       D5 E2 D6 7A FD 81 1B 8E 5F 37 B9 83 3C A5 CF B8>)
(   4,<2021-12-07 10:57:18.70 +0400>,<she>,<DPX200>,
      <abs ABSG = 5 
       data hash MD5: 64K
       8C EA 03 5D 01 8E 79 0C AA 5C F0 F8 81 FE AB 3A>)
$$ ##END=
$$ 
$$ hash MD5
$$ 7F E1 99 E7 A7 E0 5E 43 31 94 37 F7 E5 50 DF B1
##$RELAX= 
##$RELAX= 
##$RELAX= 
##$RELAX= 
##$RELAX= 
##$RELAX= 
##$RELAX= 
##$RELAX= 
$$ Bruker specific parameters
$$ --------------------------
##$DU= <F:/spectra>
##$EXPNO= 1
##$NAME= <P31>
##$PROCNO= 1
##$TYPE= <nmr>
##$USER= <she>
##$AMP= (0..31)
100 100 100 100 100 100 100 100 100 100 100 100 100 100 100 100 100 100 
100 100 100 100 100 100 100 100 100 100 100 100 100 100 
##$AQSEQ= 0
##$AQ_mod= 1
##$AUNM= <au_zg>
##$AUTOPOS= <>
##$BF1= 81.014009
##$BF2= 200.13
##$BF3= 200.13
##$BF4= 200.13
##$BF5= 200.13
##$BF6= 200.13
##$BF7= 200.13
##$BF8= 200.13
##$BYTORDA= 1
##$CFDGTYP= 0
##$CFRGTYP= 5
##$CHEMSTR= <none>
##$CNST= (0..31)
1 1 145 1 1 1 1 1 1 1 1 1 1 1 1 1 1 1 1 1 1 1 1 1 1 1 1 1 1 1 1 1 
##$CPDPRG= <waltz16>
##$CPDPRG1= <>
##$CPDPRG2= <waltz16>
##$CPDPRG3= <>
##$CPDPRG4= <mlev>
##$CPDPRG5= <mlev>
##$CPDPRG6= <mlev>
##$CPDPRG7= <mlev>
##$CPDPRG8= <mlev>
##$CPDPRGB= <>
##$CPDPRGT= <>
##$D= (0..31)
0 1 0 0 0 0 0 0 0 0 0 0.03 2e-05 3e-06 0 0 0 0 0 0 0 0 0 0 0 0 0 0 0 0 
0 0 
##$DATE= 1638860187
##$DBL= (0..7)
120 120 120 11 120 120 24 19 
##$DBP= (0..7)
150 150 150 150 150 150 150 150 
##$DBP07= 0
##$DBPNAM0= <>
##$DBPNAM1= <>
##$DBPNAM2= <>
$$ [...]
##$SUBNAM3= <"">
##$SUBNAM4= <"">
##$SUBNAM5= <"">
##$SUBNAM6= <"">
##$SUBNAM7= <"">
##$SUBNAM8= <"">
##$SUBNAM9= <"">
##$SW= 501.771253377433
##$SWIBOX= (0..15)
0 1 3 0 0 0 0 0 0 0 0 0 0 0 0 0 
##$SW_h= 40650.406504065
##$TD= 32768
##$TD0= 1
##$TE= 0
##$TE2= 300
##$TE3= 300
##$TEG= 300
##$TL= (0..7)
0 120 53 12 22 120 120 120 
##$TP= (0..7)
150 150 150 150 150 150 150 150 
##$TP07= 0
##$TPNAME0= <>
##$TPNAME1= <>
##$TPNAME2= <>
##$TPNAME3= <>
##$TPNAME4= <>
##$TPNAME5= <>
##$TPNAME6= <>
##$TPNAME7= <>
##$TPOAL= (0..7)
0.5 0.5 0.5 0.5 0.5 0.5 0.5 0.5 
##$TPOFFS= (0..7)
0 0 0 0 0 0 0 0 
##$TUNHIN= 0
##$TUNHOUT= 0
##$TUNXOUT= 0
##$USERA1= <user>
##$USERA2= <user>
##$USERA3= <user>
##$USERA4= <user>
##$USERA5= <user>
##$V9= 5
##$VALIST= <valist>
##$VCLIST= <CCCCCCCCCCCCCCC>
##$VD= 0
##$VDLIST= <DDDDDDDDDDDDDDD>
##$VPLIST= <PPPPPPPPPPPPPPP>
##$VTLIST= <TTTTTTTTTTTTTTT>
##$WBST= 1024
##$WBSW= 4
##$XGAIN= (0..3)
0 0 0 0 
##$XL= 0
##$YL= 0
##$YMAX_a= 1090
##$YMIN_a= -3556
##$ZGOPTNS= <>
##$ZL1= 120
##$ZL2= 120
##$ZL3= 120
##$ZL4= 120
##$ABSF1= 248.5645
##$ABSF2= -253.2056
##$ABSG= 5
##$ABSL= 3
##$ALPHA= 0
##$AQORDER= 0
##$ASSFAC= 0
##$ASSFACI= 0
##$ASSFACX= 0
##$ASSWID= 0
##$AUNMP= <proc_1d>
##$AZFE= 0.1
##$AZFW= 0.5
##$BCFW= 0
##$BC_mod= 2
##$BYTORDP= 0
##$COROFFS= 0
##$CY= -3
##$DATMOD= 1
##$DC= 0
##$DFILT= <>
##$DTYPP= 0
##$F1P= 0
##$F2P= 0
##$FCOR= 1
##$FTSIZE= 65536
##$FT_mod= 6
##$GAMMA= 0
##$GB= 0
##$INTBC= 1
##$INTSCL= 5.30512e-09
##$ISEN= 30
##$LB= 1
##$LEV0= 0
##$LPBIN= 0
##$MAXI= 10000
##$MC2= 0
##$MEAN= 0
##$ME_mod= 0
##$MI= 50
##$NCOEF= 0
##$NC_proc= -8
##$NLEV= 6
##$NOISF1= 182.463
##$NOISF2= 159.3651
##$NSP= 0
##$NTH_PI= 0
##$NZP= 0
##$OFFSET= 248.5645
##$PC= 4
##$PHC0= -9133.444
##$PHC1= -128.3306
##$PH_mod= 1
##$PKNL= yes
##$PPARMOD= 0
##$PSCAL= 0
##$PSIGN= 0
##$REVERSE= no
##$SF= 81.014009
##$SI= 65536
##$SIGF1= 159.3651
##$SIGF2= -187.1042
##$SINO= 113.3802
##$SIOLD= 16384
##$SREGLST= <1H.CDCl3>
##$SSB= 0
##$STSI= 65536
##$STSR= 0
##$SW_p= 40650.406504065
##$SYMM= 0
##$S_DEV= 0
##$TDeff= 32768
##$TDoff= 0
##$TI= <>
##$TILT= no
##$TM1= 0
##$TM2= 0
##$TOPLEV= 0
##$USERP1= <user>
##$USERP2= <user>
##$USERP3= <user>
##$USERP4= <user>
##$USERP5= <user>
##$WDW= 1
##$XDIM= 65536
##$YMAX_p= 342250430
##$YMIN_p= -34336122
$$ End of Bruker specific parameters
$$ ---------------------------------
##NTUPLES= NMR SPECTRUM
##VAR_NAME=  FREQUENCY,     SPECTRUM/REAL,   SPECTRUM/IMAG
##SYMBOL=    X,             R,               I
##VAR_TYPE=  INDEPENDENT,   DEPENDENT,       DEPENDENT
##VAR_FORM=  AFFN,          ASDF,            ASDF
##VAR_DIM=   65536,         65536,           65536
##UNITS=     HZ,            ARBITRARY UNITS, ARBITRARY UNITS
##FACTOR=    0.620285442955139, 1,           1
##FIRST=     20137.2065510759, 0,            0
##LAST=      -20513.1999529892, 0,           0
##MIN=       -20513.1999529892, -34336122,   0
##MAX=       20137.2065510759, 342250430,    0
$$ Real data points
##PAGE= N=1
##DATA TABLE= (X++(R..R)), XYDATA
$$ [...]
$$ plain form
13059 2065405 2441661 3179137 3053795 1928517 1303688 2063205 3137277 3216610 2202431
13050 2202431 357934 -1947340 -3089042 -1435250 1391352 1661928 -700866 -1209514
13042 -1209514 2117739 4762400 2362556 -2097594 -2473073 1468070 4357375 3531268
13034 3531268 1747947 1415415 1021059 -1177871 -3662182 -3974650 -2246710 -627456 -560569
13025 -560569 -1788258 -3131468 -3608806 -3361085 -3444927 -4189279 -4487212 -3573167 -2359910
13016 -2359910 -1777641 -1232114 -420486 -1034262 -4267011 -8049867 -9587680 -9471293 -10068304
13007 -10068304 -10776974 -8766509 -4426117 -2134064 -4520208 -8988503 -11088042 -8893210
12999 -8893210 -3275647 3537213 8614315 9876112 8144651 5923107 3867175 800001
$$ packed form
13059B065405L76256P37476j25342j125278o24829P59517J074072P9333j014179
13050B202431j844497k305274j141702J653792K826602K70576k362794n08648
13042a209514L327253K644661k399844m460150l75479L941143K889305q26107
13034C531268j783321l32532l94356k198930k484311l12468J727940J619254O6887
13025e60569j227689j343210m77338K47721q3842p44352k97933R14045J213257
13016b359910N82269N45527Q11628o13776l232749l782856j537813J16387n97011
13007a0068304p08670K010465M340392K292053k386144m468295k099539K194832
12999h893210N617563O812860N077102J261797j731461k221544k055932l067174
$$ plain form
12991 800001 -2665316 -3750945 -1671308 1027913 2584676 4225504 6544156 7111481
12983 7111481 4329232 712781 -879877 -1921813 -5441891 -10141131 -11238318 -6892728
12975 -6892728 -621367 2742931 1135040 -4175481 -9348503 -9707468 -3946327 3005569
12967 3005569 4338237 -585088 -5313004 -4527511 -247837 2100480 1167345 190050 1395355
12958 1395355 3237133 3364112 1720128 -201055 -1419492 -1731319 -1086107 217016 1322368
12949 1322368 1579368 1151456 589621 517821 1950050 5631422 10275148 12846269 12034721
12940 12034721 10314862 10721592 12559299 12716025 10585280 8548976 7455153 5325669
12932 5325669 1887152 569105 3188272 5749493 3427629 -2156924 -4830193 -2131460
$$ packed form
12991H00001l465317j085629K079637K699221J556763J640828K318652N67325
12983G111481k782249l616451j592658j041936l520078m699240j097187M345590
12975f892728O271361L364298j607891n310521n173022l58965N761141O951896
12967C005569J332668m923325m727916P85493M279674K348317r33135r77295J205305
12958A395355J841778J26979j643984j921183j218437l11827O45212J303123J105352
12949A322368K57000m27912n61835p1800J432229L681372M643726K571121q11548
12940A2034721j719859M06730J837707J56726k130745k036304j093823k129484
12932E325669l438517j318047K619167K561221k321864n584553k673269K698733
$$ plain form
12924 -2131460 2470294 5380509 6600797 7014097 6117559 4079903 2665454 2261261 904102
12915 904102 -1910643 -3388394 -1586437 1368946 2775575 3480680 5450806 7421649
12907 7421649 6633269 3618308 1623352 1817477 2363073 1989235 1357052 838657 -103352
12898 -103352 -1047271 -862741 -181202 -923883 -2834958 -3161962 -671859 2396809 3397563
12889 3397563 2229306 344857 -1201466 -1830046 -1382315 -718530 -722907 -611077 573254
12880 573254 1044170 -1775408 -6102141 -6856021 -3267203 -806753 -2927729 -5513928 -3541123
12871 -3541123 798231 1796480 -910201 -2901356 -2471432 -1695288 -1185194 139307 561590
12862 561590 -2769712 -7353486 -7032275 -1434902 2658672 1278771 -1870477 -3061135
$$ packed form
12924b131460M601754K910215J220288M13300q96538k037656j414449m04193j357159
12915I04102k814745j477751J801957K955383J406629P05105J970126J970843
12907G421649p88380l014961j994956J94125N45596l73838o32183n18395r42009
12898a03352r43919J84530O81539p42681j911075l27004K490103L068668J000754
12889C397563j168257j884449j546323o28580M47731O63785m377J11830J184331
12880E73254M70916k819578m326733p53880L588818K460450k120976k586199J972805
12871c541123M339354R98249k706681j991155M29924P76144N10094J324501M22283
12862E61590l331302m583774L21211N597373M093574j379901l149248j190658
$$ plain form
12854 -3061135 -4121883 -6297322 -5279015 1654054 8804075 9156159 4523110 1780004
12846 1780004 2062002 1107970 -1596205 -1940317 663031 1533338 -1575780 -4949294 -4824979
12837 -4824979 -2171525 -29893 163425 -1348764 -3075181 -2797005 -736575 -877115 -5157693
12828 -5157693 -8703423 -6591343 -2908338 -5202333 -11426194 -12180287 -6301791 -3149959
12820 -3149959 -6546445 -8012112 -1689564 4973323 3774663 -497356 705557 4182282
12812 4182282 825822 -7612245 -10188821 -3609126 4078886 6633861 5981206 4502499
12804 4502499 1079979 -2750420 -1747209 4409300 8857366 7408981 4128800 3777745
12796 3777745 5058138 5184124 5321604 7059862 8271403 6933907 5171479 5324530 5389822
$$ packed form
12854c061135j060748k175439J018307O933069P150021L52084m633049k743106
12846A780004K81998r54032k704175l44112K603348Q70307l109118l373514J24315
12837d824979K653454K141632J93318j512189j726417K78176K060430j40540m280578
12828e157693l545730K112080L683005k293995o223861p54093N878496L151832
12820c149959l396486j465667O322548O662887j198660m272019J202913L476725
12812D182282l356460q438067k576576O579695P688012K554975o52655j478707
12804D502499l422520l830399J003211O156509M448066j448385l280181l51055
12796C777745J280393J25986J37480J738258J211541j337496j762428J53051O5292
$$ plain form
12787 5389822 2530490 -1455838 -2064319 1994773 7420750 9675699 6641938 986247
12779 986247 -921563 4200944 10816362 10384704 3350728 -953892 1870026 4997020
12771 4997020 1931845 -3019997 -2411526 1949673 2379999 -2224993 -5478477 -3743508
12763 -3743508 -3845 2330739 3202432 3104711 1829796 475966 203527 -904900 -5169183
12754 -5169183 -9862660 -9526053 -3862303 1715716 3750174 3808661 3464444 1994428 474785
12745 474785 2279970 6920192 8679684 4718795 -58506 25717 3591114 5478995 4454360
12736 4454360 3003651 1981168 383974 -942038 -42487 2238986 3149915 2555181 2821218
12727 2821218 4343238 5069350 4757157 5644605 7763707 7484746 2914923 -2264566 -3092324
$$ packed form
12787E389822k859332l986328o08481M059092N425977K254949l033761n655691
12779I86247j907810N122507O615418m31658p033976m304620K823918L126994
12771D997020l065175m951842O08471M361199M30326m604992l253484J734969
12763c743508L739663K334584Q71693r7721j274915j353830k72439j108427m264283
12754e169183m693477L36607N663750N578019K034458N8487l44217j470016j519643
12745D74785J805185M640222J759492l960889m777301Q4223L565397J887881j024635
12736D454360j450709j022483j597194j326012Q99551K281473R10929n94734K66037
12727B821218J522020P26112l12193Q87448K119102k78961m569823n179489q27758
$$ plain form
12718 -3092324 371704 3475820 2457855 -2535773 -8645384 -12304794 -11075928 -5993919
12710 -5993919 -1798109 -2645273 -7512219 -11490509 -11405799 -8436931 -5589982 -4743685 -6105793
12701 -6105793 -8321203 -8906768 -6669568 -3701907 -2735184 -3039987 -2272206 -1893811 -5646738
12692 -5646738 -11577957 -11783950 -3687943 4159320 3178601 -2929300 -4225829 155565
12684 155565 1457983 -4386342 -10699468 -10414385 -4985077 396887 4122927 6500799
12676 6500799 5981489 1943077 -2231196 -3118941 -1650367 -281632 1131259 3323061
12668 3323061 4754454 4422379 4443531 6019916 5914895 1163266 -5516136 -9389299 -10107714
12659 -10107714 -9938786 -8515088 -4706062 -1287447 -1771199 -4253054 -4497075 -3724473 -6531879
$$ packed form
12718c092324L464028L104116j017965m993628o109611l659410J228866N082009
12710e993919M195810q47164m866946l978290Q4710K968868K846949Q46297j362108
12701f105793k215410n85565K237200K967661R66723l04803P67781L78395l752927
12692e646738n931219k05993Q096007P847263r80719o107901j296529M381394
12684A55565J302418n844325o313126K85083N429308N381964L726040K377872
12676F500799n19310m038412m174273q87745J468574J368735J412891K191802
12668C323061J431393l32075K1152J576385j05021m751629o679402l873163p18415
12659a0107714J68928J423698L809026L418615m83752k481855k44021P72602k807406
$$ plain form
12650 -6531879 -11620874 -12059729 -5909734 325086 1101515 -1327133 -2224164 -1155555 -150061
12641 -150061 506274 1102149 446411 -1914365 -4023186 -4310566 -3403167 -1514456 2568129
12632 2568129 7886835 10298751 7636575 2815037 -529991 -2271663 -3349088 -2801088
12624 -2801088 -310646 1697308 1920318 2980913 6712356 9751148 8096092 3470142
12616 3470142 555960 -27036 -1202320 -3535682 -4903444 -5072668 -5533976 -5231882 -1677157
12607 -1677157 3479198 5258807 2781630 825469 2185512 3353019 661073 -3485629
12599 -3485629 -4402480 -2201540 -758117 -1120642 -195975 4007192 9136550 11232209 8605081
12590 8605081 2590627 -3681094 -6911224 -5958481 -3244054 -2228236 -2958558 -2198503 1001539
$$ packed form
12650f531879n088995m38855O149995O234820P76429k428648q97031J068609J005494
12641a50061O56335N95875o55738k360776k108821k87380R07399J888711M082585
12632B568129N318706K411916k662176m821538l345028j741672j077425N48000
12624b801088K490442K007954K23010J060595L731443L038792j655056m625950
12616C470142k914182n82996j175284k333362j367762j69224m61308L02094L554725
12607a677157N156355J779609k477177j956161J360043J167507k691946m146702
12599c485629r16851K200940J443423l62525R24667M203167N129358K095659k627128
12590H605081o014454o271721l230130R52743K714427J015818p30322P60055L200042
$$ plain form
12581 1001539 2577765 -993317 -6382935 -6779528 -1318656 3354666 2334474 -1105443
12573 -1105443 -1280606 1501214 2854763 2128484 2664317 4916268 5110534 1867395 -967575
12564 -967575 -271103 1855644 2202038 1421753 1809017 3095288 3814144 4563844 6511919
12555 6511919 8240629 7208795 3365523 -977451 -3599254 -2939458 1546226 7258446
12547 7258446 9212560 5940276 2240492 2697914 5074347 4361476 958014 -539951
12539 -539951 790322 1516872 804138 1988372 6087232 9120648 7865840 3957800 446329
12530 446329 -1700710 -1920353 907506 5368295 7136086 4313883 201838 -1385974
12522 -1385974 -491290 1256784 3677340 6191644 6426058 3852033 1839728 2781310 3969323
$$ packed form
12581A001539J576226l571082n389618l96593N460872M673322j020192l439917
12573a105443j75163K781820J353549p26279N35833K251951J94266l243139k834970
12564i67575O96472K126747L46394p80285L87264J286271P18856P49700J948075
12555F511919J728710j031834l843272m342974k621803O59796M485684N712220
12547G258446J954114l272284l699784M57422K376433p12871l403462j497965
12539e39951J330273P26550p12734J184234M098860L033416j254808l908040l511471
12530D46329k147039k19643K827859M460789J767791k822203m112045j587812
12522a385974Q94684J748074K420556K514304K34414k574025k012305R41582J188013
$$ plain form
12513 3969323 1889293 -2031201 -4007327 -4069012 -5221874 -7792559 -9033072 -7882470
12505 -7882470 -6269030 -5797633 -6361946 -7748750 -9588966 -10123273 -7955365 -4521197 -2048074
12496 -2048074 -136768 2335183 3326531 161065 -4650913 -5234167 -627809 3620917
12488 3620917 3513183 1616809 1909627 3802059 4160099 2002626 -1731243 -6325788 -10231835
12479 -10231835 -10301419 -5387864 843912 3691947 2949611 2160017 3372438 5161991 5336648
12470 5336648 3545796 1445263 1465705 4563207 8236940 8407881 4655271 1576239 2902735
12461 2902735 6316542 6913036 4167623 2004283 2736755 4586233 5398722 5468881 5580742
12452 5580742 4788257 1779461 -2765428 -6331391 -6764050 -4255235 -1511780 -1265968 -2935849
$$ packed form
12513C969323k080030l920494j976126o1685j152862k570685j240513J150602
12505g882470J613440M71397n64313j386804j840216n34307K167908L434168K473123
12496b048074J911306K471951R91348l165466m811978n83254M606358M248726
12488C620917j07734j896374K92818J892432L58040k157473l733869m594545l906047
12479a0231835o9584M913555O231776K848035p42336p89594J212421J789553J74657
12470E336648j790852k100533K0442L097502L673733J70941l752610l079032J326496
12461B902735L413807N96494k745413k163340P32472J849478Q12489P0159J11861
12452E580742p92485l008796m544889l565963m32659K508815K743455K45812j669881
$$ plain form
12443 -2935849 -2979905 272795 3796353 3774090 632874 -2448333 -4414720 -6113441 -6291418
12434 -6291418 -2472108 3734896 6804126 4522744 1209035 1415533 3824651 4429197
12426 4429197 3069257 3014409 5338195 7369594 6741704 4217929 1985096 1102606 1327873
12417 1327873 2153909 3206532 4068914 4137700 2804265 147983 -2567196 -3809119 -3396882
12408 -3396882 -2482277 -1777292 -699704 1486778 4540669 7349351 8333643 6167916 1622289
12399 1622289 -1664541 -456659 3788368 6183585 4512454 1661125 1142513 2803495
12391 2803495 4286259 4192288 2179010 -1457315 -4255063 -2363278 4343538 10159476
12383 10159476 9779675 4965953 1692959 2157581 3477821 3465771 3352095 4348730 5343955
$$ packed form
12443b935849m4056L252700L523558k2263l141216l081207j966387j698721j77977
12434f291418L819310O207004L069230k281382l313709K06498K409118O04546
12426D429197j359940n4848K323786K031399o27890k523775k232833q82490K25267
12417A327873Q26036J052623Q62382O8786j333435k656282k715179j241923M12237
12408c396882R14605P04985J077588K186482L053891K808682R84292k165727m545627
12399A622289l286830J207882M245027K395217j671131k851329n18612J660982
12391B803495J482764r3971k013278l636325k797748J891785O706816N815938
12383A0159476l79801m813722l272994M64622J320240j2050j13676R96635R95225
$$ plain form
12374 5343955 5239575 4591805 3655369 1510870 -1286679 -1647220 2245391 7605322 9850474
12365 9850474 8052905 5451117 4646424 4612722 3586392 2913079 5202040 9004864 9039696
12356 9039696 3709864 -878182 1592669 8114263 9599605 3334393 -3699045 -5195138
12348 -5195138 -3126207 -2119444 -2106875 -1042908 -58840 -656900 -788065 845691 543224
12339 543224 -4232600 -8423779 -6483178 -2416717 -3893273 -8763134 -7799876 -405132
12331 -405132 3637943 58509 -3350598 -353592 3855189 2832589 196158 2644529
12323 2644529 8085577 9378872 5870676 3154289 3778343 5188060 5359264 4630339 3199937
12314 3199937 1519087 1467918 3137963 3113122 22576 -1896082 263346 1882513 -1957555
$$ packed form
12374E343955j04380o47770r36436k144499k797549l60541L892611N359931K245152
12365I850474j797569k601788q04693l3702j026330o73313K288961L802824L4832
12356I039696n329832m588046K470851O521594J485342o265212p033438j496093
12348e195138K068931J006763J2569J063967R84068n98060j31165J633756l02467
12339E43224m775824m191179J940601M066461j476556m869861R63258P394744
12331d05132M043075l579434l409107K997006M208781j022600k636431K448371
12323B644529N441048J293295l508196k716387O24054J409717J71204p28925j430402
12314C199937j680850n1169J670045k4841l090546j918658K159428J619167l840068
$$ plain form
12305 -1957555 -7069149 -5966004 -183431 2186584 -227513 -919647 2087335 2456988
12297 2456988 -3326667 -9591714 -10107888 -6332783 -3180481 -2290462 -3135237 -5532527 -7431800
12288 -7431800 -5166454 433949 2982430 -582265 -4747468 -3348373 1686324 4401091
12280 4401091 3738390 2829990 2259806 64832 -2876268 -3048285 129388 3295931 4009766
12271 4009766 3202215 2577421 2494586 2732223 3058341 2886280 2063494 1667834 2514168 3610928
12261 3610928 3586890 2622500 1535567 446193 -10364 1841375 5660194 7485105 4281646
12252 4281646 -1291017 -3859162 -2023983 1149510 3267007 4431470 4408747 2107680
12244 2107680 -1580149 -4114831 -5329916 -7541333 -10446611 -9736234 -3150786 5187226
$$ packed form
12305a957555n111594J103145N782573K370015k414097o92134L006982L69653
12297B456988n783655o265047n16174L775105L152302Q90019q44775k397290j899273
12288g431800K265346N600403K548481l564695m165203J399095N034697K714767
12280D401091o62701r08400n70184k194974k941100j72017L177673L166543P13835
12271D009766q07551o24794q2835K37637L26118j72061q22786l95660Q46334J096760
12261C610928k4038r64390j086933j089374m56557J851739L818819J824911l203459
12252D281646n572663k568145J835179L173493K117497J164463k2723k301067
12244B107680l687829k534682j215085k211417k905278P10377O585448Q338012
$$ plain form
12236 5187226 9535463 9422094 8460531 7853211 5149967 -457724 -5464989 -6387614 -4282235
12227 -4282235 -2820082 -3383453 -4325943 -4224515 -3398829 -2311893 -898647 12249 -1015295
12218 -1015295 -3252838 -3608792 -842429 2126310 2255736 752894 658389 1844902 2014760
12209 2014760 1541873 3033714 6151756 7261800 5078346 2526612 1693250 1055858 -432322
12200 -432322 -754537 935571 1460392 -1339881 -3969448 -2045248 2484161 3492593 -895859
12191 -895859 -6156620 -7524367 -5002078 -2047517 -1753233 -4426484 -7282681 -7067229 -4188691
12182 -4188691 -2591603 -3946442 -4679509 -1665136 2003028 1330552 -2466550 -3454383 73975
12173 73975 3570302 3685753 2606628 3327622 5056689 5767316 5935077 7013133 8456746
$$ packed form
12236E187226M348237j13369r61563o07320k703244n607691n007265r22625K105379
12227d282235J462153n63371r42490J01428Q25686J086936J413246R10896j027544
12218a015295k237543l55954K766363K968739J29426j502842r4505J186513J69858
12209B014760m72887J491841L118042J110044k183454k551734q33362o37392j488180
12200d32322l22215J690108N24821k800273k629567J924200M529409J008432m388452
12191h95859n260761j367747K522289K954561K94284k673251k856197K15452K878538
12182d188691J597088j354839p33067L014373L668164o72476l797102r87833L528358
12173G3975L496327J15451j079125P20994J729067P10627J67761J078056J443613
$$ plain form
12164 8456746 8705924 7686180 6446202 5303543 3742706 1579068 -476944 -1093873
12156 -1093873 507721 2921970 3193322 614252 -1479399 -3657 3173133 3868994
12148 3868994 1732289 -52654 -513186 -1893661 -4668455 -6076181 -4753350 -2732768
12140 -2732768 -1422822 410363 2887658 3226620 221626 -2762312 -2041333 1554016
12132 1554016 4390478 4401934 1897758 -1616416 -3577736 -1754764 2577028 5107153
12124 5107153 3805862 1325678 570893 828527 305688 -498796 -406872 171952 1028926
12115 1028926 3463639 7225959 9036947 7199825 4983366 5970051 8357576 7592836
12107 7592836 2906624 -2356477 -5432289 -5722468 -3150777 1364237 4698219 4293555
$$ packed form
12164H456746K49178j019744j239978j142659j560837k163638k056012o16929
12156a093873J601594K414249K71352k579070k093651J475742L176790O95861
12148C868994k136705j784943m60532j380475k774794j407726J322831K020582
12140b732768J309946J833185K477295L38962l004994k983938P20979L595349
12132A554016K836462J1456k504176l514174j961320J822972M331792K530125
12124E107153j301291k480184p54785K57634n22839q04484R1924N78824Q56974
12115A028926K434713L762320J810988j837122k216459R86685K387525p64740
12107G592836m686212n263101l075812k90179K571691M515014L333982m04664
$$ plain form
12099 4293555 1713256 525169 1302071 1674156 817228 796869 3225123 6853893 8851711
12090 8851711 7277938 2717981 -1662357 -2820082 -1459862 -1334281 -4132829 -7373512
12082 -7373512 -8399367 -7620567 -6447082 -5232187 -4745734 -5871187 -6240827 -2071080 4366175
12073 4366175 5234389 -1049268 -5268627 -599578 6343754 5796360 366500 -86285 4763607
12064 4763607 5949586 1156068 -1708929 1511316 4904657 3717637 2036555 4349336
12056 4349336 7683978 7736544 6218978 6537399 7491149 6429931 4158595 2099657 -1164750
12047 -1164750 -6119984 -9102394 -7239201 -3178783 -1013696 -785896 -472567 157852 1106772
12038 1106772 3774598 7401658 7670381 2740188 -2904525 -4509800 -3323226 -2789075
$$ packed form
12099D293555k580299j188087P76902L72085q56928k0359K428254L628770J997818
12090H851711j573773m559957m380338j157725J360220J25581k798548l240683
12082g373512j025855P78800J173485J214895M86453j125453l69640M169747O437255
12073D366175Q68214o283657m219359M669049O943332n47394n429860m52785M849892
12064D763607J185979m793518k864997L220245L393341j187020j681082K312781
12056D349336L334642N2566j517566L18421R53750j061218k271336k058938l264407
12047a164750m955234k982410J863193M060418K165087K27800L13329O30419R48920
12038A106772K667826L627060K68723m930193n644713j605275J186574N34151
$$ plain form
12030 -2789075 -2340932 142661 2915873 2737032 581421 151373 2163330 4220333 4956988
12021 4956988 4776565 4067097 3778660 5715092 9281902 10525578 7571094 4014572 3344249
12012 3344249 3332663 310203 -4203987 -6225290 -6015693 -6600573 -7515072 -5689511 -1584174
12003 -1584174 820313 -97489 -1986503 -2333101 -243578 4456220 9999509 11770163
11995 11770163 6844668 -1221780 -5833946 -4841612 -1476163 709594 454283 -1921929
11987 -1921929 -4188160 -2850053 2332201 6369939 4982452 105036 -3899484 -6184123
11979 -6184123 -7530959 -6606841 -3366163 -2077138 -4737842 -5657952 -8097 6303805
11971 6303805 4347879 -3271500 -5810955 -807577 3690839 3219853 2067428 2755071
$$ packed form
12030b789075M48143K483593K773212j78841k155611m30048K011957K057003P36655
12021D956988j80423p09468k88437J936432L566810J243676k954484l556522o70323
12012C344249j1586l022460m514190k021303K09597n84880r14499J825561M105337
12003a584174K404487r17802j889014l46598K089523M699798N543289J770654
11995A1770163m925495q066448m612166R92334L365449K185757k55311k376212
11987a921929k266231J338107N182254M037738j387487m877416m004520k284639
11979f184123j346836R24118L240678J289025k660704r20110N649855O311902
11971F303805j955926p619379k539455N003378M498416m70986j152425O87643
$$ plain form
11963 2755071 1357045 -3243645 -5337443 -2129877 996137 -450523 -3384961 -3931209
11955 -3931209 -3526314 -3818358 -2715866 -151148 -610106 -5000112 -7146215 -3727351 -546237
11946 -546237 -2909469 -6776264 -6308613 -3645265 -3468868 -3684099 7310 4889582 5359791
11937 5359791 2873601 3226593 6328396 6844280 3400449 -381986 -2744509 -4675576
11929 -4675576 -5255163 -3019388 -819495 -2510564 -5889221 -5842267 -3411684 -4096351 -7498982
11920 -7498982 -6873312 -196908 5963036 6058971 2560232 514428 621032 833284 462363
11911 462363 -294189 -1635332 -2853707 -2677737 -2145562 -3813621 -7043788 -7719795 -3938269
11902 -3938269 1520422 5538876 7795394 8370714 6303700 2466498 220764 955340
$$ packed form
11963B755071j398026m600690k093798L207566L126014j446660k934438n46248
11955c931209M04895k92044J102492K564718m58958m390006k146103L418864L181114
11946e46237k363232l866795M67651K663348J76397k15231L691409M882272M70209
11937E359791k486190L52992L101803N15884l443831l782435k362523j931067
11929d675576n79587K235775K199893j691069l378657M6954K430583o84667l402631
11920g498982O25670O676404O159944R5935l498739k045804J06604K12252l70921
11911D62363p56552j341143j218375J75970N32175j668059l230167o76007L781526
11902c938269N458691M018454K256518N75320k067014l837202k245734P34576
$$ plain form
11894 955340 2057264 1366729 524024 1537704 2908059 1962258 -986137 -3346483 -3662074
11885 -3662074 -2354491 -424311 987137 1033705 321664 152094 -58255 -2239907 -5468468
11876 -5468468 -5325439 173743 6516382 7743138 4031255 808954 1008258 1960128 667610
11867 667610 -1377920 -1044339 878265 312068 -3970327 -7956364 -7755740 -5137326 -4974831
11858 -4974831 -8168462 -10418560 -8393766 -3922017 -687596 478071 1042765 1780426
11850 1780426 2601239 3617590 4215462 2733856 -794971 -3449570 -3370364 -2863632 -4556594
11841 -4556594 -6390080 -4256441 1488025 6103826 6685810 4667440 2238491 -130928
11833 -130928 -2170072 -2951424 -2272573 -689075 1778932 4798556 6385712 5292478 3907046
$$ packed form
11894I55340J101924o90535q42705J013680J370355r45801k948395k360346l15591
11885c662074J307583J930180J411448M6568p12041j69570k10349k181652l228561
11876e468468J43029N499182O342639J226756l711883l222301J99304R51870j292518
11867F67610k045530L33581J922604n66197m282395l986037K00624K618414J62495
11858d974831l193631k250098K024794M471749L234421J165667N64694P37661
11850A780426Q20813J016351N97872j481606l528827k654599P9206N06732j692962
11841d556594j833486K133639N744466M615801N81984k018370k428949k369419
11833a30928k039144p81352O78851J583498K468007L019624J587156j093234j385432
$$ plain form
11824 3907046 5352382 8318531 8644481 5760448 3333893 3281827 3546388 2643034 2036341
11815 2036341 2543043 2427577 967119 371939 2141315 4557254 5647459 5819529 5902136
11806 5902136 5336218 3850217 2284894 616117 -1876823 -3634261 -1820290 2368883
11798 2368883 3717234 457182 -2616286 -1345519 1745066 2259887 867548 909329 2145201
11789 2145201 1894428 484786 721643 2970550 4978741 5738909 5691184 4072464 104520
11780 104520 -3888202 -4627191 -2735790 -1506937 -1369919 -130589 1375197 -739866 -6328587
11771 -6328587 -9226414 -5291319 1581362 5119631 5284491 6805668 10764188 12558546
11763 12558546 8849839 2668692 -351375 1344279 4342290 4951879 2931481 805759
$$ packed form
11824C907046J445336K966149L25950k884033k426555n2066K64561r03354o06693
11815B036341N06702j15466j460458n95180J769376K415939J090205J72070Q2607
11806E902136n65918j486001j565323j668777k492940j757438J813971M189173
11798B368883J348351l260052l073468J270767L090585N14821j392339M1781J235872
11789B145201k50773j409642K36857K248907K008191P60168m7725j618720l967944
11780A04520l992722p38989J891401J228853J37018J239330J505786k115063n588721
11771f328587k897827L935095O872681L538269J64860J521177L958520J794358
11763A2558546l708707o181147l020067J695654K998011O09589k020398k125722
$$ plain form
11755 805759 865140 3008951 4784016 3637019 -143253 -3058707 -2068423 1643365 4034281
11746 4034281 3201225 967561 -786165 -2531002 -4352777 -3809058 474344 5189639
11738 5189639 6120166 4343658 4458781 6973308 7186402 2675377 -2669579 -4409628 -3547852
11729 -3547852 -3548480 -4231971 -2643557 1250498 3644884 2051086 -1340013 -2499807 -316625
11720 -316625 2569654 3259889 2018379 1497898 2654972 2965791 43437 -4234148 -5527223
11711 -5527223 -2497115 1915764 4390040 3780711 63371 -5894121 -10971435 -11627738
11703 -11627738 -8251735 -4702677 -2656267 16660 3976269 5760588 3003314 -1293436
11695 -1293436 -2842124 -1559145 44199 1161585 2077597 1771867 -278063 -1832359
$$ packed form
11755H05759N9381K143811J775065j146997l780272k915454R90284L711788K390916
11746D034281q33056k233664j753726j744837j821775N43719M283402M715295
11738E189639R30527j776508J15123K514527K13094m511025n344956j740049Q61776
11729c547852o28o83491J588414L894055K394386j593798l391099j159794K183182
11720c16625K886279O90235j241510n20481J157074L10819k922354m277585j293075
11711e527223L030108M412879K474276o09329l717340n957492n077314o56303
11703a1627738L376003L549058K046410K672927L959609J784319k757274m296750
11695a293436j548688J282979J603344J117386R16012l05730k049930j554296
$$ plain form
11687 -1832359 -765518 1481495 2216814 1253887 -420269 -3102692 -6236919 -6798246 -3836083
11678 -3836083 -1644147 -3636907 -5989856 -3164421 2654019 4438713 1271321 -917717
11670 -917717 663829 2489046 2447391 3196151 5552776 5616635 1767252 -1674192 -1433280
11661 -1433280 -208259 -663714 -137251 3870425 7995447 8259117 6709774 7045360 7448519
11652 7448519 4199509 -640410 -2105905 -797145 -1288377 -3296735 -2023076 2623637
11644 2623637 4692761 1499090 -2608618 -3819484 -3552348 -2864277 977947 7998820
11636 7998820 11699204 7572700 884028 -476298 2378177 1778593 -4279542 -9621267
11628 -9621267 -9564329 -6373934 -3669214 -1260215 1940486 4482958 4812182 3860067 2766750
$$ packed form
11687a832359J066841K247013P35319r62927j674156k682423l134227n61327K962163
11678c836083K191936j992760k352949K825435N818440J784694l167392k189038
11670i17717J581546J825217m1655P48760K356625O3859l849383l441444K40912
11661a433280J225021m55455N26463M007676M125022K63670j549343L35586M03159
11652G448519l249010m839919j465495J308760m91232k008358J273659M646713
11644B623637K069124l193671m107708j210866K67136O88071L842224P020873
11636G998820L700384m126504o688672j360326K854475n99584o058135n341725
11628i621267N6938L190395K704720K408999L200701K542472L29224r52115j093317
$$ plain form
11619 2766750 884988 -1854121 -3534483 -3377000 -3304736 -4116708 -3303117 497878 4052265
11610 4052265 4062555 2358485 2604066 4293787 4489359 3470505 3649408 4323279 2916413
11601 2916413 630720 1157093 3949065 4731414 3023281 2650846 3654130 989142 -5894719
11592 -5894719 -9530906 -5194878 1263968 2346317 140034 1398946 5667400 6714237
11584 6714237 3433874 590544 -587767 -3691275 -8000807 -6887047 1359886 8592486
11576 8592486 7561613 1961944 285122 3774661 6397434 4477279 668758 -1111995
11568 -1111995 -173025 1932368 3718652 4527068 4825121 5756251 7327150 8077431 7660301
11559 7660301 7770782 8683807 7378649 2125457 -3310651 -4104861 -1552472 -1120802 -3868452
$$ packed form
11619B766750j881762k739109j680362J57483P2264q11972Q13591L800995L554387
11610D052265J0290j704070K45581J689721J95572j018854J78903O73871j406866
11601B916413k285693N26373K791972P82349j708133l72435J003284k664988o883861
11592e894719l636187M336028O458846J082349k206283J258912M268454J046837
11584F714237l280363k843330j178311l103508m309532J113760Q246933P232600
11576H592486j030873n599669j676822L489539K622773j920155l808521j780753
11568a111995R38970K105393J786284Q08416K98053R31130J570899P50281m17130
11559G660301J10481R13025j305158n253192n436108p94210K552389M31670k747650
$$ plain form
11550 -3868452 -5034652 -1977252 1721375 2296236 1353488 2095903 3632154 3061799 803429
11541 803429 -299552 257135 686220 803394 2007887 3761357 3917687 2740019 2897530
11532 2897530 4807801 5524697 3359462 246563 -1933255 -4027850 -6575939 -7294948
11524 -7294948 -4501490 -656836 704777 -14073 310933 2392921 3798707 2945524 982922
11515 982922 -451848 -1199138 -2169761 -4477755 -8481481 -12209047 -11980928 -6925708 -1723841
11506 -1723841 -1771854 -6106324 -8462257 -5532080 -841145 464464 -2287416 -5829004
11498 -5829004 -7321064 -6635775 -5631721 -6101598 -7530976 -7028551 -3005455 1669229 2623689
11489 2623689 -221888 -2783473 -2805475 -2321737 -3435361 -5182944 -5998898 -6052669 -5463372
$$ packed form
11550c868452j166200L057400L698627N74861r42748P42415J536251n70355k258370
11541H03429j102981N56687M29085J17174J204493J753470J56330j177668J57511
11532B897530J910271P16896k165235l112899k179818k094595k548089p19009
11524g294948K793458L844654J361613p18850L25006K081988J405786q53183j962602
11515I82922j434770p47290r70623k307994m003726l727566K28119N055220N201867
11506a723841m8013m334470k355933K930177M690935J305609k751880l541588
11498e829004j492060O85289J004054m69877j429378N02425M023096M674684R54460
11489B623689k845577k561585k2002M83738j113624j747583q15954n3771N89297
$$ plain form
11480 -5463372 -3321302 -387660 409294 -1497973 -2437303 -58137 2196774 -26271
11472 -26271 -4816928 -6190356 -2724896 318851 -1719530 -6755310 -8732808 -4855981
11464 -4855981 1506287 4784695 3183582 113687 -439435 1148069 1282322 -1569997
11456 -1569997 -5144062 -6894528 -6674023 -5549991 -4656256 -5695127 -9458991 -13027150
11448 -13027150 -11943535 -6559911 -2528535 -3097801 -4789285 -3316952 102160 1874566
11440 1874566 2110515 3348802 5430426 5709754 3113168 -1027985 -4732612 -5701341 -2333202
11431 -2333202 3069339 5089121 2083333 -1127038 -725795 173776 -2367192 -5432691
11423 -5432691 -3841023 907500 3087266 1722365 79870 -1728989 -5825143 -9366711
$$ packed form
11480e463372K142070K933642P96954j907267r39330K379166K254911k223045
11472b6271m790657j373428L465460L043747k038381n035780j977498L876827
11464d855981O362268L278408j601113l069895n53122J587504J34253k852319
11456a569997l574065j750466K20505J124032Q93735j038871l763864l568159
11448a3027150J083615N383624M031376n69266j691484J472333L419112J772406
11440A874566K35949J238287K081624K79328k596586m141153l704627r68729L368139
11431b333202N402541K019782l005788l210371M01243Q99571k540968l065499
11423e432691J591668M748523K179766j364901j642495j808859m096154l541568
$$ plain form
11415 -9366711 -6640259 1286834 6797210 6483507 4157148 2188220 -1837200 -7582096
11407 -7582096 -9416938 -5188035 -321193 927582 1517111 4372004 5820551 2098353
11399 2098353 -3147218 -4214679 -1957266 -879483 -1240926 -322143 1247963 723887 -1024965
11390 -1024965 -793316 1213693 2106568 1625625 1767243 2189901 1037427 -405828 999063
11381 999063 4505229 5965241 4329216 2940106 3614439 3945136 1841200 -1287261 -3645298
11372 -3645298 -5747341 -7672641 -6607839 -313623 8225779 12503792 9220640 1955703
11364 1955703 -2527887 -1349528 1738091 1215065 -3178152 -6070728 -3509330 1945517
11356 1945517 4776904 3113598 -588801 -3733343 -5243910 -3987948 625007 5957551
$$ packed form
11415i366711K726452P927093N510376l13703k326359j968928m025420n744896
11407g582096j834842M228903M866842J248775N89529K854893J448547l722198
11399B098353n245571j067461K257413J077783l61443R18783J570106n24076j748852
11390a024965K31649K007009Q92875m80943J41618M22658j152474j443255J404891
11381I99063L506166J460012j636025j389110O74333L30697k103936l128461k358037
11372c645298k102043j925300J064802O294216Q539402M278013l283152p264937
11364A955703m483590J178359L087619n23026m393217k892576K561398N454847
11356A945517K831387j663306l702399l144542j510567J255962M612955N332544
$$ plain form
11348 5957551 7448018 4137021 532262 1298668 5850936 9844241 10417420 7899877
11340 7899877 3548422 -1553199 -5222536 -4658799 74855 4628766 4569829 428280 -3444230
11331 -3444230 -4659687 -4856790 -5665743 -5781010 -3858464 -1645052 -1467915 -2484105 -2485797
11322 -2485797 -1976486 -2950983 -4490589 -3380147 926803 5418228 7764214 8218317 7300592
11313 7300592 5167780 3508515 4263943 5988665 5410901 3139137 3414886 7270771 10718252
11304 10718252 11176907 10607541 10224116 7604417 2187191 -1674680 -1179916 166134 -1341354
11295 -1341354 -3335161 -2203555 150114 78888 -1119705 -515483 -73141 -2873438 -5643622
11286 -5643622 -2940469 2840526 3958487 -462166 -3072954 -187430 3100879 2108743
$$ packed form
11348E957551J490467l310997l604759P66406M552268L993305N73179k517543
11340G899877m351455n101621l669337N63737M733654M553911n8937m141549l872510
11331c444230j215457j97103q08953j15267J922546K213412J77137j016190j692
11322b485797N09311r74497j539606J110442M306950M491425K345986M54103r17725
11313G300592k132812j659265P55428J724722n77764k271764K75749L855885L447481
11304A0718252M58655n69366l83425k619699n417226l861871M94764J346050j507488
11295a341354j993807J131606K353669p1226j198593O04222M42342k800297k770184
11286e643622K703153N780995J117961m420653k610788K885524L288309r92136
$$ plain form
11278 2108743 -563963 -1009524 -623954 -2348897 -5080429 -6253404 -6460782 -7516204 -8674620
11269 -8674620 -8177914 -6232162 -3749231 -594009 2530494 3240723 1067861 -849963
11261 -849963 -209605 1226575 1544866 2537799 5986013 8879491 6845766 948334 -3006209
11252 -3006209 -1394054 4025080 8921232 9617758 4877972 -2263585 -5641530 -2433951
11244 -2433951 2470217 2211237 -2988200 -6889137 -6663420 -5660598 -5827016 -3507690 3565856
11235 3565856 9786397 7666173 -1501189 -8161203 -5895092 1680300 6444147 5022285
11227 5022285 665543 -2012214 -1793747 -811594 -1331500 -2957398 -2914420 411096 4321040
11218 4321040 3738256 -2696498 -9779230 -10785844 -4858559 2348136 5091839 2686191
$$ packed form
11278B108743k672706m45561L85570j724943k731532j172975k07378j055422j158416
11269h674620M96706J945752K482931L155222L124503P10229k172862j917824
11261h49963O40358J436180L18291R92933L448214K893478k033725n897432l954543
11252c006209J612155N419134M896152O96526m739786p141557l377945L207579
11244b433951M904168k58980n199437l900937K25717J002822j66418K319326P073546
11235C565856O220541k120224r167362o660014K266111P575392M763847j421862
11227E022285m356742k677757K18467R82153n19906j625898M2978L325516L909944
11218D321040n82784o434754p082732j006614N927285P206695K743703k405648
$$ plain form
11210 2686191 -1716113 -4997087 -5736336 -4159987 -2155018 -1995174 -3489081 -3587043 -337106
11201 -337106 4156730 6601864 6853050 6841523 6507546 4371756 1817991 2640354 7118191
11192 7118191 10262827 8217363 3440980 748519 682680 377872 -671817 -114075 2077449
11183 2077449 2284781 -1291225 -5195196 -5226624 -2196857 -448669 -1979737 -4906954 -7056270
11174 -7056270 -7878057 -6663729 -2446766 2697306 3462904 -2413806 -9539874 -10329792 -4637180
11165 -4637180 -46090 -1862911 -6740099 -8375342 -6152622 -4554892 -5919107 -7845410
11157 -7845410 -7465930 -4703343 -816262 3187336 5745133 5134549 2138558 181967
11149 181967 1329931 3905136 5263871 4844413 3017124 -547016 -4929556 -6708041
$$ packed form
11210B686191m402304l280974p39249J576349K004969J59844j493907r7962L249937
11201c37106M493836K445134K51186j1527l33977k135790k553765Q22363M477837
11192G118191L144636k045464m776383k692461o5839l04808j049689N57742K191524
11183B077449K07332l576006l903971l1428L029767J748188j531068k927217k149316
11174g056270q21787J214328M216963N144072P65598n876710p126068p89918N692612
11165d637180M591090j816821m877188j635243K222720J597730j364215j926303
11157g845410L79480K762587L887081M003598K557797o10584k995991j956591
11149A81967J147964K575205J358735m19458j827289l564140m382540j778485
$$ plain form
11141 -6708041 -4087784 -813543 -1956799 -6378088 -7791217 -3786051 919411 2041702
11133 2041702 1920716 4637010 8548742 8559389 4079257 -246620 -1418556 -1090988 -1203973
11124 -1203973 -1036989 -171898 -609428 -3676854 -7650778 -10559304 -12714232 -14285796 -13158191
11115 -13158191 -8162494 -2314621 310351 -625471 -2862118 -5553569 -8656878 -10003189
11107 -10003189 -7320364 -2596224 -236083 -921376 -1333523 -93499 422746 -1075342
11099 -1075342 -2661391 -3336251 -4841315 -7214327 -6936636 -2563744 1721157 1939008 310230
11090 310230 966859 2468024 111600 -5580739 -8633744 -6506377 -3908413 -5608983
11082 -5608983 -9588541 -10526759 -7463332 -4364632 -4031001 -4751722 -3472660 99318 3713839
$$ packed form
11141f708041K620257L274241j143256m421289j413129M005166M705462J122291
11133B041702j20986K716294L911732J0647m480132m325877j171936L27568j12985
11124a203973J66984Q65091m37530l067426l973924k908526k154928j571564J127605
11115a3158191M995697N847873K624972r35822k236647k691451l103309j346311
11107a0003189K682825M724140K360141o85293m12147J240024N16245j498088
11099a075342j586049o74860j505064k373012K77691M372892M284901K17851j628778
11090C10230O56629J501165k356424n692339l053005K127367K597964j700570
11082e608983l979558r38218L063427L098700L33631p20721J279062L571978L614521
$$ plain form
11073 3713839 5387482 4583649 1597761 -2328479 -4555360 -3019383 558423 1621315
11065 1621315 -1485124 -4700109 -3473255 964345 3764808 3699645 4133326 6858156 9410314
11056 9410314 9660608 8860489 8196221 6350103 3195504 2066420 4578012 6310039 2278081
11047 2278081 -5239703 -9243914 -7536368 -4803659 -4973760 -6309450 -5775616 -4333903
11039 -4333903 -4996351 -7787663 -9573244 -8296398 -5274059 -3113555 -2668133 -2654372 -1738621
11030 -1738621 -204397 727227 631380 87655 -583998 -1596428 -2524431 -2163245 -270727
11021 -270727 1387676 466680 -3664744 -8891903 -11252211 -7930458 -695831 4823603
11013 4823603 5290887 3697568 4414227 5926732 3166359 -3595828 -8059787 -7101413 -4648015
$$ packed form
11073C713839J673643q03833k985888l926240k226881J535977L577806J062892
11065A621315l106439l214985J226854M437600K800463o5163M33681K724830K552158
11056I410314K50294q00119o64268j846118l154599j129084K511592J732027m031958
11047B278081p517784m004211J707546K732709j70101j335690N33834J441713
11039d333903o62448k791312j785581J276846L022339K160504M45422J3761R15751
11030a738621J534224R31624r5847n43725o71653j012430r28003L61186J892518
11021b70727J658403r20996m131424n227159k360308L321753P234627N519434
11013D823603M67284j593319P16659J512505k760373o762187m463959R58374K453398
$$ plain form
11004 -4648015 -4190330 -3682432 -1518239 -1406681 -5880552 -10017831 -8073755 -2606569 -252672
10995 -252672 -1374909 -1130561 1228230 1856671 297742 159561 1367639 -668719 -6386176
10986 -6386176 -9527247 -6276678 -1275784 -962126 -5191924 -8980500 -9403508 -7576544
10978 -7576544 -5824172 -5204936 -4643274 -1872337 3117248 6302806 4483088 1051121
10970 1051121 2267022 7835298 10751303 7588610 2935914 1248498 421863 -2440357
10962 -2440357 -4203873 -378170 6635081 9880542 7167069 3086091 2042138 3456643
10954 3456643 4447144 4119254 3987900 5623685 8619342 10578561 9476680 6170011 3611813
10945 3611813 3569369 5483132 8181450 10381508 9716814 4615063 -2149665 -5213412 -3153729
$$ packed form
11004d648015M57685N07898K164193J11558m473871m137279J944076N467186K353897
10995b52672j122237K44348K358791O28441j558929j38181J208078k036358n717457
10986f386176l141071L250569N000894L13658m229798l788576m23008J826964
10978g576544J752372O19236N61662K770937M989585L185558j819718l431967
10970A051121J215901N568276K916005l162693m652696j687416q26635k862220
10962b440357j763516L825703P013251L245461k713473m080978j043953J414505
10954C456643R90501l27890j31354J635785K995657J959219j101881l306669k558198
10945C611813m2444J913763K698318K200058o64694n101751o764728l063747K059683
$$ plain form
10936 -3153729 43332 1170736 1456448 2363612 2427567 1186782 1557518 4196021 3950374
10927 3950374 -2626009 -9829232 -9396548 -2249776 3321957 3885169 3502064 4067566 1759640
10918 1759640 -3952831 -5952539 125723 7140251 5360328 -3362132 -8054924 -3898894
10910 -3898894 2772566 5403801 5300891 5535445 3728524 -2989204 -10122840 -10301984 -4328319
10901 -4328319 -693976 -3343576 -6517857 -4415640 -173146 -584275 -5753966 -9539337
10893 -9539337 -8596555 -5745214 -4431724 -4310418 -3350012 -1116350 1336018 2788647 2301146
10884 2301146 -43240 -2531906 -3467699 -3295278 -3457301 -3623385 -2219517 530278 2409905
10875 2409905 2123817 358538 -1897549 -3865765 -4068885 -1610200 1402482 1369051 -2213144
$$ packed form
10936c153729L197061J127404K85712R07164O3955j240785L70736K638503k45647
10927C950374o576383p203223M32684P146772N571733N63212l83105N65502k307926
10918A759640n712471j999708O078262P014528j779923q722460m692792M156030
10910c898894O671460K631235j02910K34554j806921o717728p133636j79144N973665
10901d328319L634343k649600l174281K102217M242494m11129n169691l785371
10893i539337R42782K851341J313490J21306R60406K233662K452368J452629m87501
10884B301146k344386k488666r35793J72421j62023j66084J403868K749795J879627
10875B409905k86088j765279k256087j968216k03120K458685L012682l3431l582195
$$ plain form
10866 -2213144 -5927106 -6787618 -5240817 -3195820 -1242646 1116874 3918254 6204109
10858 6204109 6338895 3268652 -1387095 -3633367 -1550885 1594785 1267256 -2206299
10850 -2206299 -4363155 -2769907 808167 3977195 5948080 6194559 4282282 1390867
10842 1390867 -718300 -1901497 -2114765 626897 6493905 9768952 4662004 -5115987
10834 -5115987 -9362241 -4903799 877874 1926944 1280197 3144670 4596551 1354967
10826 1354967 -3536157 -3828887 354084 3645633 4053920 4168373 4825445 3670451 423895
10817 423895 -1458604 293101 3655608 5354895 4612571 2951217 1965249 1975508 2055694
10808 2055694 1290354 139729 -362954 -747212 -2445394 -4579369 -4132473 -587001 2409681
$$ packed form
10866b213144l713962q60512J546801K044997J953174K359520K801380K285855
10858F204109J34786l070243m655747k246272K082482L145670l27529l473555
10850b206299k156856J593248L578074L169028J970885K46479j912277k891415
10842A390867k109167j183197k13268K741662N867008L275047n106948r777991
10834e115987m246254M458442N781673J049070o46747J864473J451881l241584
10826A354967m891124k92730M182971L291549M08287J14453O57072j154994l246556
10817D23895j882499J751705L362507J699287p42324j661354r85968J0259Q0186
10808B055694p65340j150625n02683l84258j698182k133975M46896L545472K996682
$$ plain form
10799 2409681 1896694 -418797 -1147188 184207 1783394 2626352 2472342 880734 -1471944
10790 -1471944 -2427370 -1423445 -808726 -1991528 -2797497 -1142164 1330068 2228836 2405713
10781 2405713 3489341 3900092 1527502 -1379997 -688115 2890573 4046996 308324
10773 308324 -4516311 -5363519 -1595110 3473722 6581532 6743888 4721870 1583367 -2082885
10764 -2082885 -5651173 -7658818 -6677141 -3267019 32897 1031955 -665531 -4151187
10756 -4151187 -7529670 -8257711 -5524451 -2048566 -881092 -897851 1074193 4047668 3480770
10747 3480770 -1216719 -4866584 -4000650 -1252153 130490 1197287 3381061 4247493
10739 4247493 1460327 -2399658 -3245626 -1260460 296080 -241038 -2440530 -5378817
$$ packed form
10799B409681n12987k315491p28391J331395J599187Q42958j54010j591608k352678
10790a471944r55426J003925O14719j182802q05969J655333K472232Q98768J76877
10781B405713J083628M10751k372590k907499O91882L578688J156423l738672
10773C08324m824635q47208L768409N068832L107810J62356k022018l138503l666252
10764b082885l568288k007645R81677L410122L299916R99058j697486l485656
10756d151187l378483p28041K733260L475885J167474j6759J972044K973475n66898
10747C480770m697489l649865Q65934K748497J382643J066797K183774Q66432
10739D247493k787166l859985q45968J985166J556540n37118k199492k938287
$$ plain form
10731 -5378817 -7026137 -4926475 -86597 3084168 3112215 3578566 6153971 6754738 2800415
10722 2800415 -1073136 -140187 2358179 828980 -3076343 -3905059 -2376147 -3763345
10714 -3763345 -7846959 -8639454 -4161282 864260 2906763 3594033 4432555 3680692 736615
10705 736615 -1281732 20842 2685579 3320777 1340056 -914036 -549982 3451056 8413632
10696 8413632 9424335 4946360 -272573 -759727 2679877 5024394 4728996 4978640 7550516
10687 7550516 9786355 8669822 4829891 1326016 266662 1193660 1806542 514081
10679 514081 -1328514 -1086140 953892 1556750 -588716 -3247614 -4889437 -6395882 -6957979
10670 -6957979 -3422566 3424424 7257372 4768211 660139 -351664 -1060710 -5602915
$$ packed form
10731e378817j647320K099662M839878L170765K8047M66351K575405O00767l954323
10722B800415l873551R32949K498366j529199l905323q28716J528912j387198
10714c763345m083614p92495M478172N025542K042503O87270Q38522p51863k944077
10705G36615k018347J302574K664737O35198j980721k254092L64054M001038M962576
10696H413632J010703m477975n218933m87154L439604K344517k95398K49644K571876
10687G550516K235839j116533l839931l503875j059354R26998O12882j292461
10679E14081j842595K42374K040032O02858k145466k658898j641823j506445n62097
10670f957979L535413O846990L832948k489161m108072j011803p09046m542205
$$ plain form
10662 -5602915 -10831620 -10750007 -5889217 -1534989 352746 1091557 308327 -2363095 -3454206
10653 -3454206 -103062 4321608 5261412 4452502 5812537 7497611 5560929 2124097
10645 2124097 1705872 2407852 -487258 -4654800 -3805553 1027529 2696135 -428086 -3132130
10636 -3132130 -3150542 -3276319 -3832886 -1841172 2085389 4312654 5562322 9363387 13450029
10627 13450029 11628902 4495798 -502719 -249234 1243819 1462738 2154874 3090674 1702092
10618 1702092 -656933 -429601 543286 -2003802 -5268271 -3027642 2214035 2252752 -2016568
10609 -2016568 -1647855 3738765 4342513 -2184374 -5834843 -1716770 1457350 -2991432
10601 -2991432 -8244408 -6198179 -248431 2559908 2746638 3422444 2445207 -2142225 -5843204
$$ packed form
10662e602915n228705Q1613M860790M354228J887735P38811p83230k671422j091111
10653c454206L351144M424670R39804q08910J360035J685074j936682l436832
10645B124097m18225P01980k895110m167542Q49247M833082J668606l124221k704044
10636c132130j8412j25777n56567J991714L926561K227265J249668L801065M086642
10627A3450029j821127p133104m998517K53485J493053K18919O92136R35800j388582
10618A702092k359025K27332R72887k547088l264469K240629N241677L8717m269320
10609b016568L68713N386620O03748o526887l650469M118073L174120m448782
10601b991432n252976K046229N949748K808339J86730O75806r77237m587432l700979
$$ plain form
10592 -5843204 -4495142 -1305762 -770360 -1639671 -1530755 -2106450 -4272586 -4666139 -1933391
10583 -1933391 71952 -181841 1595087 7039577 10890676 9915993 8183909 8718495 8205213
10574 8205213 4954480 3419972 5343053 5181359 114933 -4188764 -3621212 -2354170
10566 -2354170 -3563761 -3146858 617011 1229322 -4345195 -7895406 -2624193 5290803
10558 5290803 6758679 3095493 345920 -1633488 -5144143 -7062104 -4395814 -929322
10550 -929322 -471234 -459522 766114 -1139696 -6903363 -8516987 -2366423 2412471 -1633130
10541 -1633130 -7386385 -5501054 -154249 -575937 -5129967 -5995521 -2690519 465783
10533 465783 3653372 7722671 8194722 3291374 253144 3582050 5564493 -929545
$$ packed form
10592e843204J348062L189380N35402q69311J08916n75695k166136l93553K732748
10583a933391K005343k53793J776928N444490L851099r74683j732084N34586n13282
10574H205213l250733j534508J923081j61694n066426m303697N67552J267042
10566b354170j209591M16903L763869O12311n574517l550211N271213P914996
10558E290803J467876l663186k749573j979408l510655j917961K666290L466492
10550i29322M58088J1712J225636j905810n763667j613624O150564M778894m045601
10541a633130n753255J885331N346805m21688m554030q65554L305002L156302
10533D65783L187589M069299M72051m903348l038230L328906J982443o494038
$$ plain form
10525 -929545 -9273844 -9806350 -4577579 -431717 2706149 5529965 2641573 -5677488
10517 -5677488 -7111626 3869736 13480367 9321851 175605 -722349 2085040 -1287438
10509 -1287438 -5596592 -2215260 2114404 -1373110 -5073821 -644486 2396943 -4126123
10501 -4126123 -6883031 4961371 15313581 9320096 3720855 15232562 23794261 9471832
10493 9471832 -1134938 20686605 42384726 23809965 15498786 107367991 268778118
10486 268778118 342250430 242247900 74045969 -8685973 7375950 26548775 6216263
10479 6216263 -9923689 4059590 15491374 3117732 -8010075 -115476 6828988
10472 6828988 -1764384 -8373808 188758 8336278 2742409 -4779346 -2737931 105610
$$ packed form
10525i29545q344299n32506N228771M145862L137866K823816k888392q319061
10517e677488j434138J0981362R610631m158516r146246q97954K807389l372478
10509a287438m309154L381332M329664l487514l700711M429335L041429o523066
10501d126123k756908J1844402J0352210n993485n599241J1511707Q561699j4322429
10493I471832j0606770K1821543K1698121j8574761q311179R1869205J61410127
10486B68778118P3472312j00002530j68201931q2731942J6061923J9172825k0332512
10479F216263j6139952J3983279J1431784j2373642j1127807P894599O944464
10472F828988q593372o609424Q562566Q147520n593869p521755K041415K843541
$$ plain form
10464 105610 -4090262 -6667406 -2268662 -677099 -5866632 -5767292 4443798 10663483
10456 10663483 4320931 -2494015 209640 2659764 -4804728 -12773199 -9818043 -2644917
10448 -2644917 -2854936 -6963673 -5653039 -1654439 -2744131 -6018421 -3970834 818590
10440 818590 413482 -4725617 -8258827 -8993349 -9065853 -6298344 1605955 9497783 10526526
10431 10526526 6014430 2079416 237120 -1645361 -2965398 -1875718 -33686 -40888
10423 -40888 -1034825 -1311029 -1793425 -3065126 -3143523 -1724496 -1879733 -4198816 -4597580
10414 -4597580 -1356951 1428110 858672 -513725 -816611 -2172545 -4021509 -1141992
10406 -1141992 6436705 9730007 3702575 -3779174 -3730859 259097 -656697 -5326750 -5208955
$$ packed form
10464A05610m195872k577144M398744J591563n189533R9340J0211090O219685
10456A0663483o342552o814946K703655K450124p464492p968471K955156P173126
10448b644917k10019m108737J310634L998600j089692l274290K047587M789424
10440H18590m05108n139099l533210p34522p2504K767509P904299P891828J028743
10431A0526526m512096l935014j842296j882481j320037J089680J842032p202
10423d0888r93937k76204m82396j271701p8397J419027j55237k319083l98764
10414d597580L240629K785061n69438j372397l02886j355934j848964K879517
10406a141992P578697L293302o027432p481749M8315L989956r15794m670053J17795
$$ plain form
10397 -5208955 978799 5643832 4598866 1937411 1913342 3259438 3135069 1379464 -587759
10388 -587759 -1459833 -233263 2365098 3204095 405016 -3334696 -3987882 -1523221 942646
10379 942646 1938644 2521828 3473744 4413814 4879908 4272652 1973035 -928902 -1975882
10370 -1975882 -1001599 -987217 -3446175 -5717440 -5003681 -2332984 -237418 744703 1046817
10361 1046817 503472 4576 1559355 4500400 5146064 2606379 924843 2633687 4590237
10352 4590237 3796410 2820953 4884510 7673680 7302860 4961704 4017874 3472478 319526
10343 319526 -3851172 -4922547 -3572379 -4333740 -7816959 -9625770 -7248836 -3091589
10335 -3091589 -357327 -189170 -2691003 -6360956 -6888212 -1413978 5979660 8061951
$$ packed form
10397e208955O187754M665033j044966k661455k4069J346096j24369j755605j967223
10388e87759q72074J226570K598361Q38997k799079l739712o53186K464661K465867
10379I42646R95998N83184R51916R40070M66094o07256k299617k901937j046980
10370a975882R74283J4382k458958k271265P13759K670697K095566R82121L02114
10361A046817n43345m98896J554779K941045O45664k539685j681536J708844J956550
10352D590237p93827r75457K063557K789170l70820k341156r43830n45396l152952
10343C19526m170698j071375J350168p61361l483219j808811K376934M157247
10335c091589K734262J68157k501833l669953n27256N474234P393638K082291
$$ plain form
10327 8061951 4092337 423097 667839 1091400 -1956108 -5542471 -4979806 -1173866 1332117
10318 1332117 1312844 1482971 3149650 4234776 3023736 908844 179079 863816 1307683
10309 1307683 1126715 1801950 3735212 4194706 206773 -6717257 -11207533 -10358624 -7077744
10300 -7077744 -5402554 -4966304 -3157038 -897044 -1890012 -6186856 -8819825 -6294708
10292 -6294708 -1100276 2149977 2237350 685587 -1846180 -5218960 -7283660 -5471219
10284 -5471219 -1111935 968427 -1748647 -6424060 -8976576 -9186394 -9671374 -11204362
10276 -11204362 -11707250 -9749421 -6749700 -5106263 -5676932 -7556807 -8942527 -7922529
10268 -7922529 -4070409 269026 2027475 1250453 832567 1835653 1873944 -408359 -2359625
$$ packed form
10327H061951l969614l669240K44742M23561l047508l586363N62665L805940K505983
10318A332117j9273J70127J666679J085126j211040k114892p29765O84737M43867
10309A307683j80968O75235J933262M59494l987933o924030m490276Q48909L280880
10300g077744J675190M36250J809266K259994r92968m296844k632969K525117
10292f294708N194432L250253Q7373j551763k531767l372780k064700J812441
10284e471219M359284K080362k717074m675413k552516k09818m84980j532988
10276a1204362n02888J957829K999721J643437n70669j879875j385720J019998
10268g922529L852120M339435J758449p77022m17886J003086L8291k282303j951266
$$ plain form
10259 -2359625 -1361426 873840 1275006 404993 775356 2077676 2288061 2045776 3281166
10250 3281166 4502415 2585591 -1174104 -2370904 -1044621 -1804923 -5203524 -5609409
10242 -5609409 -589420 3853666 1962045 -2858555 -3255045 1449570 5562266 5807154
10234 5807154 4196549 2880282 1099989 -2201808 -6118236 -8693948 -8209707 -4136186
10226 -4136186 1479896 5007846 5610822 6645365 10206445 12816354 10203806 4159753
10218 4159753 26329 -1191560 -2936717 -5764970 -5709725 -1320307 2842688 2481422 -454172
10209 -454172 -1201968 1031958 3022944 2722299 1287500 250468 -709837 -2494069 -4629000
10200 -4629000 -5622934 -4834524 -3198829 -1943324 -1222212 -663545 -627440 -1439225 -1562202
$$ packed form
10259b359625R98199K235266M01166q70013L70363J302320K10385k42285J235390
10250C281166J221249j916824l759695j196800J326283p60302l398601m05885
10242e609409N019989M443086j891621m820600l96490M704615M112696K44888
10234E807154j610605j316267j780293l301797l916428k575712M84241M073521
10226d136186N616082L527950O02976J034543L561080K609909k612548o044053
10218D159753m133424j217889j745157k828253N5245M389418M162995l61266k935594
10209d54172p47796K233926J990986l00645j434799j037032r60305j784232k134931
10200d629000r93934P88410J635695J255505P21112N58667L6105q11785j22977
$$ plain form
10191 -1562202 1190465 5776299 7662590 4294561 -1127639 -3582467 -2146715 691256
10183 691256 3755910 7376249 9864028 8473472 4453010 2753225 5069182 7081768
10175 7081768 4986285 1145635 -173179 240040 -1553560 -5222193 -5946409 -2278687
10167 -2278687 688524 -1422490 -5540624 -5492906 -936022 2568932 1868017 -181746 -539388
10158 -539388 -718309 -2690195 -3836875 -593501 4929054 7075167 4810587 2666264
10150 2666264 3120215 3320724 1071651 -1098559 -916307 -922860 -3916691 -7318478 -6907324
10141 -6907324 -3845472 -2918000 -5047884 -6499299 -5023221 -2086400 983903 4383415
10133 4383415 6813177 5711864 1827919 -563660 370717 1689769 1090821 613536 2320268
$$ packed form
10191a562202K752667M585834J886291l368029n422200k454828J435752K837971
10183F91256L064654L620339K487779j390556m020462j699785K315957K012586
10175G081768k095483l840650j318814M13219j793600l668633p24216L667722
10167b278687K967211k111014m118134M7718M556884L504954p00915k049763l57642
10158e39388j78921j971886j146680L243374N522555K146113k264580k144323
10150B666264M53951K00509k249073k170210J82252o553k993831l401787M11154
10141f907324L061852R27472k129884j451415J476078K936821L070303L399512
10133D383415K429762j101313l883945k391579R34377J319052n98948m77285J706732
$$ plain form
10124 2320268 3992657 2615944 -660581 -2729558 -3449758 -4461013 -4821197 -2170814
10116 -2170814 2522278 5607588 6019146 5886918 5745184 3527642 -608573 -2893488 -1532538
10107 -1532538 214710 -691624 -2349122 -1975275 -1220021 -2602123 -3316435 1194742 8480035
10098 8480035 10745560 6187123 1867411 2770733 4664082 2289437 -1322157 -144661
10090 -144661 4516107 6489167 5062092 4886893 6501458 5341255 1161017 154131
10082 154131 4813854 9130172 8043357 5043835 5084147 5836732 2787053 -1356559 -255779
10073 -255779 5145127 7144881 2720471 -2504149 -3114419 -838994 -114403 -1239335 -1278376
10064 -1278376 765589 2740726 2474154 268501 -1715107 -2047925 -1799428 -2930375 -4823140
$$ packed form
10124B320268J672389j376713l276525k068977p20200j011255l60184K650383
10116b170814M693092L085310M11558j32228j41734k217542m136215k284915J360950
10107a532538J747248r06334j657498L73847P55254j382102p14312M511177P285293
10098H480035K265525m558437m319712R03322J893349k374645l611594J177496
10090a44661M660768J973060j427075j75199J614565j160203m180238j006886
10082A54131M659723M316318j086815k999522M0312P52585l049679m143612J100780
10073b55779N400906J999754m424410n224620o10270K275425P24591j124932l9041
10064a278376K043965J975137k66572k205653j983608l32818K48497j130947j892765
$$ plain form
10055 -4823140 -4428365 -1005639 1824154 1021437 -1372269 -1770444 -673736 -680522 -785674
10046 -785674 2227702 7359563 9607551 7109787 3381561 1531889 755123 -27090 643508
10037 643508 3678990 6797660 7215616 4862253 1614365 -697974 -1017388 -46159 -457080
10028 -457080 -3520222 -6257813 -5384994 -2829381 -2556152 -3175627 -234663 4535281 4414909
10019 4414909 -495228 -1724105 3801007 7754554 4050694 -436320 2750997 8918944
10011 8918944 7397070 -1380089 -7224698 -6097456 -3383126 -2031487 1163484 6038211
10003 6038211 6703333 2227963 223806 4992984 10137755 8568185 3164210 1273029
9995 1273029 3850117 6477001 7248555 7265229 5935158 1922399 -2511083 -3322454 -374879
$$ packed form
10055d823140L94775L422726K829793q02717k393706l98175J096708o786j05152
10046g85674L013376N131861K247988k497764l728226j849672p76766p82213O70598
10037F43508L035482L118670M17956k353363l247888k312339l19414R71229m10921
10028d57080l063142k737591Q72819K555613K73229o19475K940964M769944j20372
10019D414909m910137j228877N525112L953547l703860m487014L187317O167947
10011H918944j521874q777159n844609J127242K714330J351639L194971M874727
10003F038211O65122m475370k004157M769178N144771j569570n403975j891181
9995A273029K577088K626884P71554J6674j330071m012759m433482q11371K947575
$$ plain form
9986 -374879 2661237 3545802 3290945 3447851 4542464 6498670 8083087 6924159 2485906
9977 2485906 -2133523 -3600000 -2106055 327952 3150694 6122626 7141979 4854965
9969 4854965 1884719 1790903 3945159 4906814 3710183 2099818 620407 -1418121 -2716512
9960 -2716512 -1010095 2682466 4810145 4506627 4251538 5037145 4850242 2781372 937759
9951 937759 1078053 2455061 3944043 5326752 5729432 3921174 983822 -367438 207568
9942 207568 462891 -298700 -571905 -535585 -2142994 -4272302 -2724145 2807168 6498312
9933 6498312 4109196 -1189825 -3937266 -3474575 -2306760 -948694 1312212 3076500
9925 3076500 2391240 -53855 -2434614 -4473980 -5907919 -5048825 -2002167 -308872 -1915695
$$ packed form
9986c74879L036116Q84565k54857J56906J094613J956206J584417j158928m438253
9977B485906m619429j466477J493945K434007K822742K971932J019353k287014
9969D854965k970246r3816K154256R61655j196631j610365j479411k038528j298391
9960b716512J706417L692561K127679l03518k55089P85607j86903k068870j843613
9951I37759J40294J377008J488982J382709M02680j808258k937352j351260N75006
9942B07568K55323p61591k73205L6320j607409k129308J548157N531313L691144
9933F498312k389116n299021k747441M62691J167815J358066K260906J764288
9925C076500o85260k445095k380759k039366j433939Q59094L046658J693295j606823
$$ plain form
9916 -1915695 -3717254 -2887095 -1924729 -3658392 -5069459 -2146742 2271256 2451734 -658668
9907 -658668 -1234330 1398159 2346457 473922 178670 2947602 4619242 2733358 -193600
9898 -193600 -2375292 -4909868 -6439991 -2943302 4422846 8336075 5582693 1744285
9890 1744285 2066532 4285842 4632166 4364154 5480830 5939616 4089665 2212883 1220770
9881 1220770 -1722539 -5778330 -4569172 2555097 6720198 4804172 7590744 20506950
9873 20506950 26855461 8492138 -22533906 -34336122 -17713424 2669601 4850951
9866 4850951 -3168713 -3424777 2925328 3003278 -3430787 -5704663 -2594041 -3319413 -9428715
9857 -9428715 -11350551 -5002150 1383592 947580 -2136751 -1711050 548232 297425 -1215027
$$ packed form
9916a915695j801559Q30159R62366j733663j411067K922717M417998J80478l110402
9907f58668n75662K632489R48298j872535k95252K768932J671640j885884k926958
9898a93600k181692k534576j530123L496689P366148L913229k753382l838408
9890A744285L22247K219310L46324k68012J116676M58786j849951j876782r92113
9881A220770k943309m055791J209158P124269M165101j916026K786572J2916206
9873B0506950O348511j8363323l1026044j1802216J6622698K0383025K181350
9866D850951q019664k56064O350105P7950o434065k273876L110622p25372o109302
9857i428715j921836O348401O385742m36012l084331M25701K259282k50807j512452
$$ plain form
9848 -1215027 -339835 2023956 2336265 277467 -1933438 -3600526 -4841545 -4073272 -289699
9839 -289699 3761668 4453920 2171155 -3413 -1270470 -3232849 -5834929 -6909023 -5776295
9830 -5776295 -4025029 -2466587 -451229 1350687 853179 -1556652 -2199173 789806 4054038
9821 4054038 3297650 -759945 -3524928 -2657414 -209703 1064551 701863 -628365 -2686124
9812 -2686124 -4859138 -5714500 -4820203 -3698866 -3597721 -3469548 -1701099 1108584 2921832
9803 2921832 3331282 3938537 5562269 6767503 5773008 2718583 -437157 -1426492 1019164
9794 1019164 6041168 10274097 9925481 4461216 -2285497 -5568509 -4027421 -154599
9786 -154599 2694963 2881724 883946 -1328778 -1324042 1946951 6680436 9437183 8428066
$$ packed form
9848a215027Q75192K363791L12309k058798k210905j667088j241019P68273L783573
9839b89699M051367O92252k282765k174568j267057j962379k602080j074094J132728
9830e776295J751266J558442K015358J801916m97508k409831o42521K988979L264232
9821D054038p56388m057595k764983Q67514K447711J274254l62688j330228k057759
9812b686124k173014q55362Q94297J121337J01145J28173J768449K809683J813248
9803B921832M09450O07255J623732J205234r94495l054425l155740r89335K445656
9794A019164N022004M232929l48616n464265o746713l283012J541088L872822
9786a54599K849562J86761j997778k212724M736L270993M733485K756747j009117
$$ plain form
9777 8428066 4970162 1325245 -1761528 -4362725 -5519960 -4414797 -3199791 -5739068
9769 -5739068 -12056472 -16445294 -13769026 -6245353 -744504 85559 112955 2428843 4010044
9760 4010044 525862 -6405844 -10565097 -8572749 -2650454 3422236 7707282 9389130
9752 9389130 8066029 4976348 2615787 1990814 1960480 1793746 2097048 2427216 734114
9743 734114 -3079595 -5456163 -3511719 589074 2298370 678744 -1161110 -1210503 -1000339
9734 -1000339 -2217442 -3646055 -3247696 -1621249 -1295762 -3121527 -5200278 -5633552 -4934818
9725 -4934818 -4930755 -6101729 -7130321 -6923219 -5912133 -4884395 -3532661 -1239564 1198310
9716 1198310 1982380 560083 -1731717 -3636648 -5365201 -7175209 -7618828 -4742733 950069
$$ packed form
9777H428066l457904l644917l086773k601197j157235J105163J215006k539277
9769e739068o317404m388822K676268P523673N500849Q30063K7396K315888J581201
9760D010044l484182o931706m159253J992348N922295O072690M285046J681848
9752I389130j323101l089681k360561o24973l0334j66734L03302L30168j693102
9743G34114l813709k376568J944444M100793J709296j619626j839854m9393K10164
9734a000339j217103j428613L98359J626447L25487j825765k078751m33274O98734
9725d934818M063j170974j028592K07102J011086J027738J351734K293097K437874
9716A198310P84070j422297k291800j904931j728553j810008m43619K876095N692802
$$ plain form
9707 950069 5921266 6689814 3295803 -699877 -1763351 222469 2372704 2498114 1577227
9698 1577227 1921471 3720200 4922944 4428744 3545951 3551617 3518832 2126225 507280
9689 507280 1187884 4278993 6668390 5684436 2131349 -1358309 -3857096 -6359928 -8812566
9680 -8812566 -9051481 -5872401 -1727885 -208751 -1041267 -56698 4757981 9413468 8575401
9671 8575401 2991830 -744112 1865391 8176170 12249951 11344065 7016043 1989623
9663 1989623 -1554856 -1869595 1173851 4760218 5404014 3050801 967134 978433 883581
9654 883581 -2154896 -7337375 -11110699 -11338203 -8770209 -4978960 -998114 1837704 1962378
9645 1962378 -288809 -2171018 -1823842 -1175922 -3684257 -9448208 -14451548 -14923281 -10798079
$$ packed form
9707I50069M971197P68548l394011l995680j063474J985820K150235J25410r20887
9698A577227L44244J798729J202744m94200q82793N666l2785j392607j618945
9689E07280O80604L091109K389397r83954l553087l489658k498787k502832k452638
9680h812566k38915L179080M144516J519134q32516R84569M814679M655487q38067
9671H575401n583571l735942K609503O310779M073781r05886m328022n026420
9663A989623l544479l14739L043446L586367O43796k353213k083667J1299r4852
9654H83581l038477n182479l773324k27504K567994L791249L980846K835818J24674
9645A962378k251187j882209L47176O47920k508335n763951n003340m71733M125202
$$ plain form
9636 -10798079 -4536345 1414832 4934887 4167339 -581151 -5821274 -7906949 -6775974
9628 -6775974 -5059895 -4123339 -3106734 -1617984 -920631 -1906575 -3822522 -5652462 -7163579
9619 -7163579 -8123530 -8069664 -7153856 -5555812 -2211902 3347642 7819173 6360837 -615503
9610 -615503 -6447511 -6377450 -3408020 -2876823 -4389611 -3713622 -611366 746324 -1053803
9601 -1053803 -2367697 -571065 1925039 1695099 -974431 -3390223 -3865269 -2077076 1525065
9592 1525065 4900185 5275048 2631053 379471 1149221 4112829 7600766 11098324 12718906
9583 12718906 8745960 -476392 -7473997 -5595576 1717177 4906404 727744 -4797213
9575 -4797213 -5900831 -3593662 -1134456 1212392 3615013 3551968 -358465 -4467432 -4508823
$$ packed form
9636a0798079O261734N951177L520055p67548m748490n240123k085675J130975
9628f775974J716079R36556J016605J488750O97353r85944j915947j829940j511117
9619g163579r59951N3866R15808J598044L343910N559544M471531j458336o976340
9610f15503n832008P0061K969430N31197j512788O75989L102256J357690j800127
9601a053803j313894J796632K496104k29940k669530k415792m75046J788193L602141
9592A525065L375120L74863k643995k251582P69750K963608L487937L497558J620582
9583A2718906l972946r222352o997605J878421P312753L189227m178660n524957
9575d797213j103618K307169K459206K346848K402621o3045l910433m108967m1391
$$ plain form
9566 -4508823 -1965691 -1705109 -4440656 -5894416 -3278099 1270404 4124887 3736275 288449
9557 288449 -4872553 -8466318 -7118814 -1681556 2807235 3282586 2418419 4029677 6994081
9548 6994081 7096831 3787513 1126334 1457616 1897012 -681575 -4032701 -3613377 -108628
9539 -108628 662807 -3510137 -6885156 -3469207 4001102 7612092 5373239 2942106 3800728
9530 3800728 4179109 783572 -2366690 -257824 4166207 4142017 -46195 -1666602 1335113
9521 1335113 3227063 99317 -4201826 -4903733 -3433369 -3599475 -5005851 -4834018 -3129729
9512 -3129729 -1868257 -874214 1236118 3510719 3628636 1314813 -2004093 -5471370 -8150184
9503 -8150184 -8161918 -5497741 -3566248 -4596358 -5738681 -3570504 -138063 205852 -1922240
$$ packed form
9566d508823K543132K60582k735547j453760K616317M548503K854483l88612l447826
9557B88449n161002l593765J347504N437258M488791M75351q64167J611258K964404
9548F994081J02750l309318k661179L31282M39396k578587l351126M19324L504749
9539a08628P71435m172944l375019L415949P470309L610990k238853k431133Q58622
9530C800728L78381l395537l150262K108866M424031k4190m188212j620407L001715
9521A335113J891950l127746m301143p01907J470364j66106j406376J71833J704289
9512c129729J261472R94043K110332K274601J17917k313823l318906l467277k678814
9503h150184j1734K664177J931493j030110j142323K168177L432441L43915k128092
$$ plain form
9494 -1922240 -2315382 -708341 -863600 -3125595 -3176092 358650 2833763 654786 -3288735
9485 -3288735 -4177283 -1461965 2332866 5601783 7305175 5396228 -850417 -8262618
9477 -8262618 -12205237 -10977179 -6450518 -1539815 1790014 3210002 3672607 3628733 2032209
9468 2032209 -1260633 -3415793 -2210457 -636781 -3316693 -8641289 -10222016 -7064672
9460 -7064672 -5731906 -9704437 -13161359 -9845446 -2443056 2479806 4154903 5776985
9452 5776985 6791451 4422835 766707 794446 3816410 3964930 -290697 -3563724 -1865951
9443 -1865951 2156863 4228242 3824364 2395530 413682 -1460762 -1754905 -929157 -1685576
9434 -1685576 -4507306 -5841722 -3008741 1544329 3267715 1096804 -1860267 -1910143 2136495
$$ packed form
9494a922240l93142J607041j55259k261995n0497L534742K475113k178977l943521
9485c288735q88548K715318L794831L268917J703392j908947o246645p412201
9477h262618l942619J228058M526661M910703L329829J419988M62605m3874j596524
9468B032209l292842k155160J205336J573676k679912n324596j580727L157344
9460g064672J332766l972531l456922L315913P402390M922862J675097J622082
9452E776985J014466k368616l656128K7739L021964J48520m255627l273027J697773
9443a865951M022814K071379m03878j428834j981848j874444k94143Q25748p56419
9434a685576k821730j334416K832981M553070J723386k170911k957071m9876M046638
$$ plain form
9425 2136495 7965955 11001152 8437054 2860141 -101548 1510461 3878373 2953579
9417 2953579 -439925 -2634270 -2042830 -101431 1146933 585600 -1746009 -4463316 -5666135
9408 -5666135 -4858956 -3189103 -1520770 150804 1067182 -285543 -3564160 -6034596 -5906951
9399 -5906951 -4423751 -3498288 -3198935 -2898720 -2981817 -3740769 -4102040 -2996677 -782196
9390 -782196 1715599 4034278 5181771 4092265 2026492 1884147 3567495 3020376 -1732035
9381 -1732035 -6595659 -6829293 -3946251 -3018293 -4810641 -5506291 -3815474 -3154564 -5459846
9372 -5459846 -7318247 -4940089 624 2674732 1822480 1138344 3840091 8019070 8639138
9363 8639138 3581845 -3603180 -7718813 -7853018 -7484647 -8628468 -8612956 -4516918 1541039
$$ packed form
9425B136495N829460L035197k564098n576913k961689J612009K367912r24794
9417B953579l393504k194345N91440J941399J248364n61333k331609k717307j202819
9408e666135Q07179J669853J668333J671574R16378j352725l278617k470436J27645
9399e906951J483200R25463K99353L00215q3097p58952l61271J105363K214481
9390g82196K497795K318679J147493j089506k065773j42345J683348n47119m752411
9381a732035m863624k33634K883042R27958j792348o95650J690817O60910k305282
9372e459846j858401K378158M940713K674108q52252o84136K701747M178979O20068
9363H639138n057293p185025m115633j34205L68371j143821J5512M096038O057957
$$ plain form
9354 1541039 4807201 4501931 4300866 6085784 6996319 4186629 -577416 -3462083 -3718732
9345 -3718732 -3660653 -4465819 -4580500 -2425330 1187876 4044208 4969244 4600809 4028575
9336 4028575 3211039 1167047 -2095045 -4407229 -3165410 1662033 7041037 9619290
9328 9619290 8342847 4410518 -196987 -3714074 -5298784 -5666846 -6363150 -7718227 -8250692
9319 -8250692 -6784229 -4212426 -2094346 -434150 1508025 2748816 1141965 -3137833
9311 -3137833 -6752016 -7168003 -5918875 -6008670 -7088537 -5817366 -1150430 3464893 4623532
9302 4623532 3626149 4334268 7524823 10075260 9597602 7180700 4854130 2833637 747835
9293 747835 -405258 448728 2426333 3861958 4548294 4835892 3509351 -713297 -5735974
$$ packed form
9354A541039L266162l05270k01065J784918R10535k809690m764045k884667k56649
9345c718732N8079q05166j14681K155170L613206K856332R25036l68435n72234
9336D028575q17536k043992l262092k312184J241819M827443N379004K578253
9328I619290j276443l932329m607505l517087j584710l68062o96304j355077n32465
9319h250692J466463K571803K118080J660196J942175J240791j606851m279798
9311c137833l614183m15987J249128q9795j079867J271171M666936M615323J158639
9302D623532r97383P08119L190555K550437m77658k416902k326570k020493k085802
9293G47835j153093Q53986J977605J435625O86336K87598j326541m222648n022677
$$ plain form
9284 -5735974 -7128893 -3624683 781603 1727975 -352923 -1847037 -1397032 -1262908 -3347802
9275 -3347802 -6069917 -6310480 -3536166 -727124 -957948 -3656830 -5121823 -3077984 231580
9266 231580 872479 -1224824 -1731130 2058172 6719561 6603735 1400621 -3049670 -2114430
9257 -2114430 1840371 2628769 -2165657 -8685810 -11463682 -8919427 -4031372 -845081
9249 -845081 -969995 -2869276 -3943127 -3300112 -2435925 -2993046 -4312308 -4107495 -1530190
9240 -1530190 1560812 2852575 2102446 645203 -685522 -1862968 -2390152 -1355693 897716
9231 897716 2480870 2117798 733227 5741 5570 -550324 -1925854 -2680716 -1950497 -1273841
9221 -1273841 -2753378 -5624944 -6285393 -2612433 2862482 5620862 4563868 2858730
$$ packed form
9284e735974j392919L504210M406286R46372k080898j494114M50005J34124k084894
9275c347802k722115k40563K774314K809042k30824k698882j464993K043839L309564
9266B31580O40899k097303n06306L789302M661389j15826n203114m450291R35240
9257b114430L954801P88398m794426o520153k777872K544255M888055L186291
9249h45081j24914j899281j073851O43015Q64187n57121j319262K04813K577305
9240a530190L091002J291763p50129j457243j330725j177446n27184J034459K253409
9231H97716J583154l63072j384571p27486j71n55894j375530p54862P30219O76656
9221a273841j479537k871566o60449L672960N474915K758380j056994j705138
$$ plain form
9213 2858730 3040806 3451423 1226737 -2668336 -4028850 -1001264 3295918 4719077 3000549
9204 3000549 1250419 1439349 2051286 516078 -2967724 -4920929 -2231745 3960528 8888425
9195 8888425 9100244 5880669 2853559 1321389 -117963 -1987852 -2742375 -1715971 -577555
9186 -577555 -344419 794701 4475492 8559339 9155706 5613276 1152966 -1289383 -1758727
9177 -1758727 -1794532 -2262289 -3080344 -3510549 -2373515 530306 2986326 2168125 -1432055
9168 -1432055 -3606887 -1169787 4127618 7641450 6864491 3190858 -473816 -2262275
9160 -2262275 -1834746 -78642 1131792 123070 -2560355 -3807233 -795342 5436834
9152 5436834 10040274 8830682 2610381 -3707464 -6302261 -5812835 -5139518 -5139339 -3919705
$$ packed form
9213B858730J82076M10617k224686l895073j360514L027586M297182J423159j718528
9204C000549j750130J88930O11937j535208l483802j953205K689184O192273M927897
9195H888425K11819l219575l027110j532170j439352j869889p54523J026404J138416
9186e77555K33136J139120L680791M083847N96367l542430m460310k442349m69344
9177a758727l5805m67757q18055m30205J137034K903821K456020q18201l600180
9168a432055k174832K437100N297405L513832p76959l673633l664674j788459
9160b262275M27529J756104J210434j008722k683425j246878L011891O232176
9152E436834M603440j209592o220301o317845k594797M89426O73317J79J219634
$$ plain form
9143 -3919705 -55901 4962373 7909212 6643912 1585741 -4663132 -8708480 -8375503
9135 -8375503 -4522815 -753200 -241374 -2270488 -2627606 1467406 7128673 8366512 3738754
9126 3738754 -775395 823813 5781397 5515040 -2290221 -9516808 -8362434 -1921578
9118 -1921578 767790 -2584686 -5893867 -4980335 -2940596 -3703601 -5930910 -6480556 -5636911
9109 -5636911 -5115176 -4048545 -1076044 1722508 1143135 -2123908 -4702514 -5997496 -8419041
9100 -8419041 -12112905 -13536230 -10611609 -6142249 -4102176 -4555672 -4351619 -1833598 1044508
9091 1044508 1298461 -1496971 -4749979 -5934159 -5572257 -6092946 -7636759 -6936013 -1960577
9082 -1960577 3851056 4699389 -468503 -6472159 -7966079 -4858541 -968633 687841
$$ packed form
9143c919705L863804N018274K946839j265300n058171o248873m045348L32977
9135h375503L852688L769615N11826k029114l57118M095012N661267J237839m627758
9126C738754m514149J599208M957584k66357p805261p226587J154374O440856
9118a921578K689368l352476l309181R13532K039739p63005k227309n49646Q43645
9109e636911N21735J066631K972501K798552n79373l267043k578606j294982k421545
9100h419041l693864j423325K924621M469360K040073m53496K04053K518021K878106
9091A044508K53953k795432l253008j184180L61902n20689j543813P00746M975436
9082a960577N811633Q48333n167892o003656j493920L107538L889908J656474
$$ plain form
9074 687841 26149 -1210726 -1240175 351278 2017747 1637484 -938969 -3489295 -4110559
9065 -4110559 -3399232 -3216086 -4115866 -4942715 -4498997 -2825785 -1128715 -957173 -2991868
9056 -2991868 -5999201 -7380712 -5599770 -2092837 -101626 -1235537 -3503330 -3312043
9048 -3312043 482454 5147058 7178572 6092779 4035600 2446013 1241202 1062006
9040 1062006 3183325 6161265 6057250 2408648 579873 4328748 8930992 7100009
9032 7100009 98063 -3660266 -1316924 254226 -4457154 -10848509 -11208069 -5682233
9024 -5682233 -696520 494256 -11959 -289390 -756676 -1308986 -1052377 -927002 -2465956
9015 -2465956 -3981835 -2193589 2085976 4209884 2458729 316122 640943 1715230
$$ packed form
9074F87841o61692j236875k9449J591453J666469l80263k576453k550326o21264
9065d110559P11327J83146q99780q26849M43718J673212J697070J71542k034695
9056b991868l007333j381511J780942L506933J991211j133911k267793J91287
9048c312043L794497M664604K031514j085793k057179j589587j204811j79196
9040A062006K121319K977940j04015l648602j828775L748875M602244j830983
9032G100009p001946l758329K343342J571150m711380o391355l59560N525836
9024e682233M985713J190776n06215k77431m67286n52310K56609J25375j538954
9015b465956j515879J788246M279565K123908j751155k142607L24821J074287
$$ plain form
9007 1715230 1175097 38675 -53047 -437603 -2793813 -5139220 -4244775 -917136 750594
8998 750594 -806962 -2793395 -2556425 -1183376 -1330388 -3357440 -5282966 -5700650 -5183389
8989 -5183389 -4882935 -4992089 -5105237 -5227434 -5381557 -4542895 -1443569 3005840 5460924
8980 5460924 3607002 -877631 -4138252 -4287610 -2282646 591178 3874677 6477842
8972 6477842 6391521 3036992 -1324494 -3528011 -2322045 925816 3543155 3670335 2098269
8963 2098269 1709178 3824348 5767709 4125329 -17854 -1952959 149421 2666627
8955 2666627 1753152 -1594704 -3616464 -2745637 -324445 1976549 3240281 2967914 1657645
8946 1657645 872244 1190642 1158342 -269299 -1643384 -1227570 10387 -211075 -1992028
$$ packed form
9007A715230n40133j136422r1722l84556k356210k345407Q94445L327639J667730
8998G50594j557556j986433K36970J373049j47012k027052j925526m17684N17261
8989e183389L00454j09154j13148j22197j54123Q38662L099326M449409K455084
8980E460924j853922m484633l260621j49358K004964K873824L283499K603165
8972F477842q6321l354529m361486k203517J205966L247861K617339J27180j572066
8963B098269l89091K115170J943361j642380m143183j935105K102380K517206
8955B666627r13475l347856k021760Q70827K421192K300994J263732k72367j310269
8946A657645p85401L18398l2300j427641j374085M15814J237957k21462j780953
$$ plain form
8937 -1992028 -3299228 -2959271 -1698798 -670149 -661044 -2264603 -5156626 -7583109 -7934003
8928 -7934003 -6348749 -3903693 -1511759 -677341 -3161531 -7847036 -10215308 -7873396
8920 -7873396 -4503781 -4586858 -6084312 -3375594 3259288 6897874 3802763 -1436861 -3030177
8911 -3030177 -1544824 -846766 -1271364 -403183 1417045 1075491 -2125279 -5040910 -5062712
8902 -5062712 -3159081 -1620116 -876205 61808 1184189 1125164 -665698 -2437935 -1841255
8893 -1841255 922745 2906479 2191502 607018 1039875 2999202 3266549 730891 -2057653
8884 -2057653 -2566969 -1025222 1117417 2843476 2774241 -447519 -5480779 -8622764 -8537514
8875 -8537514 -7973364 -8833221 -8720978 -5403863 -1639066 -1243699 -2496424 -654560 3750571
$$ packed form
8937a992028j307200L39957J260473J028649R105j603559k892023k426483l50894
8928g934003J585254K445056K391934Q34418k484190m685505k368272K341912
8920g873396L369615q3077j497454K708718O634882L638586l095111n239624j593316
8911c030177J485353O98058m24598Q68181J820228l41554l200770k915631k1802
8902e062712J903631J538965P43911R38013J122381n9025j790862j772237N96680
8893a841255K764000J983734p14977j584484M32857J959327K67347k535658k788544
8884b057653n09316J541747K142639J726059o9235l221760n033260l141985Q5250
8875h537514N64150q59857J12243L317115L764797L95367j252725J841864M405131
$$ plain form
8866 3750571 4766068 70773 -5028762 -5038673 -1579243 -13880 -1747595 -3624393 -3378063
8857 -3378063 -1972036 -874950 -140656 377129 317078 86259 965001 2932674 3829742
8848 3829742 1982817 -1169222 -2452400 -809142 1336962 886724 -2393325 -5546498
8840 -5546498 -5404685 -1645684 3013112 5519639 5290034 4089344 3225710 1906953 -672184
8831 -672184 -2662410 -1234884 3003547 5920819 5327606 3863930 4376738 5187168 3381019
8822 3381019 539251 368068 1699232 -326986 -5539097 -7453883 -3169238 1402170
8814 1402170 367420 -3160861 -2507541 1962985 4362228 3257005 3029431 5584147 7464327
8805 7464327 6428163 5049224 5739400 7015596 6917919 5957930 4529307 1348888 -3267413
$$ packed form
8866C750571J015497m695295n099535r911L459430J565363j733715j876798K46330
8857c378063J406027J097086P34294N17785o0051k30819Q78742J967673Q97068
8848C829742j846925l152039j283178J643258K146104m50238l280049l153173
8840e546498J41813L759001M658796K506527k29605j200690q63634j318757k579137
8831f72184j990226J427526M238431K917272n93213j463676N12808Q10430j806149
8822C381019k841768j71183J331164k026218n212111j914786M284645M571408
8814A402170j034750l528281O53320M470526K399243j105223k27574K554716J880180
8805G464327j036164j378939O90176J276196r7677r59989j428623l180419m616301
$$ plain form
8796 -3267413 -6306817 -6473911 -5964447 -5622334 -2666441 3589387 8018567 5978352 55161
8787 55161 -3906418 -4651301 -4657201 -4040393 -989112 2938488 3547750 162698 -3357056
8778 -3357056 -3847780 -1346818 3075945 7797896 9404814 5528002 -1013243 -5099120
8770 -5099120 -5960352 -6287229 -5581257 -833332 5820518 7627011 3727235 1755175 6018076
8761 6018076 10175011 7413406 1702050 1330545 5550534 6274838 1187746 -3349172 -2709881
8752 -2709881 197776 1162828 468796 150878 451253 1418845 3904244 6722454 6643067
8743 6643067 3545421 2008372 5059334 9386054 9738782 5757917 1457686 -376620
8735 -376620 -340972 176573 1200268 3549726 7038452 9509572 8349806 4183513 1865369
$$ packed form
8796c267413l039404j67094N09464L42113K955893O255828M429180k040215n923191
8787E5161l961579p44883n900O16808L051281L927600O09262l385052l519754
8778c357056m90724K500962M422763M721951J606918l876812o541245m085877
8770e099120q61232l26877P05972M747925O653850J806493l899776j972060M262901
8761F018076M156935k761605n711356l71505M219989P24304n087092m536918O39291
8752b709881K907657R65052o94032l17918L00375R67592K485399K818210p9387
8743F643067l097646j537049L050962M326720L52728l980865m300231j834306
8735c76620L5648N17545J023695K349458L488726K471120j159766m166293k318144
$$ plain form
8726 1865369 4930805 9742014 9229301 2783161 -2361192 -1112924 3205740 5344909
8718 5344909 5676762 6825028 7239517 4119576 -21226 -60088 3710184 6123326 5055207
8709 5055207 3064166 1384687 -1615460 -5288355 -6130910 -4096472 -3807858 -7056102 -9455630
8700 -9455630 -7679111 -4938039 -5294163 -7060868 -6625572 -4989747 -4993196 -5010285 -1711870
8691 -1711870 2510370 1522220 -5151104 -11078767 -12140430 -11259679 -12024279 -13110767 -12301423
8682 -12301423 -11340337 -12392127 -13024335 -9668951 -4104376 -1402641 -2125829 -1566264 2636333
8673 2636333 6629364 5875553 1087450 -3645485 -6111353 -6847920 -6503386 -4962334 -2484518
8664 -2484518 95801 1897012 1795412 -964937 -4616433 -5062701 -558416 4951143 5821231
$$ packed form
8726A865369L065436M811209n12713o446140n144353J248268M318664K139169
8718E344909L31853J148266M14489l119941m140802l8862L770272K413142j068119
8709E055207j991041j679479l000147l672895q42555K034438K88614l248244k399528
8700i455630J776519K741072l56124j766705M35296J635825l449j7089L298415
8691a711870M222240r88150o673324n927663j061663Q80751p64600j086488Q09344
8682a2301423R61086j051790o32208L355384N564575K701735p23188N59565M202597
8673B636333L993031p53811m788103m732935k465868p36567L44534J541052K477816
8664b484518K580319J801211j01600k760349l651496m46268M504285N509559Q70088
$$ plain form
8655 5821231 1495203 -3263997 -4559222 -2959563 -859220 697257 1578772 1460450 536802
8646 536802 -261849 -632173 -1091691 -1599864 -1789542 -2474573 -4452607 -5881034 -4150001
8637 -4150001 -807628 -642947 -4522515 -7367303 -5522850 -1912947 -722822 -1116017 -438347
8628 -438347 97558 -1713043 -3289803 -485577 4822088 6561747 3692331 1688746 4013944
8619 4013944 7455725 7564172 4319936 574358 -1621794 -1639572 -287104 -212949 -3377376
8610 -3377376 -7656735 -9086559 -7412040 -5612130 -4236879 -1177033 2672377 3353842
8602 3353842 849437 183931 3234164 5411437 3688268 1927894 3797507 5835926
8594 5835926 3152581 -2247775 -4807216 -3827961 -2532943 -1276298 1988103 5869499
$$ packed form
8655E821231m326028m759200j295225J599659K100343J556477Q81515j18322r23648
8646E36802p98651l70324m59518n08173j89678o85031j978034j428427J731033
8637d150001L342373J64681l879568k844788J844453L609903J190125l93195O77670
8628d38347N35905j810601j576760K804226N307665J739659k869416k003585K325198
8619D013944L441781J08447l244236l745578k196152j7778J352468P4155l164427
8610c377376m279359j429824J674519J799910J375251L059846L849410O81465
8602C353842k504405o65506L050233K177273j723169j760374J869613K038419
8594E835926k683345n400356k559441R79255J295018J256645L264401L881396
$$ plain form
8586 5869499 6312049 3048465 234533 459514 2181196 3029943 2122335 -441860 -3147158
8577 -3147158 -3143794 16842 2403478 1045760 -1140803 -368939 848635 -2106324 -6510800
8568 -6510800 -4887576 2932426 8402053 6720870 3082583 3266609 5054764 3840631
8560 3840631 1112879 1407616 4378685 5703545 4035392 2158692 2149725 3278308 4136837
8551 4136837 3828202 1729412 -1409579 -3092037 -2106996 -628981 -801865 -792240 2507562
8542 2507562 7855805 10484291 8642761 5843740 5552188 6523064 5242637 1114341 -2986791
8533 -2986791 -4605096 -4111100 -2989619 -1395842 1402577 4952191 7553493 8321811 7848912
8524 7848912 6453381 3491240 -681747 -3922399 -5009205 -5312409 -5748766 -4201273 767028
$$ packed form
8586E869499M42550l263584k813932K24981J721682Q48747r07608k564195k705298
8577c147158L364L160636K386636j357718k186563P71864J217574k954959m404476
8568f510800J623224P820002N469627j681183l638287J84026J788155j214133
8560C840631k727752K94737K971069J324860j668153j876700q967J128583Q58529
8551D136837l08635k098790l138991j682458R85041J478015j72884R625L299802
8542B507562N348243K628486j841530k799021k91552R70876j280427m128296m101132
8533b986791j618305M93996J121481J593777K798419L549614K601302P68318m72899
8524G848912j395531k962141m172987l240652j086806l03204m36357J547493M968301
$$ plain form
8515 767028 5250683 3552767 -3637926 -9049112 -7866483 -3039451 -36037 -180630 -1576948
8506 -1576948 -3159243 -4458499 -3713559 37365 3984959 3985507 -7652 -3384047 -2258389
8497 -2258389 2120086 5062000 3971006 1471385 2349134 7404006 12020847 12052623 8931548
8488 8931548 6263900 3677581 -1293822 -6573673 -7092263 -3505416 -2477505 -5892754
8480 -5892754 -6878017 -1012400 5195519 3708577 -2329212 -3499501 1342774 4297265
8472 4297265 1284451 -3078132 -4512401 -4959062 -6843649 -8332275 -7768772 -7167098 -7588935
8463 -7588935 -6098425 -1354241 2411960 1681289 -49262 2477993 7757748 9900085
8455 9900085 7499130 4378380 2707745 1363562 916730 4025966 9545135 11789463
$$ packed form
8515G67028M483655j697916p190693n411186J182629M827032L003414j44593j396318
8506a576948j582295j299256P44940L750924L947594N48l993159l376395J125658
8497b258389M378475K941914j090994k499621Q77749N054872M616841L1776l121075
8488H931548k667648k586319m971403n279851n18590L586847J027911l415249
8480e892754r85263N865617O207919j486942o037789j170289M842275K954491
8472D297265l012814m362583j434269m46661j884587j488626N63503O01674m21837
8463g588935J490510M744184L766201p30671j730551K527255N279755K142337
8455I900085k400955l120750j670635j344183m46832L109236N519169K244328
$$ plain form
8447 11789463 8028397 2250325 -881745 -1461780 -1022875 1490393 6228742 8845555
8439 8845555 5715600 164025 -2006250 -1168852 -1869737 -3596980 -1209597 4802651 6754146
8430 6754146 1694115 -2637884 852923 7542847 8355256 3596375 1314276 4185020
8422 4185020 6744077 5652825 4359647 5531437 6164528 3690207 1026260 1325641 2265744
8413 2265744 91739 -4003771 -5991453 -5132666 -3874341 -3250651 -2101413 107310 2575959
8404 2575959 4277636 3625506 -1068303 -8177591 -11978094 -8740137 -2033141 1632985
8396 1632985 1096676 501388 1969621 3079815 2110154 1287192 2856030 5052673 4441048
8387 4441048 679612 -2983515 -3351594 -354784 3143494 4136585 2288379 -50988 -649335
$$ packed form
8447A1789463l761066n778072l132070n80035M38905K513268M738349K616813
8439H845555l129955n551575k170275Q37398p00885j727243K387383O012248J951495
8430F754146n060031m331999L490807O689924Q12409m758881k282099K870744
8422D185020K559057j091252j293178J171790O33091k474321k663947K99381R40103
8413B265744k174005m095510j987682Q58787J258325O23690J149238K208723K468649
8404B575959J701677o52130m693809p109288l800503L237957O706996L666126
8396A632985n36309n95288J468233J110194r69661q22962J568838K196643o11625
8387D441048l761436l663127l68079K996810L498278R93091j848206k339367n98347
$$ plain form
8378 -649335 528021 2127471 2753493 976855 -3731569 -8629800 -8809601 -3210289 2644842
8369 2644842 3107608 -264036 -1659711 266191 1531588 266054 -505199 1144995 2324781
8360 2324781 358431 -2342574 -1880029 1268489 3463218 3377694 3024061 4116366 6193818
8351 6193818 8026552 8547170 6555323 1765065 -3497611 -5521225 -2961159 1706454
8343 1706454 5038271 5936859 5416912 4067861 1300658 -2745611 -6052887 -6733210 -5504023
8334 -5504023 -4565689 -4173788 -2334626 1502306 4676313 4839628 3439241 3428003 4759362
8325 4759362 4884426 3215467 2160215 3267037 4846715 4481974 2105324 -579808 -2479683
8316 -2479683 -3719249 -4484482 -4206756 -2058172 1727622 5179350 6071226 4428703 2430880
$$ packed form
8378f49335J177356J599450O26022j776638m708424m898231j79801N599312N855131
8369B644842M62766l371644j395675J925902J265397j265534p71253J650194J179786
8360B324781j966350k701005M62545L148518K194729q5524l53633J092305K077452
8351F193818J832734N20618j991847m790258n262676k023614K560066M667613
8343A706454L331817Q98588n19947j349051k767203m046269l307276o80323J229187
8334e504023R38334L91901J839162L836932L174007J63315j400387j1238J331359
8325D759362J25064j668959j055252J106822J579678l64741k376650k685132j899875
8316b479683j239566p65233K77726K148584L785794L451728Q91876j642523j997823
$$ plain form
8307 2430880 1255298 -350581 -3272634 -5780615 -5899481 -4219253 -2276416 -198538
8299 -198538 1527217 555600 -3284976 -4965194 -403909 6092552 6829508 2550626 1933090
8290 1933090 8085664 13345674 11026005 5215238 3415042 5115182 4557850 1179199
8282 1179199 -94831 2514486 5393455 5826344 4889959 3591052 1114400 -1991920 -3061774
8273 -3061774 -1177451 1325773 2261641 1858000 1054406 183675 -198074 331403 750991
8264 750991 202157 449321 3327599 6114348 3995546 -2091185 -4998568 -917236 5071342
8255 5071342 6190923 3054941 1584766 4366996 8281060 9427969 6714490 1305396
8247 1305396 -4196809 -6563473 -4969713 -2787210 -3493793 -5410285 -3857113 1646336
$$ packed form
8307B430880j175582j605879k922053k507981j18866J680228J942837K077878
8299a98538J725755r71617l840576j680218M561285O496461P36956m278882o17536
8290A933090O152574N260010k319669n810767j800196J700140n57332l378651
8282A179199j274030K609317K878969M32889r36385j298907k476652l106320j069854
8273c061774J884323K503224R35868m03641q03594q70731l81749N29477M19588
8264G50991n48834K47164K878278K786749k118802o086731k907383M081332N988578
8255E071342J119581l135982j470175K782230L914064J146909k713479n409094
8247A305396n502205k366664J593760K182503p06583j916492J553172N503449
$$ plain form
8239 1646336 6063169 5379837 983815 -3651681 -7235446 -9678149 -9859209 -7154251 -3387527
8230 -3387527 -776681 707898 1769428 1177596 -2434735 -7081854 -8763920 -6353685
8222 -6353685 -2776756 -1139148 -1743967 -3120167 -3944297 -3501225 -1983763 -725896 -672077
8213 -672077 -706512 676703 2397601 2125993 645598 1495446 5093894 6651977 2327200
8204 2327200 -5139077 -9703811 -9041362 -5548063 -2067306 239126 944545 642105 1640309
8195 1640309 5203070 8391190 6952020 1494714 -2618538 -2322869 -538769 -1357013 -4346715
8186 -4346715 -5768575 -3663121 224098 2538154 1093523 -3251338 -6497956 -4770785
8178 -4770785 1088167 5601538 4684398 240415 -2723690 -2155453 -181055 688215 213794
$$ packed form
8239A646336M416833o83332m396022m635496l583765k442703j81060K704958L766724
8230c387527K610846J484579J061530n91832l612331m647119j682066K410235
8222f353685L576929J637608o04819j376200q24130M43072J517462J257867N3819
8213f72077l4435J383215J720898k71608j480395Q49848L598448J558083m324777
8204B327200p466277m564734O62449L493299L480757K306432P05419l02440R98204
8195A640309L562761L188120j439170n457306m113252K95669J784100q18244k989702
8186d346715j421860K105454L887219K314056j444631m344861l246618J727171
8178d770785N858952M513371r17140m443983k964105N68237J974398Q69270m74421
$$ plain form
8169 213794 -561980 -895699 -424087 928203 2455534 2929049 1955756 681229 694111
8160 694111 2277125 3956311 4042208 2752605 2343832 4525981 8173385 10584621 10640344
8151 10640344 9263377 6963674 3130779 -1517609 -4076279 -2811582 155649 1534009
8143 1534009 1137289 1234853 2280549 1929222 -1265630 -5331056 -7094201 -5622863 -2597362
8134 -2597362 -300309 -19968 -1438105 -2580425 -1104805 3188023 7458446 8544333
8126 8544333 6478627 4182995 3524361 3014379 290438 -4144941 -7165543 -6811944 -4404806
8117 -4404806 -2552465 -2337733 -3171131 -4258644 -5018197 -4711096 -2986432 -683029 843738
8108 843738 1075354 285461 -1423807 -3940251 -6214137 -6785787 -5453178 -3445406 -1765964
$$ packed form
8169B13794p75774l33719M71612J352290J527331M73515r73293j274527J2882
8160F94111J583014J679186Q5897j289603m08773K182149L647404K411236N5723
8151A0640344j376967k299703l832895m648388k558670J264697K967231J378360
8143A534009l96720R7564J045696l51327l194852m065426j763145J471338L025501
8134b597362K297053K80341j418137j142320J475620M292828M270423J085887
8126H544333k065706k295632o58634n09982k723941m435379l020602L53599K407138
8117d404806J852341K14732q33398j087513p59553L07101J724664K303403J526767
8108H43738K31616p89893j709268k516444k273886n71650J332609K007772J679442
$$ plain form
8099 -1765964 -346312 868659 1026293 -681545 -3575878 -5640525 -5290233 -2973953 -816980
8090 -816980 -274470 -383214 710200 2628919 2931845 972637 -629198 33248 936693
8081 936693 -417806 -2087089 39127 5632377 9643612 9203676 7006680 6461180 7052949
8072 7052949 6724167 5750279 5250187 4097018 793118 -2767949 -2937876 414114 3381911
8063 3381911 3396883 2434483 3442783 5546466 5031395 623986 -4236678 -5192334 -1980597
8054 -1980597 1539347 2108639 472218 -461950 259432 612813 -1489223 -5194421 -6987468
8045 -6987468 -4084574 2128061 6509863 5263648 424773 -2603818 -1982443 -1019731 -2036173
8036 -2036173 -2498041 153240 3458740 3749815 2167964 2073645 2679432 981792 -1340039
$$ packed form
8099a765964J419652J214971J57634j707838k894333k064647L50292K316280K156973
8090h16980N42510j08744J093414J918719L02926j959208j601835O62446R03445
8081I36693j354499j669283K126216N593250M011235m39936k196996n45500N91769
8072G052949l28782r73888n00092j153169l303900l561067j69927L351990K967797
8063C381911J4972r62400J008300K103683n15071m407409m860664r55656L211737
8054a980597L519944N69292j636421r34168P21382L53381k102036l705198j793047
8045f987468K902894O212635M381802j246215m838875l028591O21375R62712j016442
8036b036173m61868K651281L305500K91075j581851r4319O05787j697640k321831
$$ plain form
8027 -1340039 406278 5262514 6444998 1393468 -4330982 -5594790 -4167578 -3518712
8019 -3518712 -2873612 -648901 1108358 597411 721873 4684397 10147431 12617323 12088392
8010 12088392 11508064 10853000 7880529 3507291 1539384 3288558 6187893 7487282
8002 7487282 6475675 3920852 1923088 2896514 6003201 6490686 1640772 -4656874 -6651896
7993 -6651896 -4004733 -720410 1022984 1921668 2333089 2254121 2872075 4130849 2825366
7984 2825366 -2433908 -6687179 -4353044 2384032 6490652 5664024 3061614 323038
7976 323038 -3072771 -4642142 -1074570 4306800 4432172 -72086 -725331 5296532 10078461
7967 10078461 7252057 1315344 -686867 205241 -806126 -2715139 -932088 4055758
$$ packed form
8027a340039J746317M856236J182484n051530n724450j263808J427212O48866
8019c518712O45100K224711J757259n10947J24462L962524N463034K469892n28931
8010A2088392n80328o55064k972471m373238j967907J749174K899335J299389
8002G487282j011607k554823j997764R73426L106687M87485m849914o297646j995022
7993f651896K647163L284323J743394Q98684M11421p8968O17954J258774j305483
7984B825366n259274m253271K334135O737076M106620q26628k602410k738576
7976C23038l395809j569371L567572N381370J25372m504258o53245O021863M781929
7967A0078461k826404n936713k002211Q92108j011367j909013J783051M987846
$$ plain form
7959 4055758 7130494 6195685 3810468 2111070 815960 -244142 -474484 -55809 681053
7950 681053 2568514 5882770 8595374 8632949 6443801 3426369 -107108 -3415543 -4470624
7941 -4470624 -3135642 -2468377 -4134750 -5508933 -4356739 -2925103 -3444703 -3101789 1388248
7932 1388248 7039003 8334823 5843530 4792721 5981588 4844074 115236 -3054152
7924 -3054152 -756138 4060893 6281316 5009212 2718349 1131640 392929 134667 -458070
7915 -458070 -1951206 -3215179 -2742122 -1618799 -2276591 -3992947 -3388029 -365287 675720
7906 675720 -2470473 -6083809 -6359601 -5083898 -5605768 -6409465 -3584897 2205149 6282938
7897 6282938 6724120 5817486 4941604 2858855 -142588 -1213434 124503 256117 -2793617
$$ packed form
7959D055758L074736r34809k385217j699398j295110j060102k30342M18675P36862
7950F81053J887461L314256K712604L7575k189148l017432l533477l308435j055081
7941d470624J334982O67265j666373j374183J152194J431636n19600L42914M490037
7932A388248N650755J295820k491293j050809J188867j137514m728838l169388
7924c054152K298014M817031K220423j272104k290863j586709p38711k58262n92737
7915d58070j493136j263973M73057J123323o57792j716356O04918L022742J041007
7906F75720l146193l613336k75792J275703n21870q03697K824568N790046M077789
7897F282938M41182r06634q75882k082749l001443j070846J337937J31614l049734
$$ plain form
7888 -2793617 -5696703 -5144485 -3517072 -5000166 -8316146 -8238389 -3535721 1373111 2904943
7879 2904943 2007442 562053 -1459002 -3479760 -3064140 161442 2634081 1856993 403897
7870 403897 1648891 4085412 3800526 709924 -1936300 -3121852 -4671721 -6541028 -5872178
7861 -5872178 -1605455 3380950 5803445 5186097 3114143 1643861 2453495 5060073 6251851
$$ packed form
7888b793617k903086N52218J627413j483094l315980P7757M702668M908832J531832
7879B904943q97501j445389k021055k020758M15620L225582K472639p77088j453096
7870D03897J244994K436521k84886l090602k646224j185552j549869j869307O68850
7861e872178M266723M986405K422495o17348k071954j470282Q09634K606578J191778
$$ [...]
##END NTUPLES=NMR SPECTRUM
##END=
