##TITLE=31Pdec_DE_PH-Ala_sum
 D2O, 24 sc
 19.2.2026
##JCAMPDX= 6.0         $$ Bruker NMR JCAMP-DX V2.0
##DATA TYPE= NMR SPECTRUM
##DATA CLASS= NTUPLES
##ORIGIN= UXNMR, Bruker Analytische Messtechnik GmbH
##OWNER= root
$$ XWIN-NMR		Version 3.5
$$ Thu Feb 19 16:20:31 2026 Russian Standard Time (UT+4h)  she@DPX200
##.OBSERVE FREQUENCY= 81.013821
##.OBSERVE NUCLEUS= ^31P
##.ACQUISITION MODE= SIMULTANEOUS
##.ACQUISITION SCHEME= undefined
##.AVERAGES= 24
##.DIGITISER RES= 17
##SPECTROMETER/DATA SYSTEM= spect
##.PULSE SEQUENCE= zgpg30
##.SOLVENT NAME= CDCl3
##.SHIFT REFERENCE= (INTERNAL, CDCl3, 0, 198.062)
##AUDIT TRAIL= $$ (NUMBER, WHEN, WHO, WHERE, WHAT)
$$ ##TITLE= Audit trail, XWIN-NMR		Version 3.5
$$ ##JCAMPDX= 5.01
$$ ##ORIGIN= Bruker BioSpin GmbH
$$ ##OWNER= she
$$ F:/spectra/data/she/nmr/P31/2/pdata/1/auditp.txt
$$ ##AUDIT TRAIL=  $$ (NUMBER, WHEN, WHO, WHERE, WHAT)
(   1,<2026-02-19 16:19:02.90 +0400>,<she>,<DPX200>,
      <created by zg, POWCHK disabled, PULCHK disabled
       configuration hash MD5:
       00 E9 B6 7A A2 85 ED C7 34 08 36 98 17 FE 4E 26
       data hash MD5: 32K
       82 44 9A 32 54 97 72 24 A2 86 81 03 62 E0 B6 EB>)
(   2,<2026-02-19 16:19:06.01 +0400>,<she>,<DPX200>,
      <Start of raw data processing
       efp BC_mod = 2 LB = 1.5 FT_mod = 6 PKNL = 1 PHC0 = 1412.871 PHC1 = -10.89932 SI = 64K 
       data hash MD5: 64K
       AB 4D 16 F8 01 E0 F1 8B 3C 50 1D CC 69 DE BD 03>)
(   3,<2026-02-19 16:19:28.39 +0400>,<she>,<DPX200>,
      <pk PHC0 = -4.002627 PHC1 = 12.8 
       data hash MD5: 64K
       65 CF EB 0F 81 86 DA 7B FD BA 31 61 F4 C5 21 C1>)
(   4,<2026-02-19 16:19:36.35 +0400>,<she>,<DPX200>,
      <abs ABSG = 5 
       data hash MD5: 64K
       D4 48 B4 1B D3 47 AC F4 A3 6F 9C 93 A6 DE C0 48>)
$$ ##END=
$$ 
$$ hash MD5
$$ A0 53 75 BE 74 E5 22 91 B3 1E 56 86 96 E4 53 E6
##$RELAX= 
##$RELAX= 
##$RELAX= 
##$RELAX= 
##$RELAX= 
##$RELAX= 
##$RELAX= 
##$RELAX= 
$$ Bruker specific parameters
$$ --------------------------
##$DU= <F:/spectra>
##$EXPNO= 2
##$NAME= <P31>
##$PROCNO= 1
##$TYPE= <nmr>
##$USER= <she>
##$AMP= (0..31)
100 100 100 100 100 100 100 100 100 100 100 100 100 100 100 100 100 100 
100 100 100 100 100 100 100 100 100 100 100 100 100 100 
##$AQSEQ= 0
##$AQ_mod= 1
##$AUNM= <au_zg>
##$AUTOPOS= <>
##$BF1= 81.014009
##$BF2= 200.13
##$BF3= 200.13
##$BF4= 200.13
##$BF5= 200.13
##$BF6= 200.13
##$BF7= 200.13
##$BF8= 200.13
##$BYTORDA= 1
##$CFDGTYP= 0
##$CFRGTYP= 5
##$CHEMSTR= <none>
##$CNST= (0..31)
1 1 145 1 1 1 1 1 1 1 1 1 1 1 1 1 1 1 1 1 1 1 1 1 1 1 1 1 1 1 1 1 
##$CPDPRG= <waltz16>
##$CPDPRG1= <>
##$CPDPRG2= <waltz16>
##$CPDPRG3= <>
##$CPDPRG4= <mlev>
##$CPDPRG5= <mlev>
##$CPDPRG6= <mlev>
##$CPDPRG7= <mlev>
##$CPDPRG8= <mlev>
##$CPDPRGB= <>
##$CPDPRGT= <>
##$D= (0..31)
0 1 0 0 0 0 0 0 0 0.06 0 0.03 2e-05 3e-06 0 0 0.0002 0 0 0 0 0 0 0 0 0 
0 0 0 0 0 0 
##$DATE= 1771503542
##$DBL= (0..7)
120 120 120 11 120 120 24 19 
##$DBP= (0..7)
150 150 150 150 150 150 150 150 
##$DBP07= 0
##$DBPNAM0= <>
##$DBPNAM1= <>
$$ [...]
##$SUBNAM3= <"">
##$SUBNAM4= <"">
##$SUBNAM5= <"">
##$SUBNAM6= <"">
##$SUBNAM7= <"">
##$SUBNAM8= <"">
##$SUBNAM9= <"">
##$SW= 400.765351723535
##$SWIBOX= (0..15)
0 1 3 0 0 0 0 0 0 0 0 0 0 0 0 0 
##$SW_h= 32467.5324675325
##$TD= 32768
##$TD0= 1
##$TE= 0
##$TE2= 300
##$TE3= 300
##$TEG= 300
##$TL= (0..7)
0 120 53 12 22 120 120 120 
##$TP= (0..7)
150 150 150 150 150 150 150 150 
##$TP07= 0
##$TPNAME0= <>
##$TPNAME1= <>
##$TPNAME2= <>
##$TPNAME3= <>
##$TPNAME4= <>
##$TPNAME5= <>
##$TPNAME6= <>
##$TPNAME7= <>
##$TPOAL= (0..7)
0.5 0.5 0.5 0.5 0.5 0.5 0.5 0.5 
##$TPOFFS= (0..7)
0 0 0 0 0 0 0 0 
##$TUNHIN= 0
##$TUNHOUT= 0
##$TUNXOUT= 0
##$USERA1= <user>
##$USERA2= <user>
##$USERA3= <user>
##$USERA4= <user>
##$USERA5= <user>
##$V9= 5
##$VALIST= <valist>
##$VCLIST= <CCCCCCCCCCCCCCC>
##$VD= 0
##$VDLIST= <DDDDDDDDDDDDDDD>
##$VPLIST= <PPPPPPPPPPPPPPP>
##$VTLIST= <TTTTTTTTTTTTTTT>
##$WBST= 1024
##$WBSW= 4
##$XGAIN= (0..3)
0 0 0 0 
##$XL= 0
##$YL= 0
##$YMAX_a= 6832
##$YMIN_a= -12144
##$ZGOPTNS= <>
##$ZL1= 120
##$ZL2= 120
##$ZL3= 120
##$ZL4= 120
##$ABSF1= 198.0616
##$ABSF2= -202.7028
##$ABSG= 5
##$ABSL= 3
##$ALPHA= 0
##$AQORDER= 0
##$ASSFAC= 0
##$ASSFACI= 0
##$ASSFACX= 0
##$ASSWID= 0
##$AUNMP= <proc_1d>
##$AZFE= 0.1
##$AZFW= 0.5
##$BCFW= 0
##$BC_mod= 2
##$BYTORDP= 0
##$COROFFS= 0
##$CY= -3
##$DATMOD= 1
##$DC= 0
##$DFILT= <>
##$DTYPP= 0
##$F1P= 0
##$F2P= 0
##$FCOR= 1
##$FTSIZE= 65536
##$FT_mod= 6
##$GAMMA= 0
##$GB= 0
##$INTBC= 1
##$INTSCL= 9.790993e-09
##$ISEN= 30
##$LB= 1.5
##$LEV0= 0
##$LPBIN= 0
##$MAXI= 10000
##$MC2= 0
##$MEAN= 0
##$ME_mod= 0
##$MI= 50
##$NCOEF= 0
##$NC_proc= -8
##$NLEV= 6
##$NOISF1= 182.463
##$NOISF2= 159.3651
##$NSP= 0
##$NTH_PI= 0
##$NZP= 0
##$OFFSET= 198.0616
##$PC= 4
##$PHC0= 1408.868
##$PHC1= 1.900681
##$PH_mod= 1
##$PKNL= yes
##$PPARMOD= 0
##$PSCAL= 0
##$PSIGN= 0
##$REVERSE= no
##$SF= 81.0140089999434
##$SI= 65536
##$SIGF1= 159.3651
##$SIGF2= -187.1042
##$SINO= 113.3802
##$SIOLD= 16384
##$SREGLST= <1H.CDCl3>
##$SSB= 0
##$STSI= 65536
##$STSR= 0
##$SW_p= 32467.5324675325
##$SYMM= 0
##$S_DEV= 0
##$TDeff= 32768
##$TDoff= 0
##$TI= <>
##$TILT= no
##$TM1= 0
##$TM2= 0
##$TOPLEV= 0
##$USERP1= <user>
##$USERP2= <user>
##$USERP3= <user>
##$USERP4= <user>
##$USERP5= <user>
##$WDW= 1
##$XDIM= 65536
##$YMAX_p= 405523602
##$YMIN_p= -45748266
$$ End of Bruker specific parameters
$$ ---------------------------------
##NTUPLES= NMR SPECTRUM
##VAR_NAME=  FREQUENCY,     SPECTRUM/REAL,   SPECTRUM/IMAG
##SYMBOL=    X,             R,               I
##VAR_TYPE=  INDEPENDENT,   DEPENDENT,       DEPENDENT
##VAR_FORM=  AFFN,          ASDF,            ASDF
##VAR_DIM=   65536,         65536,           65536
##UNITS=     HZ,            ARBITRARY UNITS, ARBITRARY UNITS
##FACTOR=    0.49542278885378, 1,            1
##FIRST=     16045.7642231865, 0,            0
##LAST=      -16421.768244346, 0,            0
##MIN=       -16421.768244346, -45748266,    0
##MAX=       16045.7642231865, 405523602,    0
$$ Real data points
##PAGE= N=1
##DATA TABLE= (X++(R..R)), XYDATA
$$ [...]
41260B227233O55532M50419k2127n83391r67506j002069m15273N40090P25886
41251A608794m39960j725408j641007o67572l02810m75993M5522J014382Q81821
41242a702231k34409l18564J098687J754547J65759j885433k045256p56655k1135
41233c944690k03685j57585L95666O84570N81051N94141M55429n13802j689839
41224c798744j488715L39776K143593K423339J347008l4655j021136j374690j113290
41215b577514n97655k19369J49284P88516J271396Q36527k81437q25861j58208
41206a614321Q52653J012783K76931m12594l45966L16577R21198J037636P92497
41197B837394M96593M8147q59222j824086j778591m75380Q12504R02290L05079
$$ plain form
41260 2227233 2882765 3333184 3311057 2727666 1760160 758091 342818 882908 1608794
41251 1608794 1168834 -556574 -2197581 -2865153 -3167963 -3643956 -3598434 -2584052 -1702231
41242 -1702231 -1936640 -2255204 -1156517 598030 763789 -1121644 -3166900 -3923555 -3944690
41233 -3944690 -4148375 -4305960 -3910294 -3225724 -2644673 -2050532 -1595103 -2108905 -3798744
41224 -3798744 -5287459 -4947683 -2804090 -380751 966257 931602 -89534 -1464224 -2577514
41215 -2577514 -3175169 -3394538 -3245254 -2456738 -1185342 -348815 -630252 -1456113 -1614321
41206 -1614321 -761668 251115 528046 115452 -230514 86063 1007261 2044897 2837394
41197 2837394 3333987 3382134 2522912 698826 -1079765 -1555145 -742641 159649 464728
41188D64728J47465K06721m65031j398187j055760N87234J669495J115595n1963
41179A220297p40308j351164k266967k449066j084215O05764R28894L02397N21331
41170d313037J872762K704846J898590K96805o66706o75291m24424n10254q47715
41161f64424r38430n77544k50347m71793p74976j99673J003027J371301N68823
41152i34036K67911J468652K388583R90625j406064j569282Q21231K432565R69132
41143E429317j719241k452331q95469O52815O08535l63237q73921o44786n05621
41134g63939j003951j435976p02763Q16848J234678k03485j548095p81060R00309
41125c487434P36939j028744j110900J726165M397269L775914Q70994j161432
$$ plain form
41188 464728 612193 818914 353883 -1044304 -2100064 -1512830 156665 1272260 1220297
41179 1220297 479989 -871175 -3138142 -5587208 -6671423 -6065659 -5136765 -4834368 -4313037
41170 -4313037 -2440275 264571 2163161 2459966 1793260 1117969 693545 183291 -664424
41161 -664424 -1602854 -2180398 -2430745 -2902538 -3677514 -3877187 -2874160 -1502859 -934036
41152 -934036 -666125 802527 3191110 4181735 2775671 1206389 2027620 4460185 5429317
41143 5429317 3710076 1257745 362276 1015091 1623626 1260389 386468 -258318 -763939
41134 -763939 -1767890 -3203866 -3906629 -3089781 -1855103 -2058588 -3606683 -4387743 -3487434
41125 -3487434 -2750495 -3779239 -4890139 -3163974 1233295 5009209 5880203 4718771
41117D718771j269150o26715N417O86648R35099J63496r48622j284372j023864
41108A356708r54036p04432M93664J774957J365501p08406k368111k078684l58838
41099b181677J276338J692305O61116q49705j270664l35286L69806q8011k50033
41090i75811J134427K280802R13843j473551j432904P31305J065159j586566l322830
41081b666126j157292K321035K859342M03336j842237k229416j557466m75217
41073d344041J041473K197173J893046N91772k05292o6772L42410P65135J223461
41064C438365J025839k77460j475616j119668P3389K14284p01902r09727J9676
41055B87180N29495l7928j86653J122724K509214K160426M11591j094660j857951
$$ plain form
41117 4718771 3449621 2822906 2828323 3514971 4450070 4613566 3664944 2380572 1356708
41108 1356708 402672 -301760 191904 1966861 3332362 2623956 255845 -1822839 -2181677
41099 -2181677 -905339 786966 1448082 598377 -672287 -1007573 -637767 -725778 -975811
41090 -975811 158616 2439418 3353261 1879710 446806 1178111 2243270 656704 -2666126
41081 -2666126 -3823418 -1502383 1356959 1760295 -81942 -2311358 -3868824 -4344041
41073 -4344041 -3302568 -1105395 787651 1379423 1174131 1107359 1449769 2214904 3438365
41064 3438365 4464204 4186744 2711128 1591460 1664849 1879133 1177231 267504 287180
41055 287180 816675 778747 592094 1714818 4224032 6384458 6796049 5701389 3843438
41046C843438k595001l336730l021603j250829O85753J263250O77688M84729J300414
41037a948891J841832Q97701n91199p27767M39220R40922M2068n80361K72050
41028E85575J150728K97098j352282j539557r1730J186564J412447J230572Q62917
41019C742332j51965j230133j020132J84385M23965q81590j863045j110528J57653
41010a749058Q0201j122943j795444j227672r1020Q64645J392105J362321P02761
41001a584104l27608j196884j342034m46413J038184J874745J378479N69477Q96844
40992H60686J954745J875396J35830j545688j571984l45554P65183J054370N03427
40983C686411n90108j435619j334456q10567q92337j126541p1023J910667K528625
$$ plain form
41046 3843438 1248437 -2088293 -5109896 -6360725 -5674972 -4411722 -3734034 -3249305 -1948891
41037 -1948891 -107059 790642 199443 -528324 -89104 851818 893886 313525 585575
41028 585575 1736303 2033401 681119 -858438 -950168 236396 1648843 2879415 3742332
41019 3742332 3590367 2360234 1340102 1524487 1948452 1066862 -796183 -1906711 -1749058
41010 -1749058 -1668857 -2791800 -4587244 -5814916 -5905936 -5041291 -3649186 -2286865 -1584104
41001 -1584104 -1911712 -3108596 -4450630 -4897043 -3858859 -1984114 -605635 -36158 860686
40992 860686 2815431 4690827 4826657 3280969 1708985 1363431 2128614 3182984 3686411
40983 3686411 3096303 1660684 326228 -484339 -1376676 -2503217 -2574240 -663573 1865052
40974A865052J015298n90634p01000k66729j45403Q42809K898046K948106j237595
40965F627950o418006p180808l077586J190921K398429J885090J756405J775050
40957a042555J301937J185250J915615K179322R46665p85734j752226k195218
40949A753056k531370k015096l30660J054526Q69583L4312r7534j85105j486615
40940b934903l009273k556345l05811J112305M38280n21720J22998J509911J541838
40931d602720N4679j137886r01728L2078O42719J040630J655933J977413J198862
40922d0020k62648j076534q73772o45355r28670q70427J00284R00352M14308m77900
40912c760382j97823Q45433R05895K415j4023J106144J079139j119395k839300
$$ plain form
40974 1865052 2880350 2289716 1588716 1321987 1176584 2019393 4917439 7865545 6627950
40965 6627950 209944 -6970864 -10048450 -8857529 -6459100 -4574010 -2817605 -1042555
40957 -1042555 259382 1444632 3360247 5539569 6486234 5700500 3948274 1753056
40949 1753056 -778314 -2793410 -3124070 -2069544 -1199961 -1165649 -1263183 -1448288 -2934903
40940 -2934903 -5944176 -8500521 -8806332 -7694027 -7255747 -7777467 -7654469 -6144558 -4602720
40931 -4602720 -4548041 -5685927 -6587655 -6555577 -5912858 -4872228 -3216295 -1238882 -40020
40922 -40020 -302668 -1379202 -2252974 -2898329 -3826999 -4697426 -4597142 -3696790 -3282482 -3760382
40912 -3760382 -3958205 -3112772 -2206877 -2204462 -2218485 -1112341 -33202 -1152597 -3991897
40903c991897j290052K060537L233942J271936o23220K20226K413338K771634
40895F066444N95108j766762k036858m53274R59317P49311p44243k216447k847024
40886a694428k639007j741145k38557J289412J875311J344739P18323Q01671J019011
40877G35330M79304m05658n42360r4367m15577j849784k886532k132175j52323
40868g264142J429998J918632J689810R34841m44658j684351j258787J118303
40860c560354L483587L701882K119337Q57190N26547o48966l580001n792762m137395
40851g030935N49473L728998K591945o23660j757492K40594K778859L250457J664348
40842E392587j59045q27160n64747o46462j668567k437015j327156J082055K070132
$$ plain form
40903 -3991897 -5281949 -3221412 12530 1284466 661246 881472 3294810 6066444
40895 6066444 6661552 4894790 2857932 2404658 3363975 4113286 3369043 1152596 -1694428
40886 -1694428 -4333435 -6074580 -6313137 -5023725 -3148414 -1803675 -1085352 -283681 735330
40877 735330 1214634 808976 266616 172249 -243328 -2093112 -4979644 -7111819 -7264142
40868 -7264142 -5834144 -3915512 -2225702 -1290861 -1735519 -3419870 -4678657 -3560354
40860 -3560354 -76767 3625115 5744452 6601642 7128189 6479223 2899222 -2893540 -7030935
40851 -7030935 -6481462 -2752464 -160519 -784179 -2541671 -2301077 477782 3728239 5392587
40842 5392587 5233542 4406382 3841635 3195173 1526606 -910409 -2237565 -1155510 914622
40833I14622L39937j859172j706854J88979Q50144n68188j748219q99277Q54617
40824c633411J667676J595297J670814J797262J165953j0556o69355m96741k33047
40815B853892n17755j231570j806219j577146j89590J666622K353545R87729j203263
40806A336245k120997j271247p2636L18231M10064J138251K116934K052501O10887
40797D518233j033232j679739j427735j079174p87147j02295Q41501J202877P60098
40788A213387M16073P96182J192333P47909m7078j51859K83051K62609k90257
40779D422350n14843k18148l7867r054M51259R89929M92657q35314j453821j121803
40769B165345j397202k520731k218846O09357L281638K953738J052136R26752
$$ plain form
40833 914622 1254559 -604613 -2311467 -2122488 -1272344 -1840532 -3588751 -4488028 -3633411
40824 -3633411 -1965735 -370438 1300376 3097638 4263591 4253035 3583680 3086939 2853892
40815 2853892 2336137 1104567 -701652 -2278798 -2468388 -801766 1551779 2539508 1336245
40806 1336245 -784752 -2055999 -2128635 -1810404 -1400340 -262089 1854845 3907346 4518233
40797 4518233 3485001 1805262 377527 -701647 -1488794 -1591089 -749588 453289 1213387
40788 1213387 1629460 2425642 3617975 4365884 4318806 4166947 4449998 4712607 4422350
40779 4422350 3907507 3689359 3651492 3642438 4093697 5083626 5576283 4740969 3287148 2165345
40769 2165345 768143 -1752588 -3971434 -3362077 -80439 2873299 3925435 4852187
40761D852187K233830J431863k135437m494062k662665J055022K376740N02307
40753C159785j836982k350300j129444N74393J674052J640428Q89273N46201R46669
40744D114075R52066k48017j409366p42719J243643K013270K74269k376870l565451
40735B54900k828535j495946o36155p3689O96405J455019J539025Q60757J28813
40726i9406m0005J81642K83515J77771O1299j32028m97545o15915k8682Q43469
40716A34115J115763P56684N40073O27542L28185m73709r04166o37282n64690
40707I22515j113807j155089K24437J883517K020198P40478k85891l68751m39222
40698B428385j161414j852355j638712o28132M38697R14753M39437p79314j681928
$$ plain form
40761 4852187 7086017 8517880 6382443 1888381 -774284 280738 2657478 3159785
40753 3159785 1322803 -1027497 -2156941 -1582548 91504 1731932 2621205 3167406 4114075
40744 4114075 5066141 4818124 3408758 2666039 3909682 5922952 6197221 3820351 254900
40735 254900 -2573635 -4069581 -4705736 -4779425 -4083020 -2628001 -1088976 -228219 -99406
40726 -99406 -139411 42231 325746 503517 564816 432788 -64757 -680672 -709354 134115
40716 134115 1249878 2006562 2546635 3174177 3502362 3028653 2124487 1487205 922515
40707 922515 -191292 -1346381 -1121944 761573 2781771 3522249 3236358 2867607 2428385
40698 2428385 1266971 -585384 -2224096 -2852228 -2413531 -1498778 -1059341 -1838655 -3520583
40689c520583j172166N10395J935194K202287J757534J252010N22192o68672j609359
40680A208832j318138m9016P45508J91909q47206q71165K95010J308472J155817
40671A820023M06825R4750R2025l82577j132360j229075p23894n21695m59612
40662b035590N55078J957271J350605j733216m051793k691794Q14412K831752
40654c003275K644999K240138K110576Q09906j401265k075543o08875M40610n18860
40645F38411j425329J38391L135329M587297L330245M76304k466252m200885l682031
40636E31480j397665L56476J27976o95827o9872J609069K350832J583804L92866
40627D789139n69510j450353j912717j397909m74505k26735n06476m35383l36446
$$ plain form
40689 -3520583 -4692749 -4182354 -2247160 -44873 1712661 2964671 3486863 2818191 1208832
40680 1208832 -109306 -158322 587186 779095 -68111 -939276 -644266 664206 1820023
40671 1820023 2226848 2321598 2413623 2031046 898686 -330389 -1054283 -1575978 -2035590
40662 -2035590 -1480512 476759 1827364 94148 -3957645 -6649439 -5835027 -3003275
40654 -3003275 -358276 1881862 3992438 4802344 3401079 1325536 716661 1157271 638411
40645 638411 -786918 -648527 2486802 7074099 10404344 10880648 8414396 4213511 531480
40636 531480 -866185 -509709 -381733 -1077560 -1147432 461637 2812469 4396273 4789139
40627 4789139 4219629 2769276 856559 -541350 -1015855 -1242590 -1749066 -2184449 -2520895
40618b520895j272239k740218k858516j179677N54849J052235J141945J949455
40610e873061K851329K443705P28543p34461n92217R24679K210643J761777k37363
40601C483574j909036j679571L7847J675497K352104J953942K66649k305000l700144
40592A75862k095924J023067J994965p8597j779599j49163K983088L546935Q33173
40583F453807j911485k127069p95914j64288n61962p00375k2310O74442P14141
40574A558987N12650Q02623J572680K180950K120555J266575k82884k035676l000413
40565D696047k505883j154921k34295j00579Q809M48566N87269J66764m8460K30145
40555B093462l9460j442057k670040k328408j110858n04009l44331L05649P69972
$$ plain form
40618 -2520895 -3793134 -6533352 -9391868 -10571545 -10016696 -8964461 -7822516 -5873061
40610 -5873061 -3021732 -578027 150516 -583945 -1176162 -251483 1959160 3720937 3483574
40601 3483574 1574538 -105033 -67186 1608311 3960415 5914357 6181006 3876006 175862
40592 175862 -1920062 -896995 1097970 1019373 -760226 -909389 2073699 5620634 6453807
40583 6453807 4542322 2415253 1619339 1455051 893089 192714 170404 844846 1558987
40574 1558987 2071637 2874260 4446940 6627890 8748445 10015020 9732136 7696460 4696047
40565 4696047 2190164 1035243 800948 700369 709178 1157744 1745013 1911777 1863317 2093462
40555 2093462 2054002 611945 -2058095 -4386503 -5497361 -6001370 -6345701 -6040052 -5270080
40546e270080j82518j384855l66154K405418L482997J534355n59828k62587Q09804
40537B06552n635j770451j452882J095860K763551J639727o89369j710169q87986
40528h10802O23257J690972J816084R35127o28650k251946l256342l025352j319062
40519f226714J067551K467856J917162K83216q07046p92938k55381L15431Q30012
40510a200851R70328L89645l91688l06385P22661J363810M92304j285123k308048
40501a553347j893239j093147j180330j822380j491828K77865J992548K153408
40493d610450J243674P26006P84746N24918l3280L3070N82569L97984n40004p75908
40483a666675J0802K48702o51631q58235Q47905K554669J841460n04633j645154
$$ plain form
40546 -5270080 -5452598 -6837453 -7203607 -4798189 -1315192 219163 -340665 -603252 206552
40537 206552 200917 -1569534 -3022416 -1926556 836995 2476722 1787353 77184 -810802
40528 -810802 -187545 1503427 3319511 4254638 3625988 1374042 -1882300 -4907652 -6226714
40519 -6226714 -5159163 -2691307 -774145 -490929 -1297975 -2090913 -2346294 -2030863 -1200851
40510 -1200851 -230523 159122 -232566 -538951 183710 1547520 2039824 754701 -1553347
40501 -1553347 -3446586 -4539733 -5720063 -7542443 -9034271 -8756406 -6763858 -4610450
40493 -4610450 -3366776 -2640770 -1856024 -1331106 -1364386 -1331316 -748747 -350763 -890767 -1666675
40483 -1666675 -1655873 -1407171 -2058802 -2917037 -2069132 485537 2326997 1822364 177210
40474A77210o01284J160882K315002K633569J815512m02587k925173l934656l039248
40465b800773j436494j08881P60779R32284K65435m77820m80303k03120l99445
40456c948338m16015O36503J625228O93924j383577j763989K64148K222138K218978
40447A49000J240211O83788J46109q34339j094443J29542J261059O25895o75881
40438A630941m34886R81955J059279r09197k595409j918850K58251J685853J671770
40429A429707J166322O14416o45315k582023l525999k202073L4507O06279o78466
40420e782645j198843O84021L194689L774795K563302J446718R00753L5612r91867
40411D626535j105684n77251o93906j153033l42796J437307J714815l19383k214391
$$ plain form
40474 177210 -424074 736808 3051810 5685379 7500891 7098304 4173131 238475 -2800773
40465 -2800773 -4237267 -4346148 -3585369 -2653085 -2387650 -2865470 -3345773 -3548893 -3948338
40456 -3948338 -4364353 -3727850 -2102622 -1408698 -2792275 -4556264 -4292116 -2069978 149000
40447 149000 1389211 2072999 2219108 1384769 290326 419868 1680927 2306822 1630941
40438 1630941 1196055 2178010 3237289 2328092 -267317 -2186167 -1927916 -242063 1429707
40429 1429707 2596029 3210445 2565130 -16893 -3542892 -5744965 -5710458 -5104179 -5782645
40420 -5782645 -6981488 -6297467 -3102778 672017 3235319 4682037 5582790 5618402 4626535
40411 4626535 3520851 2943600 2249694 1096661 753865 2191172 3905987 3586604 1372213
40402A372213j808650k11688L17751l56079q36982o64076m33408l54394j33941
40393c109254K94456Q26051J241707P84262j027259k729702j932833J110072L024901
40384a517599J777659m58648o92272O36739J106311L27008k27744k52921n79633
40375A18900p47629M78857K294661K332884K93953j388200j116700j44300j67113
40366A955313q60242r53259l10652K26703J38214m87838j197303j158606J94919
40357b452751J952318K120947L9061k324898k390303N3154K622162K979097J108244
40348C707031j088496j955082j442640m99215J95765M41391N4834q31551j249975
40339b667938l88523Q31962N77683j118942j972318o45817J239771J540233N87008
$$ plain form
40402 1372213 -436437 -648125 -330374 -686453 -1523435 -2187511 -2620919 -2975313 -3109254
40393 -3109254 -2814798 -1988747 -747040 37222 -990037 -3719739 -5652572 -4542500 -1517599
40384 -1517599 260060 -198588 -890860 -254121 852190 1179198 951454 698533 118900
40375 118900 -628729 -149872 2144789 4477673 4771626 3383426 2266726 2122426 1955313
40366 1955313 1095071 141812 -168840 57863 196077 -291761 -1489064 -2647670 -2452751
40357 -2452751 -500433 1620514 1659575 -665323 -3055626 -3002472 -380310 2598787 3707031
40348 3707031 2618535 663453 -779187 -1278402 -1082637 -641246 -586412 -1417963 -2667938
40339 -2667938 -3056461 -2224499 -1646816 -2765758 -4738076 -5383893 -4144122 -2603889 -2016881
40330b016881J30188M64717N44004J89926J42721K58218l59164j428006j506209
40321c580486j99431J168893J453669R83604N82140L54276r8362q85153j472615
40312a693465q98632J217042L520970L749093J498189r44249j611398j307689
40304C529861j501002j397122M08494K565004K409143L91217k62776J317133K111139
40295I571091m8856l032719l435949j017663J625108K414048J370123j16287n35752
40286F793144L62210R73493k41035k205984k430993q78880j29037j049737j287880
40277i4699M45270J634263k1989k404811j994175O11069J665022q9061k139690
40268b388801k363900j316789j07872J082849J690327O37399j412849j987566
$$ plain form
40330 -2016881 -1886693 -1421976 -877972 -688046 -545325 -287107 -646271 -2074277 -3580486
40321 -3580486 -3779917 -2611024 -1157355 -173751 408389 762665 664303 -220850 -1693465
40312 -1693465 -2592097 -1375055 2145915 5895008 7393197 6448948 4837550 3529861
40304 3529861 2028859 631737 1040231 3605235 6014378 6405595 6142819 7459952 9571091
40295 9571091 9522235 6489516 3053567 2035904 3661012 6075060 7445183 7328896 6793144
40286 6793144 7155354 8128847 7887812 5681828 3250835 2371955 2242918 1193181 -94699
40277 -94699 350571 1984834 1962845 -441966 -2436141 -1825072 -160050 -249111 -2388801
40268 -2388801 -4752701 -6069490 -6177362 -5094513 -3404186 -2766787 -4179636 -6167202
40260f167202k81207J331676P81165n42357p8913J837285K570382J234389k55880
40251D29338l50541J03658j74390o93383l39693M32770K65282p24887r52822R3773
40241a910895Q76600N2142j464485j661308o712K040890K756284J677319l20654
40232B039181j887378k269562j797215j094713l9421J585037K624325J526110
40224F86364p49508r95437J687049L782827K054338j513596k443675j79581J744292
40215D073073J419341N85235N46913m1057j914151l115245k208756q70664j016526
40206b541837j553417m25558J768844K669008J612487Q7713n56564j87850O22667
40197A495493Q82660j72926j654198j505019M51687J598277J54525k024942k211828
$$ plain form
40260 -6167202 -6448409 -5116733 -4335568 -4877925 -4956838 -3119553 -549171 685218 429338
40251 429338 78797 182455 8065 -685318 -1025011 -592241 -326959 -1051846 -2004668 -1910895
40241 -1910895 -1034295 -982153 -2446638 -4107946 -4114658 -2073768 682516 2359835 2039181
40232 2039181 151803 -2117759 -3914974 -5009687 -5049108 -3464071 -839746 686364
40224 686364 -63144 -1058581 628468 4411295 6465633 4952037 2508362 2328781 4073073
40215 4073073 5492414 6077649 6624562 6583505 4669354 1554109 -654647 -1525311 -2541837
40206 -2541837 -4095254 -4520812 -2751968 -82960 1529527 1617240 1060676 872826 1495493
40197 1495493 2378153 2205227 551029 -953990 -502303 1095974 1250499 -774443 -2986271
40188b986271p19009K21394N7805j82702m77680j489434k335480j479529M38540
40179h952366J294572Q51657Q27217J598685J604256M59004k0759J167797K470105
40170A300168K207617Q85281j29940o50964j121636j286502p38531j6098k2989
40161D26406p39912j250334q29405L21166J193489Q54347m26736j216148o37513
40152b304640M32432O93170L24340M09976J024411J331411J213558J218021J103089
40143E445768J58983j050497j080296L3403N80993k25844j188331j245616r91417
40134D37146j224296j481490j087157n05967n43493r89076j012480m02790K55018
40125f554585K76733n03042j331429q73335J163139K921127K277530o3818r86051
$$ plain form
40188 -2986271 -3705280 -3483886 -3426081 -3608783 -4086463 -5575897 -7911377 -9390906 -8952366
40179 -8952366 -7657794 -6806137 -5978920 -4380235 -2775979 -2316975 -2337734 -1169937 1300168
40170 1300168 3507785 4393066 4263126 3612162 2490526 1204024 465493 449395 426406
40161 426406 -313506 -1563840 -2393245 -2072079 -878590 -24243 -450979 -1667127 -2304640
40152 -2304640 -1872208 -1179038 -854698 -444722 579689 1911100 3124658 4342679 5445768
40143 5445768 5604751 4554254 3473958 3507361 4088354 3862510 2674179 1428563 437146
40134 437146 -787150 -2268640 -3355797 -3861764 -4405257 -5394333 -6406813 -6809603 -6554585
40125 -6554585 -6277852 -6780894 -8112323 -8985658 -7822519 -4901392 -2623862 -2687680 -3673731
40116c673731R59377L452755L383905O83844k012889k671023j608228m23221k25732
40107b134943q35121j157308m50314O52452Q40495p4454q28641m60344M40627
40098d007551P23985J90511m61300o14506j01779Q99575J772842J675597M66013
40089E43387p83291p66884M88297J413042N56890j584359k838471j816862L36067
40080d452184J430085J073295P27073J060249J114730N67570O77086J815805K164356
40071F178065N70700j231936j338601p23083j076894j435897j09041J499766P00188
40062C033267j694917k299225n91476N45715j00704m84307N35494J343479R78288
40053A265614P40464J144583Q03332l26093k12883J216159J099170j411960l037063
$$ plain form
40116 -3673731 -2714354 738401 4122306 4806150 2793261 122238 -1485990 -1909211 -2134943
40107 -2134943 -2970064 -4127372 -4577686 -3925234 -3084739 -3159193 -3987834 -4448178 -4007551
40098 -4007551 -3283566 -3093055 -3554355 -4168861 -4270640 -3371065 -1598223 77374 543387
40089 543387 -239904 -1006788 -518491 894551 1451441 -132918 -2971389 -4788251 -4452184
40080 -4452184 -3022099 -1948804 -1221731 -161482 953248 1520818 2197904 4013709 6178065
40071 6178065 6748765 5516829 4178228 3455145 2378251 942354 833313 2333079 3033267
40062 3033267 1338350 -960875 -1552351 -1006636 -1107340 -1591647 -1056153 287326 1265614
40053 1265614 2006078 3150661 3953993 3627900 3415017 4631176 5730346 4318386 1281323
40044A281323j536672O78419P59417l15653o14716q45447j725345j200813J829102
40035a690385M136895K782057K85840N40540K078430O87525l100564m796635l276676
40026b352973j682948j263279O4217K464298K950471P84534p39899K27133J147962
40017A599516j69830j769132j136279N69634Q17191r0472m7024J074783J343695
40008B192082j15423j905286k203802p64554R49840J362904O32429M11676J231488
39999A791354J309880o30541k724718k414814m61740L14741l99319l46347J016526
39990b544978J620030N30673p20362j184770j655942k031806q21762J673915K921353
39981b213649K085023J217391J310383O42412j320465k019286p7237J855043J197122
$$ plain form
40044 1281323 -255349 423070 1182487 866834 252118 -593329 -2318674 -3519487 -1690385
40035 -1690385 2446510 5228567 5514407 6054947 8133377 8820902 5720338 923703 -2352973
40026 -2352973 -4035921 -5299200 -5234983 -2770685 179786 964320 224421 451554 1599516
40017 1599516 1429686 -339446 -1475725 -906091 -88900 -179372 -226396 848387 2192082
40008 2192082 2076659 171373 -2032429 -2796983 -1847143 -484239 148190 559866 1791354
39999 1791354 3101234 2470693 -254025 -2668839 -3130579 -2815838 -3215157 -3561504 -2544978
39990 -2544978 -924948 -394275 -1114637 -2299407 -3955349 -5987155 -6808917 -5135002 -2213649
39981 -2213649 -128626 1088765 2399148 3041560 1721095 -298191 -375428 1479615 2676737
39972B676737n70457q40801q3836o9568l29544L70491J105261O05633J44930J282926
39962D291772K419048J135059j389790j993907o19220o8625j175184j858838j017617
39953b77302n344J71485K22900N84385N08967k89728j042887j229101q22380M42797
39943a736208K211305K615953N82016j665659j148549J315191K192959O51884
39935E018892n42644J34846P94838j80417j528187j648035r80421l39887N62079
39926A291064J391827N60673j853571k946279q78803K114595K858394J575540
39918D113440O80465P47225L78943p69510j442513j021068k49490J95130K72192
39909B904814m9192n84426m90161O11367J571846J193763J82725P3845P87446
$$ plain form
39972 2676737 2106280 1265479 1181643 1112075 782531 1153022 2258283 2863916 3008846 4291772
39962 4291772 6710820 7845879 6456089 4462182 3842962 3774337 2599153 740315 -277302
39953 -277302 -282646 -111161 111739 696124 1205091 915363 -127524 -1356625 -2179005 -1736208
39943 -1736208 475097 3091050 3673066 2007407 858858 2174049 4367008 5018892
39935 5018892 4476248 4611094 5405932 5225515 3697328 2049293 1068872 728985 1291064
39926 1291064 2682891 3243564 1389993 -1556286 -2435089 -320494 2537900 4113440
39918 4113440 4793905 5541130 5920073 5150563 3708050 2686982 2437492 2632622 2904814
39909 2904814 2855622 2271196 1781035 2392402 3964248 5158011 5340736 5414581 6202027
39900F202027R81674L52412l26285j106340k648433m097392l472653p40645J544419
39891c311216J537983L39012O624Q87265J928642K270864J476862n14791k560078
39882B061167k719750p45326J061270Q17407l77328m65524K64675N2907j075116
39873a125618j471003r46945j019624j847341j581462M45130K338756K607800
39865b600307K222278K241136J622799n32038k436094j911695j4191M04051q79229
39856a883290j280439L77296K190307K271179J175492L19684r9781n08757p57213
39847A804478n82015j78298M33668J520708K564437K377372R47917j96926k42079
39838H449262k57571j154068j944550j386041j51850J46223p30319j702255k052642
$$ plain form
39900 6202027 7183701 7536113 7209828 6103488 3455055 -642337 -4114990 -4855635 -3311216
39891 -3311216 -1773233 -1434221 -1427597 -540332 1388310 3659174 5136036 4621245 2061167
39882 2061167 -658583 -1403909 -342639 474768 97440 -368084 -103409 -50502 -1125618
39873 -1125618 -2596621 -3543566 -4563190 -6410531 -7991993 -7546863 -5208107 -2600307
39865 -2600307 -378029 1863107 3485906 2953868 517774 -1393921 -1408112 -1004061 -1883290
39856 -1883290 -3163729 -2786433 -596126 1675053 2850545 3170229 3070448 2561691 1804478
39847 1804478 1222463 1044165 1477833 2998541 5562978 7940350 8888267 8691341 8449262
39838 8449262 8191691 7037623 5093073 3707032 3555182 3701405 2971086 1268831 -783811
39829g83811j783891r72487q610K11702l87526k91031J567672L644518L420911
39820D617447R41120j051813o66473R72035J498890Q0872k023128k862695j518907
39811a2652R39712K247088J298955n86420j534563j617179k146627k941570k267282
39802f620538J53726K006196J374051m99791q99714O86233K153758J900620Q26730
39793A081271O44987J311683J262455j98969j976234k800422k614287j808370
39785e097886k92954J593390K343337J081255o24241o82876K86236m507j448584
39776b846830j456269N79777J977705J257054O49158J949492L009376J438977
39768F558440q82740q44178L70972p37290l569836l831244m33138K635433K366819
$$ plain form
39829 -783811 -2567702 -3540189 -3548799 -3337097 -3724623 -4015654 -2447982 1196536 4617447
39820 4617447 5558567 4506754 3840281 4812316 6311206 6392078 4368950 1506255 -12652
39811 -12652 927060 3174148 4473103 3886683 2352120 734941 -1411686 -4353256 -6620538
39802 -6620538 -6466812 -4460616 -3086565 -3586356 -4486070 -3799837 -1646079 254541 1081271
39793 1081271 1726258 3037941 4300396 4101427 2125193 -675229 -3289516 -5097886
39785 -5097886 -5390840 -3797450 -1454113 -372858 -997099 -1679975 -1393739 -1398246 -2846830
39776 -2846830 -4303099 -3723322 -1745617 -488563 160595 2110087 5119463 6558440
39768 6558440 5675700 4831522 5202494 4465204 895368 -2935876 -3369014 -733581 1633238
39759A633238N54446m7771K32482j09395p36778o62896k61921k6470Q20349K621905
39749D017189L908460L410641J817113O0444k215500m791173n586077l488073
39741b866976p33561l561n53592J56513K108078K899714J773053N96759O52000
39732D028427R05004J19346j221900j929964j735659j175341o95955l59010N8342
39723b006710P59715J350793R20167o87912k167814k158597r64980k3562j7521
39714d996421l66745k60845N57943J656094J932904M54124j992973l056727j555672
39705g628318Q47034J926942J837184K087995K504605J539305n67168j454725
39697A092854j73438J096138J65859j854549k073359J01328K137476J755444k36934
$$ plain form
39759 1633238 2187684 2139913 2372395 2263000 1526222 863326 601405 574935 1395284 4017189
39749 4017189 7925649 11336290 13153403 13213847 10998347 6207174 621097 -2866976
39741 -2866976 -3600537 -3604098 -4157690 -4001177 -1893099 1006615 2779668 3376427 4028427
39732 4028427 4933431 5052777 3830877 1900913 165254 -1010087 -1706042 -2065052 -2006710
39723 -2006710 -1246995 103798 1023965 336053 -1831761 -3990358 -4955338 -4978900 -4996421
39714 -4996421 -5363166 -5624011 -5066068 -3409974 -1477070 -1022946 -3015919 -6072646 -7628318
39705 -7628318 -6781284 -4854342 -3017158 -929163 1575442 3114747 2547579 1092854
39697 1092854 919416 2015554 2181413 326864 -1746495 -1645167 492309 2247753 2010819
39688B010819j265357m18985O27086K33859q69231q65349L04600R41709L24201
39679A023352l16351n4911K28937l31821p95089O5708J532854J914409J057676
39670D324764K50880L2365k95473j086360j700258j523028o15253N74785J291938
39661A254360O52539j223930k667558k181917l61792J022489J374198J398394
39653g33217J334104O21811p39658j861814k017690j033176R66999L046685L390358
39644B974402J379394q37950p61914R08940J329341j41330j209604n29339L90167
39635C502107L7309q22027j010565r14659j053352n66752J090844K462647J956051
39626D681603K73626p64170q71366j050833j494180j502236j021508o43162l71255
$$ plain form
39688 2010819 745462 326477 953563 1187422 318191 -547158 -242558 699151 1023352
39679 1023352 707001 652090 881027 549206 -245883 -180175 1352679 3267088 4324764
39670 4324764 4575644 4608009 4312536 3226176 1525918 2890 -612363 -37578 1254360
39661 1254360 1906899 682969 -1984589 -4166506 -4528298 -3505809 -2131611 -733217
39653 -733217 600887 1222698 483040 -1378774 -3396464 -4429640 -3462641 -415956 2974402
39644 2974402 4353796 3515846 2753932 3662872 4992213 4850883 3641279 3111940 3502107
39635 3502107 3539416 2717389 1706824 792165 -261187 -827939 262905 2725552 4681603
39626 4681603 4955229 4191059 3319693 2268860 774680 -727556 -1749064 -2392226 -2763481
39617b763481K03166P97128Q04676M31158J93287k59011j370144k159583j238524
39608e361328P53523J603193O89477j53939M56280J522341J671631J377107J616188
39599D174473J684002L92402j336768j422263o5360K12640j400235k372565p06867
39590h40541J642362J528568n92441j434832R4393J633964J360339K51680n47136
39581C096356j659802l109431k791557J44290K566511J174757k325823l280233
39573f184932o90227J780279J575266M99969J056189K491022K407131M24592j623677
39564A735612k100055q56107J060927K089508J312577m69461j587105j581744
39556c95848j324979j125232m24103M21469J41886r88336q45905J286072L178506
$$ plain form
39617 -2763481 -2560315 -1763187 -958511 -527353 -334066 -593077 -1963221 -4122804 -5361328
39608 -5361328 -4607805 -3004612 -2315135 -2469074 -2012794 -490453 1181178 2558285 4174473
39599 4174473 5858475 6250877 4914109 3491846 3426486 3639126 2238891 -133674 -840541
39590 -840541 801821 2330389 1737948 303116 397509 2031473 3391812 3643492 3096356
39581 3096356 1436554 -1672877 -4464434 -4320144 -1753633 -578876 -2904699 -6184932
39573 -6184932 -6875159 -5094880 -3519614 -3019645 -1963456 527566 2934697 3359289 1735612
39564 1735612 -364443 -1220550 -159623 1929885 3242462 2773001 1185896 -395848
39556 -395848 -1720827 -2846059 -3270162 -2848693 -2706807 -3695143 -4541048 -3254976 -76470
39547g6470K771669R92228j17889l47019n57351n42236K29435Q58798J64253j168638
39537B206780j556206j010770p75977j012255p58745J31040Q18761J029901J124053
39528A96582Q79195j00168r61202l88937J142228J650773M68610q09069o75348
39519A402664L52655P81885O8575j177156k157538k388932j642504j1204J820845
39510b950710K599849J383788j045384k216036o61206J701823J683768n92753
39502i6861j598021L44578K469053J961436K01931o9411N23501l68395k058100
39493A309711j762368L26498J025150n78213j743952p89187M23285M7085q63985
39484b605976p14798M3349M27800P46523J214054Q24273p04549j747271j172319
$$ plain form
39547 -76470 2695199 3687427 3569538 3222519 2665168 2122932 2352367 3211165 3375418 2206780
39537 2206780 650574 -360196 -1136173 -2148428 -2907173 -2776133 -1957372 -927471 196582
39528 196582 1075777 975609 14407 -374530 767698 2418471 2887081 2078012 1402664
39519 1402664 1755319 2537204 2605779 1428623 -728915 -3117847 -4760351 -4771555 -2950710
39510 -2950710 -350861 1032927 -12457 -2228493 -2889699 -1187876 495892 -96861
39502 -96861 -1694882 -1350304 1118749 3080185 3282116 3212705 3736206 3367811 1309711
39493 1309711 -452657 -126159 898991 320778 -1423174 -2212361 -1789076 -1741991 -2605976
39484 -2605976 -3320774 -3277425 -2849625 -2103102 -889048 -64775 -769324 -2516595 -3688914
39475c688914j47419J7213M015P86456J571496J282426N14819J99176j57206j082275
39465g00213j580882q98243k30715n66104m91142J352079L180415K413152j4363
39456B463984r13854J70409N69564r46015k463905k318191j255456l84046M03406
39447d674104R44929K27527j392834j579025P96023L586842M106831K505057Q46457
39438E367703M9589n48186j372590k015155k157054j887612j277712m39555K67685
39429d012887O52180Q73995Q60522L05642l52851m4638J176134J703082O76178
39420A837357n42654m85678O4900m23469j395563j068369L91474R88195K38623
39411c95184j21793O06039O49418j044342k386384j010276J915584L132813J810345
$$ plain form
39475 -3688914 -3836333 -3819120 -3815105 -3028649 -1457153 -174727 340092 539268 382062 -700213
39465 -700213 -2281095 -3179338 -3410053 -3976157 -4467299 -3115220 65195 2478347 2463984
39456 2463984 1550130 1720539 2290103 1344088 -1119817 -3438008 -4693464 -5077510 -4674104
39447 -4674104 -3729175 -3501648 -4894482 -6473507 -5677484 -2090642 2016189 4521246 5367703
39438 5367703 5417292 4869106 3496516 1481361 -675693 -2563305 -3841017 -4280572 -4012887
39429 -4012887 -3360707 -2486712 -1626190 -1320548 -1673399 -1718037 -541903 1161179 1837357
39420 1837357 1294703 809025 873925 450456 -945107 -2013476 -1622002 -633807 -395184
39411 -395184 -516977 89062 738480 -305862 -2692246 -3702522 -1786938 1345875 3156220
39402C156220K11067J1624L62920J16561k05905J95490O80692K69623o11617q99978
39392C286697p00569r56192j747736k205518j882035j064152Q2624J516467K594995
39383a075419K561713J741755J044546L28152j245785l059346l068760p89132
39375c562276J438346J451644J68196j12423P78737J020468q9528j231508j310638
39366a448982p41902j20446O89014J494367J369721K44333m29930K50878J030574
39357B337627L55548j019818j054235K58662N21339j580469l967820l508996N7723
39348g600439L697419M462365K454963K37117j27825R86923J629748O28063j240779
39339E127555k392306k258219j505729p17464L02274J645672K515338K041445
$$ plain form
39402 3156220 3367287 3378911 3741831 3858392 3652487 3847977 4528669 4798292 4186675 3286697
39392 3286697 2586128 1629936 -117800 -2323318 -4205353 -5269505 -5186881 -3670414 -1075419
39383 -1075419 1486294 3228049 4272595 4600747 3354962 295616 -2773144 -3562276
39375 -3562276 -2123930 -672286 -504090 -616513 162224 1182692 1093164 -138344 -1448982
39366 -1448982 -2190884 -2311330 -1622316 -127949 1241772 1486105 1056175 1307053 2337627
39357 2337627 2693175 1673357 619122 877784 1399123 -181346 -4149166 -7658162 -7600439
39348 -7600439 -3903020 559345 3014308 3251425 3123600 4110523 5740271 6368334 5127555
39339 5127555 2735249 477030 -1028699 -1746163 -1443889 201783 2717121 4758566
39331D758566N23292q60580j422904j413942j265857j128059j080814j020788
39323b911086l89984J026143K051071J191881r10494j689224j79141J314867N70866
39314G4899j093725r98111L84994J51305j943843k545077O1185K909969K663352
39305c35052M51680l58120N45333O59357o26892j089276K77279J437971O66287
39296A628567q29617j126869m40511r1800k17159k94318o77144j652708j915877
39287e617436j53010K309861K687426O64112r84044k87278J335294J500059K92917
39278A747901l42312K21096N52621l68022j403931o86577J854096M107971L972277
39269I655120J621938o91768j206453o12567q46045k170078k672822j153317P69118
$$ plain form
39331 4758566 5281858 4421278 2998374 1584432 318575 -809484 -1890298 -2911086
39323 -2911086 -3301070 -2274927 -223856 968025 57531 -1631693 -1810834 -495967 74899
39314 74899 -1018826 -2016937 -1631943 -1480638 -3424481 -5969558 -5908373 -2998404 -335052
39305 -335052 116628 -241492 303841 963198 336306 -752970 -475691 962280 1628567
39296 1628567 798950 -327919 -768430 -860230 -1077389 -1371707 -2048851 -3701559 -5617436
39287 -5617436 -5770446 -3460585 -773159 -109047 -1093091 -1380369 -45075 1454984 1747901
39278 1747901 1405589 1626685 2179306 1811284 407353 -279224 1574872 5682843 9655120
39269 9655120 11277058 10585290 9378837 8766270 7920225 5750147 3077325 1924008 2693126
39260B693126P02679j143447k297189j528689k08680K15271L06102J144474K143163
39251B026810J855549K17847j460461k325585k453711j828150l61428J048919
39243c280210J035666k35809q98583J63542J837785K483234K023202J381242P88631
39234E298700o6417q02816p03847j52732l08939j146935j156178L64552J813130
39225C138518J141266j362142l279292k943128j072265O29484J440433J585632
39217g21494J159723K10725n02205j16515Q95695J127413M12771K80043J472706
39208D218862K366153J230729r52110j793284j105104j011962k249237k648142
39200a944095m74322K491027K992317N77433j891275j837286K89131K061799J875896
$$ plain form
39260 2693126 3395805 2252358 -44831 -1573520 -1782200 -1566929 -1260827 -116353 2026810
39251 2026810 3882359 4100206 2639745 314160 -2139551 -3967701 -4329129 -3280210
39243 -3280210 -2244544 -2480353 -3378936 -3215394 -1377609 1105625 3128827 4510069 5298700
39234 5298700 5232283 4429467 3725620 3572888 3263949 2117014 960836 1325388 3138518
39225 3138518 4279784 2917642 -361650 -3304778 -4377043 -3747559 -2307126 -721494
39217 -721494 438229 648954 146749 30234 925929 2053342 2466113 2746156 4218862
39208 4218862 6585015 7815744 6863634 5070350 3965246 2953284 704047 -1944095
39200 -1944095 -2418417 72610 3064927 3642360 1751085 -86201 202930 2264729 4140625
39191D140625K77982r96786r37307k13614j77280j023749j499555o73212O52328
39182d50568R08987k42906j591099j930719j332012p23013o01918m81386L42982
39173f101652J675346K490388K246796J542977J030313M23001n29095q46987M48182
39164B379269K321350K660188J169176m74227j417817k438272l501239k969803
39156b271375m26559J911967K144435J152804N52567J53014o75546j092747n04670
39147I43890l24516j442395j757459O50107L430813K746499p74369k810998j781465
39138a119893m26571o32333p86395N41699J978445K081840J642624J559479J121553
39129E960448J8042n10243n9518l6136q21686q19461J21185l51071k596314l051242
$$ plain form
39191 4140625 4418607 3421821 2484514 2270900 2093620 1069871 -429684 -1102896 -450568
39182 -450568 458419 215513 -1375586 -3306305 -4638317 -5361330 -5963248 -6444634 -6101652
39173 -6101652 -4426306 -1935918 310878 1853855 2884168 3307169 2778074 1931087 2379269
39164 2379269 4700619 7360807 8529983 8055756 6637939 4199667 698428 -2271375
39156 -2271375 -2697934 -785967 1358468 2511272 3063839 3216853 2541307 1448560 943890
39147 943890 619374 -823021 -2580480 -1930373 1500440 4246939 3472570 661572 -1119893
39138 -1119893 -1546464 -2178797 -2965192 -2423493 -445048 1636792 3279416 4838895 5960448
39129 5960448 5978490 5468247 5408729 5372593 4550907 3731446 3852631 3501560 905246 -2145996
39119b145996J21302K889599R76437l123263l632836k29464K059373J063625L9778
39110a981445J288388K376893Q50005j374272j191646Q26666J651848K86164j444344
39101A288257j760438p17486M77716P33528l7831p27982k81198P19015P73773
39092D67354j03135k64117P42894J020308q57961l367623l894421k098754Q7053
39083h268402J193652J453050J543135J477086J014641L11835k51723n33966o30720
39074b691412m70718L58969J993374L410824K934699L50735k116743k132508k03854
39065A433366J102440P26726J15403L52994L40778j005550k416450j904048J61231
39056a093110J451562R10636q5063o1017M49315n3920j639734k627114j721437
$$ plain form
39119 -2145996 -2024694 864905 1841342 -1281921 -4914757 -5144221 -3084848 -2021223 -1981445
39110 -1981445 -693057 1683836 2533841 1159569 -32077 794589 2446437 2732601 1288257
39101 1288257 -472181 -1189667 -711951 21577 -16254 -744236 -1025434 -306419 467354
39092 467354 364219 100102 842996 1863304 1005343 -2362280 -6256701 -8355455 -8268402
39083 -8268402 -7074750 -5621700 -4078565 -2601479 -1586838 -1275003 -1526726 -2060692 -2691412
39074 -2691412 -3162130 -2803161 -809787 2601037 5535736 5886471 3769728 1637220 1433366
39065 1433366 2535806 3262532 3377935 3730929 4071707 3066157 649707 -1254341 -1093110
39056 -1093110 358452 1269088 1184025 1123008 1572323 1518403 -121331 -2748445 -4469882
39047d469882K76341J466073J231582P67161J097801J613336J259066K50979m95729
39038B996728r17030j397133j371026m3639J691721J937220N97677l50180J41369
39029C285707P77007K48887q24036j323927j366277j393286j010367n0097N50266
39020a106123L24196M08915J551860K274041R20269j417476k095530n53880J125973
39011A432245J058115o69220k794648l929593l062089n22649J738395K154063
39003d595381J429232J114614J068631J85881j003707p90292Q09610J920260J703605
38994A842453J106599M97276r23353k718744k798725n66808J744075K188958J509296
38985A881027J057307M74249q02329j692100j238511n85129r73139j253932J26731
$$ plain form
39047 -4469882 -4193541 -2727468 -1495886 -728725 369076 1982412 3241478 3492457 2996728
39038 2996728 2079698 682565 -688461 -732100 959621 2896841 3494518 3144338 3285707
39029 3285707 4062714 4311601 3487565 2163638 797361 -595925 -1606292 -1656389 -1106123
39020 -1106123 -781927 -373012 1178848 3452889 4373158 2955682 860152 306272 1432245
39011 1432245 2490360 1821140 -973508 -4903101 -7965190 -8487839 -6749444 -4595381
39003 -4595381 -3166149 -2051535 -982904 -797023 -1800730 -2591022 -1781412 138848 1842453
38994 1842453 2949052 3446328 2522975 -195769 -2994494 -3561302 -1817227 371731 1881027
38985 1881027 2938334 3412583 2610254 918154 -320357 -905486 -1878625 -3132557 -3005826
38976c005826J931300J748963J8710n63847O09683J326446L90437p41426q64281
38967H50159p92561j070500m67313J582258L109700K151822k93506j725482j432149
38958A912428n58717R2054M20150l6154j463234k432105j234177J409435K842281
38949I51961J944854L50202k79417l70023q51621j077573M1059J682690J712662
38940D104794l56777k479407k697804j610522j269222k109482k248773k28662
38932h895855K609231L677742K697385K092457L306145M285591K170116k338937
38924I603875n269467m174201r05340J094558Q55894P9298J75704N95512J39586
38915B195419j092778j633820m01449J743447K573420R66594j552101k486208
$$ plain form
38976 -3005826 -1074526 674437 693147 129300 738983 2065429 2455866 1714440 850159
38967 850159 57598 -1012902 -1480215 102043 3211743 5363565 5070059 3344577 1912428
38958 1912428 1353711 1445765 1865915 1829761 366527 -2065578 -3299755 -1890320 951961
38949 951961 2896815 3247017 2967600 2597577 1745956 668383 709442 2392132 4104794
38940 4104794 3748017 1268610 -1429194 -3039716 -4308938 -6418420 -8667193 -8895855
38932 -8895855 -6286624 -2608882 88503 2180960 5487105 9772696 11942812 9603875
38924 9603875 4334408 160207 -745133 349425 1205319 1284617 1460321 2055833 2195419
38915 2195419 1102641 -531179 -932628 810819 3384239 4350833 2798732 312524
38907C12524j373878k9583K49240K24314Q12173J173360J30142j488037j663817
38898a653562n3891J556515J723283Q68693N2771m98292j022158j312776r66626
38889a306043j21125O08011P84961N18283K55269J96263j16834j209398k442580
38880b833193k181074P981K103168J894889L1239q26331K52980J487030J489917
38871A426606J251946J906480K408892J263743o74343j249774k83841L46255j20880
38862F275084k45583Q76770J746493P16851j185887j505018Q3148J285609M80141
38853H527608j181201j759514j227114q18689o52227J34763J169159R05167n88792
38844D509160j001720P88715K446109J270927j658684k790780j024314J098488
$$ plain form
38907 312524 -1061354 -1090937 -841697 -617383 194790 1368150 1498292 10255 -1653562
38898 -1653562 -1707453 -150938 1572345 2441038 2493809 1995517 973359 -339417 -1306043
38889 -1306043 -1427168 -819157 -34196 484087 739356 935619 818785 -390613 -2833193
38880 -2833193 -5014267 -5006286 -2903118 -1008229 -976990 -1803321 -1550341 -63311 1426606
38871 1426606 2678552 4585032 6993924 8257667 7583324 6333550 6049709 6395964 6275084
38862 6275084 6029501 6906271 8652764 9369615 8183728 6678710 6761858 8047467 8527608
38853 8527608 7346407 5586893 4359779 3541090 2888863 3023626 4192785 5097952 4509160
38844 4509160 3507440 4296155 6742264 8013191 6354507 3563727 2539413 3637901
38836C637901J227497n4999q99087n60143P40481K532632L664077K777134L69176
38827A3434669j117143n29030J48339j241784l531162l730081j304522J159560
38819C288846J480954K47411o51895l90226M97104J200454J335610R56030L17045
38810H281333l52696q45090q76038m13237n3706l96763r83315p39710L54279J100149
38800E075206Q76242L99338L06199L59273N45999J275417J756885K48450k808750
38791H034259m104836j822872J361395K057630J033548J244155K509971J979620
38783A2292870o21615k194731j246932j01487r15114k433957k297070l48252J842775
38774C976487L032732K704318J018341o45885o40380O67867J160276J26884p38475
$$ plain form
38836 3637901 4865398 4810399 3911312 3351169 4091650 6624282 10288359 13065493 13434669
38827 13434669 12317526 11788496 11936835 10695051 7163889 3433808 2129286 3288846
38819 3288846 4769800 5017211 4365316 3975090 4472194 5672648 7008258 7964288 8281333
38810 8281333 7928637 7083547 6207509 5794272 5740566 5343803 4360488 3620778 3975057 5075206
38800 5075206 5951448 6350786 6656985 7016258 7562257 8837674 10594559 10843009 8034259
38791 8034259 3929423 2106551 3467946 5525576 6559124 7803279 10313250 12292870
38783 12292870 11671255 9476524 8229592 8128105 7212991 4779034 2481964 2133712 3976487
38774 3976487 7009219 9713537 10731878 10085993 9445613 10113480 11273756 11400640 10662165
38765A0662165k64804L83968l0894p29163m86142L56399Q31791Q55315N88087
38756A2166722k50116j308042j334272n5890J178445J513573J556510J405561
38748A4872491K1548k197054k784126r42956O22639j57669j237771J27006K688237
38739A1012345L203056J481326J506l74001q62292j653426j643240q98434m43849
38730I822991o5119Q20480Q89919j190224l324646k277715R05672J944699o328
38721G519729j201974K89491J679900P92466j63976J047497K414794J303359o02919
38712A3078367P6117K821236M149549K992130J458251Q12376K22496m17883K97958
38703B5490597K436249L672027K335021k27354j524246j013997k51619n92672
$$ plain form
38765 10662165 10397361 10781329 10750435 10021272 9535130 9891529 10723320 11578635 12166722
38756 12166722 11916606 10608564 9274292 9218402 10396847 11910420 13466930 14872491
38748 14872491 14894039 12696985 9912859 8969903 9592542 9434873 8197102 8324108 11012345
38739 11012345 14215401 15696727 15698233 15324232 14461940 12808514 11165274 10266840 9822991
38730 9822991 9757872 10578352 11468271 10278047 6953401 4675686 5581358 7526057 7519729
38721 7519729 6317755 6607246 8287146 9079612 8915636 9963133 12377927 13681286 13078367
38712 13078367 13154484 15975720 20125269 23117399 24575650 25388026 25610522 25192639 25490597
38703 25490597 27926846 31598873 33933894 33706540 32182294 31168297 30916678 30324006
38695C0324006j656713j965257o14245J873214M269935N800269O188047N175997
38687D9395253L190944K182471L965731P334821Q840668P481279O620442R540450
38679I8552059J4807086J8337179J8895868J8907804K0304684K2307686K3632581
38672B35744947K4438026K5071600K4579668K1650223J6167790R187673K182331
38665C59022258l289970o178953o885542o988868p567940q310450q492263q080505
38657C03227767p466739o809084o215224o090406o610455o956746n714892k465512
38649B54898709J142445K540546R84645j323320j840018j092992j838352m504326
38641B48967337n655987k560940K461125M664610K997651R60274J444753L382971
$$ plain form
38695 30324006 28667293 26702036 26087791 27961005 32230940 38031209 44219256 49395253
38687 49395253 52586197 54768668 58734399 66069220 74909888 82391167 89011609 98552059
38679 98552059 113359145 131696324 150592192 169499996 189804680 212112366 235744947
38672 235744947 260182973 285254573 309834241 331484464 347652254 356839927 359022258
38665 359022258 355732288 349553335 342667793 335678925 328110985 319800535 311308272 303227767
38657 303227767 295761028 288951944 282736720 276646314 270035859 263079113 257364221 254898709
38649 254898709 256041154 258581700 259566345 258243025 256403007 255310015 253471663 248967337
38641 248967337 243311350 240750410 243211535 247876145 250873796 251834070 253278823 256661794
38633B56661794M270328L739973L239644L670089M809172O200158P401670P907518
38625B97900346P716816P546183P886371Q420213Q869213R642880J0952267J1965886
38617C70900175J1662732J0059774P825517M917053J58351p869586j9420437l2361170
38609C45872409m2370795m5658688m2277387l5944700l0039981k4841981j9365046
38602A05373831j4243624j0993696r425828q006633o501088o046343o456747n847548
38594C7852324l824636k767474m229904n880660m471896q64188P95639j034668
38586A5574537l151354k466692l73120n7251j332260j183615J178892L034710
38578A1223847K435313Q74093L34434J55641j097484k509305k132147l81013N31937
$$ plain form
38633 256661794 260932122 264672095 267911739 271581828 276391000 282591158 289992828 297900346
38625 297900346 305617162 313163345 321049716 329469929 338339142 347982022 358934289 370900175
38617 370900175 382562907 392622681 400448198 405365251 405523602 397654016 378233579 345872409
38609 345872409 303501614 257842926 215565539 179620839 149580858 124738877 105373831
38602 105373831 91130207 80136511 70710683 62704050 56202962 50156619 43699872 37852324
38594 37852324 34027688 31260214 27030310 21149650 16677754 15813566 16609205 15574537
38586 15574537 12423183 9956491 9583371 9526120 8193860 7010245 8189137 11223847
38578 11223847 13659160 14533253 14867687 15023328 13925844 11416539 9284392 8903379 9435316
38569I435316J18845j7374O64596P52054l01648r52480k62455L46422m52273j441296
38559G889707p04451J267018K193897J108824p71267j900746j786004p97701K15827
38550F715104L27958n18856j251587j075036n30369l35956q8925O76870J079123
38541D998326J53626j167828j193735j40129L26712l3586J75100J230667J682891
38532F032044J017875N75533Q94697M94177j293254k464757j236496J007686J833707
38523F861212J339232J179448J220910N3214j736577j880099j86540R13938K38874
38514H003612m92551J6979L26707r71235k401935j810576J59835J225564J028091
38505E084491J012491J351947O68188j118153k156728j482666l40998J20872N28122
$$ plain form
38569 9435316 9554161 9536787 10201383 10953437 10651789 9699309 9436854 9783276 9331003 7889707
38559 7889707 7185256 8452274 10646171 11754995 10983728 9082982 7296978 6499277 6715104
38550 6715104 7043062 6524206 5272619 4197583 3667214 3331258 3242333 3919203 4998326
38541 4998326 5151952 3984124 2790389 2650260 2976972 2943386 3118486 4349153 6032044
38532 6032044 7049919 7625452 8520149 9014326 7721072 5256315 4019819 5027505 6861212
38523 6861212 8200444 9379892 10600802 10654016 8917439 7037340 6850800 7764738 8003612
38514 8003612 7511061 7528040 7854747 6883512 4481577 2671001 2830836 4056400 5084491
38505 5084491 6096982 7448929 8117117 6998964 4842236 3359570 3018572 3139444 3667566
38496C667566J489843J861937M18876j835439k706624j657845k27322J69152k92923
38487H87221n26523J59739J425319K095365J290017k76892q14078J48687Q47947
38478E236802j59291j506636p90237J666540K909680J503864m00863j65964J652396
38469I946291K194860J94391k454929l082658j261030R52706J443006K80309p00437
38460G512509m13201J32647m78326j822943k322900j804222j697445k409096k306093
38451e609070l78289J579685J135220j199561k386585q21084J729168K597289
38443c353227J403870j957l7208J063906J953241J681433L72128j145129k010315
38434g3258j774354o09032O75524J095403M23908l71598q1902J222250K036198
$$ plain form
38496 3667566 5157409 7019346 7438222 5602783 2896159 1238314 1010992 1180144 887221
38487 887221 360698 520437 1945756 4041121 5331138 5054246 4240168 4388855 5236802
38478 5236802 5077511 3570875 2780638 4447178 7356858 8860722 8459859 8293895 9946291
38469 9946291 12141151 12335542 9880613 6797955 5536925 6489631 7932637 8212946 7512509
38460 7512509 7099308 7231955 6753629 4930686 2607786 803564 -893881 -3302977 -5609070
38451 -5609070 -5987359 -4407674 -3272454 -4472015 -6858600 -7679684 -5950516 -3353227
38443 -3353227 -1949357 -1951314 -1988522 -924616 1028625 2710058 3082186 1937057 -73258
38434 -73258 -1847612 -2456644 -1781120 -685717 -261809 -633407 -715309 506941 2543139
38425B543139J087922j059775k391366j487326Q59889K237100J144495j082618
38417A851460j577197M88622K573275J943028o96749k289046j615234l67781L397
38408C13775J57763P19291N58681j057232k300945r54388K162968M005082L077565
38399F682560N97233j685564k889819k464849l95397J739250J852785J52175q00151
38390B788223M06605K022972J691921l31653j886004j917452j270059q67438o18817
38381A8298l02288k82888p02758p35572M28121K062598K357816P76861q32707
38372B787481l75528J653442K655047J274325j051570k311684k296198j867243
38364D68072j160724Q5063J258721J450035Q42336K39690l06789j094671j558976
$$ plain form
38425 2543139 3631061 2571286 179920 -1307406 -447517 1789583 2934078 1851460
38417 1851460 274263 762885 3336160 5279188 4582439 2293393 678159 310378 313775
38408 313775 471538 1190829 1749510 692278 -1608667 -2563055 -400087 3604995 6682560
38399 6682560 7279793 5594229 2704410 239561 -155836 1583414 3436199 3588374 2788223
38390 2788223 3194828 5217800 6909721 6578068 4692064 2774612 1504553 637115 18298
38381 18298 -283990 -566878 -1269636 -2005208 -1577087 485511 2843327 3620188 2787481
38372 2787481 2411953 4065395 6720442 7994767 6943197 4631513 2335315 468072
38364 468072 -692652 -607589 651132 2101167 2943503 3183193 2876404 1781733 222757
38355B22757r72004R7368N84031P02184J185441J321182k4780j692176j192833
38346B31170J244258K297989K13247k605509l055538j306643L03454N90017r064
38337b096619q79805j394821o96705J103955K407150K107619J098807N99344K58046
38328B506971o29765j355352j019346l85471o07860j070305m81699P09797J092930
38319a240100P86223R33469J231967L75424j198005j437674J94153J928571K396819
38310C970847K033175J314156j85976k082741k567275q75297J095631J066284
38302C768804o84272j909896j284950L71669J410588J090238R3432l63304q280
38293B484029J25130p17557j563579q93849J019900K299303J980778R45979J55387
$$ plain form
38355 222757 -749247 -651879 -67848 634336 1819777 3140959 3116179 1424003 231170
38346 231170 1475428 3773417 3986664 1381155 -1674383 -2981026 -2677572 -2087555 -2096619
38337 -2096619 -2976424 -4371245 -5067950 -3963995 -1556845 550774 1649581 2248925 2506971
38328 2506971 1877206 521854 -497492 -882963 -1490823 -2561128 -3042827 -2333030 -1240100
38319 -1240100 -453877 479592 1711559 2086983 888978 -548696 -354543 1574028 3970847
38310 3970847 6004022 7318178 7132202 5049461 2482186 1606889 2702520 3768804
38302 3768804 3084532 1174636 -110314 261355 1671943 2762181 2855613 2492309 2484029
38293 2484029 2609159 1891602 328023 -565826 454074 2753377 4734155 5680134 5835521
38284E835521n33278j301400j567781j017413l10451n4273m6466j10099o05767
38275B88593j454979j709110q52591L57015J012678J147827J149126J064636J058080
38266B061275J458910J753912P87070j251090k408811j625895m48997o98865j642831
38257b015322j251120N76094J967590J858285R36521o8471j179457j990222j465083
38248b631185L32398J663600J234858k9164l40982M39785P96713p8053j040485
38239C47485o14489Q54528J529646M26645j444049k511833k364379j485867j63944
38230e426257J317117K020281J237064j92066p45710l08784j9893j05876M48053
38221a776071J786839K522871J866318Q20868M36713L90788K09868L56717R98232
$$ plain form
38284 5835521 5302243 4000843 2433062 1415649 1105198 1050925 1004459 894360 288593
38275 288593 -1166386 -2875496 -3728087 -3371072 -2358394 -1210567 -61441 1003195 2061275
38266 2061275 3520185 5274097 6061167 4810077 2401266 775371 326374 -372491 -2015322
38257 -2015322 -3266442 -2690348 -722758 1135527 2072048 2003577 824120 -1166102 -2631185
38248 -2631185 -2298787 -635187 599671 570507 229525 669310 1466023 1387970 347485
38239 347485 -267004 587524 2117170 2543815 1099766 -1412067 -3776446 -5262313 -5426257
38230 -5426257 -4109140 -2088859 -851795 -1043861 -1789571 -2098355 -2118248 -2224124 -1776071
38221 -1776071 10768 2533639 4399957 5220825 5657538 6048326 6258194 6614911 7613143
38212G613143J161250L08773o76220j267795k369885m081274m222887j322055
38204d856950K326100L148980J040018q92151q05905J78446O23620O24565O60740
38195B047463O42227N70685N82287J70832j104329k195422j554980M66935J922908
38186A548606J897906J095384O2937j063594j261174L78567K176702J211143k131965
38177C914512l741216j209783K787570M160746K344361j64318j359925r32587
38169E799360N79935J915269J465915p57054k477856j925383k14613M70408n0408
38160D805573l11176L26273J212307J691768J372530j33228k310018l371005k242663
38151A040361j70746J011617J276902J549427J561445N62137n92731k73097J251977
$$ plain form
38212 7613143 8774393 9083166 8406946 7139151 4769266 687992 -3534895 -4856950
38204 -4856950 -2530850 618130 1658148 765997 -39908 138538 762158 1386723 2047463
38195 2047463 2689690 3260375 3842662 4013494 2909165 713743 -841237 -374302 1548606
38186 1548606 3446512 4541896 4604833 3541239 2280065 2658632 4835334 6046477 3914512
38177 3914512 173296 -1036487 1751083 5911829 8256190 8091872 6731947 5799360
38169 5799360 6379295 8294564 9760479 9003425 6525569 4600186 4385573 4855981 4805573
38160 4805573 4494397 4820670 6032977 7724745 9097275 8964047 6654029 3283024 1040361
38151 1040361 869615 1881232 3158134 4707561 6269006 6831143 6238412 5965315 7217292
38142G217292J990340J110047p6564j49380P96310J634139J265325n11179k265241
38133A1011089j926609L00561J361902m94134k600025j659187P80216M82968k415919
38124D840862l131257J62690L112801J843141j235763j653334J75762L95207j668572
38115B841537k710295r46648J445343K021717J153795L57455j00313o29843j010343
38106B422405q97824n80874l42890N1448N93044O56006L0408m81420j39992P11998
38096B022309J224478J035809L06649n78979j011322o26066j21039o47027j890698
38087b85886j933352P2600K236727K326637R53036N52194J580472J838013m0872
38078G299569k407591k938805j641858k13446M61669O62002M57736l63251j318979
$$ plain form
38142 7217292 9207632 10317679 10241115 10091735 10888045 12522184 13787509 13276330 11011089
38133 11011089 9084480 9385041 10746943 10252809 7652784 5993597 6773813 7256781 4840862
38124 4840862 1709605 1872295 4985096 6828237 5592474 3939140 4114902 4510109 2841537
38115 2841537 131242 -815406 629937 2651654 3805449 4162904 4062591 3432748 2422405
38106 2422405 1524581 943707 600817 652265 1245309 1901315 1931723 1450303 1310311 2022309
38096 2022309 3246787 4282596 4589245 4010266 2998944 2372878 2251839 1604812 -285886
38087 -285886 -2219238 -2146638 90089 2416726 3369762 3921956 5502428 7340441 7299569
38078 7299569 4891978 1953173 311315 97869 559538 1221540 1679276 1316025 -2954
38069b954j674612j683904j956098j812005o8495K413213L032523J092965p67495
38060a426862j00932J967212K537319R26610j035925j927987j904586j272860
38052b238011K9114J344084J548199Q92727R77778K227376K902607J586484o11294
38043H659064j543237q67295j36539m86560j406145j768189j210471l13636J46513
38034A073505K3319j1378O74879J580608J455019J41682p25706K59263K037342
38025F508533K066688l55095k902152k996663r76769N00635q7925j432517j427495
38016a102760J13548J576278J720992O92721q00404k065647k163270m68096J977897
38007e18741K901312J394176r07384k007952j789178j086616J16699J940322L077465
$$ plain form
38069 -2954 -1677566 -3361470 -5317568 -7129573 -7198068 -4784855 -1752332 -659367 -1426862
38060 -1426862 -1527794 439418 2976737 3903347 2867422 939435 -965151 -2238011
38052 -2238011 -2208897 -864813 683386 1576113 2553891 4781267 7683874 9270358 8659064
38043 8659064 7115827 6248532 6111993 5625433 4219288 2451099 1240628 926992 1073505
38034 1073505 1096824 1085446 1760325 3340933 4795952 4937634 4211928 4471191 6508533
38025 6508533 8575221 8220126 5317974 2321311 1344542 1845177 1757252 324735 -1102760
38016 -1102760 -989212 587066 2308058 3000779 2200375 134728 -2028542 -2496638 -518741
38007 -518741 2382571 3776747 2869363 861411 -927767 -2014383 -1897684 42638 3120103
37998C120103K083364k32295j675257j704002j597750j745316j122994J86018
37990b688129M18854r52922j907634q02509J188786K039418J717081J475271J599454
37981B087670J535027J236460P62150n53689k814163m200225k768448O88518L216090
37972h10610L074811J269109j38746n7895J105662J855457P54446j840446l582008
37963A629780k738033m90755O31719J25326k49727N96196J580005J196875m88184
37954A793202k029113k013978k38313J824292J992524k65272k782831l054005
37946d773494j236061M22063O90785L37694K19814J50892j21428l39771m62160
37937e111666o67756m79753P42219K289746K593964J512491O25375Q69241J360317
$$ plain form
37998 3120103 5203467 4971172 3295915 1591913 -5837 -1751153 -2874147 -2688129
37990 -2688129 -2269275 -3222197 -5129831 -5932340 -4743554 -2704136 -987055 488216 2087670
37981 2087670 3622697 4859157 5621307 5067618 2253455 -1946770 -4715218 -4026700 -810610
37972 -810610 2264201 3533310 3394564 3336669 4442331 6297788 7052234 5211788 1629780
37963 1629780 -1108253 -1599008 -967289 -841963 -1091690 -495494 1084511 2281386 1793202
37954 1793202 -235911 -2249889 -2488202 -663910 1328614 1063342 -1719489 -4773494
37946 -4773494 -6009555 -5587492 -4896707 -4559013 -4339199 -4188307 -4309735 -4649506 -5111666
37937 -5111666 -5779422 -6259175 -5516956 -3227210 -633246 879245 1504620 2373861 3734178
37928C734178J025798l3599j250770k185900k008607p5983K345728K704984M69053
37919D724882j769811j579361L09368J397399N68363j272837k633362k504115
37911b759474r51920O30965Q68193K99617M63914R90681j4593k120167k188687
37902d781471O23470K735259J514701l09115R13004L525530L220427K24238j192047
37893F473996J26627O97591j318264l181867k552884j129518j036985j208449
37885c129753p9930J088469N62664n22549j88133Q45854O52392k95191o8526J138411
37875C708J413141N89727L89037J180403J338177J76858q63458o07743K23229
37866C843079N00139K65607J55286L99937Q22070Q94581j42611k080549l004668
$$ plain form
37928 3734178 4759976 4726377 3475607 1289707 -718900 -794883 1550845 4255829 4724882
37919 4724882 2955071 1375710 1685078 3082477 3650840 2378003 -255359 -2759474
37911 -2759474 -3711394 -3080429 -2212236 -1912619 -1448705 -458024 -472617 -2592784 -4781471
37902 -4781471 -4158001 -1422742 91959 -217156 695848 4221378 7441805 7666043 6473996
37893 6473996 6600623 7298214 5979950 2798083 245199 -884319 -1921304 -3129753
37885 -3129753 -3209683 -2121214 -1558550 -2081099 -2269232 -1423378 -770986 -1066177 -1134703 3708
37875 3708 1416849 2006576 2395613 3576016 4914193 5091051 4227593 3619850 3843079
37866 3843079 4343218 4608825 4764111 5164048 5986118 6880699 6738088 4657539 1652871
37857A652871j403453J209503J822831J87829p66525O12352K268581J746677k32363
37848G098303j309696r35257k50188K40614P26127O43341o00721j821458j120547
37839B670518J177879K572361J679302k21187j385289j714988j916435j960659
37831I01502j439843n47426K63880R80388J617793J723590J083778M20051N31541
37822E535254J062617R77304J49247l43806K95681J403622J580001M02894r94449
37813A0068365j237327l63966K86479j34720r62948j178781q59253o52566m34428
37804D530855K70673Q79235L32237q43573q14191O51304J322871l12288k560918
37795C456205k794767j078203L00962K37901j78403J50033R34551J434885J288403
$$ plain form
37857 1652871 249418 1458921 3281752 3469581 2703056 3315408 5583989 7330666 7098303
37848 7098303 5788607 4853350 4603162 4843776 5569903 6213244 5612523 3791065 2670518
37839 2670518 3848397 6420758 8100060 7878873 6493584 4778596 2862161 901502
37831 901502 -538341 -1085767 -821887 158501 1776294 3499884 4583662 5003713 5535254
37822 5535254 6597871 7575175 7724422 7380616 7676297 9079919 10659920 11062814 10068365
37813 10068365 8831038 8467072 8753551 8618831 7655883 6477102 5617849 4965283 4530855
37804 4530855 4801528 5680763 6013000 5169427 4355236 5006540 6329411 6017123 3456205
37795 3456205 661438 -416765 -115803 122098 -56305 93728 1028279 2463164 3751567
37786C751567K24242j637432k983563k268522Q3385J757126J350887j16710j013101
37777h52121j080279q62676m24069K74003O31849J88387m48720m10767J82564
37768b801829O10482O76569O20694M10273M108j00489M85209J130334Q24213m02587
37758A456977j461542j516852o77183M48879J213636J067930p0594j514595k296508
37749c349852j974939q00234N80092J343200R93569R6525j14162N68746P93720
37740a863335l18020j417774n79357J697621K738125J138940j427722k408477
37732b439999j293747L80859J202099J161907R98807R65892N48812o30670j859264
37723i65304j795536j76995J466131J440105j06278j515508j680989r34637n0831
$$ plain form
37786 3751567 3975809 2338377 -645186 -2913708 -2830323 -1073197 277690 160980 -852121
37777 -852121 -1932400 -2795076 -3219145 -2945142 -2313293 -2124906 -2573626 -2984393 -2801829
37768 -2801829 -2191347 -1514778 -894084 -483811 -479703 -580192 -94983 1035351 1859564 1456977
37758 1456977 -4565 -1521417 -2198600 -1749721 -536085 531845 461251 -1053344 -3349852
37749 -3349852 -5324791 -6125025 -5544933 -4201733 -3208164 -3111639 -3225801 -2657055 -1863335
37740 -1863335 -2181355 -3599129 -4178486 -2480865 257260 1396200 -31522 -2439999
37732 -2439999 -3733746 -3352887 -2150788 -988881 9926 975818 1524630 893960 -965304
37723 -965304 -2760840 -2937835 -1471704 -31599 -137877 -1653385 -3334374 -4269011 -4319842
37714d319842O39047J001463Q49154K83154k63268n37111o15356n51532l44337
37705c858628j44562L2002N41277J386403J639415N68164r61246j437409r08941
37696c143525p75455j290512j010574O46472J997117J437295r6303m72463O40925
37687b067023J636273J422856N89447J07219P8162J10906J43648M36739J054297
37678C512524J603681J486590N26619o40542j126836p91307k18727L08336J020531
37669E680869J612364J045366q44251k438104k132428m79351O41233O02155M06496
37660D094349N34581o447j790777l339709k624374J75558K548091K463772N14487
37651B569531j173596j521900j206783j052432q02317Q9575J299437K045674K112921
$$ plain form
37714 -4319842 -3680795 -2679332 -1830178 -1547024 -1810292 -2347403 -2962759 -3514291 -3858628
37705 -3858628 -4003190 -3971188 -3429911 -2043508 -404093 164071 -797175 -2234584 -3143525
37696 -3143525 -3918980 -5209492 -6220066 -5573594 -3576477 -2139182 -2235485 -2707948 -2067023
37687 -2067023 -430750 992106 1581553 1688772 1766934 1877840 2021488 2458227 3512524
37678 3512524 5116205 6602795 7129414 6488872 5362036 4570729 4352002 4660338 5680869
37669 5680869 7293233 8338599 7494348 5056244 2923816 2444465 3085698 3687853 4094349
37660 4094349 4628930 4622483 2831706 -508003 -3132377 -2956819 -408728 2055044 2569531
37651 2569531 1395935 -125965 -1332748 -2385180 -3187497 -3097922 -1798485 247189 2360110
37642B360110J613951K41946k071352l998139l729945j312938J140379J983033
37634c772955J676227J457619J558565J468972R58655L7052j211126k016629j192187
37625a035807J030454K443751J381667r83534k172783j594594p81802q73153j414066
37616c999867j610081j340318o96591K99276J158651J047792j04468j197026r70682
37607g413314Q14555L104871M158798K863438L2593k025906j901009n71812J79501
37598g58285J28211K79779Q07556Q20728M6593p03896r27256j071647j524858
37589b903075j973077k031989j680594r19083K36966J377980K018655K167476
37581c706741J917242R50518n94631j432685o90674M31982K88905m20376L42516
$$ plain form
37642 2360110 3974061 4216007 2144655 -1853484 -5583429 -6896367 -5755988 -3772955
37634 -3772955 -2096728 -639109 919456 2388428 3347083 3384135 2173009 156380 -1035807
37625 -1035807 -5353 2438398 3820065 2836531 663748 -930846 -1712648 -2585801 -3999867
37616 -3999867 -5609948 -6950266 -7646857 -7347581 -6188930 -5141138 -5245606 -6442632 -7413314
37607 -7413314 -6598759 -3493888 664910 3528348 3560941 1535035 -365974 -937786 -758285
37598 -758285 -630074 -350295 457261 1277989 1324582 620686 -306570 -1378217 -2903075
37589 -2903075 -4876152 -6908141 -8588735 -9507818 -9270852 -7892872 -5874217 -3706741
37581 -3706741 -1789499 -838981 -1433612 -2866297 -3556971 -3124989 -2836084 -3256460 -2913944
37572b913944K304327K814087R41212r61306r19940j47531n05499j234547m58873
37563a082014J371865J904648K48613j973298k769634j593614P25648K633760
37555e34026K704310R82952p07354p01570N79377J405005Q92017m99124j976776
37546B144811k835851k410588q20931N66275N41330l37599n48459K73945J058637
37537b368430R27488J35811m73710k05445R76889J981884J244658j248317l304884
37528b334056l052122j401921n74523q10534l84306J315396K690511K323054Q69252
37519a359249q2773P6289P58342J046785M71958m27209m06070Q16234J616049
37510B510356M61391j576032k049229p23984J65985m60991j007387k18886N80563
$$ plain form
37572 -2913944 -609617 2204470 3145682 2184376 1264436 1116905 611406 -623141 -1082014
37563 -1082014 289851 2194499 2443112 469814 -2299820 -3893434 -3167786 -534026
37555 -534026 2170284 3153236 2445882 1744312 2323689 3728694 4620711 4121587 2144811
37546 2144811 -691040 -3101628 -3922559 -3356284 -2814954 -3152553 -3701012 -3427067 -2368430
37537 -2368430 -1440942 -1305131 -1778841 -1984286 -1007397 974487 2219145 970828 -2334056
37528 -2334056 -5386178 -6788099 -7362622 -8173156 -8557462 -7242066 -4551555 -2228501 -1359249
37519 -1359249 -1442022 -1365733 -607391 439394 911352 484143 78073 894307 2510356
37510 2510356 2971747 1395715 -653514 -1377498 -1211513 -1672504 -2679891 -2898777 -2318214
37501b318214q0389j066486m93981R31819Q86193q03494j762189n91110J301241
37492c996610J993560J448688O80782j03148j225127k168853j909944n32392O34160
37483e178884Q03610P67600J508690K404151J849389l38766k203384j917573m6780
37474b351947J323591J306140R72792J370640J901696J334745j89185j065789
37466D602683k70506J049169O46762j962265m319760l629340l85979J980206J551902
37457g37128L54380J015250K573435J979455r82403l120559k455268p12276k04247
37448b289361n90224k88302P47515J474829J654455J551589Q20449o17324j521616
37439I42010q91945K15352J58419p40355r45911l32406r50M7299P78174J772185
$$ plain form
37501 -2318214 -2398603 -3465089 -3959070 -3027251 -2141058 -2944552 -4706741 -5297851 -3996610
37492 -3996610 -2003050 -554362 126420 23272 -1201855 -3370708 -5280652 -5813044 -5178884
37483 -5178884 -4375274 -3607674 -2098984 305167 2154556 1815790 -387594 -2305167 -2351947
37474 -2351947 -1028356 277784 1250576 2621216 4522912 5857657 5668472 4602683
37466 4602683 4332177 5381346 6028108 4065843 -253917 -3883257 -4269236 -2289030 -737128
37457 -737128 -382748 632502 3205937 5185392 4202989 1082430 -1372838 -2085114 -2289361
37448 -2289361 -2879585 -3167887 -2420372 -945543 708912 2260501 3080950 2463626 942010
37439 942010 50065 265417 423836 -316519 -1262430 -1594836 -1595786 -1548487 -770313 1001872
37429A001872J368034n02138j822810j427030l62259L52633J162499K131845J872518
37420C775164n6614j529602o61736J130859J112236o54150j588533o45598M03711
37411A285737R9246n51537p7852R80583J060971J07724l96180K75486J019489
37402C803667M93401r80281j771020j026101K86168P57427M30413M93104J225461
37393C712239J380447R0932j611482k091271j243810l01163K7342Q7708J99031
37384B49973J77039p6544m23317p97613q41320K39609K198562K829386N47743
37375D103518k431963k170759J298998L347039J198457k002404k035068J23804
37367A431622M23974j510314k014270M53753K909758K559722M57898j044472j581707
$$ plain form
37429 1001872 2369906 1867768 44958 -1382072 -1744331 -1391698 -229199 1902646 3775164
37420 3775164 3718550 2188948 1527212 2658071 3770307 3116157 1527624 882026 1285737
37411 1285737 1384983 833446 755594 1736177 2797148 2904872 2508692 2784178 3803667
37402 3803667 4297068 3316787 1545767 519666 805834 1563261 1993674 2486778 3712239
37393 3712239 5092686 5183618 3572136 1480865 237055 -64108 -36766 50942 249973
37384 249973 427012 350468 -72849 -870462 -1711782 -1472173 726389 3555775 4103518
37375 4103518 1671555 -499204 799794 4146833 5345290 3342886 1307818 1431622
37367 1431622 1855596 345282 -1668988 -1215235 1694523 4254245 4712143 3667671 2085964
37358B085964j665067p85296J182827K540989J917176M64241j8501J96259j34415
37349E784177p53916o94459l99163q13200j317158q56331k20244p05810j312300
37340a288404r0411K189626K768400J218182j36238l95687j258247l079948l275962
37331c348689n55652K209807J861872m82326j394569q5503J330707J548200J372511
37322B456358J578423J702922J187106K07944p86347j401669j369010j049751
37314B525976j258080j802434j246733P43508K061562Q28659j658980k674259
37306b480781j961951j566148k141071k035697l88698J302161J630894J312448
37298f328843J519931J754252Q97103n62505r39202K44591J500964J258794k46915
$$ plain form
37358 2085964 420897 -364399 818428 3359417 5276593 5740834 5722333 5918592 5784177
37349 5784177 5030261 4335802 3936639 3123439 1806281 949950 729706 23896 -1288404
37340 -1288404 -1378815 810811 3579211 4797393 4661155 4265468 3007221 -72727 -3348689
37331 -3348689 -3904341 -1694534 167338 -314988 -1709557 -1795060 -464353 1083847 2456358
37322 2456358 4034781 5737703 6924809 7132753 6346406 4944737 3575727 2525976
37314 2525976 1267896 -534538 -1781271 -1037763 1023799 1852458 193478 -2480781
37306 -2480781 -4442732 -6008880 -8149951 -10185648 -10574346 -9272185 -7641291 -6328843
37298 -6328843 -4808912 -3054660 -2157557 -2720062 -3659264 -3414673 -1913709 -654915 -901830
37289i01830j428387j375411p83924o10367m99371M60571J740736J673410Q4050
37280a640523j066811n66109K32616j30192o29588L33633J798079J567870j43988
37271b45013j123851p88632n25226m72760Q41199L042131L311592O54485k031646
37262B662279k006460m45686j7847p26551p17588J72272M46755n7864K10094J776909
37252A296313L055511K528676O63540q87248j152235n40693j74704p03623j609738
37243B475799j853168j224168m94420j54335J11220M23180K60180m77268j021851
37234a954831r53841p45197m90887N08307J994164K134997Q9119k106850j923502
37225c448521L09572K145465K352765J712595J022250J86800p87372j445485j581677
$$ plain form
37289 -901830 -2330217 -3705628 -4489552 -5099919 -5599290 -5138719 -3397983 -1724573 -1640523
37280 -1640523 -2707334 -3273443 -3040827 -3171019 -3800607 -3466974 -1668895 -101025 -245013
37271 -245013 -1368864 -2157496 -2682722 -3155482 -2314283 727848 4039440 4693925 2662279
37262 2662279 655819 210133 192286 -534265 -1251853 -1079581 -632826 -690690 -480596 1296313
37252 1296313 4351824 6880500 7544040 6656792 5504557 4963864 4789160 4085537 2475799
37243 2475799 622631 -601537 -1095957 -1250292 -1139072 -715892 -455712 -932980 -1954831
37234 -1954831 -2908672 -3653869 -4144756 -3636449 -1642285 492712 581831 -1525019 -3448521
37225 -3448521 -3138949 -993484 1359281 3071876 4094126 4280926 3493554 2048069 466392
37216D66392j201835j18342J335219J839564P36326n32868k76626P82768O21967
37207C652565p56681j316842k46643J030329J402407J437740J595373J155525
37199G953773q8171q47900k61051N46038n790j804993l394873l683693k606006
37190d192666q48906M99388P35106L47010L30972O66068N19112r2278k91485q9752
37180b417431l93461r32299k20108J625237K174814K04952j958400j455370J135485
37171b236581K797777K072020J33200j412685j891442j119098N55990J783279
37163F82460J279275n02690j824735j678338m46343J010196J829719J243624m42196
37154A150972j352970n5680K127238K419397K50623k015299k337907j378503q86324
$$ plain form
37216 466392 -735443 -853785 481434 2320998 3057324 2524456 2247830 3030598 3652565
37207 3652565 2895884 1579042 1332399 2362728 3765135 5202875 6798248 7953773
37199 7953773 7865602 7017702 6756651 7302689 7296899 5491906 2097033 -1586660 -4192666
37190 -4192666 -5041572 -4542184 -3807078 -3460068 -3129096 -2463028 -1943916 -2036194 -2327679 -2417431
37180 -2417431 -2810892 -3743191 -3963299 -2338062 -163248 41704 -1916696 -3372066 -2236581
37171 -2236581 561196 2633216 2766416 1353731 -537711 -1656809 -1100819 682460
37163 682460 1961735 1459045 -365690 -2044028 -2490371 -1480175 349544 1593168 1150972
37154 1150972 -201998 -257678 1869560 4288957 4539580 2524281 186374 -1192129 -2078453
37145b078453j043836n69074J161927L100630L586338J992530o56417k600966
37137B892679k929031k121654j031322N2541R42643J016264O5478r29606r68456
37128c010464m83111m50587n97441q983Q46641N86412n45116o45576P50681J527293
37118b030251P9538k045869k107983K47858K830406L709218K876759J465531M71152
37109E496359K13307L06654J61186k16845l18291j91430n53804j397517j547667
37100A951952m68886M86111j50257j638332j861673j87678J744977K075843O36467
37091B588524j147504j604630k95885J341843J385239k5194n76757Q48786K113887
37082D628309Q47563j742314k532641j201460l45596j005804j334687m05019p132
$$ plain form
37145 -2078453 -3122289 -3691363 -2529436 571194 4157532 6150062 5493645 2892679
37137 2892679 -36352 -2158006 -3189328 -3136787 -2194144 -1177880 -1112402 -2042008 -3010464
37128 -3010464 -3493575 -3944162 -4541603 -4550586 -3703945 -3117533 -3662649 -4308225 -3557544 -2030251
37118 -2030251 -1950713 -3996582 -6104565 -5856707 -3026301 682917 3559676 5025207 5496359
37109 5496359 5709666 6016320 6177506 5960661 5642370 5450940 4897136 3499619 1951952
37100 1951952 1483066 1969177 1818920 180588 -1681085 -1868763 -123786 1952057 2588524
37091 2588524 1441020 -163610 -459495 882348 2267587 2242393 1665636 2514422 4628309
37082 4628309 5475872 3733558 1200917 -543 -346139 -1351943 -2686630 -3091649 -3098781
37073c098781j096839j537111L13028K366452J999457L70740K59421J134509J71083
37064H81959k470830l342817j043093J740289K518388K138497K194519K171206
37056D788118J135779J6230J4594L95457q8988r21997r56937o47422j113222j930610
37046F91002j900963j294312j291305j724517j410584m19210k8919n01244o86562
37037h566614J56661J697569L437642M632276L790090M04911l021692l157666
37029f26823k98166J808377J082629n52144q45497m33728p22155j013726j8103
37020a619336J504498J900500J169306K74609q58223k450464l118405j534221
37012d731736Q98532J586740M89204k73684j70080o35438j601908r64180J481730
$$ plain form
37073 -3098781 -4195620 -5732731 -5419703 -3053251 -1053794 -683054 -423633 710876 881959
37064 881959 -1588871 -4931688 -5974781 -4234492 -1716104 422393 2616912 4788118
37056 4788118 5923897 5940127 5954721 6350178 6261190 5339193 4382256 3734834 2621612 691002
37046 691002 -1209961 -2504273 -3795578 -5520095 -6930679 -7349889 -7378808 -7880052 -8566614
37037 -8566614 -8409953 -6712384 -3274742 1357534 5147624 5552535 2530843 -626823
37029 -626823 -924989 883388 1966017 1413873 568376 134648 -587507 -1601233 -1619336
37020 -1619336 -114838 1785662 2954968 3229577 2371354 -79110 -3197515 -4731736
37012 -4731736 -3833204 -2246464 -1757260 -2030944 -2201024 -2836462 -4438370 -5402550 -3920820
37003c920820K693580P96588j734148j631342M02785J187431K0885p83620J17133
36994b851528J368885J503603R17630N10927K02113k29574k52792M14465R71866
36985B555595O81890j3366m06464o97565j261135j540537q77685J31704M16343
36976a011220J81861M71844J134249P95885q64900k291090k081541o25707R22192
36967c368427K042190K383185J214320j319565l306115k934644p80931J096050
36959d973937J872117K317455K749504K301281M78256j852149l376610l353260
36951c837343j752124N54131J848743J098844n33255r47819J56276J163626J050803
36942a198118L60015l35935j023574j089309L00841K162478K271176N17865o64897
$$ plain form
37003 -3920820 -1227240 -430652 -2164800 -3796142 -3393357 -2205926 -2185041 -2968661 -2851528
36994 -2851528 -1482643 20960 938590 1449517 1651630 1422056 1169264 1583729 2555595
36985 2555595 3237485 3224119 2817655 2120090 858955 -681582 -1559267 -1427563 -1011220
36976 -1011220 -829359 -357515 776734 1572619 707719 -1583371 -3664912 -4290619 -3368427
36967 -3368427 -1326237 1056948 2271268 951703 -2354412 -5289056 -6069987 -4973937
36959 -4973937 -3101820 -784365 1965139 4266420 4744676 2892527 -484083 -3837343
36951 -3837343 -5589467 -5035336 -3186593 -2087749 -2621004 -3568823 -3412547 -2248921 -1198118
36942 -1198118 -838103 -1174038 -2197612 -3286921 -2986080 -823602 1447574 1965439 1300542
36933A300542j54051K43711o14839r25222O30332J975593R88838o98938n75014
36924B170952K30150q05678k482562j562080J210752J617552j224238l244722
36916d089874j758530Q47426J510198P54013L34477m3446j032268j388465j71169
36907e037638R80161M56524l36618O21006K219926J882785j50910j265834o57507
36898a288105j49510q16235j440638q92618O9247K37088k42527l49569L59455
36889d513412J356425J761785J175040J62254k43281K11883O65899L66928l42537
36880F00984o58469l25909L12162O09454j46455j793531k575604q68225K125684
36871b719909L262251J604555m15299q22029n94931r20289o98193Q57771J587546
$$ plain form
36933 1300542 1146491 1390202 775363 -149859 480473 2456066 3444904 2745966 2170952
36924 2170952 2401102 1595424 -887138 -2449218 -1238466 379086 -845152 -4089874
36916 -4089874 -5848404 -5000978 -3490780 -2736767 -2402290 -2445736 -3478004 -4866469 -5037638
36907 -5037638 -4057477 -3600953 -3937571 -3316565 -1096639 786146 635236 -630598 -1288105
36898 -1288105 -1437615 -2253850 -3694488 -4587106 -4517859 -4280771 -4523298 -4872867 -4513412
36889 -4513412 -3156987 -1395202 -220162 -57908 -301189 -89306 576593 943521 600984
36880 600984 -57485 -383394 -71232 538222 391767 -1401764 -3977368 -4845593 -2719909
36871 -2719909 542342 2146897 1731598 909569 314638 -605651 -1303844 -446073 1141473
36862A141473n39818l485543l649477j125225R57269J442418J863119K596406
36854g99378K159469N99077q6890L66420j61717k089832k731121n59693K027362
36845a276303K113266P9644j834668k725783k868074k110726l76467J448013K589938
36836d961160L202406L142527J660147n41392j003276J036278K825817J784714
36828G146061p21697j623060o70500k5397l23625p7764J230117K118958J476503
36819H529596j08911j675038k767354k837325j579123j48972k71958j719185k391540
36810d969810j397108j93026J21191O48083K352866L587034K181234q33444k113034
36801f16014p08316N85681l86156j633452l3973L505023M790104K176069j287372
$$ plain form
36862 1141473 601655 -2883888 -6533365 -7658590 -6701321 -5258903 -3395784 -799378
36854 -799378 1360091 1959168 1872278 2238698 2076981 -12851 -2743972 -3303665 -1276303
36845 -1276303 836963 916607 -918061 -3643844 -6511918 -8622644 -8999111 -7551098 -4961160
36836 -4961160 -1758754 1383773 3043920 2502528 1499252 2535530 5361347 7146061
36828 7146061 6424364 4801304 4130804 4105407 3781782 3704018 4934135 7053093 8529596
36819 8529596 8420685 6745647 3978293 1140968 -438155 -587127 -859085 -2578270 -4969810
36810 -4969810 -6366918 -6559944 -6438753 -5790670 -3437804 149230 2330464 1497020 -616014
36801 -616014 -1324330 -738649 -1124805 -2758257 -2792230 712793 5502897 7678966 6391594
36792F391594k533238k499292l406837m360934k848667N37402K409440J579473
36784d731059M21653O12580P22156n67328j708345q26249J115732J931475J464865
36775a564520J063524R80199M53426l83964o32398j97873L07758O80322P93964
36766A500438j2247j704377k589364j353555O02008P32340j131451k605501j917752
36757h479461L07133K301330K850676J915204O84177O52816J690709J810601l5346
36748C697839k080414k194440r75026m24986o77566m02153L69398M00497k58367
36739b545218m35894q9517N9271N37813K000430K757840P79397k185437k325672
36730a446987K29540J328757m89590j717749k5046J810242Q53740j100202j081799
$$ plain form
36792 6391594 3858356 1359064 -2047773 -6408707 -9257374 -8719972 -6310532 -4731059
36784 -4731059 -4309406 -3696826 -2974670 -3541998 -5250343 -6076592 -4960860 -3029385 -1564520
36775 -1564520 -500996 479203 932629 548665 -83733 -281606 26152 706474 1500438
36766 1500438 1488191 -216186 -2805550 -4159105 -3557097 -2824757 -3956208 -6561709 -8479461
36757 -8479461 -8172328 -5870998 -3020322 -1105118 -420941 231875 1922584 3733185 3697839
36748 3697839 1617425 -577015 -1552041 -1977027 -2654593 -3056746 -2687348 -2286851 -2545218
36739 -2545218 -2981112 -3070629 -3011358 -2473545 -473115 2284725 3064122 878685 -1446987
36730 -1446987 -1217447 111310 -378280 -2096029 -2121075 -310833 542907 -557295 -1639094
36721a639094m8490m58356j394872m55516J393588J369687Q3429N71090K558801
36712A980267K357314r89917l736081k929815k99979J060300Q80288N63627K65591
36703h48405n82895j373242j045162J48095J157306J693798K007176J836115Q40907
36694C833693l99233r33735p31503n76094q37685j007706m37600P93585J766785
36685A470507J576551N10306n3154M52568N89832j109128l359821l177688n2737
36676c152764K853913K718120O26802l55911N31344J310679N74592p27585j041882
36667C337308k33395P39385J171427R71379K72266p32408j797937k709081l110746
36658b091802k331116m5542K683471L855205K681065P10704m1058L30425O2442
$$ plain form
36721 -1639094 -1687584 -2145940 -3540812 -3996328 -2602740 -1233053 -1149624 -578534 1980267
36712 1980267 4337581 3347664 -388417 -3318232 -3618211 -2557911 -1677623 -1113996 -848405
36703 -848405 -1431300 -2804542 -3849704 -3701609 -2544303 -850505 1156671 2992786 3833693
36694 3833693 3434460 2500725 1769222 1193128 355443 -652263 -1089863 -296278 1470507
36685 1470507 3047058 3557364 3504210 3956778 4546610 3437482 77661 -3100027 -3152764
36676 -3152764 -298851 2419269 3046071 2690160 3221504 4532183 5106775 4379190 3337308
36667 3337308 3103913 3843298 5014725 5986104 6258370 5525962 3728025 1018944 -2091802
36658 -2091802 -4422918 -4468460 -1784989 2070216 4751281 5461985 5420927 5751352 5813794
36649E813794j387086k409158j774525o35073p38282j709342j809369p88961L2277
36640e405725M21118J645850L588311L759652P61649k989203l995538k101033
36632d314919j62849O7519l66236M0857J182590K009396J836183N72492j237266
36623c72233k361657j927773o70494q7012l14939r6683J019768J878165J578128
36614a354730Q33349P33002J116681R40413l35657k192695l407075k861077o60719
36605g188508J594183K418427K065450J580982Q39630q02517k319942j819062
36597c631357K32749J072381k67696j412457m39670J225069J466721P64058N94971
36588c95231N47991l49248j031122o5331J257767O54570j100286j192658M73267
$$ plain form
36649 5813794 4426708 2017550 243025 -392048 -1130330 -2839672 -4649041 -5438002 -5405725
36640 -5405725 -4984607 -3338757 249554 4009206 4770855 1781652 -2213886 -4314919
36632 -4314919 -4477768 -4410249 -4776485 -4735628 -3553038 -1543642 292541 865033 -372233
36623 -372233 -2733890 -4661663 -5332157 -5419169 -5734108 -5830791 -4811023 -2932858 -1354730
36614 -1354730 -521381 211621 1328302 2268715 1933058 -259637 -3666712 -6527789 -7188508
36605 -7188508 -5594325 -3175898 -1110448 470534 1310164 507647 -1812295 -3631357
36597 -3631357 -3398608 -2326227 -2593923 -4006380 -4446050 -3220981 -1754260 -990202 -395231
36588 -395231 152760 -196488 -1227610 -1292941 -35174 619396 -480890 -1673548 -1200281
36579a200281J069814l18384j253079l03305O27959j0145n78858N93610J890751
36570E18082J099228n57427k71309J654859K260654O67732q22145o73936k17299
36561C658439q14988j463303q12899K89362K21920o01425l90872J014816J777674
36552B878724Q69791m67381p64768m45689p58078j486330j226023K53513J402079
36543B55838J073920J43327J33864J060920J663843J339145P42121N12092L64571
36534G289641k99659j511668k680597l020296k039205q5378J641284K128725J546025
36525B968872P72782K64879L3864K56362Q29229P04351q85263k654693k468466
36516a78083n90980K14341j340021k938374j935292R00144K771857K716570J912136
$$ plain form
36579 -1200281 -130467 -448851 -1701930 -2005235 -1377276 -1387421 -1966279 -1372669 518082
36570 518082 1617310 1059883 788574 2443433 4704087 5371819 4549674 3875738 3658439
36561 3658439 2843451 1380148 567249 856611 1078531 477106 86234 1101050 2878724
36552 2878724 3748515 3281134 2516366 2070677 1312599 -173731 -1399754 -1146241 255838
36543 255838 1329758 1473085 1606949 2667869 4331712 5670857 6412978 6925070 7289641
36534 7289641 6989982 5478314 2797717 -222579 -2261784 -2347162 -705878 1422847 2968872
36525 2968872 3741654 4006533 4040397 4296759 5125988 5830339 4945076 2290383 -178083
36516 -178083 -769063 -554722 -1894743 -4833117 -6768409 -5868265 -3096408 -379838 1532298
36507A532298R93427m51128j886739j809879k10688R91962O93430j6048l4844
36498a98209n717o51521r61907K08793J749925J462029o86229k257003j536433
36489b876272M08567J418695Q83332j19422o26409p36187q75427r78177p43897
36480d245197k51266J55397M13904P10884R44733P49715J69399k50079k62442
36471a864952j81021M77Q82472K306537K616979N88885k381928l560582k298044
36462c891177o33030k73694o30069m56458J59642N05949O57907R54075J044548
36453b562307O81958N79413J198581J530162N70894o81443m39702J027591J584351
36444C489498L07616j303816j524403l62184J062281J794378J326272j17422j178113
$$ plain form
36507 1532298 2525725 2074597 187858 -1622021 -1832709 -840747 -147317 -163365 -198209
36498 -198209 -203926 -855447 -1817354 -1608561 141364 1603393 917164 -1339839 -2876272
36489 -2876272 -2467705 -1049010 -165678 -285100 -911509 -1647696 -2523123 -3501300 -4245197
36480 -4245197 -4496463 -4341066 -3927162 -3216278 -2271545 -1521830 -1352431 -1602510 -1864952
36471 -1864952 -2045973 -2045496 -1163024 1143513 3760492 4349377 1967449 -1593133 -3891177
36462 -3891177 -4524207 -4797901 -5427970 -5884428 -5724786 -5218837 -4560930 -3606855 -2562307
36453 -2562307 -1880349 -1300936 -102355 1427807 1998701 1317258 877556 1905147 3489498
36444 3489498 3797114 2493298 968895 606711 1668992 3463370 4789642 4672220 3494107
36435C494107n67635Q95924R31345r15602k275213j260112Q69562J809644J498870
36426D480890J340949J257336k197j950945k380723q09785L64745p11225k577325
36417i88280k636367q37146O12827N86150K37027Q06902J828612K131578J541208
36408C282511P45386J00438n68167j221311j442209j095563n94837k82379R8572
36399i77559R88920K184937K725779J785184l09905k101729k318834j252991m89551
36390B34251r95857j864526j531326M3018J312907J313702Q17007Q47879J089156
36381A266211O69756k44023p97624q93527j059135j186946p40783p0392l5599
36372c092062k39800O97013K628129L350726J573726j002915j846710p74821L33609
$$ plain form
36435 3494107 2926472 3822396 4753741 3838139 1562926 302814 1172376 2982020 4480890
36426 4480890 5821839 7079175 7076978 5126033 2745310 1935525 2300270 1589045 -988280
36417 -988280 -3624647 -4461793 -3848966 -3262816 -3025789 -2218887 -390275 1741303 3282511
36408 3282511 4027897 4128335 3560168 2338857 896648 -198915 -793752 -1076131 -977559
36399 -977559 11361 2196298 4922077 6707261 6397356 4295627 1976793 723802 234251
36390 234251 -761606 -2626132 -4157458 -4114440 -2801533 -1487831 -670824 177055 1266211
36381 1266211 1935967 1691944 894320 793 -1058342 -2245288 -2986071 -3056463 -3092062
36372 -3092062 -3331862 -2634849 -6720 3344006 4917732 3914817 2068107 1293286 1626895
36363A626895J74666r46298k040549k108559n06887K044602L416286K409105N45980
36354D615241K3454N52704J58774j330623j930294p55143O94998J079935Q70937
36345C979983O32715j93016j587482k036638q56438K76243j77816j137381q28231
36336a928061K03326K40426n05781m23467N01580P68512K20184K72833J151662
36327E01214J399819O07084J77435O18152N14654o51554j098251J70773J109452
36318C348778k71743k312059j947909N17880J846872P02053r22861j408526j667569
36309b115084k444729k145757M95519L333606L043874j03830k174039o66708K279803
36300d97345K838078L43685k251362k300290l62197J142634J041456K29981j25735
$$ plain form
36363 1626895 1801561 855263 -1185286 -3293845 -3800732 -1756130 1660156 4069261 4615241
36354 4615241 4638695 5191399 5350173 4019550 2089256 1334113 2029111 3109046 3979983
36345 3979983 4612698 4419682 2832200 795562 -60876 215367 37551 -1099830 -1928061
36336 -1928061 -1724735 -1484309 -1990090 -2413557 -1911977 -1143465 -923281 -650448 501214
36327 501214 1901033 2508117 2685552 3303704 3818358 3166804 2068553 2239326 3348778
36318 3348778 3077035 764976 -1182933 -665053 1181819 1883872 961011 -447515 -2115084
36309 -2115084 -4559813 -6705570 -6210051 -2876445 167429 63599 -2110440 -2777148 -497345
36300 -497345 2340733 2684418 433056 -1867234 -2229431 -1086797 -45341 184640 58905
36291E8905k1425J124q6230j19925n37158j797567l106723k806011m64981K209519
36281f670472L226055K586006J925573K075644J911529P4405k694405l786747
36273a352412j636217K029679L621742J652440j375169j790624Q54448L283496
36265E287383K545944n69899k905312k812964j476688p16894q37919r90033o53922
36256c130304m4304N02907Q75270R84877O50831j84506j199275j725879j228092
36247d498475N6261J108767J115525L92974o9379L1416o9903j025063k228021
36238e185898k234106k81222K678008M435662L314396n3964k917210l037649j127944
36229d409927J22557m62782j124322J89211K834304M325442L602677K019756J056052
$$ plain form
36291 58905 37480 38604 -47626 -167551 -704709 -2502276 -5608999 -8415010 -8879991 -6670472
36281 -6670472 -3444417 -858411 1067162 3142806 5054335 5128740 2434335 -1352412
36273 -1352412 -2988629 -958950 2662792 4315232 2940063 1149439 2003887 5287383
36265 5287383 7833327 7263428 4358116 1545152 68464 -648430 -1486349 -2476382 -3130304
36256 -3130304 -3174608 -2671701 -1796431 -811554 -160723 -345229 -1544504 -3270383 -4498475
36247 -4498475 -4442214 -3333447 -2217922 -1824948 -1894327 -1862911 -1932814 -2957877 -5185898
36238 -5185898 -7420004 -7701226 -5023218 -587556 2726840 2672876 -244334 -3281983 -4409927
36229 -4409927 -4287370 -4750152 -5874474 -5685263 -2850959 1474483 5077160 7096916 8152968
36220H152968M36096q30611k509464l267991k471798r86617l9787J19395M8347
36211a349462j2491m13730j142799j305699k43699J163006J267101j17334j206954
36202c362061n32597J029427J367698j52374k030919k579628j657455l25331N37202
36193g706038R45259J465213K334891K859724J979369k10057j929422j482442
36185a743503N81981J910259J084912p94411j547506l72980J468842K099459R04128
36176C591181q87121j518165p17588j4387o82799j985174k288101j371000l57975
36167f231129L53211J441105K716134K619807N85014j562053j867909r00481o87905
36158c534206j684218k377306j728652m87192K18206M00499P35351J304637J502632
$$ plain form
36220 8152968 8589064 7758453 5248989 1980998 -490800 -1477417 -1517204 -1397809 -1349462
36211 -1349462 -1361953 -1775683 -2918482 -4224181 -4467880 -3304874 -2037773 -2155107 -3362061
36202 -3362061 -3894658 -2865231 -1497533 -1649907 -3680826 -6260454 -7917909 -8243240 -7706038
36193 -7706038 -6760779 -5295566 -2960675 -100951 1878418 1668361 -261061 -1743503
36185 -1743503 -1161522 748737 1833649 1039238 -508268 -881248 587594 2687053 3591181
36176 3591181 2704060 1185895 468307 453920 -228879 -2214053 -4502154 -5873154 -6231129
36167 -6231129 -5877918 -4436813 -1720679 899128 1484142 -77911 -1945820 -2846301 -3534206
36158 -3534206 -5218424 -7595730 -9324382 -9811574 -9593368 -9192869 -8457518 -7152881 -5650249
36149e650249R70871J79268j3127O81361J558745J681660J048293N90592Q51708
36140A899122J193134P32859l50438j012102o52821K30004O39695O5454j022982
36131A721925j570446j078832l29309m47808j252440j354364j44210J287858J734824
36122a432802J395451J050359O76588l6585n47999j46354O32445N41272n61714
36113A570661j515038j398244l45718J027352K059568K047662Q10882p42518j396066
36104B118541q85005J91434J185960J345971j66982k817537m059060k069469J284343
36095c871804K380198O79369p64293j259J262166R40695j13713J5373J019611
36086A546343J237947N92450L08945M05584k04872j296806j250285K62285J408322
$$ plain form
36149 -5650249 -4679378 -4500110 -4513237 -3831876 -2273131 -591471 456822 1047414 1899122
36140 1899122 3092256 3825115 3474677 2462575 1809754 2039758 2679453 2744907 1721925
36131 1721925 151479 -927353 -1256662 -1704470 -2956910 -4311274 -4455484 -3167626 -1432802
36122 -1432802 -37351 1013008 1689596 1653011 1105012 958658 1591103 2132375 1570661
36113 1570661 55623 -1342621 -1688339 -660987 1398581 3446243 4257125 3514607 2118541
36104 2118541 1233536 1424970 2610930 3956901 3789919 972382 -3086678 -5156147 -3871804
36095 -3871804 -1491606 -812237 -1576530 -1577789 -315623 625072 511359 526732 1546343
36086 1546343 2784290 3376740 3685685 4091269 3886397 2589591 1339306 1601591 3009913
36077C009913P48593p90449j395964p69614p6909j72422q55780j593327k061800
36068c957759j903067p12973J238107K667257K378201P91096k92765J43311J039223
36059A390631Q64440o4259j05509J000477J428937j92045k714371l777579k457283
36050d626561Q6097J989919K129535P89548n34435n34192L63362N62731l74977
36041a48973j128292p93671k09509j95503m465J053887J832053J050809k72843
36032A183493k53945P10514O05838o70473j020955K98024J355297O72950n60099
36023B320644p32577l89077q51678j638337j224329K98419J170898M52580r29025
36014a522482j728091j727000j205721j42580J345381K334206J711007m32152
$$ plain form
36077 3009913 3758506 2968057 1572093 802479 725570 553148 -302632 -1895959 -3957759
36068 -3957759 -5860826 -6573799 -5335692 -2668435 -290234 500862 208097 351408 1390631
36059 1390631 2255071 2190812 2085303 3085780 4514717 4322672 1608301 -2169278 -4626561
36050 -4626561 -4540464 -2550545 -421010 368538 -165897 -700089 -336727 226004 -148973
36041 -148973 -1277265 -2070936 -2280445 -2475948 -2480413 -1426526 405527 1456336 1183493
36032 1183493 929548 1640062 2245900 1575427 554472 852496 2207793 2880743 2320644
36023 2320644 1588067 1198990 347312 -1291025 -2515354 -2216935 -1046037 -593457 -1522482
36014 -1522482 -3250573 -4977573 -6183294 -6325874 -4980493 -2646287 -935280 -1367432
36006a367432k475083k697837r91321J095832J994926J479283M12748k58259j0915
35997b818058J041769J910029J426319n6775m93576J155574K829860J728289j546892
35988E176539l307539j613166J257854K094439O75143r86942j811173k195225
35980g10070k223936j294012M94910J997411K296987J475768J51473r83201j306244
35971a00914p48316m8574J04069m0759J16530M66495N47546N53538R49286J324444
$$ plain form
36006 -1367432 -3842515 -6540352 -7531673 -6435841 -4440915 -2961632 -2548884 -2807143 -2818058
35997 -2818058 -1776289 133740 1560059 1503284 1009708 2165282 4995142 6723431 5176539
35988 5176539 1869000 255834 1513688 3608127 4283270 3296328 1485155 -710070
35980 -710070 -2934006 -4228018 -3733108 -1735697 561290 2037058 2188531 1205330 -100914
35971 -100914 -849230 -897804 -793735 -834494 -717964 -251469 296077 849615 1798901 3123345
$$ [...]
##END NTUPLES=NMR SPECTRUM
##END=
