##TITLE=31Pdec_DE_63_EXTEtOH
 D2O, 64 sc
 1.8.2024
##JCAMPDX= 6.0         $$ Bruker NMR JCAMP-DX V2.0
##DATA TYPE= NMR SPECTRUM
##DATA CLASS= NTUPLES
##ORIGIN= UXNMR, Bruker Analytische Messtechnik GmbH
##OWNER= root
$$ XWIN-NMR		Version 3.5
$$ Thu Aug  1 15:43:36 2024 Russian Standard Time (UT+4h)  she@DPX200
##.OBSERVE FREQUENCY= 81.013821
##.OBSERVE NUCLEUS= ^31P
##.ACQUISITION MODE= SIMULTANEOUS
##.ACQUISITION SCHEME= undefined
##.AVERAGES= 64
##.DIGITISER RES= 17
##SPECTROMETER/DATA SYSTEM= spect
##.PULSE SEQUENCE= zgpg30
##.SOLVENT NAME= D2O
##.SHIFT REFERENCE= (INTERNAL, D2O, 0, 198.062)
##AUDIT TRAIL= $$ (NUMBER, WHEN, WHO, WHERE, WHAT)
$$ ##TITLE= Audit trail, XWIN-NMR		Version 3.5
$$ ##JCAMPDX= 5.01
$$ ##ORIGIN= Bruker BioSpin GmbH
$$ ##OWNER= she
$$ F:/spectra/data/she/nmr/P31/2/pdata/1/auditp.txt
$$ ##AUDIT TRAIL=  $$ (NUMBER, WHEN, WHO, WHERE, WHAT)
(   1,<2024-08-01 15:41:28.18 +0400>,<she>,<DPX200>,
      <created by zg, POWCHK disabled, PULCHK disabled
       configuration hash MD5:
       00 E9 B6 7A A2 85 ED C7 34 08 36 98 17 FE 4E 26
       data hash MD5: 32K
       6C D7 F5 11 DF BD 45 C7 E9 7E 64 C9 AF E4 EC 2D>)
(   2,<2024-08-01 15:42:33.50 +0400>,<she>,<DPX200>,
      <Start of raw data processing
       efp BC_mod = 2 LB = 1.5 FT_mod = 6 PKNL = 1 PHC0 = 2662.751 PHC1 = 101.2869 SI = 64K 
       data hash MD5: 64K
       13 D6 78 6E BB 0E 07 01 68 F4 D4 04 7A DC 11 40>)
(   3,<2024-08-01 15:42:58.96 +0400>,<she>,<DPX200>,
      <pk PHC0 = 20.35877 PHC1 = -45.4 
       data hash MD5: 64K
       D7 67 02 BA 5D 40 E9 BC 90 A9 B1 97 4E EC 32 C0>)
$$ ##END=
$$ 
$$ hash MD5
$$ 74 5D 3C B9 6E AB F0 2C DB 43 8A 52 50 00 75 9D
##$RELAX= 
##$RELAX= 
##$RELAX= 
##$RELAX= 
##$RELAX= 
##$RELAX= 
##$RELAX= 
##$RELAX= 
$$ Bruker specific parameters
$$ --------------------------
##$DU= <F:/spectra>
##$EXPNO= 2
##$NAME= <P31>
##$PROCNO= 1
##$TYPE= <nmr>
##$USER= <she>
##$AMP= (0..31)
100 100 100 100 100 100 100 100 100 100 100 100 100 100 100 100 100 100 
100 100 100 100 100 100 100 100 100 100 100 100 100 100 
##$AQSEQ= 0
##$AQ_mod= 1
##$AUNM= <au_zg>
##$AUTOPOS= <>
##$BF1= 81.014009
##$BF2= 200.13
##$BF3= 200.13
##$BF4= 200.13
##$BF5= 200.13
##$BF6= 200.13
##$BF7= 200.13
##$BF8= 200.13
##$BYTORDA= 1
##$CFDGTYP= 0
##$CFRGTYP= 5
##$CHEMSTR= <none>
##$CNST= (0..31)
1 1 145 1 1 1 1 1 1 1 1 1 1 1 1 1 1 1 1 1 1 1 1 1 1 1 1 1 1 1 1 1 
##$CPDPRG= <waltz16>
##$CPDPRG1= <>
##$CPDPRG2= <waltz16>
##$CPDPRG3= <>
##$CPDPRG4= <mlev>
##$CPDPRG5= <mlev>
##$CPDPRG6= <mlev>
##$CPDPRG7= <mlev>
##$CPDPRG8= <mlev>
##$CPDPRGB= <>
##$CPDPRGT= <>
##$D= (0..31)
0 1 0 0 0 0 0 0 0 0.06 0 0.03 2e-05 3e-06 0 0 0.0002 0 0 0 0 0 0 0 0 0 
0 0 0 0 0 0 
##$DATE= 1722512487
##$DBL= (0..7)
120 120 120 11 120 120 24 19 
##$DBP= (0..7)
150 150 150 150 150 150 150 150 
##$DBP07= 0
##$DBPNAM0= <>
##$DBPNAM1= <>
##$DBPNAM2= <>
##$DBPNAM3= <>
##$DBPNAM4= <>
##$DBPNAM5= <>
##$DBPNAM6= <>
##$DBPNAM7= <>
##$DBPOAL= (0..7)
0.5 0.5 0.5 0.5 0.5 0.5 0.5 0.5 
##$DBPOFFS= (0..7)
$$ [...]
##$SUBNAM2= <"">
##$SUBNAM3= <"">
##$SUBNAM4= <"">
##$SUBNAM5= <"">
##$SUBNAM6= <"">
##$SUBNAM7= <"">
##$SUBNAM8= <"">
##$SUBNAM9= <"">
##$SW= 400.765351723535
##$SWIBOX= (0..15)
0 1 3 0 0 0 0 0 0 0 0 0 0 0 0 0 
##$SW_h= 32467.5324675325
##$TD= 32768
##$TD0= 1
##$TE= 0
##$TE2= 300
##$TE3= 300
##$TEG= 300
##$TL= (0..7)
0 120 53 12 22 120 120 120 
##$TP= (0..7)
150 150 150 150 150 150 150 150 
##$TP07= 0
##$TPNAME0= <>
##$TPNAME1= <>
##$TPNAME2= <>
##$TPNAME3= <>
##$TPNAME4= <>
##$TPNAME5= <>
##$TPNAME6= <>
##$TPNAME7= <>
##$TPOAL= (0..7)
0.5 0.5 0.5 0.5 0.5 0.5 0.5 0.5 
##$TPOFFS= (0..7)
0 0 0 0 0 0 0 0 
##$TUNHIN= 0
##$TUNHOUT= 0
##$TUNXOUT= 0
##$USERA1= <user>
##$USERA2= <user>
##$USERA3= <user>
##$USERA4= <user>
##$USERA5= <user>
##$V9= 5
##$VALIST= <valist>
##$VCLIST= <CCCCCCCCCCCCCCC>
##$VD= 0
##$VDLIST= <DDDDDDDDDDDDDDD>
##$VPLIST= <PPPPPPPPPPPPPPP>
##$VTLIST= <TTTTTTTTTTTTTTT>
##$WBST= 1024
##$WBSW= 4
##$XGAIN= (0..3)
0 0 0 0 
##$XL= 0
##$YL= 0
##$YMAX_a= 19602
##$YMIN_a= -16838
##$ZGOPTNS= <>
##$ZL1= 120
##$ZL2= 120
##$ZL3= 120
##$ZL4= 120
##$ABSF1= 0
##$ABSF2= 0
##$ABSG= 0
##$ABSL= 0
##$ALPHA= 0
##$AQORDER= 0
##$ASSFAC= 0
##$ASSFACI= 0
##$ASSFACX= 0
##$ASSWID= 0
##$AUNMP= <proc_1d>
##$AZFE= 0.1
##$AZFW= 0.5
##$BCFW= 0
##$BC_mod= 2
##$BYTORDP= 0
##$COROFFS= 0
##$CY= -3
##$DATMOD= 1
##$DC= 0
##$DFILT= <>
##$DTYPP= 0
##$F1P= 0
##$F2P= 0
##$FCOR= 1
##$FTSIZE= 65536
##$FT_mod= 6
##$GAMMA= 0
##$GB= 0
##$INTBC= 1
##$INTSCL= 9.790993e-09
##$ISEN= 30
##$LB= 1.5
##$LEV0= 0
##$LPBIN= 0
##$MAXI= 10000
##$MC2= 0
##$MEAN= 0
##$ME_mod= 0
##$MI= 50
##$NCOEF= 0
##$NC_proc= -6
##$NLEV= 6
##$NOISF1= 182.463
##$NOISF2= 159.3651
##$NSP= 0
##$NTH_PI= 0
##$NZP= 0
##$OFFSET= 198.0616
##$PC= 4
##$PHC0= 2683.11
##$PHC1= 55.8869
##$PH_mod= 1
##$PKNL= yes
##$PPARMOD= 0
##$PSCAL= 0
##$PSIGN= 0
##$REVERSE= no
##$SF= 81.0140089999434
##$SI= 65536
##$SIGF1= 159.3651
##$SIGF2= -187.1042
##$SINO= 113.3802
##$SIOLD= 16384
##$SREGLST= <1H.CDCl3>
##$SSB= 0
##$STSI= 65536
##$STSR= 0
##$SW_p= 32467.5324675325
##$SYMM= 0
##$S_DEV= 0
##$TDeff= 32768
##$TDoff= 0
##$TI= <>
##$TILT= no
##$TM1= 0
##$TM2= 0
##$TOPLEV= 0
##$USERP1= <user>
##$USERP2= <user>
##$USERP3= <user>
##$USERP4= <user>
##$USERP5= <user>
##$WDW= 1
##$XDIM= 65536
##$YMAX_p= 331882478
##$YMIN_p= -8466797
$$ End of Bruker specific parameters
$$ ---------------------------------
##NTUPLES= NMR SPECTRUM
##VAR_NAME=  FREQUENCY,     SPECTRUM/REAL,   SPECTRUM/IMAG
##SYMBOL=    X,             R,               I
##VAR_TYPE=  INDEPENDENT,   DEPENDENT,       DEPENDENT
##VAR_FORM=  AFFN,          ASDF,            ASDF
##VAR_DIM=   65536,         65536,           65536
##UNITS=     HZ,            ARBITRARY UNITS, ARBITRARY UNITS
##FACTOR=    0.49542278885378, 1,            1
##FIRST=     16045.7642231865, 0,            0
##LAST=      -16421.768244346, 0,            0
##MIN=       -16421.768244346, -8466797,     0
##MAX=       16045.7642231865, 331882478,    0
$$ Real data points
##PAGE= N=1
##DATA TABLE= (X++(R..R)), XYDATA
$$ [...]
$$ plain form
39787 32020793 29853177 28200551 26488354 24986776 24189806 24072501 24177135 24088878 23646358
39778 23646358 23026505 22800851 23514727 24948610 26190379 26795514 27494594 29252117 31916406
39769 31916406 34452102 36424580 38554092 41644310 45594959 49812503 54043989 58250109
39761 58250109 62024555 64895720 67200274 69941008 73458672 76722135 78330697 77866323
39753 77866323 75807687 72461107 67721099 61880045 55893577 50482847 45511857 40678345
39745 40678345 36342410 33071682 30669869 28363824 25888534 23705977 22047292 20398778
39737 20398778 18276703 16055920 14605250 14305356 14724820 15124462 15058920 14593945 14105965
39728 14105965 13832869 13641472 13397027 13438676 14277403 15799222 17248983 18137528 18641625
$$ packed form
39787C2020793k167616j652626j712197j501578p96970j17305J04634q8257m42520
39778B3646358o19853k25654P13876J433883J241769O05135O99080J757523K664289
39769C1916406K535696J972478K129512L090218L950649M217544M231486M206120
39761E8250109L774446K871165K304554K740734L517664L263463J608562m64374
39753G7866323k058636l346580m740008n841054n986468n410730m970990m833512
39745D0678345m335935l270728k401813k306045k475290k182557j658685j648514
39737B0398778k122075k220783j450670k99894M19464L99642o5542m64975m87980
39728A4105965k73096j91397k44445M1649Q38727J521819J449761Q88545N04097
$$ plain form
39719 18641625 18884638 18456347 17133485 15545459 14461155 13752041 12743636 11346250
39711 11346250 10092462 9178877 8260058 7227928 6432964 5966429 5421027 4608075 3871216
39702 3871216 3406721 2917538 2306291 2051226 2367373 2584095 2046591 1209388 1055337
39693 1055337 1672236 2215656 2218755 2126546 2386249 2734517 2719169 2397388 2145614 2157516
39683 2157516 2463191 3104517 3919641 4408666 4195289 3474043 2708281 2079452 1563361
39674 1563361 1327086 1572118 2058562 2270858 2087427 1830816 1602197 1122419 455830
39665 455830 309028 1125538 2284303 2782044 2471529 2003493 1688267 1149608 182819
39656 182819 -758924 -1192185 -1110597 -583874 476005 1687584 2029974 1065600 -132974
$$ packed form
39719A8641625K43013m28291j322862j588026j084304p09114j008405j397386
39711A1346250j253788r13585r18819j032130p94964m66535n45402q12952p36859
39702C871216m64495m89183o11247k55065L16147K16722n37504q37203j54051
39693A055337O16899N43420L099r2209K59703L48268j5348l21781k51774J1902
39683B157516L05675O41326Q15124M89025k13377p21246p65762o28829n16091
39674A563361k36275K45032M86444K12296j83431k56611k28619m79778o66589
39665D55830j46802Q16510J158765M97741l10515m68036l15226n38659r66789
39656A82819r41743m33261Q1588N26723J059879J211579L42390r64374j198574
$$ plain form
39647 -132974 -169913 823328 1483143 1248332 982989 1350873 1722292 1366287 827997 1145589
39637 1145589 2175972 2712408 2162381 1232105 810564 869716 762215 141762 -746709
39628 -746709 -1447666 -1703956 -1584226 -1343234 -1141057 -931219 -688052 -602244 -855650 -1298982
39618 -1298982 -1574650 -1502888 -1173797 -782717 -586686 -846671 -1498700 -2017941 -1962571 -1547099
39608 -1547099 -1311470 -1359662 -1387674 -1345407 -1463940 -1610547 -1296216 -525161 6409 -112374
39598 -112374 -417149 -370331 -181074 -246374 -253669 387696 1434587 1914965 1385816 450952
39588 450952 -104112 -144634 42684 319929 709773 1134119 1456639 1655220 1773112 1831917
39578 1831917 1918267 2185331 2603022 2839372 2577333 1898717 1211888 813843 636261 452472
$$ packed form
39647a32974l6939R93241O59815k34811k65343L67884L71419l56005n38290L17592
39637A145589J030383N36436n50027r30276m21541N9152j07501o20453q88471
39628g46709p00957k56290J19730K40992K02177K09838K43167Q5808k53406m43332
39618a298982k75668P1762L29091L91080J96031k59985o52029n19241N5370M15472
39608a547099K35629m8192k8012M2267j18533j46607L14331P71055N31570j18783
39598a12374l04775M6818J89257o5300p295O41365J046891M80378n29149r34864
39588D50952n55064m0522J87318K77245L89844M24346L22520J98581J17892N8805
39578A831917Q6350K67064M17691K36350k62039o78616o86829l98045j77582j83789
$$ plain form
39568 452472 247211 253167 580497 983534 1234656 1622852 2626603 3967222 4534917 3700305
39558 3700305 2273176 1513188 1460842 1062041 -112701 -1215024 -1430329 -1033967 -616573
39549 -616573 -63046 899312 1718102 1582221 745640 311840 666359 1008089 645872 -44849
39539 -44849 -342361 -188935 32757 252697 662321 1164763 1388471 1149651 554278 -214423
39529 -214423 -875555 -989700 -334345 703519 1450731 1646368 1545113 1397945 1158908
39520 1158908 695182 -11280 -871057 -1629791 -1856437 -1324926 -403494 275312 539891
39511 539891 718915 967170 1022221 740433 387084 181285 26446 -17824 504695 1745166
39501 1745166 2973333 3247319 2465043 1300943 338504 -215395 -206637 353963 873455
$$ packed form
39568D52472k05261N956L27330M03037K51122L88196J003751J340619N67695q34612
39558C700305j427129p59988n2346l98801j174742j102323k15305L96362M17394
39549f16573N53527R62358Q18790j35881q36581m33800L54519L41730l62217o90721
39539d4849k97512J53426K21692K19940M09624N02442K23708k38820n95373p68701
39529b14423o61132j14145O55355J037864P47212J95637j01255j47168k39037
39520A158908m63726p06462q59777p58734k26646N31511R21432O78806K64579
39511E39891J79024K48255N5051k81788l53349k05799j54839m4270N22519J240471
39501A745166J228167K73986p82276j164100r62439n53899Q758N60600N19492
$$ plain form
39492 873455 579733 -470320 -1314402 -1188714 -250487 886757 1767374 2090027 1755329
39483 1755329 1248301 1355138 2067561 2357920 1570697 443814 41037 194938 -62233
39474 -62233 -839841 -1245211 -897702 -517234 -693127 -978105 -727269 -156419 32867 -377302
39464 -377302 -1076401 -1799970 -2434157 -2814665 -2893584 -2888274 -2858064 -2422942 -1412531 -539647
39454 -539647 -770752 -2058558 -3293058 -3592706 -3136173 -2603662 -2310198 -2126654 -1821751
39445 -1821751 -1154540 54085 1564499 2609035 2513064 1416166 141879 -632999 -876868
39436 -876868 -902177 -858817 -704383 -519789 -557407 -894095 -1267557 -1477989 -1785499 -2526124
39426 -2526124 -3348397 -3344363 -2204760 -805661 -211503 -442432 -793835 -1077432 -1711475
$$ packed form
39492H73455k93722j050053q44082J25688R38227J137244Q80617L22653l34698
39483A755329n07028J06837P12423K90359p87223j126883m02777J53901k57171
39474f2233p77608m05370L47509L80468j75893k84978K50836N70850J89286m10169
39464c77302o99099p23569o34187l80508p8919N310L0210M35122J010411Q72884
39454e39647k31105j287806j234500k99648M56533N32511K93464J83544L04903
39445a821751O67211J208625J510414J044536r5971j096898j274287p74878k43869
39436h76868k5309M3360J54434J84594l7618l36688l73462k10432l07510p40625
39426b526124q22273M034J139603J399099N94158k30929l51403k83597o34043
$$ plain form
39417 -1711475 -2587046 -2804517 -1975716 -1053766 -1211749 -2344726 -3347970 -3572382 -3291431
39408 -3291431 -2877604 -2290545 -1516388 -904973 -789280 -1118632 -1632906 -2089161 -2230014
39399 -2230014 -1917264 -1454189 -1399382 -1851734 -2258233 -2152095 -1737407 -1476063 -1450162 -1487134
39389 -1487134 -1578196 -1690177 -1411138 -401327 835896 1255804 542728 -392871 -477749
39380 -477749 300985 1053561 1109033 587805 -37506 -536131 -959470 -1347447 -1600136 -1589235
39370 -1589235 -1282370 -756211 -150199 363193 590233 371743 -290203 -1135391 -1728932
39361 -1728932 -1728317 -1142985 -370405 59026 -115172 -653050 -1024592 -925237 -569594 -433169
39351 -433169 -754845 -1359016 -1898157 -2153999 -2131230 -1975500 -1809173 -1590392 -1182552 -620502
$$ packed form
39417a711475q75571k17471Q28801R21950j57983j132977j003244k24412K80951
39408c291431M13827N87059P74157O11415J15693l29352n14274m56255j40853
39399b230014L12750M63075N4807m52352m06499J06138M14688K61344K5901l6972
39389a487134r1062j11981K79039J009811J237223M19908p13076r35599q4878
39380d77749P78734P52576N5472n21228o25311m98625m23339l87977k52689J0901
39370a589235L06865N26159O06012N13392K27040k18490o61946q45188n93541
39361a728932O15N85332P72580M29431j74198n37878l71542R9355L55643J36425
39351d33169l21676o04171n39141k55842K2769J55730J66327K18781M07840N62050
$$ plain form
39341 -620502 -176878 -19018 56100 313097 630561 680935 477095 323496 205156 -271961
39331 -271961 -1127164 -1664404 -1268470 -238731 556074 626448 104737 -696235 -1477025 -1856883
39321 -1856883 -1640121 -1201626 -1138741 -1472269 -1629985 -1313712 -909411 -829191 -885811 -664284
39311 -664284 -207253 81283 83834 131760 474501 850474 752087 66328 -691497 -913374
39301 -913374 -641535 -533159 -951902 -1402506 -1228594 -631672 -430808 -847748 -1168159 -792073
39291 -792073 -32090 474548 656905 865404 1190753 1403652 1350114 991288 256605 -718666
39281 -718666 -1388564 -1297795 -723338 -414300 -714816 -1263748 -1502354 -1171929 -400408 367528
39271 367528 593747 120031 -634439 -1183060 -1491091 -1696686 -1642796 -1210104 -850808 -1088179
$$ packed form
39341f20502M43624J57860P5118K56997L17464N0374k03840j53599j18340m77117
39331b71961q55203n37240L95934J029739P94805P0374n21711q00972p80790l79858
39321a856883K16762M38495O2885l33528j57716L16273M04301Q0220n6620K21527
39311f64284M57031K88536K551M7926L42741L75973r8387o85759p57825k21877
39301i13374K71839J08376m18743m50604J73912N96922K00864m16940l20411L76086
39291g92073P59983N06638J82357K08499L25349K12899n3538l58826p34683r75271
39281g18666o69898R0769N74457L09038l00516n48932k38606L30425P71521P67936
39271C67528K26219m73716p54470n48621l08031k05595N3890M32692L59296k37371
$$ plain form
39261 -1088179 -1582345 -1464100 -656217 -61442 -217437 -573150 -514292 -345536 -604060 -972840
39251 -972840 -699081 161565 698053 332045 -558328 -1275195 -1537382 -1409098 -916175 -41819
39241 -41819 1056960 2055171 2667898 2783179 2440632 1774789 1010732 432838 186083 57635
39231 57635 -323036 -895053 -1041577 -395508 472705 695566 299411 102421 438180 763776
39221 763776 718810 719843 1080087 1359173 1210484 1122276 1513711 1762160 1135287 182694
39211 182694 19181 504159 439326 -412074 -841739 -62926 1164598 1848605 2123289 2512736
39201 2512736 2730362 2212874 1321915 1028587 1602321 2350481 2496505 1733384 192313
39192 192313 -1445972 -2033441 -935195 1077266 2530700 2803265 2391101 1789536 948703
$$ packed form
39261a088179m94166J18245Q07883N94775j55995l55713N8858J68756k58524l68780
39251i72840K73759Q60646N36488l66008q90373p16867k62187J28284M92923Q74356
39241d1819J098779R98211O12727J15281l42547o65843p64057n77894k46755j28448
39231E7635l80671n72017j46524O46069Q68213K22861l96155j96990L35759L25596
39221G63776m4966J033L60244K79086j48689q8208L91435K48449o26873r52593
39211A82694j63513M84978o4833q51400m29665P78813J227524O84007K74684L89447
39201B512736K17626n17488q90959k93328N73734P48160J46024p63121j541071
39192A92313j638285n87469J098246K012461J453434K72565m12164o01565q40833
$$ plain form
39183 948703 -74937 -791716 -963722 -971857 -1136128 -1252551 -1187881 -1321845 -1853717 -2191741
39173 -2191741 -1723785 -855677 -539437 -929830 -1247779 -965006 -400310 -871 279197
39164 279197 567935 616528 203363 -376657 -671519 -664555 -605521 -490097 -166676 199862
39154 199862 273771 106914 58686 141464 -20608 -427529 -436429 378681 1469073 1847862
39144 1847862 1191312 24190 -1031186 -1748900 -2090437 -1987641 -1523491 -1036589 -819891
39135 -819891 -839194 -871498 -792749 -611919 -345926 -24071 222438 214178 -86255 -461676
39125 -461676 -534240 -19746 1014353 2099752 2646345 2385346 1602803 920827 759347
39116 759347 927948 787689 -57161 -1224436 -1861368 -1531195 -622089 206135 756849
$$ packed form
39183I48703j023640p16779j72006q135j64271j16423O4670j33964n31872l38024
39173b191741M67956Q68108L16240l90393l17949K82773N64696L99439K80068
39164B79197K88738M8593m13165n80020k94862O964N9034J15424L23421L66538
39154A99862P3909j66857m8228Q2778j62072m06921q900Q15110J090392L78789
39144A847862o56550j167122j055376p17714l41537J02796M64150M86902K16698
39135h19891j9303l2304P8749J80830K65993L21855K46509q260l00433l75421
39125d61676p2564N14494J034099J085399N46593k60999p82543o81976j61480
39116G59347J68601j40259q44850j167275o36932L30173R09106Q28224N50714
$$ plain form
39107 756849 1288465 1972353 2656174 3080955 3040292 2369175 1110068 -252329 -1036010
39098 -1036010 -1007155 -595236 -342196 -319613 -237271 43203 337696 454884 489030 690517
39088 690517 1083401 1345146 1197998 862256 858638 1268953 1510717 1115054 432491 121077
39078 121077 139143 -137367 -806788 -1158060 -753687 -156575 -91850 -360894 -227705 358045
39068 358045 605716 -31888 -1171429 -2031410 -2217172 -1795481 -984422 -92593 461643
39059 461643 458916 227138 425782 1355722 2588589 3398937 3511562 3269509 3048916 2722733
39049 2722733 1892680 530291 -873180 -1773983 -1945022 -1400060 -299504 946166 1803264
39040 1803264 2074151 2018022 1848408 1408180 617494 -68218 -115462 295955 426565 -41847
$$ packed form
39107G56849N31616O83888O83821M24781m0663o71117j259107j362397p83681
39098a036010K8855M11919K53040K2583Q2342K80474K94493J17188L4146K01487
39088F90517L92884K61745j47148l35742l618M10315K41764l95663o82563l11414
39078A21077J8066k76510o69421l51272M04373N97112O4725k69044J33189N85750
39068C58045K47671o37604j139541q59981j85762M21691Q11059Q91829N54236
39059D61643k727k31778J98644R29940J232867Q10348J12625k42053k20593l26183
39049B722733q30053j362389j403471r00803j71039N44962J100556J245670Q57098
39040A803264K70887n6129j69614m40228p90686o85712m7244M11417J30610m68412
$$ plain form
39030 -41847 -615737 -726657 -484152 -432222 -802155 -1323051 -1674024 -1817935 -1860376 -1839630
39020 -1839630 -1786795 -1792972 -1790783 -1393967 -292531 1160719 2129366 2239897 1988668 1913012
39010 1913012 1772538 1097160 216082 -71292 211801 167758 -520532 -1000556 -604039 41366
39000 41366 -7641 -552086 -645113 -20584 779810 1434776 2063354 2545807 2567158 2345935
38990 2345935 2399176 2493593 1809018 410244 -433313 87660 1173791 1582045 1247237
38981 1247237 969454 1005537 877471 373916 -112142 -305186 -437411 -715506 -865247 -487490
38971 -487490 355533 1135213 1410027 1311907 1417663 2032695 2664098 2488773 1424015 403480
38961 403480 358129 1167323 1897333 1921548 1533801 1512597 2248773 3271465 3622845 2854448
$$ packed form
39030d1847n73890j10920K42505N1930l69933n20896l50973j43911m2441K0746
39020a839630N2835o177K189L96816J101436J453250R68647J10531k51229p5656
39010A913012j40474o75378q81078k87374K83093m4043o88290m80024L96517O45405
39000D1366m9007n44445r3027O24529Q00394O54966O28578M82453K1351k21223
38990B345935N3241R4417o84575j398774q43557N20973J086131M08254l34808
38981A247237k77783L6083j28066n03555m86058j93044j32225k78095j49741L77757
38971d87490Q43023P79680K74814r8120J05756O15032O31403j75325j064758j020535
38961D03480m5351Q09194P30010K4215l87747k1204P36176J022692L51380p68397
$$ plain form
38951 2854448 1604759 888826 871244 843786 473378 376021 1097288 2174536 2784304 2814589
38941 2814589 2645988 2316131 1688065 1136911 1187689 1594858 1644825 1333204 1319963 1615264
38931 1615264 1309528 -3217 -1406087 -1831095 -1376631 -849996 -585980 -446110 -558011
38922 -558011 -1205760 -2106561 -2524649 -2159175 -1391121 -626567 89014 713563 947696 553896
38912 553896 -325585 -1287559 -1916004 -1952293 -1523933 -1165049 -1222021 -1258827 -566457 650079
38902 650079 1238158 599624 -372565 -444739 329985 904765 881495 897536 1322423 1589790
38892 1589790 1273571 957009 1288355 1800605 1600924 883094 716361 1363039 1833467
38883 1833467 1388176 596217 417800 924507 1498578 1769471 1748277 1451612 1024885 924012
$$ packed form
38951B854448j249689p15933j7582k7458l70408r7357P21267J077248O09768L0285
38941B814589j68601l29857o28066n51154N0778M07169M9967l11621j3241K95301
38931A615264l05736j312745j402870m25008M54464N26635K64016J39870j11901
38922e58011o47749r00801m18088L65474P68054P64554P15581O24549K34133l93800
38912E53896q79481r61974o28445l6289M28360L58884n6972l6806O92370J216536
38902F50079N88079o38534r72189p2174P74724N74780k3270J6041M24887K67367
38892A589790l16219l16562L31346N12250j99681p17830j66733O46678M70428
38883A833467m45291p91959j78417N06707N74071K70893k1194k96665m26727j00873
$$ plain form
38873 924012 1338028 1679990 1312938 596228 497662 1242876 2075165 2377757 2302645 2171807
38863 2171807 2024564 2050917 2748653 4146065 5372062 5527134 4663191 3486784 2442944
38854 2442944 1582872 1062632 1180482 1920151 2836910 3429502 3452437 3007950 2544841 2556985
38844 2556985 3000980 3216553 2731319 1922291 1519204 1681647 2011199 2268239 2505146
38835 2505146 2565933 2081962 1087344 133853 -365522 -486254 -382752 -19719 505273 866095
38825 866095 995778 1193681 1436199 1113211 -42875 -1207491 -1319316 -462664 291442
38816 291442 351345 218944 554956 1299469 1997457 2459970 2711738 2653236 2202879 1594681
38806 1594681 1201580 1146505 1260708 1271752 917140 146122 -621890 -796695 -456439 -494449
$$ packed form
38873I24012M14016L41962l67052p16710r8566P45214Q32289L02592p5112j30838
38863B171807j47243K6353O97736J397412J225997J55072q63943j176407j043840
38854B442944q60072n20240J17850P39669R16759N92592K2935m44487m63109J2144
38844B556985M43995K15573m85234q09028m03087J62443L29552K57040K36907
38835B505146O0787m83971r94618r53491m99375j20732J03502L63033N24992L60822
38825H66095J29683J97903K42518l22988j156086j164616j11825Q56652P54106
38816B91442N9903j32401L36012P44513O97988M62513K51768n8502m50357o08198
38806A594681l93101n5075J14203J1044l54612p71018p68012j74805L40256l8010
$$ plain form
38796 -494449 -1473200 -2645177 -2700271 -1336099 484702 1723388 2085511 1747913 1075396
38787 1075396 764780 1458824 2813716 3601205 3188884 2303128 1795580 1325582 93028
38778 93028 -1597286 -2544199 -2315478 -1717388 -1454423 -1214504 -473864 490687 948749 693133
38768 693133 195554 -21148 149422 409434 348860 -96854 -391037 103455 1248171 2137100
38758 2137100 2189609 1818424 1684009 1703979 1313933 447033 -343106 -686060 -793899 -983644
38748 -983644 -1229456 -1329335 -1192262 -822407 -293533 130240 123634 -263873 -524097 -260604
38738 -260604 315731 677842 628270 390990 157142 -100985 -298024 -79499 730566 1712934
38728 1712934 2192051 1937333 1271587 551157 -107073 -550637 -476692 161272 935167 1418626
$$ packed form
38796d94449r78751j171977n5094J364172J820801J238686L62123l37598o72517
38787A075396l10616O94044J354892P87489m12321q85756n07548m69998j232554
38778I3028j690314r46913K28721N98090K62965K39919P40640R64551M58062k55616
38768F93133m97579k16702J70570K60012o0574m45714k94183M94492J144716Q88929
38758B137100N2509l71185j34415J9970l90046q66900p90139l42954j07839j89745
38748i83644k45812r9879J37073L69855N28874M23773o606l87507k60224K63493
38738b60604N76335L62111m9572k37280k33848k58127j97039K18525Q10065R82368
38728A712934M79117k54718o65746p20430o58230m43564P3945O37964P73895M83459
$$ plain form
38718 1418626 1650688 1851182 1956883 1846272 1799603 2194939 2792551 2858194 2112509 1140757
38708 1140757 713059 1011370 1607231 1875706 1374391 189726 -978546 -1407529 -1113231
38699 -1113231 -725326 -637172 -716928 -818226 -967169 -974664 -574423 -144156 -496803 -1581842
38689 -1581842 -2227987 -1769746 -1123938 -1408582 -2171856 -2085017 -999167 -107568 -112732 -375806
38679 -375806 -137578 365528 453832 26709 -419200 -431370 825 427444 274508 -473995
38669 -473995 -1034084 -745159 -87003 -88512 -783101 -1114581 -536779 204731 300213 81716
38659 81716 399275 1364284 2331751 2747189 2492489 1729280 866906 378266 236062 -150882
38649 -150882 -1079095 -2022001 -2356826 -2176733 -1906312 -1590350 -1190032 -1160051 -1931415 -3014629
$$ packed form
38718A418626K32062K00494J05701j10611m6669L95336N97612O5643p45685r71752
38708A140757m27698K98311N95861K68475n01315j184665j168272m28983K94298
38699a113231L87905Q8154p9756j01298j48943p495M00241M30267l52647j085039
38689a581842o46145M58241O45808k84644p63274Q6839J085850Q91599n164k63074
38679c75806K38228N03106Q8304m27123m45909j2170M32195M26619j52936p48503
38669d73995n60089K88925O58156j509o94589l31480N77802P41510R5482k18497
38659H1716L17559R65009R67467M15438k54700p63209q62374m88640j42204l86944
38649a50882r28213r42906l34825J80093K70421L15962M00318K9981p71364j083214
$$ plain form
38639 -3014629 -3389280 -2762707 -1814284 -1223420 -1061378 -1130698 -1286759 -1348558 -1220510 -1161634
38629 -1161634 -1456747 -1850445 -1872476 -1694724 -1964089 -2679945 -3000157 -2471384 -1762537 -1712323
38619 -1712323 -2196937 -2484035 -2304029 -1982692 -1740234 -1413149 -817380 8063 889481
38610 889481 1570719 1757685 1377010 738473 263114 158533 473762 1191550 2001758 2271138
38600 2271138 1657159 616899 -77434 -227663 -245709 -424406 -633436 -717814 -718735 -620559
38590 -620559 -326889 -19002 -92241 -530062 -775650 -528723 -275241 -609579 -1331432 -1727318
38580 -1727318 -1598731 -1462208 -1694747 -1970113 -1732190 -899952 94104 741000 787707 361000
38570 361000 -78871 -101299 224103 399304 168200 -130338 -97741 72481 -177707 -980065
$$ packed form
38639c014629l74651O26573R48423N90864J62042o9320j56061o1799J28048N8876
38629a161634k95113l93698k2031J77752k69365p15856l20212N28773P08847N0214
38619a712323m84614k87098J80006L21337K42458L27085N95769Q25443Q81418
38610H89481O81238J86966l80675o38537m75359j04581L15229P17788Q10208K69380
38600B271138o13979j040260o94333j50229j8046j78697k09030q4378r21R8176
38590f20559K93670L07887p3239m37821k45588K46927K53482l34338p21853l95886
38580a727318J28587J36523k32539k75366K37923Q32238R94056O46896M6707m26707
38570C61000m39871k2428L25402J75201k31104k98538L2597J70222k50188q02358
$$ plain form
38560 -980065 -1805479 -2045937 -1606896 -903855 -461355 -533461 -957922 -1348266 -1487340 -1443487
38550 -1443487 -1242063 -701562 118709 564773 -7671 -1290935 -2167247 -1910229 -873808
38541 -873808 97911 523761 413327 26376 -190459 194485 1091062 1830372 1916659 1584392
38531 1584392 1315564 1113409 668650 13605 -470929 -607809 -560748 -464773 -291880 -53048
38521 -53048 212707 623473 1291465 1992587 2327466 2209351 1891735 1550661 1185128 909029
38511 909029 938188 1202291 1304183 971036 286276 -565422 -1480484 -2298996 -2787667 -2873078
38501 -2873078 -2682042 -2323743 -1861731 -1466875 -1287194 -1174094 -862895 -405769 -77581
38492 -77581 74899 134375 -147001 -1054878 -2089360 -2204487 -1210026 -244217 -338449 -1085631
$$ packed form
38560i80065q25414k40458M39041P03041M42500p2106m24461l90344j39074M3853
38550a443487K01424N40501Q20271M46064n72444j283264q76312K57018J036421
38541h73808R71719M25850j10434l86951k16835L84944Q96577P39310Q6287l32267
38531A584392k68828k02155m44759o55045m84534j36880M7061R5975J72893K38832
38521e3048K65755M10766O67992P01122L34879j18115l17616l41074l65533k76099
38511I09029K9159K64103J01892l33147o84760q51698r15062q18512m88671q5411
38501b873078J91036L58299M62012L94856J79681J13100L11199M57126L28188
38492g7581J52480N9476k81376r07877j034482j15127R94461R65809r4232p47182
$$ plain form
38482 -1085631 -1370093 -974932 -693021 -1024654 -1507164 -1412298 -589955 504352 1285597
38473 1285597 1472484 1271961 1128189 1159600 1015367 453512 -247274 -745875 -1153251 -1643739
38463 -1643739 -1870624 -1358281 -304208 599444 1034142 1157562 960152 248418 -671758
38454 -671758 -1031280 -579137 31063 91997 -401607 -1057488 -1622673 -1930607 -1793219 -1284765
38444 -1284765 -748460 -249675 544517 1644874 2392525 2267969 1646427 1266102 1258072 1181080
38434 1181080 753794 80631 -611050 -987239 -607027 553801 1741565 2119793 1715447
38425 1715447 1183269 800017 309031 -319592 -681272 -596425 -355646 -134853 251710 782519
38415 782519 978111 568055 -35587 -293025 -197875 -39222 135664 406614 602795 486623
$$ packed form
38482a085631k84462L95161K81911l31633m82510R4866Q22343J094307P81245
38473A285597J86887k00523j43772L1411j44233n61855p00786m98601m07376m90488
38463a643739k26885N12343J054073R03652M34698J23420j97410p11734r20176
38454f71758l59522M52143O10200O0934m93604o55881n65185l07934J37388N08454
38444a284765N36305M98785P94192J100357P47651j24556o21542l80325q030p6992
38434A181080m27286o73163o91681l76189L80212J160828J187764L78228m04346
38425A715447n32178l83252m90986o28623l61680Q4847K40779K20793L86563N30809
38415G82519J95592m10056o03642k57438R5150J58653J74886K70950J96181j16172
$$ plain form
38405 486623 182283 62213 286460 695270 1010631 925090 219924 -909466 -1851979 -2206085
38395 -2206085 -2189401 -2129514 -1881709 -1230078 -570216 -537705 -1081896 -1593551 -1916329 -2449989
38385 -2449989 -3110249 -3037283 -1784559 -116900 954738 1401669 1786705 2089165 1759775
38376 1759775 802968 -15512 -165795 61160 132480 -91258 -491410 -961024 -1264622 -1057719
38366 -1057719 -391935 119675 1737 -449638 -575735 -216918 184711 224321 -74665 -461124
38356 -461124 -719970 -710572 -411675 -3142 262461 295402 150360 -160597 -616854 -975279
38346 -975279 -875162 -247621 544868 1032219 966195 367770 -472768 -968918 -538097 782972
38336 782972 2136580 2511389 1639643 151114 -1081483 -1618453 -1562878 -1221786 -759941
$$ packed form
38405D86623l04340j20070K24247M08810L15361q5541p05166j129390r42513l54106
38395b206085J6684N9887K47805O51631O59862L2511n44191n11655l22778n33660
38385b449989o60260P2966J252724J667659J071638M46931L85036L02460l29390
38376A759775r56807q18480j50283K26955P1320k23738m00152m69614l03598K06903
38366a057719O65784N11610j17938m51375j26097L58817M01629L9610k98986l86459
38356d61124k58846R398K98897M08533K65603L2941j45042l10957m56257l58425
38346i75279J00117O27541P92489M87351o6024n98425q40538m96150M30821J321069
38336G82972J353608L74809q71746j488529j232597n36970N5575L41092M61845
$$ plain form
38327 -759941 -152433 569151 1114639 1140248 691038 232602 81587 -16532 -474952 -1138964
38317 -1138964 -1353839 -855130 -252719 -354319 -1169809 -1882394 -1772966 -905170 135243
38308 135243 869632 1089964 653099 -429207 -1615142 -1979324 -1141734 83860 415726
38299 415726 -436161 -1415723 -1412829 -529221 299136 607961 738874 965339 993140 579851
38289 579851 70376 -138576 -269331 -751472 -1383164 -1532044 -1135910 -877514 -1191122 -1616917
38279 -1616917 -1454612 -699363 3548 87832 -541273 -1596287 -2535558 -2770521 -2133055
38270 -2133055 -1098893 -257920 367414 1168000 2189946 2934004 2982609 2485589 1893700
38261 1893700 1490915 1328996 1348284 1356767 1099844 590194 249926 512617 1331691 2214723
$$ packed form
38327g59941O07508P21584N45488K5609m49210m58436j51015r8119m58420o64012
38317a138964k14875M98709O02411j01600q15490p12585J09428Q67796J040413
38308A35243P34389K20332m36865j082306j185935l64182Q37590J225594L31866
38299D15726q51887r79562K894Q83608Q28357L08825J30913K26465K7801m13289
38289E79851n09475k08952j30755m82141o31692j48880L96134K58396l13608m25795
38279a616917J62305P55249P02911Q4284o29105j055014r39271k34963O37466
38270b133055J034162Q40973O25334Q00586J021946P44058M8605m97020n91889
38261A893700m02785j61919J9288Q483k56923n09650l40268K62691Q19074Q83032
$$ plain form
38251 2214723 2680683 2588213 2126435 1632359 1359551 1299478 1243452 1051318 769698 459722
38241 459722 74284 -389723 -753690 -787876 -377956 494398 1757415 3130364 4184979
38232 4184979 4658846 4552797 3878063 2642835 1250433 470355 604242 990387 812700
38223 812700 153717 -301349 -386274 -561572 -934860 -964758 -371363 343407 660930 785409
38213 785409 1191536 1875422 2504716 2945328 3169932 2948100 2124160 1008300 81625
38204 81625 -470905 -572235 26354 1257104 2265577 2185588 1325912 859849 1259911 1736693
38194 1736693 1427784 491780 -312846 -607695 -549986 -392200 -290381 -326563 -439927 -513424
38184 -513424 -640152 -978896 -1245712 -849023 203932 1052822 1042594 570512 390227 528115
$$ packed form
38251B214723M65960r2470m61778m94076k72808o0073n6026j92134k81620l09976
38241D59722l85438m64007l63967l4186M09920Q72354J263017J372949J054615
38232D184979M73867j06049o74734j235228j392402p80078J33887L86145j77687
38223H12700o58983m55066q4925j75298l73288k9898N93395P14770L17523J24479
38213G85409M06127O83886O29294M40612K24604k21832q23940j115860r26675
38204H1625n52530j01330N98589J230750J008473p9989q59676m66063M00062M76782
38194A736693l08909r36004q04626k94849N7709J57786J01819l6182j13364p3497
38184e13424j26728l38744k66816L96689J052955Q48890j0228m72082j80285J37888
$$ plain form
38174 528115 525658 379820 445754 589617 289609 -401002 -802362 -670832 -542128 -745980
38164 -745980 -837090 -451591 -56349 -227999 -689157 -774998 -528210 -544054 -851290 -775208
38154 -775208 -75189 502736 211572 -649338 -1173990 -1053105 -774890 -680820 -414980 417006
38144 417006 1460167 1970474 1826240 1641210 1765280 1709422 925856 -269432 -1119589
38135 -1119589 -1520606 -1995035 -2619344 -2767384 -2156676 -1411991 -1135418 -1048575 -672490 -318421
38125 -318421 -566862 -1066770 -830038 224508 909645 274686 -1194350 -2291278 -2504732
38116 -2504732 -2259878 -2110694 -2200251 -2374791 -2415226 -2173889 -1742094 -1443016 -1454418 -1501306
38106 -1501306 -1143265 -368762 274785 225813 -456391 -1059191 -892074 -14685 835480 1102743
$$ packed form
38174E28115k457j45838O5934J43863l00008o90611m01360J31530J28704k03852
38164g45980r1110L85499L95242j71650m61158q5841K46788j5844l07236P6082
38154g75208P00019N77925k91164q60910n24652J20885K78215R4070K65840Q31986
38144D17006J043161N10307j44234j85030J24070n5858p83566j195288q50157
38135a119589m01017m74429o24309j48040O10708P44685K76573Q6843L76085L54069
38125c18421k48441m99908K36732J054546O85137o34959j469036j096928k13454
38116b504732K44854J49184q9557j74540m0435K41337M31795K99078j1402m6888
38106a501306L58041P74503O43547m8972o82204o02800J67117Q77389Q50165K67263
$$ plain form
38096 1102743 958245 791837 511675 -144567 -811614 -741649 44905 547248 48517 -951606
38086 -951606 -1445298 -1095200 -320225 334254 452535 -192626 -1276557 -1928603 -1643642
38077 -1643642 -918793 -470547 -163238 624547 1838722 2720187 2819327 2314708 1425674
38068 1425674 324586 -367675 82339 1432215 2491118 2574462 2256223 2321547 2648132
38059 2648132 2605415 2004364 1128334 255350 -361791 -422837 25850 417427 281972 -250612
38049 -250612 -851357 -1443651 -1867400 -1615757 -494791 831192 1546843 1631353 1558838 1453136
38039 1453136 1221823 1162548 1576850 1970473 1562452 608239 327272 1302277 2685107
38030 2685107 3262613 2705903 1523366 362973 -349671 -587946 -826736 -1551229 -2494870
$$ packed form
38096A102743j44498j66408k80162o56242o67047O9965P86554N02343m98731j000123
38086i51606m93692L50098P74975O54479J18281o45161j083931o52046K84961
38077a643642P24849M48246L07309P87785J214175Q81465R9140n04619q89034
38068A425674j101088o92261M50014J349876J058903Q3344l18239O5324L26585
38059B648132m2717o01051q76030q72984o17141o1046M48687L91577j35455n32584
38049b50612o00745n92294m23749K51643J120966J325983P15651Q4510p2515j05702
38039A453136k31313n9275M14302L93623m08021r54213k80967R75005J382830
38030B685107N77506n56710j182537j160393p12644k38275k38790p24493r43641
$$ plain form
38021 -2494870 -2868661 -2513830 -2202279 -2479186 -2826380 -2437062 -1316993 -111629 744662
38012 744662 1194728 1242199 1011080 846076 856825 629415 -118626 -897274 -1034057 -648404
38002 -648404 -383971 -354792 -109992 385417 543802 133714 -236421 23990 680989 1135114
37992 1135114 1258528 1300195 1252174 852842 155408 -368215 -392914 -115906 67490 69876
37982 69876 120932 349683 544723 406130 -47857 -440709 -396130 160430 1041505 1977552
37972 1977552 2711474 3088882 3160556 3061719 2726291 1934150 752736 -342432 -981310
37963 -981310 -1229152 -1136707 -365517 1202638 2760913 3217810 2550406 1831223 1777011 1980396
37953 1980396 1884327 1795199 2316714 3237401 3678669 3160577 1937090 409466 -1179642
$$ packed form
38021b494870l73791L54831L11551k76907l47194L89318J120069J205364Q56291
38012G44662M50066M7471k31119j65004J0749k27410p48041p78648j36783L85653
38002f48404K64433K9179K44800M95409J58385m10088l70135K60411O56999M54125
37992A135114J23414M1667m8021l99332o97434n23623k4699K77008J83396K386
37982F9876N1056K28751J95040j38593m53987l92852M4579N56560Q81075R36047
37972A977552P33922L77408P1674r8837l35428p92141j181414j095168o38878
37963i81310k47842R2445P71190J568155J558275M56897o67404p19183n4212K03385
37953A980396r6069q9128N21515R20687M41268n18092j223487j527624j589108
$$ plain form
37944 -1179642 -2469629 -3016106 -2825271 -2452754 -2336968 -2304875 -1930599 -1163610 -408986
37935 -408986 -112122 -372905 -849413 -993110 -535881 220247 767991 1024204 1302152 1635343
37925 1635343 1573078 897222 135261 -82195 90360 16473 -349172 -352924 255739 781110
37915 781110 584480 137159 403262 1378888 2000487 1620931 890526 796498 1350565 1774130
37905 1774130 1653434 1260152 855330 399387 83072 442081 1521241 2432264 2321856
37896 2321856 1509864 1063661 1349683 1644843 1281295 560170 187120 249441 256725 9790
37886 9790 -84368 357117 1082433 1407713 926069 -59043 -763320 -619548 157848 762070
37876 762070 666245 199973 44958 280690 334495 -71555 -419258 -162651 385941 453677
$$ packed form
37944a179642j289987n46477J90835L72517J15786L2093L74276P66989P54624
37935d08986K96864k60783m76508j43697M57229P56128N47744K56213K77948L33191
37925A635343o2265o75856p61961k17456J72555p3887l65645l752O08663N25371
37915G81110j96630m47321K66103R75626O21599l79556p30405r4028N54067M23565
37905A774130j20696l93282m04822m55943l16315L59009J079160R11023j10408
37896B321856q11992m46203K86022K95160l63548p21125l73050O2321P284k46935
37886I790r4158M41485P25316L25280m81644r85112p04277J43772P77396O04222
37876G62070r5825m66272j55015K35732N3805m06050l47703K56607N48592O7736
$$ plain form
37866 453677 -89897 -613561 -707057 -648285 -664954 -348675 679250 1911927 2403194 1926118
37856 1926118 1095794 391758 -282952 -940630 -1108621 -544059 107395 -65726 -1140838
37847 -1140838 -2344338 -3013998 -3134081 -2984305 -2762374 -2649592 -2795114 -2994429 -2708330
37838 -2708330 -1706901 -515127 75384 -133899 -617817 -821785 -735251 -707405 -911075
37829 -911075 -1183176 -1309305 -1223601 -874930 -159279 761852 1239679 670905 -639840 -1536260
37819 -1536260 -1201318 -16918 1075703 1783775 2537566 3506732 4170492 4011225 3137095
37810 3137095 1974913 752257 -421697 -1305072 -1712751 -1740011 -1508465 -938017 -104550
37801 -104550 446034 228840 -441428 -728453 -301406 352382 690780 721467 662721 451996
$$ packed form
37866D53677n43574n23664r3496N8772j6669L16279J027925J232677M91267m77076
37856A926118q30324p04036o74710o57678j67991N64562O51454j73121j075112
37847a140838j203500o69660j20083J49776K21931J12782j45522j99315K86099
37838b708330J001429J191774N90511k09283m83918k03968Q6534K7846k03670
37829i11075k72101j26129Q5704L48671P15651R21131M77827n68774j310745q96420
37819a536260L34942J184400J092621P08072P53791R69166O63760j59267q74130
37810C137095j162182j222656j173954q83375m07679k7260K31546N70448Q33467
37801a04550N50584k17194o70268k87025M27047O53788L38398L0687n8746k10725
$$ plain form
37791 451996 -23455 -456082 -331251 377951 1053337 1104787 633815 271705 425570 863226
37781 863226 1093583 978580 762148 580612 283843 -143089 -310363 127168 939850 1566498
37771 1566498 1763595 1665150 1300503 517306 -549867 -1372327 -1581153 -1301460 -762779
37762 -762779 46954 1037948 1667315 1427746 632873 294936 1083208 2602975 3795057
37753 3795057 3910744 3026557 1741753 555201 -397174 -1106620 -1451329 -1359800 -1068437
37744 -1068437 -938817 -1025292 -1066722 -901067 -600066 -179426 448522 1120036 1424366 1287377
37734 1287377 1161943 1323575 1353742 765378 -154217 -672844 -639697 -622068 -1029952 -1627916
37724 -1627916 -2003044 -2047650 -1820368 -1343191 -770943 -456106 -593987 -990130 -1358605 -1687432
$$ packed form
37791D51996m75451m32627J24831P09202O75386N1450m70972l62110J53865M37656
37781H63226K30357j15003k16432j81536k96769m26932j67274M37531Q12682O26648
37771A566498J97097r8445l64647p83197j067173q22460k08826K79693N38681
37762g62779Q09733R90994O29367k39569p94873l37937P88272J519767J192082
37753C795057J15687q84187j284804j186552r52375p09446l44709R1529K91363
37744a068437J29620q6475m1430J65655L01001M20640O27948O71514L04330j36989
37734A287377j25434J61632L0167n88364r19595n18627L3147J7629m07884n97964
37724a627916l75128m4606K27282M77177N72248L14837j37881l96143l68475l28827
$$ plain form
37714 -1687432 -2155957 -2820199 -3496867 -3863656 -3634819 -2773916 -1571285 -402877 546519
37705 546519 1178618 1255142 624223 -347856 -949522 -824907 -222609 477329 1123386 1620225
37695 1620225 1828663 1821493 1866928 1959818 1748428 1164258 720701 845437 1267875 1477894
37685 1477894 1503409 1752465 2256696 2576189 2441921 2084738 1868634 1891123 2005743 2033121
37675 2033121 1917299 1804417 1925372 2283905 2556866 2424702 1875845 1096254 289231
37666 289231 -250127 -194199 400174 986716 1149970 1095828 1212613 1435232 1466501 1366035
37656 1366035 1389828 1404109 1023646 288015 -322723 -554318 -588673 -580081 -439144 -103984
37646 -103984 384347 1044003 1766726 2099843 1777122 1343253 1521251 1981882 1618517 223067
$$ packed form
37714a687432m68525o64242o76668l66789K28837Q60903J202631J168408R49396
37705E46519O32099P6524o30919r72079o01666J24615O02298O99938O46057M96839
37695A620225K08438p170M5435R2890k11390n84170m43557J24736M22438K10019
37685A477894K5515K49056N04231L19493j34268l57183k16104K2489J14620K7378
37675B033121j15822j12882J20955L58533K72961j32164n48857p79591q07023
37666B89231n39358N5928N94373N86542J63254n4142J16785K22619L1269j00466
37656A366035K3793J4281l80463p35631o10738k31595l4355Q592J40937L35160
37646a03984M88331O59656P22723L33117l22721m33869J77998M60631l63365j395450
$$ plain form
37636 223067 -1044612 -1270733 -990472 -1174704 -1804291 -2246014 -2413137 -2600309 -2572345 -1848070
37626 -1848070 -747017 -163030 -232654 -134105 579932 1302235 1418815 1295915 1613890 2218879
37616 2218879 2363262 1884019 1421849 1385075 1306856 577149 -556804 -1193858 -897960 -189376
37606 -189376 169423 20418 -252717 -315511 -84832 443014 1163509 1750043 1949299 1953552
37596 1953552 2122807 2391840 2358028 1915059 1336876 751008 62021 -571064 -782396 -628105
37586 -628105 -539145 -519144 -118701 584257 839550 453723 260347 768453 1234179 880142
37576 880142 215249 153869 531712 620337 502097 655662 677060 -111000 -1066021 -861313
37566 -861313 305546 818082 188756 -241711 289140 627688 -200430 -1097058 -519110
$$ packed form
37636B23067j267679k26121K80261j84232o29587m41723j67123j87172K7964P24275
37626a848070J101053N83987o9624R8549P14037P22303J16580j22900L17975O04989
37616B218879J44383m79243m62170l6774p8219p29707j133953o37054K95898P08584
37606a89376L58799j49005k73135o2794K30679N27846P20495N86534J99256M253
37596A953552J69255K69033l3812m42969n78183n85868o88987o33085k11332J54291
37586f28105Q8960K0001M00443P02958K55293l85827j93376N08106M65726l54037
37576H80142o64893o1380L77843Q8625j18240J53565K1398p88060r55021K04708
37566h61313J166859N12536o29326m30467N30851L38548q28118q96628N77948
$$ plain form
37557 -519110 1079590 1968746 1637705 1093148 1034208 1122304 965085 613210 34677 -871806
37547 -871806 -1653248 -1613319 -864487 -252486 -140951 -84776 175137 261720 -20432 -201618
37537 -201618 117828 660560 1000420 1187007 1437917 1624883 1482724 1053228 594323 272535
37527 272535 185895 441202 954278 1367943 1378008 986604 329521 -487356 -1217975 -1426594
37517 -1426594 -897147 17516 662200 670174 242599 -52991 246471 1054223 1732154 1721678
37507 1721678 1181537 771421 828773 1107267 1377380 1823028 2569153 3192876 3143111 2489201
37497 2489201 1843041 1577181 1504962 1401704 1460962 1954716 2623579 2756350 1946415 560275
37487 560275 -649292 -1206719 -1032915 -149135 1316458 2831308 3632957 3458731 2831366
$$ packed form
37557e19110J598700Q89156l31041n44557n8940Q8096j57219l51875n78533r06483
37547h71806p81442L9929P48832O12001J11535N6175K59913Q6583k82152j81186
37537b01618L19446N42732L39860J86587K50910J86966j42159m29496m58905l21788
37527B72535q6640K55307N13076M13665J0065l91404o57083q16877p30619k08619
37517a426594N29447R14663O44684P974m27575k95590K99462Q07752O77931j0476
37507A721678n40141m10116N7352K78494K70113M45648P46125O23723m9765o53910
37497B489201o46160k65860p2219j03258N9258M93754O68863J32771q09935j386140
37487E60275j209567n57427J73804Q83780J465593J514850Q01649j74226o27365
$$ plain form
37478 2831366 2371304 2061678 1477277 531299 -368014 -824845 -816638 -582134 -378994 -304076
37468 -304076 -176164 299867 1087952 1722282 1875047 1811356 1990611 2411611 2677737 2538572
37458 2538572 2047239 1377667 817047 689399 898749 837268 205019 -419408 -401420 -64773
37448 -64773 -117448 -393387 -146600 571524 972912 1021324 1609677 2900796 3732224 3340776
37438 3340776 2592750 2608508 3049027 2822162 1863446 1096338 969394 1073976 1051233 951417
37428 951417 758965 391624 155594 435818 909569 784540 -110975 -1115320 -1649550
37419 -1649550 -1699414 -1352725 -612925 119419 107088 -774779 -1671590 -1749616 -1161879 -595852
37409 -595852 -201003 484062 1610791 2524212 2407256 1243866 -73370 -609134 -218959
$$ packed form
37478B831366m60062l09626n84401r45978q99313m56831Q207K34504K03140P4918
37468c04076J27912M76031P88085O34330J52765o3691J79255M21000K66126j39165
37458B538572m91333o69572n60620j27648K09350o1481o32249o24427J7988L36647
37448f4773n2675k75939K46787P18124M01388M8412N88353J291119Q31428l91448
37438C340776p48026J5758M40519k26865r58716p67108j26944J04582k2743r9816
37428I51417j92452l67341k36030K80224M73751j25029q95515j004345n34230
37419a649550m9864L46689P39800P32344j2331q81867q96811p8026N87737N66027
37409e95852L94849O85065J126729R13421j16956j163390j317236n35764L90175
$$ plain form
37400 -218959 546345 1159740 1466960 1463234 1207307 1032590 1328943 1889981 1988930 1432181
37390 1432181 1004768 1401484 2226967 2648864 2556124 2329835 1903417 993916 14648 -296935
37380 -296935 -139663 -482193 -1465279 -1989541 -1267176 118579 1197736 1876569 2627969
37371 2627969 3542350 4310611 4709704 4583503 3765318 2516242 1612717 1468445 1559664
37362 1559664 1262362 862023 1093472 1984457 2844855 3213118 3132336 2625807 1667325 726279
37352 726279 597620 1421057 2432711 2989276 3315332 3806919 4047754 3217844 1427617
37343 1427617 -14115 26383 1235582 2335229 2613045 2472519 2480048 2478337 2009344 1217721
37333 1217721 802196 1174820 2078124 2965402 3384192 3077567 2171313 1282908 1016302
$$ packed form
37400b18959P65304O13395L07220l726k55927j74717K96353N61038R8949n56749
37390A432181m27413L96716Q25483M21897r2740k26289m26418r09501r79268l11583
37380b96935J57272l42530r83086n24262P22365J385755J079157O78833P51400
37371B627969R14381P68261L99093j26201q18185j249076r03525j44272R1219
37362A559664k97302m00339K31449Q90985Q60398L68263q0782n06529r58482r41046
37352G26279j28659Q23437J011654N56565L26056M91587K40835q29910j790227
37343A427617j441732M0498J209199J099647K77816j40526P529j711m68993p91623
37333A217721m15525L72624R03304Q87278M18790l06625r06254q88405k66606
$$ plain form
37324 1016302 1271085 1401866 1075034 575484 262704 185034 292128 554315 769623 718945
37314 718945 620664 948819 1682373 2240014 2282140 2035589 1714881 1281280 965713 1268091
37304 1268091 2069056 2480329 2068340 1533246 1589170 1841711 1515973 752119 334138 481145
37294 481145 730423 823701 959592 1236466 1443968 1376698 961202 254232 -342270 -212732
37284 -212732 704394 1680532 2167804 2490048 3033168 3387819 3065306 2479783 2298254 2309097
37274 2309097 1938510 1444388 1486008 1879124 1981621 2002013 2578803 3255557 2877555 1544317
37264 1544317 639884 699869 792082 409024 377326 1198318 1971469 1890243 1544339 1756619
37254 1756619 2266219 2578020 3011429 3770370 4005243 3086713 1931443 1689261 1871328
$$ packed form
37324A016302K54783J30781l26832m99550l12780p7670J07094K62187K15308n0678
37314G18945r8281L28155P33554N57641M2126k46551l20708m33601l15567L02378
37304A268091Q00965M11273m11989n35094N5924K52541l25738p63854m17981J47007
37294D81145K49278R3278J35891K76874K07502o7270m15496p06970n96502J29538
37284b12732R17126R76138M87272L22244N43120L54651l22513n85523j81529J0843
37274B309097l70587m94122M1620L93116J02497K0392N76790O76754l78002j333238
37264A544317r04433N9985R2213l83058l1698Q20992P73151q1226l45904K12280
37254A756619N09600L11801M33409P58941K34873r18530j155270k42182J82067
$$ plain form
37245 1871328 1270108 135557 -193352 506180 1143597 1227202 1361246 1705576 1536677
37236 1536677 796821 668942 1892335 3568410 4372798 4140215 3603803 3297563 3372210
37227 3372210 3864765 4459523 4447208 3555729 2478703 2052818 2238247 2409090 2330504 2293039
37217 2293039 2470429 2669118 2677910 2509195 2318618 2298317 2533286 2783407 2601779 1884726
37207 1884726 1093897 695702 614485 532160 484484 747683 1271678 1699375 1965501 2412358
37197 2412358 3124991 3536000 3054770 1920141 1032652 924162 1255244 1473152 1591985
37188 1591985 1959357 2508886 2793300 2735397 2759016 2996537 2927955 2162563 1112139 438485
37178 438485 227996 233141 562189 1449927 2551392 3199447 3339537 3539051 4027786 4379544
$$ packed form
37245A871328o01220j134551l28909O99532O37417Q3605J34044L44330j68899
37236A536677p39856j27879J223393J676075Q04388k32583n36412l06240P4647
37227C372210M92555N94758j2315q91479j077026m25885J85429J70843p8586l7465
37217B293039J77390J98689Q792j68715j90577k0301K34969K50121j81628p17053
37207A884726p90829l98195q1217q2325m7676K63199N23995M27697K66126M46857
37197B412358P12633M11009m81230j134629q87489j08490L31082K17908J18833
37188A591985L67372N49529K84414n7903K3619K37521o8582p65392j050424o73654
37178D38485k10489N145L29048Q87738J101465O48055J40090J99514M88735L51758
$$ plain form
37168 4379544 4252485 3817345 3296953 2702742 2226866 2245934 2632844 2696075 2208926 1908094
37158 1908094 2443874 3334213 3594260 3062946 2445854 2248181 2339965 2532825 2927491 3510326
37148 3510326 3889826 3738881 3273368 3041537 3296730 3724485 3818008 3455797 2987281 2708067
37138 2708067 2477880 2116586 1958917 2492651 3458728 3946237 3614850 3217377 3492112
37129 3492112 4073596 4093933 3483845 2990681 3087324 3518035 3865272 3959077 3707043 3090464
37119 3090464 2435481 2206994 2414576 2636244 2696662 2855424 3216242 3462510 3410516 3366609
37109 3366609 3606498 3838282 3532337 2582676 1393898 517629 395479 1168386 2429247
37100 2429247 3370046 3502487 3133496 2914420 3105720 3546835 4119782 4820677 5451922
$$ packed form
37168D379544j27059m35140n20392n94211m75876J9068L86910O3231m87149l00832
37158A908094N35780Q90339K60047n31314o17092j97673R1784J92860L94666N82835
37148C510326L79500j50945m65513k31831K55193M27755R3523l62211m68516k79214
37138B708067k30187l61294j57669N33734R66077M87509l31387l97473K74735
37129C492112N81484K0337o10088m93164R6643M30711L47237R3805k52034o16579
37119C090464o54983k28487K07582K21668O0418J58762L60818K46268n1994m3907
37109C366609K39889K31784l05945r49661j188778q76269j22150P72907J260861
37100B429247R40799J32441l68991k19076J91300M41115N72947P00895O31245
$$ plain form
37091 5451922 5683988 5514305 5355800 5555835 6044771 6527226 6786986 6711827 6270678 5670405
37081 5670405 5395579 5855260 6949742 8071562 8593893 8419416 8103559 8369885 9377005
37072 9377005 10494152 10940019 10610361 10101846 9960159 10162541 10367595 10367153 10156315 9829441
37062 9829441 9583465 9569797 9557307 9053630 8041288 7255214 7298365 7774546 7894933 7780255
37052 7780255 8408974 10159523 12109266 13102119 12968339 12343461 11807086 11652451 12037408
37043 12037408 12768536 13215537 13009213 12642207 12855101 13596218 14148120 14181519 14104369 14369787
37033 14369787 14969314 15659126 16222216 16476894 16480704 16737368 17726681 19221616 20565230
37024 20565230 21589972 22661264 23828059 24708821 25398322 26681382 28968448 31710198
$$ packed form
37091E451922K32066j69683j58505K00035M88936M82455K59760p5159m41149o00273
37081E670405k74826M59681J094482J121820N22331j74477l15857K66326J007120
37072I377005J117147M45867l29658n08515j41687K02382K05054m42k10838l26874
37062I829441k45976j3668j2490n03677j012342p86074M3151M76181J20387j14678
37052G780255O28719J750549J949743R92853j33780o24878n36375j54635L84957
37043A2037408P31128M47001k06324l67006K12894P41117N51902L3399p7150K65418
37033A4369787N99527O89812N63090K54678L810K56664R89313J494935J343614
37024B0565230J024742J071292J166795Q80762O89501J283060K287066K741750
$$ plain form
37016 31710198 34265877 36632019 38828794 40388704 41254813 42527640 45291598 49030892
37008 49030892 52230037 54455999 56913701 60866572 66323880 72464758 78664770 84874455
37000 84874455 91549826 99425887 108893855 119464184 130298315 141333040 153351711
36993 153351711 166900550 181800564 197877462 215373200 234179756 253297523 271617605
36986 271617605 288762764 304551124 317995706 327501142 331882478 330655942 323584477
36979 323584477 310737410 293138351 272739455 251400132 230103765 209233883 189206392
36972 189206392 170554197 153623284 138473291 125014312 113092032 102528226 93227205
36965 93227205 85177209 78202546 71774084 65288716 58652396 52486330 47587643 44125771
$$ packed form
37016C1710198K555679K366142K196775J559910Q66109J272827K763958L739294
37008D9030892L199145K225962K457702L952871N457308O140878O200012O209685
37000H4874455O675371P876061R467968J0570329J0834131J1034725J2018671
36993A53351711J3548839J4900014J6076898J7495738J8806556J9117767J8320082
36986B71617605J7145159J5788360J3444582R505436M381336j226536p071465
36979C23584477j2847067j7599059k0398896k1339323k1296367k0869882k0027491
36972A89206392j8652195j6930913j5149993j3458979j1922280j0563806r301021
36965I3227205q049996o974663o428462o485368o636320o166066m898687l461872
$$ plain form
36957 44125771 41435184 38668661 35632397 32904569 31111353 30145049 29170103 27426041
36949 27426041 24979788 22609214 20954852 19940702 19127608 18419483 18070355 18028481 17739322
36940 17739322 16851333 15784379 15226023 15253648 15352799 15202743 15003758 14997877 15092359 15134091
36930 15134091 15245076 15638670 16256654 16796531 17065305 17213551 17618781 18499742 19589998
36921 19589998 20319298 20501100 20734221 21839538 23892437 26057576 27406658 27683448 27266446
36912 27266446 26648825 26035293 25266854 24094344 22621337 21334079 20463192 19527705 17932601
36903 17932601 15874647 14113985 12902926 11789898 10556024 9596978 9083046 8463976
36895 8463976 7307930 6055826 5379819 5285554 5446324 5913530 6705668 7091395 6289035
$$ packed form
36957D4125771k690587k766523l036264k727828j793216r66304r74946j744062
36949B7426041k446253k370574j654362j014150q13094p08125l49128m1874k89159
36940A7739322q87989j066954n58356K7625R9151j50056j98985n881R4482M1732
36930A5134091J10985L93594O17984N39877K68774J48246M05230Q80961J090256
36921A9589998P29300J81802K33121J105317K052899K165139J349082K76790m17002
36912B7266446o17621o13532p68439j172510j473007j287258q70887r35487j595104
36903A7932601k057954j760662j211059j113028j233874r59046n13932o19070
36895H463976j156046j252104o76007r4265J60770M67206P92138L85727q02360
$$ plain form
36886 6289035 4807668 4095232 4640529 5292088 4861640 3670631 2909441 2958205 3067174
36877 3067174 2564043 1741492 1374797 1706377 2171028 2079600 1419094 855854 935850 1448329
36867 1448329 1750768 1604498 1404507 1577557 2050268 2442785 2576920 2607311 2729348 2893467
36857 2893467 2833209 2382709 1750965 1343085 1235825 1054008 578167 215218 453151 1005639
36847 1005639 1060644 425233 -152225 -18792 547502 882026 854816 776897 735982 607691
36837 607691 551705 874271 1380582 1440033 873742 313238 411089 1044208 1597943 1761102
36827 1761102 1689189 1574722 1473498 1519054 1908695 2557443 3044481 3063324 2746422 2424348
36817 2424348 2257464 2254476 2431932 2688848 2676821 2150072 1423757 1123037 1387630 1662657
$$ packed form
36886F289035j481367p12436N45297O51559m30448j191009p61190M8764J08969
36877C067174n03131q22551l66695L31580M64651r1428o60506n63240P9996N12479
36867A448329L02439j46270j99991J73050M72711L92517J34135L0391J22037J64119
36857B893467o0258m50500o31744m07880j07260j81817m75841l62949K37933N52488
36847A005639N5005o35411n77458J33433N66294L34524k7210p7919m0915j28291
36837F07691n5986L22566N06311N9451n66291n60504R7851O33119N53735J63159
36827A761102p1913j14467j01224M5556L89641O48748M87038J8843l16902l22074
36817B424348j66884k988J77456K56916j2027n26749p26315l00720K64593K75027
$$ plain form
36807 1662657 1456016 992342 836751 1117559 1497038 1775200 2082782 2456265 2651638
36798 2651638 2557956 2458247 2602032 2736993 2398270 1586304 829731 517933 440579 150562
36788 150562 -399238 -826045 -869575 -693965 -528535 -249290 398706 1243829 1710003 1529445
36778 1529445 1162641 1257227 1838888 2331138 2331964 2058031 1928927 1968010 1822269 1261785
36768 1261785 436961 -384183 -1167985 -2061671 -3004804 -3546369 -3195452 -1949574 -367580
36759 -367580 882940 1438813 1265366 573779 -147238 -316360 196242 841964 1033092
36750 1033092 923472 1182591 2008067 2796992 2931518 2483282 1894823 1354447 911437
36741 911437 944439 1900088 3478917 4578487 4361838 3158978 2048986 1709310 1950147
$$ packed form
36807A662657k06641m63674j55591K80808L79479K78162L07582L73483J95373
36798B651638r3682r9709J43785J34961l38723q11966p56573l11798p7354k90017
36788A50562n49800m26807m3530J75610J65430K79245O47996Q45123M66174j80558
36778A529445l66804R4586N81661M92250Q26k73933j29104L9083j45741n60484
36768A261785q24824q21144p83802q93686r43133n41565L50917J245878J581994
36759c67580J250520N55873j73447o91587p21017j69122N12602O45722J91128
36750A033092j09620K59119Q25476P88925J34526m48236n88459n40376m43010
36741I11437L3002R55649J578829J099570k16649j202860j109992l39676K40837
$$ plain form
36732 1950147 2254821 2381034 2345333 2171584 1930204 1853953 2122520 2576566 2882083 2957469
36722 2957469 2999326 3079832 2991008 2578639 1997970 1515017 1245518 1191877 1315451 1445114
36712 1445114 1369876 1205369 1393511 2072317 2703566 2672219 2040466 1299911 574771 -370470
36702 -370470 -1371921 -1751219 -1187646 -242222 278856 155141 -284041 -643828 -566778 300057
36692 300057 1909505 3476322 4015343 3306416 2021038 858197 -90134 -987299 -1656240
36683 -1656240 -1721229 -1229675 -752449 -763234 -1149336 -1466445 -1475779 -1218831 -705515 151272
36673 151272 1247761 2170039 2461003 1906073 633167 -800815 -1500178 -917850 353043
36664 353043 962809 353902 -482675 -275863 881607 1814783 1935499 1790480 1922684
$$ packed form
36732A950147L04674J26213l5701j73749k41380p6251K68567M54046L05517P5386
36722B957469M1857Q0506q8824m12369n80669m82953k69499n3641J23574J29663
36712A445114p5238j64507J88142O78806O31249l1347o31753p40555p25140r45241
36702c70470j001451l79298N63573R45424N21078j23715m39182l59787P7050Q66835
36692C00057J609448J566817N39021p08927j285378j162841r48331q97165o68941
36683a656240o4989M91554M77226j0785l86102l17109r334K56948N13316Q56787
36673A51272J096489R22278K90964n54930j272906j433982o99363N82328J270893
36664C53043O09766o08907q36577K06812J157470R33176J20716j45019J32204
$$ plain form
36655 1922684 2059396 1779361 1299422 1085930 1127314 1089673 894774 697755 523031 337820
36645 337820 299510 525400 756480 641431 260469 -5630 -59708 -154107 -376670 -467692
36635 -467692 -272682 -60147 -164397 -481641 -568284 -224684 222093 323096 57691 -238236
36625 -238236 -444066 -797512 -1325132 -1559695 -1239952 -939747 -1342828 -2044224 -1877184 -549829
36615 -549829 841420 1254114 917602 637997 582884 444209 293022 465491 868396 1133101
36605 1133101 1284425 1568658 1769357 1430109 711136 290817 355947 385476 73119 -209065
36595 -209065 -107583 153899 239170 238926 385973 587477 579358 311080 -61800 -368808 -471918
36584 -471918 -353903 -229959 -279654 -247832 267324 1062981 1413559 1125026 934375 1445352
$$ packed form
36655A922684J36712k80035m79939k13492M1384l7641j94899j97019j74724j85211
36645C37820l8310K25890K31080j15049l80962k66099n4078r4399k22563r1022
36635d67692J95010K12535j04250l17244q6643L43600M46777J01003k65405k95927
36625b38236k05830l53446n27620k34563L19743L00205m03081p01396J67040J327355
36615e49829J391249M12694l36512k79605n5113j38675j51187J72469M02905K64705
36605A133101J51324K84233K00699l39248p18973m20319O5130K9529l12357k82184
36595b09065J01482K61482Q5271k44J47047K01504q119k68278l72880l07008j03110
36584d71918J18015J23944m9695L1822N15156P95657L50578k88533j90651N10977
$$ plain form
36574 1445352 2156246 2118216 1250023 371007 48654 25060 -142466 -388834 -336081 103833
36564 103833 582588 718173 534190 471211 906679 1650748 2074383 1844179 1352310 1225695
36554 1225695 1568486 1962808 2112585 2127950 2145255 2043989 1754017 1580514 1885244 2498564
36544 2498564 2760511 2253316 1295087 567206 413801 697104 1182030 1724168 2098580
36535 2098580 2048774 1678440 1466324 1638811 1802659 1512157 957050 682842 777742 785490
36525 785490 388782 -242565 -809084 -1194931 -1357174 -1255391 -986257 -707275 -403290 -39281
36515 -39281 92225 -368656 -1165523 -1482484 -886597 176491 1017526 1429893 1553492 1442507
36505 1442507 1129973 819428 631651 330733 -402800 -1540042 -2712805 -3485568 -3521564
$$ packed form
36574A445352P10894l8030q68193q79016l22353k3594j67526k46368N2753M39914
36564A03833M78755J35585j83983o2979M35468P44069M23635k30204m91869j26615
36554A225695L42791L94322J49777J5365J7305j01266k89972j73503L04730O13320
36544B498564K61947n07195r58229p27881j53405K83303M84926N42138L74412
36535B098580m9806l70334k12116J72487J63848k90502n55107k74208R4900P748
36525G85490l96708o31347n66519l85847j62243J01783K69134K78982L03985L64009
36515c9281J31506m60881p96867l16961N95887J063088Q41035M12367J23599j10985
36505A442507l12534l10545j87777l00918p33533j137242j172763p72763l5996
$$ plain form
36496 -3521564 -2765390 -1624664 -695963 -168554 206917 502563 451315 67175 -150552
36487 -150552 42788 268087 317723 708122 1824701 3055629 3552648 3461170 3544079 3862551
36477 3862551 3783705 3216649 2871062 3162237 3745412 4377937 5385777 6834626 7946137
36468 7946137 7940191 7049089 6174781 5799529 5680675 5474852 5275321 5478929 6225359 6992469
36458 6992469 6916406 5744666 4275686 3442693 3149256 2616764 1769588 1430650 1979807
36449 1979807 2707558 2935713 2974938 3341895 3730927 3599149 3274467 3514878 4187682 4350544
36439 4350544 3673866 2912676 2746062 2874803 2620097 1861202 966636 186660 -447182
36430 -447182 -828417 -781613 -346457 154695 346872 58338 -552103 -1071339 -1157029 -858486
$$ packed form
36496c521564P56174J140726R28701N27409L75471K95646n1248l84140k17727
36487a50552J93340K25299M9636L90399J116579J230928M97019r1478Q2909L18472
36477C862551p8846n67056l45587K91175N83175O32525J007840J448849J111511
36468G946137n946q91102q74308l75252j18854k05823j99531K03608P46430P67110
36458F992469p6063j171740j468980q32993k93437n32492q47176l38938N49157
36449A979807P27751K28155L9225L66957L89032j31778l24682K40411O72804J62862
36439D350544o76678p61190j66614J28741k54706p58895q94566p79976o33842
36430d47182l81235M6804M35156N01152J92177k88534o10441n19236q5690K98543
$$ plain form
36420 -858486 -548074 -550843 -942133 -1603288 -2223636 -2303862 -1538641 -317711 496320 521567
36410 521567 327958 679624 1522394 2088490 1904269 1276283 713049 254381 -378808 -1202227
36400 -1202227 -1854049 -2016081 -1706138 -1149370 -593676 -310118 -511408 -1055983 -1386563
36391 -1386563 -1042542 -222174 394044 403299 40614 -266324 -424790 -588053 -780168 -912600
36381 -912600 -1085878 -1555388 -2328438 -3012122 -3186734 -2835507 -2333001 -2077050 -2167963 -2365671
36371 -2365671 -2307761 -1833594 -1158328 -701330 -695771 -968943 -1129526 -979458 -728480 -754923
36361 -754923 -1116752 -1378965 -1083859 -393342 -39921 -497456 -1375573 -1859594 -1642753 -1140889
36351 -1140889 -800221 -520601 69814 974108 1703032 1774551 1203092 466476 40134 -14677
$$ packed form
36420h58486L10412k769l91290o61155o20348q0226P65221J220930Q14031K5247
36410E21567j93609L51666Q42770N66096j84221o27986n63234m58668o33189q23419
36400a202227o51822j62032L09943N56768N55694K83558k01290n44575l30580
36391a386563L44021Q20368O16218R255l62685l06938j58466j63263j92115j32432
36381i12600j73278m69510p73050o83684j74612L51227N02506K55951r0913j97708
36371b365671N7910M74167O75266M56998N559k73172j60583J50068K50978k6443
36361g54923l61829k62213K95106O90517L53421m57535q78117m84021K16841N01864
36351a140889L40668K79620N90415R04294P28924P1519n71459p36616m26342n4811
$$ plain form
36341 -14677 -7797 -199810 -508601 -675020 -601497 -394747 -171987 -25545 -112662 -497175
36331 -497175 -875101 -778732 -212233 188901 -114139 -847768 -1206727 -750833 238008 1226003
36321 1226003 1954647 2457080 2801692 2958049 2825746 2349593 1674400 1139677 962274
36312 962274 932458 608070 -146794 -969718 -1390838 -1282266 -897170 -619436 -699352 -1053559
36302 -1053559 -1284963 -1112452 -846788 -1172739 -2288659 -3501315 -3929903 -3454929 -2696200
36293 -2696200 -2168673 -1802332 -1319364 -773720 -535687 -844160 -1489269 -1951952 -1900123 -1576505
36283 -1576505 -1562327 -2026078 -2362652 -1852055 -634764 284589 114348 -861570 -1629673
36274 -1629673 -1485670 -569798 499279 1269784 1672525 1766821 1519782 962130 427107
$$ packed form
36341a4677O880j92013l08791j66419P3523K06750K22760J46442q7117l84513
36331d97175l77926R6369N66499M01134l03040p33629l58959M55894R88841R87995
36321A226003P28644N02433L44612J56357j32303m76153o75193n34723j77403
36312I62274k9816l24388p54864q22924m21120J08572L85096K77734p9916l54207
36302a053559k31404J72511K65664l25951j115920j212656m28588M74974P58729
36293b696200N27527L66341M82968N45644K38033l08473o45109m62683N1829L23618
36283a576505J4178m63751l36574N10597J217291R19353j70241r75918p68103
36274a629673J44003R15872J069077P70505M02741R4296k47039n57652n35023
$$ plain form
36265 427107 351502 762700 1200944 1305479 1257517 1414969 1708763 1723707 1275756 590630
36255 590630 -29199 -409317 -453753 -257984 -242812 -772265 -1587400 -1994706 -1691671 -1048496
36245 -1048496 -512523 -143705 147007 326661 392221 419987 302682 -168995 -808179 -1075219
36235 -1075219 -832522 -567067 -590703 -552811 -125675 354273 413044 136912 -174042 -575521
36225 -575521 -1099685 -1282380 -828183 -377827 -744885 -1602330 -1834286 -1129788 -332056 -141763
36215 -141763 -333433 -434665 -384963 -246639 54972 412467 536761 494307 669984 1035282
36205 1035282 1097583 739707 377817 80867 -606639 -1612194 -2049872 -1585784 -1206703
36196 -1206703 -1806084 -2728043 -2689900 -1631770 -610890 -194235 -39931 55307 -204665
$$ packed form
36265D27107p5605M11198M38244J04535m7962J57452K93794J4944m47951o85126
36255E90630o19829l80118m4436J95769J5172n29453q15135m07306L03035O43175
36245a048496N35973L68818K90712J79654O5560K7766j17305m71677o39184k67040
36235a075219K42697K65455k3636L7892M27136M79948N8771k76132l10954m01479
36225e75521n24164j82695M54197M50356l67058q57445k31956P04498P97732J90293
36215a41763j91670j01232M9702J38324L01611L57495J24294m2454J75677L65298
36205A035282O2301l57876l61890k96950o87506j005555m37678M64088L79081
36196a206703n99381r21959L8143J058130J020880M16655J54304R5238k59972
$$ plain form
36187 -204665 -784022 -1078131 -841535 -622805 -896505 -1329628 -1314869 -837717 -444768 -578640
36177 -578640 -1174236 -1743167 -1774735 -1271702 -885091 -1199098 -1892266 -2031254 -1257124 -192008
36167 -192008 500889 928719 1473074 1917523 1630695 486237 -878670 -1745272 -1903813
36158 -1903813 -1529544 -841735 -82602 426164 522903 443548 544286 766482 676771 173155
36148 173155 -184655 103893 661411 645883 -59065 -639941 -486532 43009 317392 362355
36138 362355 566620 838488 739097 348273 341536 1071516 2038236 2473825 2165853 1551088
36128 1551088 1208333 1380692 1845424 2146632 2003702 1508735 950931 594993 640371 1108732
36118 1108732 1634197 1684131 1218217 821445 926102 1257375 1370844 1315317 1303371 1161214
$$ packed form
36187b04665n79357k94109K36596K18730k73700m33123J4759M77152L92949j33872
36177e78640n95596n68931l1568N03033L86611l14007o93168j38988P74130J065116
36167a92008O92897M27830N44355M44449k86828j144458j364907q66602j58541
36158a903813L74269O87809P59133N08766R6739p9355J00738K22196q9711n03616
36148A73155l57810K88548N57518j5528p04948n80876J53409N29541K74383M4963
36138C62355K04265K71868r9391l90824o737P29980R66720M35589l07972o14765
36128A551088l42755J72359M64732L01208j42930m94967n57804l55938M5378M68361
36118A108732N25465M9934m65914l96772J04657L31273J13469n5527j1946j42157
$$ plain form
36108 1161214 741368 530331 1075888 2005550 2401704 2043017 1470947 911246 74039
36099 74039 -878820 -1159511 -496456 368204 713352 637716 448799 37949 -615420 -1024239
36089 -1024239 -890632 -636311 -642759 -551387 -1432 485330 173395 -721891 -1378326 -1616883
36079 -1616883 -1960421 -2569002 -2957840 -2830396 -2473689 -2189298 -1927476 -1639149 -1474384
36070 -1474384 -1456011 -1375150 -1160958 -1008289 -1048761 -1219266 -1479686 -1789470 -1859225 -1381508
36060 -1381508 -611370 -260781 -605241 -1070688 -967209 -346829 145171 81262 -348423 -647655
36050 -647655 -510449 -23104 495875 813542 938558 966211 859446 474837 -250471 -1202274
36040 -1202274 -2077592 -2424536 -1931432 -870972 -43879 2308 -439409 -692155 -568378
$$ packed form
36108A161214m19846k11037N45557R29662L96154l58687n72070n59701q37207
36099G4039r52859k80691O63055Q64660L45148p5636j88917m10850o53369m08819
36089a024239J33607K54321o448R1372N49955M86762l11935q95286o56435k38557
36079a616883l43538o08581l88838J27444L56707K84391K61822K88327J64765
36070a474384J8373Q0861K14192J52669m0472j70505k60420l09784o9755M77717
36060a381508P70138L50589l44460m65447J03479O20380M92000o3909m29685k99232
36050f47655J37206M87345N18979L17667J25016K7653j06765l84609p25308r51803
36040a202274q75318l46944M93104J060460Q27093M6187m41717k52746J23777
$$ plain form
36031 -568378 -455526 -691283 -1279599 -2143916 -3165543 -3913579 -3817025 -2813018 -1510693
36022 -1510693 -560788 -152931 -234487 -809033 -1716645 -2418159 -2420285 -1873729 -1450011 -1568025
36012 -1568025 -1931115 -1944848 -1508925 -1199877 -1526484 -2122361 -2029116 -919097 312923
36003 312923 523558 -338617 -1291689 -1587122 -1416431 -1355377 -1639161 -2162430 -2744856 -3125093
35993 -3125093 -3040825 -2632679 -2526939 -3188839 -4308023 -5073666 -4987230 -4225808 -3290989 -2502653
35983 -2502653 -1856561 -1268074 -843545 -766099 -869972 -613061 208418 928646 712205 -247761
35973 -247761 -838757 -508260 -29877 -417463 -1577015 -2554729 -2776114 -2465960 -2047475
35964 -2047475 -1721910 -1596417 -1697291 -1807222 -1715994 -1657685 -2051622 -2734867 -2923332 -2142648
$$ packed form
36031e68378J12852k35757n88316q64317j021627p48036R6554J004007J302325
36022a510693R49905M07857q1556n74546r07612p01514k126N46556M23718j18014
36012a568025l63090j3733M35923L09048l26607n95877R3245J110019J232020
36003C12923K10635q62175r53072k95433J70691O1054k83784n23269n82426l80237
35993c125093Q4268M08146J05740o61900j119184p65643Q6436P61422R34819P88336
35983b502653O46092N88487M24529P7446j03873K56911Q21479P20228k16441r59966
35973b47761n90996L30497M78383l87586j159552r77714k21385L10154M18485
35964b047475L25565J25493j00874j09931R1228N8309l93937o83245j88465P80684
$$ plain form
35954 -2142648 -841058 128079 319523 -183081 -1060509 -1830488 -1931854 -1189996 -104553
35945 -104553 664134 990935 1144023 1130298 711638 55944 -262259 -150918 -304494 -1162013
35935 -1162013 -2027377 -1877065 -785354 190753 472836 496799 646191 523287 -218949
35926 -218949 -1017951 -1095010 -570652 -140227 50983 381278 781914 743423 365195 439327
35916 439327 1155980 1594296 1028013 -21016 -713144 -1198412 -2071871 -2970165 -2846081
35907 -2846081 -1621954 -512335 -427913 -960928 -1380507 -1766556 -2429642 -2877954 -2384699
35898 -2384699 -1339198 -979161 -1633657 -2159044 -1545894 -333686 213497 -195811 -796452
35889 -796452 -1083758 -1308912 -1611653 -1514336 -667939 457605 1062423 857276 120417 -703169
$$ packed form
35954b142648J301590R69137J91444n02604q77428p69979j01366P41858J085443
35945a04553P68687L26801J53088j3725m18660o55694l18203J11341j53576q57519
35935a162013q65364J50312J091711R76107K82083K3963J49392j22904p42236
35926b18949p99002p7059N24358M30425J91210L30295M00636l8491l78228P4132
35916D39327P16653M38316n66283j049029o92128m85268q73459q98294J24084
35907b846081J224127J109619Q4422n33015m19579l86049o63086m48312M93255
35898b384699J045501L60037o54496n25387O13150J212208N47183m09308o00641
35889g96452k87306k25154l02741R7317Q46397J125544O04818k05147p36859q23586
$$ plain form
35879 -703169 -1148972 -920218 -365424 -371554 -1246396 -2045414 -1645342 -246622 897639 1108103
35869 1108103 853887 703767 554240 157909 -322364 -713370 -1230757 -2015237 -2672513
35860 -2672513 -2725738 -2259321 -1749478 -1469550 -1339624 -1138947 -632136 271228 1269394 1832232
35850 1832232 1786810 1460000 1122350 695130 190819 -29271 261106 812953 1306989 1656447
35840 1656447 1679818 1083614 145098 -269083 81120 250647 -517663 -1517358 -1598827 -914484
35830 -914484 -526067 -636209 -482356 115822 436421 249643 240812 635558 618536 -227353
35820 -227353 -958274 -590839 424877 965080 859507 826307 1205344 1690985 2091421 2470716
35810 2470716 2608204 2102253 1058055 31583 -760840 -1593848 -2534988 -3176400 -3227325
$$ packed form
35879g03169m45803K28754N54794o130q74842p99018M00072J398720J144261K10464
35869A108103k54216j50120j49527l96331m80273l91006n17387p84480o57276
35860b672513n3225M66417N09843K79928J29926K00677N06811R03364R98166N62838
35850A832232m5422l26810l37650m27220n04311k20090K90377N51847M94036L49458
35840A656447K3371n96204r38516m14181L50203J69527p68310r99695q1469O84343
35830i14484L88417j10142J53853N98178L20599j86778q831L94746j7022q45889
35820b27353p30921L67435J015716N40203j05573l3200L79037M85641M00436L79295
35810B470716J37488n05951j044198j026472p92423q33008r41140o41412n0925
$$ plain form
35801 -3227325 -2906574 -2570180 -2336292 -2233265 -2353806 -2673955 -2998555 -3226399 -3412207
35792 -3412207 -3477183 -3171716 -2466878 -1691074 -1122113 -728070 -468061 -500404 -816420 -992153
35782 -992153 -720192 -394511 -686491 -1583832 -2339981 -2475297 -2351392 -2493699 -2763119 -2641902
35772 -2641902 -2090727 -1579342 -1312104 -974692 -389825 77627 68714 -200858 -280800 -88325
35762 -88325 228746 736547 1485477 2006624 1670608 590406 -392351 -736159 -690834 -623558
35752 -623558 -458631 -111977 64142 -238593 -730376 -944927 -928694 -1000831 -1069254 -780447
35742 -780447 -245668 -15 -174156 -254594 148668 734212 949305 674055 221741 -100260
35732 -100260 -188322 -75966 93361 110274 -107550 -397955 -514650 -350569 27969 446069
$$ packed form
35801c227325L20751L36394K33888J03027j20541l20149l24600k27844j85808
35792c412207o4976L05467P04838P75804N68961L94043K60009l2343l16016j75733
35782i92153K71961L25681k91980q97341p56149j35316J23905j42307k69420J21217
35772b641902N51175N11385K67238L37412N84867M67452q913k69572p9942J92475
35762h8325L17071N07801P48930N21147l36016j080202r82757l43808M5325O7276
35752f23558J64927L46654J76119l02735m91783k14551J6233p2137o8423K88807
35742g80447N34779K45653j74141q0438M03262N85544K15093k75250m52314l22001
35732a00260q8062J12356J69327J6913k17824k90405j16695J64081L78538M18100
$$ plain form
35722 446069 659048 473777 -42356 -548366 -716050 -470764 87211 853473 1684463 2314814
35712 2314814 2531822 2456862 2489485 2873171 3382128 3523258 3032616 2126132 1296234 937943
35702 937943 1145629 1727061 2327842 2629337 2541904 2191859 1699357 1101019 579694 552898
35692 552898 1245012 2262015 2922247 3012606 2895154 2846194 2694842 2257754 1726338 1360703
35682 1360703 1137535 1014393 1232451 1939948 2699940 2807323 2063868 940514 26087
35673 26087 -439229 -588919 -753175 -1167254 -1662679 -1826973 -1643409 -1620365 -1976378 -2163369
35663 -2163369 -1746875 -1292032 -1537875 -2000988 -1491177 -35093 881107 362741 -672955
35654 -672955 -974885 -731323 -946355 -1679962 -1993839 -1443413 -667844 -420204 -699279 -972911
$$ packed form
35722D46069K12979j85271n16133n06010j67684K45286N57975P66262Q30990O30351
35712B314814K17008p4960L2623L83686N08957J41130m90642r06484q29898l58291
35702I37943K07686N81432O00781L01495q7433l50045m92502n98338n21325k6796
35692E52898O92114J017003O60232R0359j17452m8960j51352m37088n31416l65635
35682A360703k23168j23142K18058P07497P59992J07383p43455j123354r14427
35673B6087m65316j49690j64256m14079m95425j64294J83564K3044l56013j86991
35663b163369M16494M54843k45843m63113N09811J456084R16200n18366j035696
35654f72955l01930K43562k15032p33607l13877N50426P75569K47640k79075k73632
$$ plain form
35644 -972911 -775524 -8699 970290 1559294 1536259 1362916 1509064 1695439 1330738 522257
35634 522257 -17118 -52716 -130234 -657538 -1307953 -1569290 -1352389 -809364 -71028 525106
35624 525106 445124 -376942 -1235516 -1419307 -1013741 -592932 -404387 -269628 -60504 190570
35614 190570 544500 1083345 1588499 1640583 1098079 263458 -420628 -672536 -465487 -59194
35604 -59194 127052 -83305 -395243 -449531 -383602 -661627 -1322300 -1748804 -1391294 -519354
35594 -519354 -3146 -367887 -1249142 -1867300 -1927212 -1840590 -2004472 -2128294 -1608835 -489992
35584 -489992 388856 349408 -367941 -1006263 -1122531 -752473 -93108 561682 792387 426170
35574 426170 -145727 -394585 -274104 -26029 429016 1312221 2258185 2471481 1803957 1065148
$$ packed form
35644i72911J97387P66825R78989N89004k3035j73343J46148J86375l64701q08481
35634E22257n39375l5598p7518n27304o50415k61337K16901N43025P38336N96134
35624E25106p9982q22066q58574j83791M05566M20809J88545J34759K09124K51074
35614A90570L53930N38845N05154N2084n42504q34621o84086k51908K07049M06293
35604e9194J86246k10357l11938n4288O5929k78025o60673m26504L57510Q71940
35594e19354N16208l64741q81255o18158n9912Q6622j63882j23822N19459J118843
35584d89992Q78848l9448p17349o38322j16268L70058O59365O54790K30705l66217
35574D26170n71897k48858J20481K48075M55045Q83205R45964K13296o67524p38809
$$ plain form
35564 1065148 955713 1238183 1362719 1396036 1738639 2245109 2300588 1705072 908610 325125
35554 325125 -80419 -402294 -489475 -324043 -339397 -928501 -1755051 -1972161 -1218266 -93780
35544 -93780 559096 656681 849543 1550701 2367157 2669317 2409693 2038090 1781549 1430108
35534 1430108 828653 187947 -191711 -196792 175140 813441 1277800 972197 -163088 -1366571
35524 -1366571 -1742040 -1088416 116512 1307561 2151971 2503812 2383642 1964839 1424122
35515 1424122 919132 764542 1285644 2267162 2898514 2627784 1816136 1214753 1101891
35506 1101891 1331953 1856901 2592078 3024950 2678189 1890367 1459566 1523044 1473413 1016695
35496 1016695 553992 336860 -1468 -744858 -1577874 -2136208 -2460993 -2508463 -1860676 -493523
$$ packed form
35564A065148j09435K82470J24536L3317L42603N06470N5479n95516p96462n83485
35554C25125m05544l21875q7181J65432j5354n89104q26550k17110P53895J124486
35544i3780O52876R7585J92862P01158Q16456L02160k59624l71603k56541l51441
35534A430108o01455o40706l79658n081L71932O38301M64359l05603j135285j203483
35524a366571l75469O53624J204928J191049Q44410L51841j20170m18803n40717
35515A424122n04990j54590N21102R81518O31352k70730q11648o01383j12862
35506A101891K30062N24948P35177M32872l46761p87822m30801O3478m9631m56718
35496A016695m62703k17132l38328p43390q33016n58334l24785m7470O47787J367153
$$ plain form
35486 -493523 719592 962885 572015 507928 1018828 1499066 1488268 1130133 713658 384320
35476 384320 300493 510818 662824 359497 -185054 -376092 -141619 -36793 -366338 -788541
35466 -788541 -958485 -993376 -1052704 -1003849 -838090 -911650 -1339042 -1576880 -1149709 -495184
35456 -495184 -469575 -1089824 -1349863 -438451 1239983 2459774 2379459 1203676 -190869
35447 -190869 -1061270 -1202801 -745447 127879 1067143 1407525 647739 -798417 -1764966
35438 -1764966 -1559323 -739600 -356063 -717430 -1348244 -1912391 -2529291 -3163865 -3360666
35429 -3360666 -2869115 -2082954 -1537612 -1313837 -1248031 -1371821 -1698210 -1827121 -1312799 -379529
35419 -379529 204372 16185 -633153 -1198094 -1338795 -824899 424027 1932331 2799596
$$ packed form
35486d93523J213115K43293l90870o4087N10900M80238j0798l58135m16475l29338
35476C84320q3827K10325J52006l03327n44551j91038K34473J04826l29545m22203
35466g88541j69944l4891n9328M8855J65759p3560m27392k37838M27171O54525
35456d95184K5609o20249k60039R11412J678434J219791q0315j175783j394545
35447a90869q70401j41531M57354Q73326R39264L40382p59786j446156r66549
35438a764966K05643Q19723L83537l61367o30814n64147o16900o34574j96801
35429c360666M91551P86161N45342K23775O5806j23790l26389j28911N14322R33270
35419c79529N83901j88187o49338n64941j40701N13896J248926J508304Q67265
$$ plain form
35410 2799596 2638278 2003233 1484376 809415 -531890 -2102071 -2798417 -2306287 -1455131
35401 -1455131 -947662 -543022 92344 487799 50448 -821346 -1150471 -772489 -538767
35392 -538767 -1046136 -1847090 -2199534 -2062855 -1921173 -1952063 -1886559 -1622894 -1491544 -1706596
35382 -1706596 -1850319 -1269349 36238 1261042 1694084 1487069 1229093 1021516 517707
35373 517707 -183685 -394058 137862 673889 466743 -167007 -377386 -66192 79105 -305461
35363 -305461 -876855 -1341056 -1817333 -2198058 -1848340 -442542 1315190 2308196 2168453
35354 2168453 1499607 1124274 1387336 2011040 2319818 1720071 263097 -1268722 -2018940
35345 -2018940 -1807789 -1164402 -699991 -539134 -316527 288508 976033 945239 -147855
$$ packed form
35410B799596j61318o35045n18857o74961j341305j570181o96346M92130Q51156
35401a455131N07469M04640O35366L95455m37351q71794l29125L77982K33722
35392e38767n07369q00954l52444J36679J41682l0890O5504K63665J31350k15052
35382a706596j43723N80970J305587J224804M33042k07015k57976k07577n03809
35373E17707p01392k10373N31920N36027k07146o33750k10379L11194J45297l84566
35363c05461n71394m64201m76277l80725L49718J405798J757732R93006j39743
35354B168453o68846l75333K63062O23704L08778n99747j456974j531819p50218
35345b018940K11151O43387M64411J60857K22607O05035O87525l0794j093094
$$ plain form
35336 -147855 -1505424 -1942401 -1327233 -669474 -594583 -457441 496960 1718163 1974515
35327 1974515 1138371 387279 501605 817603 289859 -1042987 -2235567 -2689116 -2586627
35318 -2586627 -2244332 -1716634 -1177804 -1110303 -1714701 -2446773 -2588482 -2163889 -1870383 -2115154
35308 -2115154 -2556116 -2710589 -2580205 -2403651 -2160599 -1708509 -1152928 -659583 -102933
35299 -102933 628169 1146922 967696 334818 26102 252528 384979 -34590 -643033 -937531
35289 -937531 -1021677 -1224974 -1459679 -1474113 -1377383 -1368263 -1211831 -543973 441601 1093282
35279 1093282 1028717 429711 -249064 -570406 -351184 42377 -87334 -852643 -1402077 -974664
35269 -974664 -36051 267074 -417686 -1391119 -1978127 -2125323 -1958718 -1514993 -1040359 -887499
$$ packed form
35336a47855j357569m36977O15168O57759P4891J37142R54401J221203K56352
35327A974515q36144p51092J14326L15998n27744j332846j192580m53549J02489
35318b586627L42295N27698N38830O7501o04398p32072j41709M24593K93506k44771
35308b115154m40962j54473J30384J76554K43052M52090N55581M93345N56650
35299a02933P31102N18753j79226o32878l08716K26426J32451m19569o08443k94498
35289i37531q4146k03297k34705j4434R6730R120J56432O67858R85574O51681
35279A093282o4565n99006o78775l21342K19222L93561j29711p65309n49434M27413
35269i74664R38613L03125o84760r73433n87008j47196J66605M43725M74634J52860
$$ plain form
35259 -887499 -959299 -857714 -674355 -922256 -1511219 -1584631 -738127 323560 814853 897096
35249 897096 1117208 1414348 1393428 1170403 1180033 1353852 1205113 670227 239136 213796
35239 213796 370359 455764 564271 845712 1172119 1316539 1306018 1423019 1860839 2421534
35229 2421534 2626274 2237037 1610740 1313282 1416146 1508121 1415935 1443227 1735607 1924939
35219 1924939 1718541 1359652 1097228 668050 -178546 -1068375 -1524093 -1715919 -1979538
35210 -1979538 -1926335 -934361 614572 1563621 1537286 1351093 1656012 2102152 2237809 2314099
35200 2314099 2539092 2306173 1065004 -492331 -1067661 -454168 216911 -24117 -910110
35191 -910110 -1498559 -1244136 -295036 832900 1598674 1741258 1494951 1342922 1422311 1351240
$$ packed form
35259h87499p1800J01585J83359k47901n88963p3412Q46504J061687M91293Q2243
35249H97096K20112K97140k0920k23025R630J73819j48739n34886m31091k5340
35239B13796J56563Q5405J08507K81441L26407J44420j0521J17001M37820N60695
35229B421534K04740l89237o26297k97458J02864R1975r2186K7292K92380J89332
35219A924939k06398l58889k62424m29178q46596q89829m55718j91826k63619
35210a979538N3203R91974J548933R49049k6335j86193L04919M46140J35657P6290
35200B314099K24993k32919j241169j557335n75330O13493O71079k41028q85993
35191i10110n88449K54423R49100J127936P65774J42584k46307j52029P9389p1071
$$ plain form
35181 1351240 763552 -172320 -917652 -1110493 -807842 -276156 317020 994554 1776710
35172 1776710 2411949 2442400 1707028 676187 16166 -143596 -188181 -272674 -78107 484391
35162 484391 829779 448977 -202013 -173227 698844 1587959 1829321 1673958 1657411 1786553
35152 1786553 1793798 1768414 1953641 2137839 1849673 1116573 484349 234497 105759 -64241
35142 -64241 57149 738084 1606271 2020398 1820333 1396117 1161250 1238670 1547463 1921433
35132 1921433 2190463 2333908 2477295 2611411 2512567 2151585 1933175 2164339 2450998 2085254
35122 2085254 1013380 -47782 -563676 -809758 -1304270 -1960377 -2167494 -1572965 -463579
35113 -463579 590130 1195213 1218497 690543 -164457 -907614 -1149611 -937623 -740971 -909069
$$ packed form
35181A351240n87688r35872p45332j92841L02651N31686N93176O77534P82156
35172A776710O35239L0451p35372j030841o60021j59762m4585q4493J94567N62498
35162D84391L45388l80802o50990K8786Q72071Q89115K41362j55363j6547J29142
35152A786553P245k5384J85227J84198k88166p33100o32224k49852j28738j70000
35142f4241J21390O80935Q68187M14127k00065m24216k34867P7420L08793L73970
35132A921433K69030J43445J43387J34116r8844l60982k18410K31164K86659l65744
35122B085254j071874j061162n15894k46082m94512o56107k07117N94529J109386
35113d63579J053709O05083K3284n27954q55000p43157k41997K11988J96652j68098
$$ plain form
35103 -909069 -1244040 -1310597 -1091409 -1019940 -1317114 -1648044 -1618373 -1295482 -978894 -746237
35093 -746237 -564220 -582472 -868032 -1015834 -533403 414843 1110268 1153657 821348 532001
35083 532001 407720 439181 641517 915515 1138113 1469491 2131352 2793808 2712636 1685786
35073 1685786 392073 -441397 -717701 -608813 -127959 571927 1058336 1236886 1568136
35064 1568136 2194195 2474133 2017688 1528655 1760863 2198685 1845276 921394 522269
35055 522269 740404 517207 -471329 -1190365 -1013603 -798094 -1345563 -1885445 -1233114 247157
35045 247157 1056450 609095 -241633 -620994 -569651 -472903 -429109 -466964 -755167 -1254528
35035 -1254528 -1536191 -1185992 -190130 1088590 2055452 2116586 1200806 46125 -443271
$$ packed form
35103i09069l34971o6557K19188P1469k97174l30930K9671L22891L16588K32657
35093g46237J82017j8252k85560j47802M82431R48246O95425M3389l32309k89347
35083E32001j24281L1461K02336K73998K22598L31378O61861O62456q1172j026850
35073A685786j293713q33470k76304J08888M80854O99886M86409J78550L31250
35064A568136O26059K79938m56445m89033K32208M37822l53409r23882l99125
35055E22269K18135k23197r88536p19036J76762K15509n47469n39882O52331J480271
35045B47157Q09293m47355q50728l79361N1343R6748M3794l7855k88203m99361
35035a254528k81663L50199R95862J278720R66862O1134r15780j154681m89396
$$ plain form
35026 -443271 -144389 336806 567410 621821 555591 218683 -214549 -165488 519326 1147515
35016 1147515 1034204 401562 -60056 -241706 -640847 -1415476 -2000840 -1867404 -1277443
35007 -1277443 -959062 -1155439 -1315492 -824603 167527 896124 901709 473308 70911 -307456
34997 -307456 -855571 -1378015 -1494684 -1277820 -1121469 -1017089 -590880 32071 70898 -884234
34987 -884234 -2228499 -3109627 -3375316 -3328430 -2978969 -2119672 -916944 114343 656064
34978 656064 747883 540059 218797 6162 -106807 -441846 -1109921 -1639553 -1530685 -958179
34968 -958179 -486474 -312170 -287269 -459342 -962807 -1504706 -1642689 -1563609 -1892968 -2631369
34958 -2631369 -2970154 -2413300 -1500947 -1101050 -1434905 -2090855 -2586175 -2614268 -2106838 -1392665
$$ packed form
35026d43271K98882M81195K30604N4411o6230l36908m33232M9061O84814O28189
35016A147515j13311o32642m61618j81650l99141p74629n85364J33436N89961
35007a277443L18381j96377j60053M90889R92130P28597N585m28401m02397l78367
34997c07456n48115n22444j16669K16864J56351J04380M26209O22951L8827r55132
34987h84234j344265q81128k65689M6886L49461Q59297J202728J031287N41721
34978F56064R1819k07824l21262k12635j12969l35039o68075n29632J08868N72506
34968i58179M71705J74304K4901j72073n03465n41899j37983P9080l29359p38401
34958b631369l38785N56854R12353L99897l33855o55950m95320k8093N07430P14173
$$ plain form
34948 -1392665 -1055629 -1371730 -2039347 -2561716 -2680075 -2442992 -2200182 -2492814 -3449480
34939 -3449480 -4268757 -3925157 -2532429 -1328232 -1060427 -1145776 -852602 -520132 -879713
34930 -879713 -1755431 -2296780 -2177895 -1774908 -1361979 -879943 -385305 -40300 273245 706438
34920 706438 916297 462412 -327005 -613740 -236250 64914 -233655 -751969 -896777 -673414
34910 -673414 -486398 -558915 -853101 -1236867 -1482988 -1371315 -953286 -454418 138694 1018293
34900 1018293 2009124 2548585 2406958 2008799 1814956 1789996 1730943 1695830 1751272 1653317
34890 1653317 1207734 715789 639247 943906 1148665 984143 695586 669108 967100 1285695
34880 1285695 1280228 913312 481379 255211 165590 -15827 -279187 -406465 -346803 -266969
$$ packed form
34948a392665L37036l16101o67617n22369j18359K37083K42810k92632r56666
34939c449480q19277L43600J392728J204197K67805q5349K93174L32470l59581
34930h79713q75718n41349J18885M02987M12929M82036M94638L45005L13545M33193
34920G06438K09859m53885p89417k86735L77490L01164k98569n18314j44808K23363
34910f73414J87016p2517k94186l83766k46121J11673M18029M98868N93112Q79599
34900A018293R90831N39461j41627l98159j93843k4960n9053l5113N5442r7955
34890A653317m45583m91945p6542L04659K04759j64522k88557k6478K97992L18595
34880A285695n467l66916m31933k26168q9621j81417k63360j27278N9662P9834
$$ plain form
34870 -266969 -242007 -211730 -236589 -436959 -671632 -688361 -626466 -895424 -1463335 -1779548
34860 -1779548 -1552215 -1055586 -472528 426914 1595649 2327665 2097607 1319077 755908
34851 755908 605419 660585 879959 1148647 916664 -132290 -1304412 -1546096 -720702
34842 -720702 424924 1349688 2034633 2424392 2428268 2411780 2802888 3197272 2774275 1689783
34832 1689783 1049370 1237436 1307625 514168 -516776 -825310 -523152 -373895 -607018
34823 -607018 -980650 -1502475 -2185216 -2454193 -1739270 -470577 391743 697201 1076959
34814 1076959 1617746 1574736 664900 -258244 -321632 220787 496802 205874 -241546 -460071
34804 -460071 -440926 -328094 -277565 -470255 -946340 -1479979 -1826827 -1959130 -1859140 -1330142
$$ packed form
34870b66969K4962L0277k4859k00370k34673j6729O1895k68958n67911l16213
34860a779548K27333M96629N83058Q99442J168735P32016k30058p78530n63169
34851G55908j50489N5166K19374K68688k31983j048954j172122k41684Q25394
34842g20702J145626R24764O84945L89759L876j6488L91108L94384m22997j084492
34832A689783o40413J88066P0189p93457j030944l08534L02158J49257k33123
34823f07018l73632n21825o82741k68977P14923J268693Q62320L05458L79758
34814A076959N40787m3010r09836r23144o3388N42419K76015k90928m47420k18525
34804d60071J9145J12832N0529j92690m76085n33639l46848j32303R9990N28998
$$ plain form
34794 -1330142 -359240 530081 739981 354256 -806 -41487 -88905 -343021 -418195 75959
34784 75959 887616 1497955 1900691 2496259 3261897 3541130 2846933 1565127 641338 704687
34774 704687 1584038 2507197 2695472 1980835 976942 468777 534255 504378 -80348 -810470
34764 -810470 -992816 -589952 -140723 51460 114200 75941 -223305 -570675 -371636 444809
34754 444809 1023744 576246 -571592 -1444885 -1690030 -1797270 -2178448 -2670458 -3034655
34745 -3034655 -3328988 -3497194 -3080083 -1794119 -178343 751045 481957 -562978 -1519333
34736 -1519333 -1846561 -1688866 -1642588 -2129806 -2927576 -3415093 -3311985 -2929802 -2578028 -2063160
34726 -2063160 -1095491 84957 959219 1478678 2044606 2734471 3098847 2894798 2499608
$$ packed form
34794a330142R70902Q89321K09900l85725l55062m0681m7418k54116p5174M94154
34784G5959Q11657O10339M02736N95568P65638K79233o94197j281806r23789O3349
34774G04687Q79351R23159J88275p14637j003893n08165O5478k9877n84726p30122
34764h10470j82346M02864M49229J92183O2740l8259k99246l47370J99039Q16445
34754D44809N78935m47498j147838q73293k45145j07240l81178m92010l64197
34745c034655k94333j68206M17111J285964J615776R29388k69088j044935r56355
34736a519333l27228J57695M6278m87218p97770m87517J03108L82183L51774N14868
34726b063160R67669J180448Q74262N19459N65928O89865L64376k04049l95190
$$ plain form
34717 2499608 2274980 1962434 1171580 172735 -340945 -179042 169088 304365 387885 686438
34707 686438 1046223 1104494 808853 442684 205082 -19078 -445184 -1050659 -1509513 -1490520
34697 -1490520 -1021947 -469933 -92172 237710 692874 1052025 931222 403790 -25773
34688 -25773 -159387 -380330 -929634 -1299524 -817921 329693 1170269 1091637 509611 210676
34678 210676 365024 528786 470209 540975 1050721 1597039 1453508 615083 -5869 303917
34668 303917 1096975 1365506 882372 332468 118011 -239674 -1177627 -2186210 -2414316
34659 -2414316 -1843366 -1242845 -1094847 -1130532 -916850 -392806 244739 763075 924989 680051
34649 680051 376786 383549 464576 45933 -766585 -1059144 -389130 354058 6478 -1239396
$$ packed form
34717B499608k24628l12546p90854r98845n13680J61903L48130J35277Q3520K98553
34707F86438L59785N8271k95641l66169k37602k24160m26106o05475m58854J8993
34697a490520M68573N52014L77761L29882M55164L59151j20803n27432m29563
34688b5773j33614k20943n49304l69890M81603J147614Q40576p8632n82026k98935
34678B10676J54348J63762n8577P0766N09746N46318j43531q38425o20952L09786
34668C03917P93058K68531m83134n49904k14457l57685r37953j008583k28106
34659b414316N70950O00521J47998l5685K13682N24044O37545N18336J61914k44938
34649F80051l03265O763Q1027m18643q12518k92559O70014P43188l47580j245874
$$ plain form
34639 -1239396 -1974030 -1321393 103512 1155560 1493602 1576820 1744334 1851808 1734547
34630 1734547 1540739 1454940 1381680 1102907 603887 68066 -381753 -783867 -1180532 -1457772
34620 -1457772 -1389288 -867112 -130222 296348 53166 -637972 -1176331 -1222246 -900279 -348373
34610 -348373 479625 1294063 1271214 12993 -1557321 -2016793 -1139989 -51702 362779
34601 362779 363001 436537 407842 43399 -215252 104785 661565 863636 814076 851519 576604
34590 576604 -628106 -2297387 -3180160 -2885502 -2256572 -1975905 -1780894 -1333901 -903221
34581 -903221 -716905 -468008 -10809 148369 -369053 -1140617 -1612528 -1881905 -2228216 -2426255
34571 -2426255 -2224522 -2052641 -2484747 -3291316 -3737838 -3591064 -3145759 -2497530 -1575963
$$ packed form
34639a239396p34634O52637J424905J052048L38042Q3218J67514J07474j17261
34630A734547j93808q5799p3260k78773m99020n35821m49819m02114l96665k77240
34620a457772O8484N22176P36890M26570k43182o91138n38359m5915L21967N51906
34610c48373Q27998Q14438k2849j258221j570314m59472Q76804J088287M14481
34601C62779K22P3536k8695l64443k58651L20037N56780K02071m9560L7443k74915
34590E76604j204710j669281q82773K94658O28930K80667J95011M46993M30680
34581i03221J86316K48897M57199J59178n17422p71564m71911k69377l46311j98039
34571b426255K01733J71881m32106q06569m46522J46774M45305O48229R21567
$$ plain form
34562 -1575963 -785432 -783087 -1525342 -2230791 -2429971 -2411848 -2451745 -2262433 -1580391 -780273
34552 -780273 -418115 -434002 -255983 383630 1069774 1193865 670510 97264 178608 947527
34542 947527 1606523 1259694 -183803 -1888204 -2824296 -2576676 -1548029 -512337 65098
34533 65098 332386 639592 899397 640960 -231937 -1098539 -1288714 -835445 -299734 -82806
34523 -82806 -188996 -431334 -552433 -348200 16024 36186 -456279 -911757 -751112 -186921
34513 -186921 104988 -70162 -292493 -157488 440170 1419359 2325179 2258700 753089 -1323868
34503 -1323868 -2498760 -2391712 -1966933 -1993768 -2074218 -1502489 -344573 807975 1607789
34494 1607789 2015456 2043803 1879230 1893075 2141511 2180437 1710031 1052172 658753 524231
$$ packed form
34562a575963P90531K345p42255p05449j99180J8123l9897J89312O82042Q00118
34552g80273L62158j5887J78019O39613O86144J24091n23355n73246Q1344P68919
34542I47527O58996l46829j443497j704401r36092K47620J028647J035692N77435
34533F5098K67288L07206K59805k58437q72897q66602j90175M53269N35711K16928
34523h2806j06190k42338j21099K04233L64224K0162m92465m55478J60645N64191
34513a86921K91909j75150k22331J35005N97658R79189R05820o6479j505611k076957
34503a323868j174892J07048M24779k6835q0450N71729J157916J152548P99814
34494A607789M07667K8347j64573J3845K48436L8926m70406o57859l93419j34522
$$ plain form
34484 524231 452046 513615 788549 961751 673274 87338 -296207 -252178 55208 352239
34474 352239 351062 -153159 -913914 -1230939 -717327 176610 804075 1189185 1752027 2431162
34464 2431162 2703572 2375527 1770542 1186816 747145 740410 1420783 2342548 2578568 1905294
34454 1905294 1196502 1242430 1676548 1603291 933597 442100 591975 932550 820562 274932
34444 274932 -163387 -135250 264189 734467 991715 848266 398234 116523 456942 1293263
34434 1293263 2060694 2519071 2984022 3625798 4014809 3764910 3212233 2869434 2511797
34425 2511797 1570103 327478 -155820 492688 1361028 1490876 1024610 635028 430486
34416 430486 78375 -403603 -669729 -621824 -349337 310547 1504384 2720454 3053767
$$ packed form
34484E24231p2185O1569K74934J73202k88477n85936l83545M4029L07386K97031
34474C52239j177n04221p60755l17025N13612Q93937O27465L85110N62842O79135
34464B431162K72410l28045o04985n83726m39671o735O80373R21765K36020o73274
34454A905294p08792M5928M34118p3257o69694m91497J49875L40575j11988n45630
34444B74932m38319K8137L99439M70278K57248j43449m50032k81711L40419Q36321
34434A293263P67431M58377M64951O41776L89011k49899n52677l42799l57637
34425B511797r41694j242625m83298O48508Q68340J29848m66266l89582k04542
34416D30486l52111m81978k66126M7905K72487O59884J193837J216070L33313
$$ plain form
34407 3053767 2245193 1029459 333363 427031 887064 1076421 615232 -340962 -1203759
34398 -1203759 -1465391 -1085583 -318038 591613 1335739 1502615 991450 251651 -275624
34389 -275624 -728417 -1405566 -2018173 -1916757 -959926 365837 1610571 2619503 3204380
34380 3204380 3144668 2564381 1831398 1093142 373267 -5366 267279 826970 1032165 1039987
34370 1039987 1635066 2809082 3426834 2734887 1412542 593613 544547 897363 1485827
34361 1485827 2152635 2261311 1339210 -22145 -732868 -561034 -203160 -111657 -38878 211247
34351 211247 354476 187519 -30015 -45521 5261 -43495 -64774 48617 129765 103826 257650
34340 257650 769248 1255494 1248619 962796 1076401 1740832 2300819 2191914 1716135 1600088
$$ packed form
34407C053767q08574j215734o96096R3668M60033J89357m61189r56194q62797
34398a203759k61632L79808P67545R09651P44126J66876n11165p39799n27275
34389b75624m52793o77149o12607J01416R56831J325763J244734J008932N84877
34380C204380n9712n80287p32983p38256p19875l78633K72645N59691K05195P822
34370A039987N95079J174016O17752o91947j322345q18929m9066L52816N88464
34361A485827O66808J08676r22101j361355p10723J71834L57874R1503P2779K50125
34351B11247J43229j66957k17534j5506N0782m8756k1279J13391Q1148k5939J53824
34340B57650N11598M86246o875k85823J13605O64431N59987j08905m75779j16047
$$ plain form
34330 1600088 2053318 2680914 3197174 3727195 4320946 4632755 4348497 3622306 2828664
34321 2828664 2177084 1865617 2255237 3394800 4605951 5124741 5053252 5075469 5299283
34312 5299283 5127293 4393120 3809996 3911097 4271454 4342991 4445378 5185825 6305000
34303 6305000 6929222 6803981 6494512 6380702 6217755 5858356 5721625 6173706 6902487
34294 6902487 7332703 7432047 7744265 8681196 10005612 11047468 11395180 11389006 11854398 13227265
34284 13227265 15033268 16412355 17058202 17394677 17925957 18771642 19854010 21159993 22676998
34275 22676998 24377537 26450783 29286143 32974856 36976611 40534276 43405907 46046832
34267 46046832 49060930 52523851 55827917 58186681 59333502 59689267 59771993 59536165 58474707
$$ packed form
34330A600088M53230O27596N16260N30021N93751L11809k84258p26191p93642
34321B828664o51580l11467L89620J139563J211151N18790p1489K2217K23814
34312E299283j71990p34173n83124J01101L60357P1537J02387P40447J119175
34303F305000O24222j25241l09469j13810j62947l59399j36731M52081P28781
34294F902487M30216R9344L12218R36931J324416J041856L47712o174M65392J372867
34284A3227265J806003J379087O45847L36475N31280Q45685J082368J305983J517005
34275B2676998J700539K073246K835360L688713M001755L557665K871631K640925
34267D6046832L014098L462921L304066K358764J146821L55765Q2726k35828j061458
$$ plain form
34258 58474707 56318172 53372669 50107646 46650202 42842528 38662464 34425274 30590198
34250 30590198 27411220 24736588 22178814 19593597 17350450 15933046 15252240 14592641
34242 14592641 13359788 11692255 10182560 9163608 8491299 7927793 7450861 7127489 6910151
34233 6910151 6729540 6675705 6849833 6982501 6409396 4665246 2110654 -194007 -1301320
34224 -1301320 -1002452 269499 1877202 3217156 3805854 3460689 2430444 1248916 465108
34215 465108 444063 1141281 1945694 2061541 1338150 514774 362101 824535 1371090 1891631
34205 1891631 2628048 3329276 3238558 2151526 867584 196556 -22594 -445204 -1106368
34196 -1106368 -1363760 -867519 -65261 374683 283902 -40993 -336421 -561383 -672528 -522116
$$ packed form
34258E8474707k156535k945503l265023l457444l807674m180064m237190l835076
34250C0590198l178978k674632k557774k585217k243147j417404o80806o59599
34242A4592641j232853j667533j509695j018952o72309n63506m76932l23372k17338
34233F910151j80611n3835J74128J32668n73105j744150k554592k304661j107313
34224a301320K98868J271951J607703J339954N88698l45165j030245j181528p83808
34215D65108k1045O97218Q04413J15847p23391q23376j52673M62434N46555N20541
34205A891631P36417P01228r0718j087032j283942o71028k19150m22610o61164
34196a106368k57392M96241Q02258M39944r0781l24895k95428k24962j11145J50412
$$ plain form
34186 -522116 -134287 126204 -7716 -131687 518368 1955921 3067487 2812830 1537425
34177 1537425 508951 282003 227054 -246402 -773057 -717275 -167032 305600 506559 693156
34167 693156 990677 1235865 1327742 1337552 1277787 1033158 520587 -192207 -795160 -731510
$$ packed form
34186e22116L87829K60491j33920j23971O50055J437553J111566k54657j275405
34177A537425j028474k26948n4949m73456n26655N5782N50243M72632K00959J86597
34167F93156K97521K45188R1877R810n9765k44629n12571p12794o02953O3650
$$ [...]
##END NTUPLES=NMR SPECTRUM
##END=
