##TITLE=31Pdec_DE_63_3_oil
 D2O, 64 sc
 6.8.2024
##JCAMPDX= 6.0         $$ Bruker NMR JCAMP-DX V2.0
##DATA TYPE= NMR SPECTRUM
##DATA CLASS= NTUPLES
##ORIGIN= UXNMR, Bruker Analytische Messtechnik GmbH
##OWNER= root
$$ XWIN-NMR		Version 3.5
$$ Tue Aug  6 14:02:13 2024 Russian Standard Time (UT+4h)  she@DPX200
##.OBSERVE FREQUENCY= 81.013821
##.OBSERVE NUCLEUS= ^31P
##.ACQUISITION MODE= SIMULTANEOUS
##.ACQUISITION SCHEME= undefined
##.AVERAGES= 64
##.DIGITISER RES= 17
##SPECTROMETER/DATA SYSTEM= spect
##.PULSE SEQUENCE= zgpg30
##.SOLVENT NAME= D2O
##.SHIFT REFERENCE= (INTERNAL, D2O, 0, 198.062)
##AUDIT TRAIL= $$ (NUMBER, WHEN, WHO, WHERE, WHAT)
$$ ##TITLE= Audit trail, XWIN-NMR		Version 3.5
$$ ##JCAMPDX= 5.01
$$ ##ORIGIN= Bruker BioSpin GmbH
$$ ##OWNER= she
$$ F:/spectra/data/she/nmr/P31/2/pdata/1/auditp.txt
$$ ##AUDIT TRAIL=  $$ (NUMBER, WHEN, WHO, WHERE, WHAT)
(   1,<2024-08-06 13:59:29.45 +0400>,<she>,<DPX200>,
      <created by zg, POWCHK disabled, PULCHK disabled
       configuration hash MD5:
       00 E9 B6 7A A2 85 ED C7 34 08 36 98 17 FE 4E 26
       data hash MD5: 32K
       28 07 87 52 7A 56 CA A7 BD 89 4A 66 3B 27 E0 FE>)
(   2,<2024-08-06 13:59:31.92 +0400>,<she>,<DPX200>,
      <Start of raw data processing
       efp BC_mod = 2 LB = 1.5 FT_mod = 6 PKNL = 1 PHC0 = 2660.968 PHC1 = 108.4869 SI = 64K 
       data hash MD5: 64K
       57 FB 72 45 8F 59 B2 BF B2 60 42 1F B6 C2 D4 A6>)
(   3,<2024-08-06 13:59:50.34 +0400>,<she>,<DPX200>,
      <pk PHC0 = -5.910271 PHC1 = 0 
       data hash MD5: 64K
       F5 2A 72 A4 0F B5 B8 00 8B 8D A0 ED A0 6C C2 10>)
(   4,<2024-08-06 13:59:55.79 +0400>,<she>,<DPX200>,
      <abs ABSG = 5 
       data hash MD5: 64K
       6C 2E 4E E0 87 17 FF 91 AF 95 62 F2 62 78 5C 3F>)
$$ ##END=
$$ 
$$ hash MD5
$$ D8 DA D8 25 3A DA D2 2F 2D 98 44 6B 89 24 84 20
##$RELAX= 
##$RELAX= 
##$RELAX= 
##$RELAX= 
##$RELAX= 
##$RELAX= 
##$RELAX= 
##$RELAX= 
$$ Bruker specific parameters
$$ --------------------------
##$DU= <F:/spectra>
##$EXPNO= 2
##$NAME= <P31>
##$PROCNO= 1
##$TYPE= <nmr>
##$USER= <she>
##$AMP= (0..31)
100 100 100 100 100 100 100 100 100 100 100 100 100 100 100 100 100 100 
100 100 100 100 100 100 100 100 100 100 100 100 100 100 
##$AQSEQ= 0
##$AQ_mod= 1
##$AUNM= <au_zg>
##$AUTOPOS= <>
##$BF1= 81.014009
##$BF2= 200.13
##$BF3= 200.13
##$BF4= 200.13
##$BF5= 200.13
##$BF6= 200.13
##$BF7= 200.13
##$BF8= 200.13
##$BYTORDA= 1
##$CFDGTYP= 0
##$CFRGTYP= 5
##$CHEMSTR= <none>
##$CNST= (0..31)
1 1 145 1 1 1 1 1 1 1 1 1 1 1 1 1 1 1 1 1 1 1 1 1 1 1 1 1 1 1 1 1 
##$CPDPRG= <waltz16>
##$CPDPRG1= <>
##$CPDPRG2= <waltz16>
##$CPDPRG3= <>
##$CPDPRG4= <mlev>
##$CPDPRG5= <mlev>
##$CPDPRG6= <mlev>
##$CPDPRG7= <mlev>
##$CPDPRG8= <mlev>
##$CPDPRGB= <>
##$CPDPRGT= <>
##$D= (0..31)
0 1 0 0 0 0 0 0 0 0.06 0 0.03 2e-05 3e-06 0 0 0.0002 0 0 0 0 0 0 0 0 0 
0 0 0 0 0 0 
##$DATE= 1722938368
##$DBL= (0..7)
120 120 120 11 120 120 24 19 
##$DBP= (0..7)
150 150 150 150 150 150 150 150 
##$DBP07= 0
##$DBPNAM0= <>
##$DBPNAM1= <>
##$DBPNAM2= <>
$$ [...]
##$SUBNAM3= <"">
##$SUBNAM4= <"">
##$SUBNAM5= <"">
##$SUBNAM6= <"">
##$SUBNAM7= <"">
##$SUBNAM8= <"">
##$SUBNAM9= <"">
##$SW= 400.765351723535
##$SWIBOX= (0..15)
0 1 3 0 0 0 0 0 0 0 0 0 0 0 0 0 
##$SW_h= 32467.5324675325
##$TD= 32768
##$TD0= 1
##$TE= 0
##$TE2= 300
##$TE3= 300
##$TEG= 300
##$TL= (0..7)
0 120 53 12 22 120 120 120 
##$TP= (0..7)
150 150 150 150 150 150 150 150 
##$TP07= 0
##$TPNAME0= <>
##$TPNAME1= <>
##$TPNAME2= <>
##$TPNAME3= <>
##$TPNAME4= <>
##$TPNAME5= <>
##$TPNAME6= <>
##$TPNAME7= <>
##$TPOAL= (0..7)
0.5 0.5 0.5 0.5 0.5 0.5 0.5 0.5 
##$TPOFFS= (0..7)
0 0 0 0 0 0 0 0 
##$TUNHIN= 0
##$TUNHOUT= 0
##$TUNXOUT= 0
##$USERA1= <user>
##$USERA2= <user>
##$USERA3= <user>
##$USERA4= <user>
##$USERA5= <user>
##$V9= 5
##$VALIST= <valist>
##$VCLIST= <CCCCCCCCCCCCCCC>
##$VD= 0
##$VDLIST= <DDDDDDDDDDDDDDD>
##$VPLIST= <PPPPPPPPPPPPPPP>
##$VTLIST= <TTTTTTTTTTTTTTT>
##$WBST= 1024
##$WBSW= 4
##$XGAIN= (0..3)
0 0 0 0 
##$XL= 0
##$YL= 0
##$YMAX_a= 15063
##$YMIN_a= -14071
##$ZGOPTNS= <>
##$ZL1= 120
##$ZL2= 120
##$ZL3= 120
##$ZL4= 120
##$ABSF1= 198.0616
##$ABSF2= -202.7028
##$ABSG= 5
##$ABSL= 3
##$ALPHA= 0
##$AQORDER= 0
##$ASSFAC= 0
##$ASSFACI= 0
##$ASSFACX= 0
##$ASSWID= 0
##$AUNMP= <proc_1d>
##$AZFE= 0.1
##$AZFW= 0.5
##$BCFW= 0
##$BC_mod= 2
##$BYTORDP= 0
##$COROFFS= 0
##$CY= -3
##$DATMOD= 1
##$DC= 0
##$DFILT= <>
##$DTYPP= 0
##$F1P= 0
##$F2P= 0
##$FCOR= 1
##$FTSIZE= 65536
##$FT_mod= 6
##$GAMMA= 0
##$GB= 0
##$INTBC= 1
##$INTSCL= 9.790993e-09
##$ISEN= 30
##$LB= 1.5
##$LEV0= 0
##$LPBIN= 0
##$MAXI= 10000
##$MC2= 0
##$MEAN= 0
##$ME_mod= 0
##$MI= 50
##$NCOEF= 0
##$NC_proc= -9
##$NLEV= 6
##$NOISF1= 182.463
##$NOISF2= 159.3651
##$NSP= 0
##$NTH_PI= 0
##$NZP= 0
##$OFFSET= 198.0616
##$PC= 4
##$PHC0= 2655.058
##$PHC1= 108.4869
##$PH_mod= 1
##$PKNL= yes
##$PPARMOD= 0
##$PSCAL= 0
##$PSIGN= 0
##$REVERSE= no
##$SF= 81.0140089999434
##$SI= 65536
##$SIGF1= 159.3651
##$SIGF2= -187.1042
##$SINO= 113.3802
##$SIOLD= 16384
##$SREGLST= <1H.CDCl3>
##$SSB= 0
##$STSI= 65536
##$STSR= 0
##$SW_p= 32467.5324675325
##$SYMM= 0
##$S_DEV= 0
##$TDeff= 32768
##$TDoff= 0
##$TI= <>
##$TILT= no
##$TM1= 0
##$TM2= 0
##$TOPLEV= 0
##$USERP1= <user>
##$USERP2= <user>
##$USERP3= <user>
##$USERP4= <user>
##$USERP5= <user>
##$WDW= 1
##$XDIM= 65536
##$YMAX_p= 371684372
##$YMIN_p= -49257384
$$ End of Bruker specific parameters
$$ ---------------------------------
##NTUPLES= NMR SPECTRUM
##VAR_NAME=  FREQUENCY,     SPECTRUM/REAL,   SPECTRUM/IMAG
##SYMBOL=    X,             R,               I
##VAR_TYPE=  INDEPENDENT,   DEPENDENT,       DEPENDENT
##VAR_FORM=  AFFN,          ASDF,            ASDF
##VAR_DIM=   65536,         65536,           65536
##UNITS=     HZ,            ARBITRARY UNITS, ARBITRARY UNITS
##FACTOR=    0.49542278885378, 1,            1
##FIRST=     16045.7642231865, 0,            0
##LAST=      -16421.768244346, 0,            0
##MIN=       -16421.768244346, -49257384,    0
##MAX=       16045.7642231865, 371684372,    0
$$ Real data points
##PAGE= N=1
##DATA TABLE= (X++(R..R)), XYDATA
$$ [...]
42127 -14787088 -14784748 -8648862 -1456198 1896907 2324025 4467187 10530572 18102871 22810975
42118 22810975 21847249 16255434 10275225 6667176 3189749 -3160440 -9411044 -9550055
42110 -9550055 -4560816 -2768028 -7724862 -12578900 -10659011 -5229153 -3058832 -4058829
42102 -4058829 -4367531 -4984212 -8817130 -12040519 -7649161 2904582 10268632 10372459
42094 10372459 9220051 12526135 17930129 20896621 21940385 23232262 22732363 17180790
42086 17180790 8414222 1770057 -743447 -1623867 -2589909 -1927017 1772715 5716443
42078 5716443 4845585 -2545795 -12152781 -17106604 -13975756 -5140400 4313422 10952885
42070 10952885 14171188 14633935 12850167 8824833 2696943 -3518476 -5272161 776817
42062 776817 11400057 18146405 16247235 9751710 5382242 4151249 2727482 497595
42054 497595 -34936 1013668 370922 -2419879 -3419221 -397565 3642295 5256024 5271659
42045 5271659 6032103 6991622 6450786 5665599 7368341 10540666 9966179 2091050 -10400463
42036 -10400463 -21029568 -25707842 -25315012 -22371423 -17030393 -8241863 1761268 7275108
42028 7275108 5153467 -1031713 -5229921 -5955280 -6483771 -9052320 -12074082 -13145112
42020 -13145112 -11935993 -9551552 -7406559 -7343410 -10668788 -16181938 -20664000 -21780731
42012 -21780731 -19365405 -14377056 -8539142 -4387652 -3058379 -2328514 266483 2701635
42004 2701635 555787 -5795130 -10328137 -9267566 -5755954 -4161951 -3547756 -529857
41996 -529857 4143458 6466108 5520486 4540512 5356148 5555120 2614329 -1801752 -3740376
41987 -3740376 -1895864 1288480 3243805 4443465 7233505 12237707 17049860 18705770
41979 18705770 16687236 13117971 10761741 11323784 14708611 18808677 20458121 17587837
41971 17587837 10549790 1605502 -5836984 -8153939 -4652293 -383045 -1887751 -7976846
41963 -7976846 -9152588 -321121 10197999 10833300 3094908 -645135 4528704 9125429
41955 9125429 3695051 -7628095 -13487608 -9979833 -3113536 295636 -1131475 -4655785
41947 -4655785 -6851749 -6339715 -5165557 -5863157 -6240646 -1035504 8995947 14615417
41939 14615417 9250398 -1304428 -5881994 -1991838 3012071 3264451 746736 161916
41931 161916 2593117 5431757 5274363 417364 -6779794 -10242051 -5782686 3743804
41923 3743804 11167061 12203532 8099943 3072471 1781828 6883290 15471274 20309944
41915 20309944 18550982 16372241 19985691 25285595 23488348 15108011 9957339 12998554
41907 12998554 18248336 18445838 13513156 7053962 1140041 -2602412 -2740792 -1571817
41899 -1571817 -3228675 -6392073 -5850492 -3520743 -8950621 -23978592 -35842781 -33028539
41891 -33028539 -20461683 -10191397 -3788864 4958316 14677611 16966904 11548248 8218308
41883 8218308 11244784 12721494 5807484 -4602206 -10205519 -11094851 -12604419 -15394389
41875 -15394389 -15539090 -11740709 -6378715 -676216 5955371 11870288 12728503 6295391
41867 6295391 -4266247 -12664438 -14646152 -11546355 -8975858 -10699116 -13764135 -11877034
41859 -11877034 -3836001 4510969 7772047 6921172 5603011 4112774 679460 -3406802
41851 -3406802 -3800422 2276140 13523862 25348130 31453397 27491088 16428268 7784721
41843 7784721 7193246 8595577 2030621 -11864725 -21472925 -19271646 -11018142 -6783220
41835 -6783220 -7929253 -7777310 -2266497 5280026 9419308 8461955 4421438 -124902
41827 -124902 -3934616 -7125563 -10095270 -12294378 -12529680 -10718612 -8180129 -5599333
41819 -5599333 -2367182 904012 1251023 -2986745 -8820012 -11692038 -11208100 -11000138 -13243193
41810 -13243193 -16389448 -18574544 -19881826 -19911766 -16186352 -7443018 3258862 11180773
41802 11180773 14813930 16283676 17695618 19112054 19811105 19601240 18600951 16944572
41794 16944572 14812705 11865232 7093956 653796 -4485198 -4715400 -208228 4507676
41786 4507676 5452847 3516093 2669805 4769726 7699215 8503199 6885850 5081513 5126933
41777 5126933 6875460 8248865 6919114 2021153 -5181769 -12095552 -16341502 -16783158
41769 -16783158 -13758125 -9177070 -6156187 -6935261 -10123876 -11155948 -7162249 -934354
41761 -934354 1779296 -1112426 -6067421 -8802956 -8905153 -8704648 -9962790 -13210067 -17964784
41752 -17964784 -21331223 -18734124 -9398948 491787 3955274 1523243 -833279 -1294902
41744 -1294902 -3984837 -10110085 -13513092 -8814219 444898 6352575 6401569 4293548
41736 4293548 3287811 3433986 3958347 3781696 585617 -6092872 -11519087 -10408288 -4870801
41727 -4870801 -2640285 -6686851 -11724307 -12439480 -9823883 -6727560 -2369440 4347141
41719 4347141 9778673 8996599 2687347 -3638395 -6261665 -5295024 -1115078 6834906
41711 6834906 17071042 25270777 27811383 24502761 17687127 10527365 6047278 5341845
41703 5341845 5980658 4064114 -1267715 -6622266 -8064931 -4860867 574885 4962814
41695 4962814 6156082 4516674 2979895 4436889 8285398 10555241 8129908 2142039
41687 2142039 -3215629 -4593575 -2086985 1161470 1713125 -1062888 -4502404 -5766279
41679 -5766279 -4893205 -3695537 -2567721 -595522 1520851 1648539 97711 183211 2930749
41670 2930749 4016812 -708364 -8228860 -10824916 -5497779 2660651 7426711 8446228
41662 8446228 9370778 11824051 14334341 15866825 16993561 17503900 15797674 11688441
41654 11688441 7798254 6965352 9573990 14121814 18617306 20313433 16311856 7012876
41646 7012876 -2077457 -4820644 -896190 4249012 5928526 4445266 2422522 555559
41638 555559 -2247863 -5960655 -8521373 -7576378 -2546288 4293904 8561611 7214951
41630 7214951 2278240 -316914 3005322 9440572 13304397 12301155 8722447 5739269
41622 5739269 4864540 6467995 10093910 13728975 14747729 12527305 9065104 6643508
41614 6643508 5998532 6915869 8988834 10944809 10573237 6817458 1679957 -1094434 278562
41605 278562 3500222 4225367 459882 -5432793 -9634752 -11164227 -11839409 -12255373 -10303513
41596 -10303513 -4770107 2088408 7714919 12877900 19104871 24032583 23297068 16960578
41588 16960578 10300642 7455601 7533904 7911330 7973928 8084790 8071674 8669494 11328573
41579 11328573 14318165 12546659 4837261 -1683734 577970 9123006 14229766 12261001
41571 12261001 10118546 14372843 21230164 21519569 12643768 991485 -6299845 -7640080
41563 -7640080 -5040167 -116561 6014623 11483694 14938901 17288321 20359328 24170246
41555 24170246 26950635 27555785 26257551 23107776 17509580 10509066 5817821 6237644
41547 6237644 9348096 9188220 3255433 -4037338 -6728799 -4917554 -4324804 -8221912
41539 -8221912 -12845654 -12659080 -7887685 -3728941 -2966087 -2997215 -754761 3092196 6762652
41530 6762652 10754492 15183158 16401100 11325246 4311624 3984637 11873189 19420349
41522 19420349 19029686 13399177 9948743 10261212 10788664 11205882 14833355 20895829 23261272
41513 23261272 18887955 12159867 8388748 7714365 8082847 9343883 10563355 7843765
41505 7843765 115495 -6247714 -4808017 815414 929277 -6426284 -12725746 -11734951
41497 -11734951 -8141830 -9071165 -12226919 -9129382 1565112 10547858 9184657 -59979
41489 -59979 -7331657 -7022383 -2294505 1441932 3925110 8737485 16325934 21778490 20607180
41480 20607180 14311257 8024836 4223535 1690680 -91017 534679 3526120 5517575
41472 5517575 4482221 3220413 5112954 8603508 9811386 9260711 11170197 15798262
41464 15798262 17492756 12447788 4364664 -593876 -1307278 -674304 232696 2618611
41456 2618611 6083764 8865075 11327162 14630718 16165539 11691866 3118174 -1471213
41448 -1471213 1747673 6918143 7293035 4817832 5719840 10121548 12643445 11751902 11629546
41439 11629546 14406396 16773733 15904223 13323058 10640540 6320088 -267073 -5637052
41431 -5637052 -6587418 -4759003 -3458479 -2673802 -832505 950863 638709 -217698 1829484
41422 1829484 6258634 8450550 5953428 1466493 -1496584 -3072658 -5508063 -9094590
41414 -9094590 -11682789 -11641410 -9751705 -7927960 -6947971 -6206158 -5457284 -5518046 -6527861
41405 -6527861 -6963473 -6119169 -6193061 -8941977 -11018097 -6845229 2996316 10482564 9340286
41396 9340286 1934823 -5345280 -9699426 -11726341 -11679537 -10648069 -12372973 -18195430
41388 -18195430 -22075923 -16886817 -5278685 1811414 -1634551 -10375884 -16070189 -16356139
41380 -16356139 -13334503 -8049819 -923768 4872949 4923502 -1492623 -10029232 -14909834
41372 -14909834 -13270519 -6693489 695947 5829909 8376744 8979426 7771489 6136185
41364 6136185 7514082 13186423 18898734 19672126 16799337 15324517 15265227 11255428 1798006
41355 1798006 -7219511 -10657632 -10265109 -9330833 -6275333 1655941 11782981 18097090
41347 18097090 18065405 13277354 5310330 -4487747 -12194320 -13191381 -7837607 -2237674
41339 -2237674 -2007548 -6459883 -9416087 -5383062 4629678 13413566 14900981 10838966
41331 10838966 7704768 7382486 5297003 -898848 -6022955 -4574924 663096 2238213
41323 2238213 -1837949 -6282397 -5848996 -423604 6416501 10218384 7610877 -892076
41315 -892076 -9966968 -14122341 -13139599 -10859747 -9778389 -9574801 -9662770 -9676102 -7938237
41306 -7938237 -2766778 4674321 11295056 15353779 16533487 14085259 8229241 2699166
41298 2699166 2307125 7655395 14664209 19027627 18988210 14922622 9237365 5803720 6231413
41289 6231413 7169369 4196765 -2350031 -8315255 -11292381 -11814102 -10055909 -5307714
41281 -5307714 1563083 8436189 14164350 17620286 16313341 9976243 3752208 2817416
41273 2817416 4964196 3743403 -1993510 -7403398 -9830385 -11393727 -13339757 -14196824
41265 -14196824 -14201686 -15382248 -16645976 -15254809 -13543020 -16487716 -21548461 -19875190
41257 -19875190 -10399574 -3315139 -4728075 -6980922 -1291617 7736655 9050781 1454203
41249 1454203 -5750376 -5387189 1728920 10924217 16803926 14637565 5282538 -3011546
41241 -3011546 -3409678 1129998 3505043 2789286 2123385 50402 -7188846 -16503493 -20235945
41232 -20235945 -17525985 -15081401 -16245269 -17499104 -16677243 -16084181 -15450473 -10316592
41224 -10316592 -894921 5128862 3099322 -1790944 -2918428 -1624608 -2886921 -6634643
41216 -6634643 -9452112 -11303365 -14144194 -15667917 -10401612 2839503 18470828 29214840
41208 29214840 31209055 24999451 14404009 4326522 -2211247 -4979950 -4506198 -1313162
41200 -1313162 2020664 1402422 -3589543 -7655156 -6039763 -949803 1492903 -872277
41192 -872277 -4860974 -7288723 -7877759 -7013936 -4266036 -34823 3922440 6577245 8402004
41183 8402004 9580467 9414004 8160210 7536143 8381091 9426838 9616333 10323622 13717767
41174 13717767 19660041 25774873 30237852 32819269 33068992 29490238 21859968 13095144
41166 13095144 6889477 3856377 1860523 115772 661105 4773352 9751740 10946705
41158 10946705 6328902 -1796283 -8801244 -11066161 -8735531 -5721087 -5331578 -5625602
41150 -5625602 -1734766 6471110 12708618 12283451 7869072 4111883 607005 -4699218
41142 -4699218 -8429847 -4955526 4292264 11214988 11163013 7006673 2706265 -1112684
41134 -1112684 -3917814 -3780069 -1581906 -1370838 -3778520 -4054854 420566 5635546 7387513
41125 7387513 7380780 8738737 9890406 7856258 4015457 1447263 -393897 -2891456 -2868796
41116 -2868796 3613512 13219315 17467669 13364030 6645298 3483253 3669697 3654798 2329729
41107 2329729 1349737 2180420 4964122 8926582 12447296 13593351 11535117 7209874
41099 7209874 2771508 877112 3456338 9473566 14198033 12487553 3538885 -7996796
41091 -7996796 -15674679 -16151096 -11176933 -4872332 1288179 9483546 19981798 26908713
41083 26908713 24092347 14463821 7845514 8187910 9105167 4642991 -2189301 -6264188
41075 -6264188 -9305293 -15030704 -20073080 -18175064 -10995489 -6203320 -5514177 -2862919
41067 -2862919 4752834 12217026 14096871 11226565 7283341 4189884 2914254 3638713
41059 3638713 3116675 -2876015 -12052366 -15784399 -9860544 -499008 3717028 1800833
41051 1800833 -1269791 -2414328 -2609753 -3658882 -6275584 -9688723 -11005671 -7421243
41043 -7421243 -974870 2110346 -813823 -5289998 -6829536 -7448926 -10867820 -14660396
41035 -14660396 -12873309 -4982333 3136421 7041034 8032304 9185615 11003178 12263917
41027 12263917 12389543 11426641 9203895 5692523 1693049 -1332704 -2411831 -2685128
41019 -2685128 -5329657 -11890899 -18663934 -19448369 -12738493 -3437860 3380710 6873246
41011 6873246 7407663 4115996 -1256180 -2765181 2377291 8280475 7982263 4089780
41003 4089780 5271050 13263095 20250019 19637605 13072811 5340437 -1672599 -7257557
40995 -7257557 -9105205 -5725802 1262134 9236637 15876997 17379349 10266343 -2368205
40987 -2368205 -11155084 -10937818 -7264083 -8268290 -13614849 -16574771 -14289168 -10009674
40979 -10009674 -6606474 -4089433 -3423553 -6541747 -11194367 -11361481 -5271111 1467342
40971 1467342 3490685 2523995 3424025 6763578 9140390 8566826 5896810 2534933 9369
40962 9369 225297 2800190 3673875 -87117 -5561079 -7841379 -7003407 -6586198 -6648834
40953 -6648834 -4385801 -1249255 -2271462 -6785227 -7261980 -914061 4503859 1700622
40945 1700622 -5482748 -9142908 -9896393 -13817674 -19916520 -20509754 -14010171 -7995102
40937 -7995102 -7321390 -7457231 -3504617 1310582 1769738 97991 2572439 9157417 12964083
40928 12964083 10129539 5251793 5196989 10342429 14401756 12359430 6455448 2796165
40920 2796165 3012263 2552643 -1567311 -5299861 -3574763 1427880 3547650 2254246
40912 2254246 2329678 4662203 5148319 3846486 6757683 15080737 20732379 17918366 12079545
40903 12079545 10455998 9870123 2754603 -8425588 -12646984 -5801448 3798867 6797368
40895 6797368 2888429 -2610826 -6687298 -9920417 -13146782 -15703588 -15932251 -12646239
40887 -12646239 -6911782 -1637860 1821141 4929377 8192103 9077935 6821504 6051158
40879 6051158 10854844 17617817 19304913 15312466 11120529 9088490 6215392 1407348
40871 1407348 -1708070 -1157991 -281828 -2460617 -6359475 -8641428 -8088213 -5531320 -2736591
40862 -2736591 -1987266 -3440236 -3089152 2284381 8551143 8440354 2770349 731958 6998806
40853 6998806 15286212 17883808 15114635 11152722 6688927 1425009 -1158036 1866207
40845 1866207 6850930 7897300 4956351 2205382 558469 -2276741 -5477136 -4809313
40837 -4809313 1046081 8560340 14320618 18139056 20647652 21044285 18167862 12016583
40829 12016583 4277930 -1454236 -1629835 3011646 7148966 7442767 6978744 9766809
40821 9766809 13626748 13609113 10620910 10520794 14933182 19148263 20035628 19906714 20416597
40812 20416597 18603899 12735844 7206114 6738331 9107908 8959628 6662906 7387747
40804 7387747 11810159 13908921 9869347 4110925 3078358 6674987 10093721 11681056
40796 11681056 13720797 16164751 15473381 11163494 8027116 8528444 7658998 285958
40788 285958 -9725761 -13788940 -10279265 -5523486 -3621734 -2280992 144863 903011
40780 903011 -436627 2024833 12479395 25682085 32645410 31025256 24882945 17179330
40772 17179330 8549259 1731806 467326 3409118 4507435 883919 -3749326 -4925114
40764 -4925114 -3034325 -1134003 136259 2897856 8153448 13357312 14538412 11002979
40756 11002979 7208181 8187899 13108305 16132097 14433249 11501990 10322483 7799532
40748 7799532 377039 -8518879 -12665998 -12464157 -13417331 -15956126 -14127651 -5841481
40740 -5841481 2355203 4021244 1244046 418971 3280730 6314738 6913679 6083840 5530262
40731 5530262 4946245 2794898 -1182099 -4516821 -3610505 2154159 8574911 10850263
40723 10850263 9236026 8164694 10040923 12836664 14138263 14499419 15680212 17909811
40715 17909811 19953006 20247583 17782908 13641321 11084919 11665588 12422057 10584361
40707 10584361 9741110 15780985 26591462 32310815 28028492 20273864 17611451 20376306
40699 20376306 23988426 27033130 30042056 30195056 24306466 15463309 10403563 10914587
40691 10914587 13316478 15730771 19623481 23655743 22516303 14471600 5139258 562382
40683 562382 285494 610609 1427081 5477581 12451322 18120655 19450537 17454675 14648456
40674 14648456 12554756 12580853 16333855 22628473 25981113 21482362 11446151 4481683
40666 4481683 6611978 15141360 22829685 26312941 27926234 30345873 32878673 33719539
40658 33719539 33025406 31952974 30251548 26742052 21730725 17688895 17469752 22024452
40650 22024452 29245293 34806742 35038928 29722605 22016416 15854806 13808490 16544778
40642 16544778 22607500 28580505 31021433 29019143 24473631 20233586 18738724 21444416
40634 21444416 27610539 33915839 37138450 37234122 36379800 35659211 34605162 33179894 31771588
40625 31771588 29997576 28273147 29594316 36152311 44762091 49781440 50308334 49833246
40617 49833246 48933599 44420672 37053365 33370900 36536223 41413213 43176308 45136833
40609 45136833 52048952 60166095 61256459 54269993 46199717 42427683 42484093 44755140
40601 44755140 48790626 52080786 50519160 44325970 39337962 40301917 45828426 51210289
40593 51210289 53370510 52196610 50087139 51137767 57619998 65953082 69038224 64162958
40585 64162958 56322318 52486624 54863024 60906658 67169736 70987013 70542124 66421113
40577 66421113 62970488 65825782 76805977 91520940 102897100 107798778 109856810 114686488
40569 114686488 122837648 129909919 133935847 138965779 148955116 161318119 170374244 175196830
40561 175196830 179791613 186393714 192642588 195224435 192961741 186768359 179934408 177665154
40553 177665154 182257506 189020956 191108239 188146823 185539569 185360571 183573459 177487086
40545 177487086 170246252 165272367 161168593 155572976 150081728 147562616 147577716 148026187
40537 148026187 148770766 150172694 150331960 147474283 143480023 141669015 142424945 144230594
40529 144230594 147701999 154783581 164098554 170478217 170147523 164806795 160242836 161818199
40521 161818199 170807407 183929596 196649065 207172092 216038557 221978688 221452399 214230548
40513 214230548 206494019 205139632 210770432 219412009 229054398 239884743 248935792 250342252
40505 250342252 242997074 233691567 229332572 228529173 224319173 213767305 201024768 190837227
40497 190837227 182771533 173751102 163828045 156574222 154475609 156334339 158940396 158785409
40489 158785409 152056259 136404304 114843469 95618540 85433916 83640944 84790435
40482 84790435 85182811 84355793 81916593 77002186 70934812 66853264 65772039 65601530
40474 65601530 64803428 64468434 65666209 66765245 64707554 58137698 49194619 42923667
40466 42923667 43474260 48842021 51195971 45806076 38060252 36958330 42505557 45485293
40458 45485293 40493215 32807193 29519070 29521759 26898359 20617776 15936921 17514355
40450 17514355 24425202 31203387 32156901 26241395 18840780 16639301 20115019 24045717
40442 24045717 25583244 27118026 29985072 31037746 28265961 24455225 21818483 18270577
40434 18270577 12924971 9679531 10561178 11247912 8975284 9017377 16077668 24711290 27080937
40425 27080937 25754318 28732796 34905225 35609632 29419527 23921959 22384105 20216525
40417 20216525 16683577 18318089 26247043 30794149 24894170 14028171 6281282 826656
40409 826656 -5901331 -9881485 -5100730 4650097 8890117 3926130 -3863566 -7109143
40401 -7109143 -3959254 3216563 10214662 13001700 11687019 11082018 13837525 16188244
40393 16188244 14931300 14241384 18712151 23305227 19180517 8059803 1166874 3102131
40385 3102131 6224016 3897244 494402 3092963 10050565 14096609 12415292 7888349
40377 7888349 3416277 276300 -228942 1540518 1947940 -1300541 -4499769 -2576279
40369 -2576279 2890772 5417521 2991252 326071 964391 2369910 1070911 -1781157
40361 -1781157 -3269917 -3869292 -5882008 -8594932 -8798656 -5407906 -307305 4968066
40353 4968066 10021614 12972371 10877271 4435229 -784656 -453559 3067009 4225726
40345 4225726 1985402 576134 2542572 4722375 3029463 -1350501 -3551785 -1913207
40337 -1913207 -179972 -2182766 -6741700 -9546857 -8704693 -6309901 -5009891 -5376266
40329 -5376266 -7217680 -11118001 -16750609 -21088452 -20947030 -17219551 -14127519 -13581076
40321 -13581076 -12579561 -7768760 -859352 2757018 280306 -5473013 -9241294 -7959921
40313 -7959921 -2176318 5430664 11905690 15157222 14489893 10669008 5650119 1905982
40305 1905982 1138907 3128682 6129227 8436617 8936148 6372799 -130321 -8825391
40297 -8825391 -14990391 -14487228 -7437714 2324111 10735772 15921159 18537261 20891626
40289 20891626 24524902 27559778 26029429 19344665 12529627 10639317 12509346 12925685
40281 12925685 9766122 5550740 2579934 548777 -526926 1109665 5767783 10417559
40273 10417559 11782175 9632695 6033644 3160231 2581845 4495146 6676656 6382863
40265 6382863 4330805 4341445 7508911 9285752 5019353 -2971913 -6701761 -1184514
40257 -1184514 9675118 16535665 13930117 6060217 2611171 8330214 18219407 24372737
40249 24372737 25208354 24622631 23990248 20457376 13390546 6875178 3856593 2664882
40241 2664882 1777343 3087125 7046969 9382221 7295472 4885911 6842813 10004814
40233 10004814 7751530 878633 -3100275 -1302101 1108331 481769 966999 7496847
40225 7496847 17208717 22431468 19851362 12950706 6738729 3293533 1891859 821886
40217 821886 -1179168 -3797255 -5391932 -5082396 -3891480 -2920427 -1400536 1945150 6207866
40208 6207866 8737707 8393449 6836164 6092677 6233281 6504401 7521402 10322008 13518762
40199 13518762 13944189 11215733 9270905 11050611 13487800 11197122 4316774 -1507043
40191 -1507043 -3420857 -5075859 -9903974 -14819459 -14375097 -8611933 -2762344 -590777
40183 -590777 -1703428 -4339277 -6987078 -7817407 -6383198 -5775893 -9191312 -14042451 -13634363
40174 -13634363 -5860742 3731157 9339603 11334161 12303586 10444128 2039904 -10649753
40166 -10649753 -19311485 -18791976 -12717922 -7780870 -5328653 -1945254 3226527 6241380
40158 6241380 4482021 1383331 2138417 6504285 9071655 6187566 -246745 -5913330
40150 -5913330 -8277126 -7199731 -4075996 -1490857 -1672578 -4228232 -7038144 -9687407
40142 -9687407 -13618236 -18466573 -21342916 -20825893 -18454988 -14912919 -8516438 252591
40134 252591 6692719 7826050 7141860 9488225 13999838 16374891 15726133 14283754 12024980
40125 12024980 6868789 -446942 -6538323 -10245824 -12994127 -14589060 -13213333 -9799933
40117 -9799933 -8047592 -9452438 -11926638 -13363077 -12790333 -8520580 -35728 8085177
40109 8085177 9394968 3932928 -1351419 -1699871 778679 2836403 4909514 7592605
40101 7592605 8548576 6793257 5984631 9163067 13082168 11910937 4750494 -3997006
40093 -3997006 -10295275 -13442261 -14435884 -14076954 -12448974 -9013950 -3888279 755787
40085 755787 2325912 897861 -1900260 -6919372 -16340270 -27588095 -33177343 -29266739
40077 -29266739 -20530276 -13646283 -9558561 -5491250 -1241637 651189 -1044989 -5351774
40069 -5351774 -10299444 -12455858 -8053011 2099394 11447077 14990442 15233327 17169341
40061 17169341 20237460 20061538 15957376 11145033 6531423 -32584 -8081942 -13329257
40053 -13329257 -13373296 -10517171 -7556755 -4394532 -458623 2800398 4187322 5351490
40045 5351490 8462242 11999400 11071433 2801313 -9188437 -16897758 -15589278 -8822668
40037 -8822668 -4369070 -5478521 -8491925 -9093100 -7624023 -6964874 -8350247 -11248034
40029 -11248034 -14515955 -15583209 -11587163 -4042009 564209 -1935010 -7913191 -10819458
40021 -10819458 -8875138 -4617107 177687 4706023 6708335 4835908 2121221 2538265
40013 2538265 5223130 6417111 5773163 5922314 6890475 6323663 4980666 6521190 11027423
40004 11027423 13495258 10156280 2769298 -4166024 -7360612 -5968554 -2504534 -2397769
39996 -2397769 -8607548 -16586842 -18760987 -14232194 -9623952 -9820603 -12669735 -14068949
39988 -14068949 -13454523 -11957516 -9168245 -4749080 -755956 182156 -2355022 -6790705
39980 -6790705 -10965435 -12641461 -10348173 -4632150 2186967 7200007 7725958 3374606
39972 3374606 -1498337 -1045293 3926324 5724143 1554402 -476344 6052946 13250953
39964 13250953 9110563 -3548707 -10674064 -8100311 -5337135 -6867356 -4436176 6574017
39956 6574017 16640509 16487566 10957428 8839415 8198942 2750221 -4568124 -6236454
39948 -6236454 -3481666 -3571590 -7037547 -8361435 -7186046 -8366129 -11891260 -12536659 -9208110
39939 -9208110 -5565555 -1694174 5432597 12762737 12197227 2990863 -5446750 -5917974
39931 -5917974 -1000061 4397513 10074342 16055521 18196803 13867624 7326758 4367023
39923 4367023 4829379 4422093 1176756 -3241471 -6123431 -4928157 1425394 9991479
39915 9991479 15120428 14581507 11815259 10370895 9427997 7087140 4546553 3908688 4754201
39906 4754201 5990506 8206038 10701021 9148845 1013268 -8321713 -10102521 -3106212
39898 -3106212 4520490 5590252 2179912 1129705 3983404 5275993 753887 -6127955
39890 -6127955 -8260571 -4169360 -240796 -2719954 -9712539 -13368412 -9062360 83268
39882 83268 7848834 11599533 13121052 14504874 15433240 14817141 13512949 13586471 14754794
39873 14754794 13742938 9081575 4820874 5977976 10806394 12094400 7186713 1794745
39865 1794745 1132652 2124998 -871731 -6210101 -6798868 -285199 8215340 13274972 14257608
39856 14257608 13190412 11818744 11249551 11207804 9715794 6336804 4498121 7079996
39848 7079996 11482801 13487232 13974665 16272970 18822846 17529646 14280832 14896898
39840 14896898 18439059 17612655 11527802 8368775 11549833 12868471 5686168 -3597417
39832 -3597417 -5485545 -2172721 -2781437 -7930014 -9154752 -2662284 5125306 6660054
39824 6660054 1406857 -6060538 -10916766 -10329926 -5268021 -644454 -223791 -1781779
39816 -1781779 -793171 2335995 3209220 785917 -1044125 920888 6447912 14420421
39808 14420421 23323594 29184595 28267357 22801461 19273434 19728665 19330736 14244224
39800 14244224 7558064 5036431 8561730 15975234 23903250 28205533 25037651 15102049
39792 15102049 5024644 1233627 3097477 4248492 142094 -7154900 -10984924 -5888301
39784 -5888301 7483255 21996244 29495186 27844543 22076331 18088987 16306189 12496437
39776 12496437 4084985 -5568314 -9641447 -4813138 4469872 9961318 8415550 4649774
39768 4649774 4554480 7486894 8376988 5190856 112571 -5435371 -11702337 -16307945 -14704198
39759 -14704198 -7174311 -678350 -488987 -3570591 -3714541 -43536 3822195 6649919
39751 6649919 10393129 14565875 14957536 9781620 3742585 3176948 8331483 12868718
39743 12868718 11359126 5710947 2786948 5998659 11200052 12014834 7496778 2236419
39735 2236419 46347 744688 2867011 5598518 6977952 4171508 -2086532 -6524480
39727 -6524480 -5666336 -2482449 -1662942 -2988356 -3513083 -4205651 -8993355 -17315818 -22770461
39718 -22770461 -20686230 -13270553 -5646081 -246627 2861393 3479433 2252177 1953483
39710 1953483 4305637 6418673 3603221 -4221043 -11526415 -13158120 -9373448 -4218553
39702 -4218553 -542537 2247027 6356314 12557376 18828007 21937522 20867994 18358800
39694 18358800 17944188 19658321 20327882 18156702 14578832 10702082 5050535 -2615423
39686 -2615423 -8084857 -7557253 -4125911 -4095973 -6944616 -5133425 3983531 12136237 10414806
39677 10414806 989600 -6795631 -8489276 -6445585 -2354307 4398032 11234156 12944352
39669 12944352 9399266 6227749 5857025 4421169 257027 -1541187 2536092 7873672
39661 7873672 9043112 7836222 7483882 4701642 -3581509 -9928515 -4067213 10321848
39653 10321848 18216137 14287012 9576141 12590897 15323421 7110334 -6171287 -8930824
39645 -8930824 1562058 11403103 9512419 624712 -4531313 -3744134 -2215321 -1971398
39637 -1971398 951347 9752729 21838656 31122849 33289949 28826113 22273530 18352021
39629 18352021 17953688 18199736 16490803 13294150 10646122 9597596 9973716 11112651
39621 11112651 11939713 11847543 12248372 15215052 19549480 20842720 17446357 13799822 14887374
39612 14887374 19480954 22468213 22360475 22270384 23996772 25473446 24443446 20842020
39604 20842020 15290355 9465760 8363254 16695088 30754116 38990659 34518347 23391863
39596 23391863 16801452 18586506 24473632 29798756 32365680 30364507 23899468 17497065
39588 17497065 15134421 13547646 6764579 -3027988 -6286946 1112008 13014567 22967523
39580 22967523 31420504 38953084 39874810 29705374 14504981 5308676 5427060 9531829
39572 9531829 13366750 17545844 22456065 26424251 29988061 35797015 42112118 41793247
39564 41793247 31312882 17418443 11279617 17500731 31035189 43376059 49715897
39557 49715897 51054609 51318215 52849464 54656705 55104446 54860305 55415097 56016720 55019259
39548 55019259 53569416 54275311 56190557 55479499 52339551 52745992 60398772 70414326
39540 70414326 74733391 71611158 66152358 63049309 62584704 63059725 63447240 63402837 63538200
39531 63538200 65958073 71927503 78747689 81672083 79626685 76491476 75765075 76639675
39523 76639675 77110128 78567850 84390694 94808947 105812483 113283453 116383811 116956189
39515 116956189 117843133 122287709 132294192 145551690 155780850 159000379 158933034 163321954
39507 163321954 174535584 186559849 192285399 191137002 187944481 187028938 190039635 197288326
39499 197288326 207298914 215732162 218459882 216085305 212734157 210479333 207981074 204514900
39491 204514900 201480609 199037398 195152698 189819619 186682155 187876234 190028279 188174952
39483 188174952 181475870 172351299 162084124 150488710 138611048 128655150 121737495
39476 121737495 117730658 116142838 115052669 110838067 101834180 91148418 83009901 77270233
39468 77270233 70469643 61722540 54554637 52795739 56555388 61866845 63190483 58181733
39460 58181733 51631117 51485702 57927988 60379627 50621740 35432048 28801911 33444373
39452 33444373 38779616 37446858 34044828 34284305 34731897 29658568 21478663 17041419
39444 17041419 17512049 18696512 18877996 20201359 23705065 27965658 31379532 31680784
39436 31680784 25255520 11639259 -2826118 -10236664 -8778007 -1824151 7538683 16280653
39428 16280653 19173808 13815977 6427602 5633934 11014715 14598750 13221915 11656206
39420 11656206 12843953 13449283 11705332 11761289 15917465 19044226 15817301 8532242
39412 8532242 2774891 -542598 -4033552 -8333737 -12454028 -16502275 -19430928 -16903557
39404 -16903557 -6339357 7692630 17282987 18942878 14638257 7923782 2774142 3046213
39396 3046213 8081005 11077978 6994559 355624 -42572 7075140 14390971 16074811
39388 16074811 13557716 11135962 10809417 12302812 14287941 14995964 14533159 15637422
39380 15637422 18560017 17384648 7326153 -5467597 -8682874 763786 13139260 19480539
39372 19480539 21347733 23478764 24016599 18465309 8967674 2798083 3189097 6782343
39364 6782343 9191972 8823881 5943694 1983649 -189975 1574327 5934351 9295567
39356 9295567 9533118 7037104 3131669 -644311 -2643814 -2508064 -1907216 -2522925 -4230972
39347 -4230972 -6363873 -9041059 -11611816 -11808522 -8935866 -6277562 -7246318 -9881271
39339 -9881271 -8289073 140127 11191290 17956660 17025371 10499847 3479995 166303
39331 166303 1520482 5729908 10140832 12398601 11227436 8380299 8930658 15860528
39323 15860528 23784929 22563913 9789957 -4138152 -7342928 -226226 6536813 5896831
39315 5896831 931772 -2482302 -3953738 -6998389 -12621346 -17856713 -19755356 -18419684
39307 -18419684 -15878994 -13357972 -10479845 -6771981 -2918329 -14082 1554513 1612406
39299 1612406 -262497 -3074436 -3609563 -30260 4603960 5835087 4266043 4243556 6211377
39290 6211377 5907136 2382988 530721 2544765 2967131 -3021095 -11492033 -15485830
39282 -15485830 -14470315 -12036981 -8180819 -1163516 5634916 6625149 2840992 685082
39274 685082 2068548 2450253 -1191390 -6883066 -12633973 -18671675 -23812404 -25381691
39266 -25381691 -23813397 -22089664 -20037799 -14738141 -7174985 -2508842 -2577418 -3701992
39258 -3701992 -2918076 -845601 2065504 5797631 6822926 1264696 -6817171 -8260668
39250 -8260668 -1902968 3555173 3453855 3492106 7538003 8786184 520820 -11853565
39242 -11853565 -17937827 -16120413 -12410151 -10053483 -8075376 -6613519 -6409938 -5775270
39234 -5775270 -4181015 -5348530 -10581645 -13257260 -7197754 3321028 9676118 11301719
39226 11301719 13356298 15266058 11718010 3792668 -1122208 -1077666 -1788931 -5507861
39218 -5507861 -6485359 -545737 8038808 12712530 12260599 9573607 7380971 7196334 8489895
39209 8489895 7907971 3291319 -1711675 -1984737 714729 10979 -4579550 -6696657 -3875704
39200 -3875704 -1627782 -4045423 -7272444 -6275244 -2608152 -1257205 -3743751 -7701538
39192 -7701538 -10027420 -8265007 -2311107 3835246 5889041 5496233 7727255 11959717
39184 11959717 11826808 5841643 724545 919363 1917338 -1414070 -6234042 -7029568 -4398073
39175 -4398073 -2686726 -2712471 -2346253 -1439974 -1371502 -2039022 -2995537 -4908459 -7023202
39166 -7023202 -6802891 -4917505 -5976980 -10833065 -13364475 -9417263 -3772413 -2898843
39158 -2898843 -5727726 -7722346 -9495188 -14284225 -20367431 -23302109 -23299399 -23626688 -23908909
39149 -23908909 -21597948 -17900926 -15600369 -13207430 -8211025 -3771873 -4325164 -6344162
39141 -6344162 -2267864 6931592 12176396 10019030 7005829 8289906 10498312 9497318
39133 9497318 7680859 8698634 10714372 10066892 7653040 6945312 8144676 8015795 4122178
39124 4122178 -2823869 -9311140 -10966317 -6537598 -452835 1337634 -1794587 -5558816
39116 -5558816 -7361885 -7972440 -6758017 -1217323 6968507 10892515 6479372 -2366013
39108 -2366013 -9301426 -12673849 -14624472 -16416882 -17370678 -16218785 -11993555 -5806602
39100 -5806602 -1946001 -3615499 -7450138 -6979393 -2068753 834493 -719783 -918593
39092 -918593 4992489 13337317 17972770 17926516 14583403 7100821 -3395564 -9998575
39084 -9998575 -7543458 -763252 1909679 80919 -278653 1618926 -219569 -7926457
39076 -7926457 -14919239 -14493994 -8290285 -3164430 -2758467 -4717428 -4509202 -289006 5353152
39067 5353152 8256678 7849128 8239413 12807792 19565976 24170292 25506930 25136181 23171775
39058 23171775 19003913 15032023 14722530 16566233 14550145 6202055 -3313083 -7013179
39050 -7013179 -3651931 2041832 4814510 3294863 217729 -933027 -88504 -850503
39042 -850503 -5369629 -10350079 -10822737 -7101655 -4609821 -6614955 -10489314 -12100938
39034 -12100938 -10842402 -8690511 -6709089 -4617742 -2632485 -2032073 -4110712 -8898877
39026 -8898877 -14280072 -16718360 -14427529 -9941218 -7977082 -10467000 -15011611 -18080516
39018 -18080516 -17879531 -14087257 -7297087 187712 4975466 5637906 4283090 4105932
39010 4105932 6157030 9220521 11846804 13402976 13726760 13061151 12610462 14306563 18973470
39001 18973470 24431005 26412462 22638573 15608940 9839888 6682912 4165104 1953815
38993 1953815 2939655 8150304 13468409 14662974 13447499 14776942 19341531 22526344
38985 22526344 20407964 13311171 3545047 -6726544 -14562149 -16420822 -11176404 -1761195
38977 -1761195 6918830 11072487 9905009 6345006 5370441 9370433 15185177 17462384
38969 17462384 14524279 9210685 4857717 2705279 2466630 2983562 2850046 2371579 3641089
38960 3641089 6526890 6943617 2608579 -1987198 -1315861 2436215 2636797 -592910 137058
38951 137058 7537619 14457276 13834677 7822275 3073213 2035307 3356945 6601328
38943 6601328 11382799 14627581 13551126 9688400 6128270 2515384 -3411990 -10787560
38935 -10787560 -15934791 -17065863 -15688599 -13865754 -12357006 -10753883 -7671101 -1871754
38927 -1871754 5380463 10677081 12468911 12640690 12878234 12326929 10503024 9038464 8102214
38918 8102214 4864373 -1143648 -4937620 -2771182 1326752 991643 -2825388 -3472626
38910 -3472626 1211675 6054641 6014378 1598783 -3689317 -7113126 -7358570 -5194683 -3955595
38901 -3955595 -5955597 -8308803 -5930289 1184057 7588269 9824502 10370794 13181338
38893 13181338 18745904 24658725 27971632 26106489 18702607 9683409 4398265 3530990
38885 3530990 2762202 -608680 -4180115 -5045219 -4234862 -4144278 -4556854 -4225728 -4138149
38876 -4138149 -5781596 -7389220 -5463373 -212213 3400886 1249058 -5022161 -10162537
38868 -10162537 -11432134 -10431385 -8796322 -5112061 1397246 6391661 4284387 -3431803
38860 -3431803 -8655376 -6909148 -2171209 781104 3052312 6345727 6796957 1018132
38852 1018132 -5682284 -5326108 356731 1753240 -4933157 -13630698 -18184780 -18383366
38844 -18383366 -15616574 -10834923 -8394162 -13250159 -21392637 -21517091 -10207593 2645605
38836 2645605 8205712 9990388 14558211 19224076 17910799 13131309 12129630 14512039
38828 14512039 13267619 6466838 -671072 -4725163 -7334073 -9591424 -10183881 -9484567
38820 -9484567 -9455772 -9390816 -7351513 -5253868 -6368088 -8340902 -5580519 1380173 6118779
38811 6118779 6490384 6844101 8661937 7495041 2716078 2153576 11117959 22791722
38803 22791722 26156193 19596482 10465906 4128139 -97150 -3623123 -5767088 -6842135
38795 -6842135 -8952749 -11838947 -11352132 -4635938 4511305 7766324 582667 -12201662
38787 -12201662 -20339730 -18337480 -10232974 -3173260 1100501 4993100 7780644 5857745
38779 5857745 588408 -852631 4469046 9919103 8365642 2122706 -1441908 -890261
38771 -890261 -1078542 -4029106 -5756010 -2855018 2670895 6681858 7539844 6141491 4043558
38762 4043558 2729298 2555985 1618374 -2190379 -7215829 -8457130 -3393679 4186289
38754 4186289 7792651 5039400 -188768 -2060144 1396986 6838082 9647597 8854082
38746 8854082 7247362 7039960 7330570 6558683 5335066 4976968 4674620 2364624 -2211231
38737 -2211231 -7156550 -10552264 -11332589 -8887542 -3752257 1814718 5662276 7589444
38729 7589444 7990900 6133348 2113931 -815035 894621 6263995 10778524 12051205
38721 12051205 11615007 11219858 10567361 9045515 6578781 2313073 -4209234 -9774383
38713 -9774383 -8918032 -238637 11330904 19633399 21971556 18320683 10067403 1186967
38705 1186967 -3555376 -4103375 -5019259 -7557265 -6725313 -81934 5795350 3838693 -2269603
38696 -2269603 -2756108 4407109 12047791 15298054 16226740 16277657 12862226 6463346 3025745
38687 3025745 4490991 3924442 -3892905 -12921619 -14210203 -9295356 -6797024 -8143590
38679 -8143590 -5964139 2957818 11663290 12626449 6907006 425893 -3747482 -5736208
38671 -5736208 -5510671 -3229552 -684699 479545 254321 -1544166 -5703756 -10418505
38663 -10418505 -11204823 -6901947 -2627413 -3374454 -7349398 -9157036 -6825214 -1588015
38655 -1588015 6379621 16372464 23027571 20488266 11330433 5491375 8465987 15343278
38647 15343278 18682178 17723603 16648000 17385975 18202028 17554902 15826549 13789965 11568546
38638 11568546 8643806 3808742 -3591050 -11422192 -15751392 -15387558 -13165989 -11087624
38630 -11087624 -7064274 681284 8602931 11316631 8824474 5958516 4797599 2028677
38622 2028677 -4838930 -12351171 -14995446 -12521014 -10584110 -13790864 -19532370 -19991272
38614 -19991272 -10791925 2999413 11092906 8528184 154541 -6273059 -8799857 -10608445
38606 -10608445 -13020466 -13472709 -10321102 -5715803 -2488941 -1022368 -636377 -1850711
38598 -1850711 -5532461 -11006823 -16222509 -19158281 -18823479 -15872519 -12266695 -9430420
38590 -9430420 -7417367 -6970896 -10273111 -16573187 -19141081 -11945304 780576 7722696
38582 7722696 4872504 521344 2567593 7077880 5290385 -2746598 -9130822 -10401298
38574 -10401298 -10849779 -13426870 -14908193 -12561250 -9776939 -11420895 -17100128 -22046602
38566 -22046602 -22279768 -16934133 -8028201 214123 4162580 4402198 4207426 3738712 -310303
38557 -310303 -7533039 -11008934 -5573955 4578137 11119091 11892046 11053402 10719543 8291252
38548 8291252 2259741 -4496049 -8667513 -9996642 -9393748 -6821091 -2676165 1166448
38540 1166448 3033388 2405438 -907218 -5797312 -8080975 -3787544 4371909 7957543
38532 7957543 2867209 -5008906 -7440459 -4125581 -1238316 -1985833 -3664998 -3658906 -3465824
38523 -3465824 -5435861 -8963776 -11715593 -12388819 -10750856 -6792150 -1493657 2795494
38515 2795494 4422437 4459354 5446279 8024785 9600084 7046091 981377 -3373860 -1061673
38506 -1061673 6649699 12868275 12555410 7607513 3102187 788607 -875081 -1979589
38498 -1979589 -655524 2648147 4364405 2673256 137994 -281991 581370 41018 -1952090
38489 -1952090 -2495312 584271 6095652 10350742 10298478 6444681 2656927 2141466 4155086
38480 4155086 6277368 8767000 13327336 17838786 16966191 9823697 2902036 2268117
38472 2268117 5909409 7207408 3527806 -2231995 -6514825 -7614288 -5078233 -938998
38464 -938998 -418292 -6782521 -15761055 -19527772 -16440390 -12463151 -12440312 -14739244 -15960958
38455 -15960958 -16068301 -15997892 -14240885 -9694473 -5382649 -5384632 -9231937 -12576347 -12707785
38446 -12707785 -10599278 -7872771 -4386513 790591 7633108 14610260 19088179 19047981
38438 19047981 15635131 13009510 13873045 15784583 13885046 7045145 -636012 -4550061
38430 -4550061 -3950956 -1222076 1375717 3070885 3800569 3564849 2708810 2158649 2811550
38421 2811550 4420781 5301184 3887071 905973 -803755 558312 3350583 4258657
38413 4258657 2142746 -1121556 -3637609 -5729035 -8273682 -10133609 -9314951 -6750262
38405 -6750262 -6672254 -11505532 -17621795 -18697560 -13260438 -6190829 -1857673 1112461
38397 1112461 5715071 9927202 8681262 2081319 -2911167 -748498 5674191 8266919
38389 8266919 2242619 -9964453 -21364838 -25597587 -21450250 -14179103 -11213302 -15210933
38381 -15210933 -22387259 -27974067 -30667465 -30537880 -26242386 -17617848 -8411065 -2222061
38373 -2222061 2847337 11058021 21058628 25804813 21454084 12303969 5074685 1687070
38365 1687070 198992 70888 2705370 7372764 9956358 7136592 574185 -4382938
38357 -4382938 -4143146 -232510 3208387 4399855 4821241 5372794 4337009 706174 -2817976
38348 -2817976 -2882826 -43796 2857266 5727688 10649509 16402850 18140206 14136120
38340 14136120 9005303 7609103 8660744 7424559 2760769 -1758519 -2779401 -459650
38332 -459650 2556957 3080078 -1058771 -8726666 -14904304 -15005668 -10262302 -6499441 -6737146
38323 -6737146 -7246554 -2589464 6977367 15371588 17680585 15325869 13521686 14819082
38315 14819082 16501463 14264665 7431965 8931 -3067379 -461981 4387287 6382347
38307 6382347 3452369 -1604136 -4243586 -2962025 -147530 1476750 1347139 -427673
38299 -427673 -4398221 -9623641 -12363587 -10019642 -5314331 -3327114 -4917142 -6553591
38291 -6553591 -6610513 -7829639 -12344251 -17794993 -20352508 -18952269 -14707704 -8604598
38283 -8604598 -1799333 3863783 7499941 9573459 9586594 6299821 1935279 2399448 9874376
38274 9874376 18131342 19603018 15386721 13627479 18590151 25738914 28098930 23878305
38266 23878305 16799660 11562088 10151199 11227437 12622311 14553707 18627448 22772280
38258 22772280 20838232 10826660 442120 -934162 5717429 10778668 9079747 4959316
38250 4959316 3745267 4825461 5423506 5471373 5666649 5489502 6176661 11087734 19864393
38241 19864393 26617354 27398706 25238250 24288332 23749477 21847236 20658077 21294573 19091310
38232 19091310 10668114 1918810 769736 4678341 4527200 -287573 -921606 5576128
38224 5576128 10226752 5371883 -4640397 -11305839 -13369168 -14264137 -14097396 -11361756
38216 -11361756 -8658661 -9445957 -11292209 -8892644 -2451111 2872179 4889463 5976979
38208 5976979 7275674 7150662 5704768 5250404 5495690 3777214 1411308 3869388 11725664
38199 11725664 16951567 13018394 4894197 3169889 9866477 16098017 14555582 8935540
38191 8935540 7800895 12473301 15866326 13053797 8141599 7730015 10602030 8933724
38183 8933724 -415195 -11154658 -16347429 -17091348 -18045735 -18087155 -11996110 -271216
38175 -271216 9651654 13003722 12416224 11305426 8930358 5452162 5660737 11884847 17595838
38166 17595838 14921233 6106621 505258 1157052 1655798 -2736061 -7808688 -7223414
38158 -7223414 -1410799 4069059 5529133 3080474 -1588192 -5835946 -6568754 -3539856
38150 -3539856 -744902 -1544990 -3858974 -3449933 -653797 271406 -1667874 -2023975 2557263
38141 2557263 8939141 10973878 6314854 -2471475 -11754742 -18730106 -20356329 -14610522
38133 -14610522 -4732034 671032 -4489337 -16056534 -23175991 -20657407 -14707311 -14026583
38125 -14026583 -18218893 -19665629 -15793274 -13353888 -18216254 -25918250 -26990851 -19007954
38117 -19007954 -8254176 -439583 4811387 9272846 10977808 7038845 -1028196 -8197225
38109 -8197225 -11328121 -11240340 -9784473 -7121694 -2613002 2811354 6449753 6621846 5522872
38100 5522872 7900340 15448365 23441363 25246698 19814286 11749193 4007526 -4988439
38092 -4988439 -15072252 -20226371 -15587037 -5362375 2196414 6059303 11914207 20707989
38084 20707989 25715873 23553936 20143165 20179904 17378969 3709482 -15276583 -24235210
38076 -24235210 -17391826 -5311382 59291 -887296 -1199772 -48188 -2274577 -8311282
38068 -8311282 -11845419 -7907848 1442811 10315295 14674441 14450643 12670723 12879225
38060 12879225 15497425 17061712 14900732 11304751 10269558 11529680 11902758 11886710
38052 11886710 15686297 23443912 28481515 25350711 17098062 10973753 9347800 8726331
38044 8726331 6478938 4478012 5501923 8834054 10986707 9951716 7677493 7876974
38036 7876974 11393669 14841416 14974706 12994107 11967907 11248098 7804001 3113799
38028 3113799 2981320 8175426 11095491 6367956 -198783 295756 6315268 8433951
38020 8433951 4107648 1172195 5127216 10967744 11397886 6861144 2791702 1803949
38012 1803949 3515621 8003402 13928699 16341099 12301362 6786202 7064995 12285743
38004 12285743 14750334 11328680 7144665 6744485 8037076 7886934 8044758 11053763
37996 11053763 14337115 13543422 9490953 6915721 7603156 9313655 10781487 13109621
37988 13109621 16060270 17490456 17509062 19086811 22797993 24516724 20629405 12828866
37980 12828866 5679404 2067393 3094748 9258948 18396795 24777427 23991981 17571751
37972 17571751 10018148 3355669 -1926989 -3222587 1461117 8320425 11206522 10172410
37964 10172410 10613836 13545350 13781868 9742566 7442533 10511419 13332901 10345572
37956 10345572 6157044 8288344 14049105 14149821 7657439 3358994 5329867 6731985
37948 6731985 1407348 -6541890 -9931635 -8836455 -7465191 -5206860 2135107 14103005
37940 14103005 24912651 30744343 32636144 31977785 28069510 21603192 16487922 15549619
37932 15549619 16694449 15915833 12926949 11319351 13260633 16329378 16752989 14340438
37924 14340438 12212281 11980435 11679038 9540673 7560110 8971386 13445500 17460161
37916 17460161 18919054 18771302 18215004 17062964 15301729 13879829 13411596 13978740 16020318
37907 16020318 19091309 20435886 18220093 15763448 18147933 24360026 28077811 27511432
37899 27511432 28210430 32921291 35161557 28802679 19194491 17027820 23255249 27967344
37891 27967344 24534179 17855748 16380669 21271518 26663395 27338512 23102380 17287830
37883 17287830 13263210 11987518 12196674 13196114 16654877 24273546 34620302 44200801
37875 44200801 50729983 53215950 50333531 42282909 33732863 30849116 34390489 38660869
37867 38660869 38266608 33581322 29019535 28413339 32674576 39482009 44414959 44532271
37859 44532271 41594379 40113403 42217998 46247814 49571351 49943236 45061391 35066294
37851 35066294 25650731 23980232 30043655 36155698 36792434 34772224 35313183 38172066
37843 38172066 39380133 37814808 36062736 36443818 39464055 44753995 50480943 53152730
37835 53152730 51189159 47949999 48347991 52830684 57188566 58099040 56631758 56180757
37827 56180757 58642697 62864988 65911894 66026985 64805185 65562299 69069044 72352668
37819 72352668 72584819 70503237 68810295 68928073 70840179 74399699 78781392 81816375
37811 81816375 81844377 79656455 77370594 76146833 75774470 75245327 73043023 68558908 64004180
37802 64004180 62988568 66488555 72433975 79490628 87637182 94193792 94352132 88501807
37794 88501807 84195821 86547019 90803147 89624455 84127497 81447341 83857694 87211739
37786 87211739 88878999 90059260 90308274 86946144 81169285 78310546 80137192 82621615
37778 82621615 83140594 83830118 85429590 84344061 79789760 77943626 83657502 92508128
37770 92508128 96729648 95573552 93945215 93611663 92340767 90286138 90441601 92713758
37762 92713758 93931753 94863974 100928801 113028689 122876489 121869094 111691703 102079612
37754 102079612 100130196 105854109 116513730 129838367 142222593 148950010 149539854 150114924
37746 150114924 157006525 169386211 181204288 189061163 194472488 199155212 202866703 206780794
37738 206780794 214036984 224209897 231284450 230919926 226868794 226258077 230874243 237232185
37730 237232185 242841003 247248360 248747849 246502192 245777825 254334102 271780203 288097022
37722 288097022 295222490 295514400 296446161 301681508 310344259 320552648 329785048 335203733
37714 335203733 337388293 340943081 348252947 355839094 360164460 363222197 367963986 371684372
37706 371684372 369489306 362198066 355387751 352006618 351010437 351916003 355111357 358269750
37698 358269750 358048625 355463993 354416141 354689060 351759494 344182075 335612325 328099395
37690 328099395 318852726 306040113 293000607 283801727 278486343 275322232 273908822 273212911
37682 273212911 270289938 264317120 258652481 255416516 251120539 241702107 229422072 220328373
37674 220328373 216345184 214049265 210412821 205857153 201978809 199667832 199210648 199109512
37666 199109512 195240564 184744407 170920670 160798889 157130209 155872706 152502041
37659 152502041 147624954 144640646 144582507 145913146 148022493 152087467 158072148 162531248
37651 162531248 160857696 152296609 142211375 137675226 139846984 142360230 139182731 132491791
37643 132491791 129536865 132399442 135144432 132161886 125082200 118800605 114341874 109899240
37635 109899240 106661826 108178374 113770838 117526849 115784326 111838487 110325492 109719446
37627 109719446 104339257 92830587 80737045 73912954 72251157 71339636 68345816 64521513
37619 64521513 62856758 64632474 67920955 69045278 66465031 63450502 65030279 71316523
37611 71316523 76126254 74175994 67409056 61255071 56751197 50930722 44137916 41128857
37603 41128857 43357678 45459776 42526404 36561676 31913535 28416667 24359357 22956081
37595 22956081 28672414 37904753 40831991 34337720 26818725 27239966 34910485 43925748
37587 43925748 52416467 61319408 67252879 64191665 52774327 42150470 40194555 45125842
37579 45125842 48764254 45780876 37970526 30943641 28257644 28427316 27294839 23551246
37571 23551246 20786043 22493637 26460605 27327016 24328929 22322047 23777712 23869782
37563 23869782 16830927 4792699 -3491924 -2062561 7016746 17379146 24292315 26460890
37555 26460890 24714868 20811702 16758588 14006721 12901922 12697032 11971989 9713611
37547 9713611 6695475 5302091 7100005 10746868 12929747 11335735 6732333 2822141
37539 2822141 3867754 10831976 19402890 23715431 22792305 20914530 20438978 17850203
37531 17850203 10263590 2686804 3333146 12619660 22409055 26667134 27332166 27983646
37523 27983646 27503184 23864707 19850982 19965728 23951797 27984594 30865245 34476732
37515 34476732 38648750 40061638 36952042 31453787 26379288 22650146 20982811 23267391
37507 23267391 30236101 39123150 45223034 45484683 40511059 34091311 30679413 31694106
37499 31694106 33903501 32853670 28178342 24038129 24069540 27718085 32196611 36108968
37491 36108968 39691009 42710507 43854891 42094527 37808378 32516933 27646144 23379506
37483 23379506 19059360 15184348 14029972 16762649 20695440 21872538 20531635 21252714
37475 21252714 26549926 32891512 35188493 33416490 32163218 34465762 38738933 41785156
37467 41785156 42389702 41124961 38574732 35408329 33319139 33972262 36626715 38167309
37459 38167309 36648964 34146545 34507709 38216656 41287191 40083505 35504149 30990988
37451 30990988 28191994 26827375 27225419 29636627 31656296 30130526 26079425 24098620
37443 24098620 25914290 28304923 28946921 30033881 33104126 34326797 29714348 22557353
37435 22557353 20154088 23790316 27223340 25682231 21351466 18024721 14806043 8737113
37427 8737113 1093824 -3134503 -1803185 1492304 2099451 150678 300088 6108732
37419 6108732 15992677 25187951 30637108 32551346 31780624 28177634 22493326 17524859
37411 17524859 15333083 14806215 13931415 12846246 12257160 10705573 6868719 3212921
37403 3212921 3062919 4662498 3189825 -956397 -1712528 2754697 5695664 1562123
37395 1562123 -4838949 -5018116 512045 3336195 171261 -2319033 2489093 12042644
37387 12042644 18542087 18068848 12522011 5421823 -506870 -3186577 -2248692 -154715
37379 -154715 -342 -2220697 -4789410 -5858596 -4602732 -612759 5107537 9120682
37371 9120682 8358892 4284917 1700291 2590549 3586764 953873 -4105706 -7299302 -6907598
37362 -6907598 -5061869 -4109722 -4512778 -6528558 -11063062 -17272959 -21265432 -19495368
37354 -19495368 -13015211 -6654514 -4054269 -4973554 -7554783 -11244186 -15941691 -19357147
37346 -19357147 -17838028 -10935964 -3444617 -646097 -1949835 -1839317 2364918 6905829
37338 6905829 7927866 8197752 12896482 20127006 21629292 14226139 4840980 855046
37330 855046 435122 -2579254 -7969933 -9820235 -6104691 -737553 3814171 9010840
37322 9010840 13935335 13430771 5963750 -2250931 -5202416 -4548433 -4605385 -4339750 -254211
37313 -254211 5912344 8965511 8085705 6546313 4832084 1109993 -1601901 3111960
37305 3111960 14052892 20403399 15320517 5584752 1904470 4172958 3608596 -2597853
37297 -2597853 -6660261 -1461098 9630980 17389486 17706317 14528575 13241011 14182199
37289 14182199 13520239 9386608 5519044 7427750 15089284 21619361 20635047 13259969
37281 13259969 5840009 2297284 1665432 2185720 3783489 5567395 4523013 -656205
37273 -656205 -6222489 -6569788 -553497 7090554 10777592 9416042 6469163 5560958 6872480
37264 6872480 8008112 7641578 7119665 8239537 10622817 12085020 10726036 5898147
37256 5898147 -1746564 -9979411 -15817129 -18063839 -18266639 -18094827 -17241530 -15420202 -14399175
37247 -14399175 -15475837 -16665219 -15458224 -12666908 -9942275 -5603813 1847764 7571616
37239 7571616 4582813 -5651749 -14101172 -17110187 -20378868 -26813983 -29356625 -22489774
37231 -22489774 -13375345 -12584967 -18741491 -21934474 -19038688 -15417922 -13120208 -8342837
37223 -8342837 -1384140 1335886 -2079381 -5369246 -4397068 -2588264 -2309730 570163
37215 570163 8174812 14378890 13414531 8274244 4225902 384124 -5073881 -7633137
37207 -7633137 -3316494 2111208 758923 -3961773 -2149967 6110247 10433601 6975500
37199 6975500 4557687 10670544 20588618 25125951 22193724 15988216 10354319 7248382
37191 7248382 7001045 6431922 1277777 -6400159 -8453701 -1870307 5725084 6256894 1626530
37182 1626530 -1374170 -1646025 -2563884 -3592638 -500671 7105484 14421478 17228613
37174 17228613 14553525 6913546 -3095932 -9534096 -7708433 82998 7522182 11967860
37166 11967860 14773594 15758999 13540212 10662881 11478690 14204788 12075152 4280757
37158 4280757 -1197134 1041907 6082285 6904086 4543059 3898611 3755188 -1334778 -10731684
37149 -10731684 -16708173 -14766224 -9135325 -5885004 -5114932 -2949065 1866365 6822429
37141 6822429 9572982 9837762 7774440 3236064 -2638451 -7015999 -7778732 -5352544
37133 -5352544 -1230933 4069788 9943704 13598049 11804521 5246005 -1380738 -4759428
37125 -4759428 -6072101 -7136116 -6295047 -1390221 5106065 8096023 6526343 4120600
37117 4120600 3276167 2178827 -1092068 -5357408 -8762184 -10971618 -11127316 -7140423
37109 -7140423 197781 5296084 3485967 -2823263 -6647049 -4024178 3221595 10841860
37101 10841860 15409059 15190170 10980029 6302755 4633010 6038361 7637358 6806490
37093 6806490 2771831 -3817881 -11055364 -16216195 -17656273 -15725044 -10974012 -3213500
37085 -3213500 6136728 12974502 14327543 11605596 7681313 2913727 -2783911 -6376293
37077 -6376293 -4863846 -683603 1097922 500512 2236131 7316872 10635801 8351331
37069 8351331 2513090 -3598260 -9546565 -14464546 -14918890 -10094959 -4975352 -3937762
37061 -3937762 -4657130 -2986538 -527084 -1645355 -5322194 -6449109 -4492274 -4471261 -8689525
37052 -8689525 -13415501 -15452994 -16513719 -18165977 -17124014 -9907714 344097 5954759
37044 5954759 2972499 -5370717 -12805957 -15159457 -11729577 -4276076 4118070 10155713
37036 10155713 11569542 8149800 2198701 -2374240 -2746187 421390 3881140 5099784
37028 5099784 3649471 -463460 -7711801 -17041173 -24373074 -25096401 -18416422 -8813415
37020 -8813415 -3111852 -5503248 -14131299 -22325943 -24386650 -20571535 -15563318 -12511348
37012 -12511348 -10770894 -9677977 -11258930 -16847075 -23054468 -24259328 -18859593 -10909913
37004 -10909913 -5587018 -4745851 -6867712 -9460443 -10739391 -10073268 -7908355 -5560843
36996 -5560843 -4951896 -7608700 -12470004 -14899672 -10219184 676919 11160888 15747908
36988 15747908 15312204 13973215 13278696 12130073 10258764 8104893 4593234 -1020453
36980 -1020453 -5951329 -6819969 -5313543 -6028148 -8483690 -7038087 -401600 4776118
36972 4776118 3243186 -1346682 -3052334 -3050997 -5999744 -10194286 -9161233 -2541285 2138681
36963 2138681 150703 -4390521 -5902022 -5112662 -5339682 -5227516 -494642 8812837 17337257
36954 17337257 20294568 17138447 9954724 1673511 -3838961 -3211936 3075972 10015229
36946 10015229 11989290 7435752 139287 -3294718 1814276 14061343 26419917 32264575
36938 32264575 30995102 26651039 21996193 16718657 11437530 9634867 13110328 17872900
36930 17872900 17948023 12710482 7555041 7125999 10465864 13600804 14533967 14171471 14045277
36921 14045277 15038013 17434767 20458810 22312287 22408734 23291558 28512018 38248265 48284545
36912 48284545 53613573 52150212 45283400 36577090 30209478 28718717 31010879 33406975
36904 33406975 33289137 31066259 28749680 28084342 29902954 33130323 34384733 31545733
36896 31545733 28204526 30414604 37036448 38099647 27166140 11592860 4530715 8936066
36888 8936066 16363430 20684896 24774283 31727592 37593138 37794098 34864626 33615177
36880 33615177 32459154 26177067 15350162 6513711 3126473 2234910 1231145 2850637
36872 2850637 10752862 23121552 33532337 37369384 35992015 34835366 37762121 43219965
36864 43219965 46507037 45671501 43139864 40961913 37884494 33536043 31779322 35377824
36856 35377824 40045386 39703857 36403198 38393216 48036034 58482567 64108433 67291644
36848 67291644 71298018 73088735 69140781 63827382 64874827 72250902 77834119 75770861
36840 75770861 67971811 59445551 53509953 52703127 59396163 72465495 85971313 93833174
36832 93833174 94899164 92388792 89986041 89919634 93528372 101487032 112788094 124022908
36824 124022908 130621245 130140543 125019606 121135916 122627167 128785673 136624906 144793979
36816 144793979 153210158 160396226 164123669 164529502 164038524 163803611 162391439 158732489
36808 158732489 154630683 153275760 156064194 161356906 165847153 167346490 167015379 168374978
36800 168374978 173015366 177824091 177920685 172199272 164865913 161715448 165446348 173423495
36792 173423495 178954445 176477565 167394110 159212202 156892645 157251998 154909565 150995281
36784 150995281 150706469 153500556 152164721 142776574 129950281 119983762 113701172 108840520
36776 108840520 104995226 102591102 100568196 98852200 100152718 105440389 110082274 108419099
36768 108419099 100457675 90664668 82106792 75313489 70784647 68266421 64826672 57958963
36760 57958963 49919764 45098396 43831921 42877371 41402709 42052066 46012908 51353982
36752 51353982 56642936 61867581 65118383 63217174 57539757 54798201 59032677 65965131
36744 65965131 68320564 64274316 57535952 51143568 45024175 39220934 35946224 37016067
36736 37016067 40849608 43546922 42894826 40455545 39021470 38428440 35441383 28372462
36728 28372462 20038172 14649760 13316533 14484950 17093712 20598022 23283828 23871458
36720 23871458 24021049 26080461 29328060 31941787 35074094 39814961 41147352 32004384
36712 32004384 14766096 1670821 326659 4851657 5812031 3242935 3583123 7845467
36704 7845467 10430985 8436580 5404676 5291550 7860648 11112349 14325105 17469234
36696 17469234 20350149 22996180 24821596 23756084 18839844 13400304 12718810 18149244
36688 18149244 25690785 30436451 30606259 27675824 24622020 23620346 23658201 21298615
36680 21298615 15604647 10664322 10647881 14061251 16118978 15283823 13759435 12896500 12499895
36671 12499895 13833023 18290879 22774678 21174102 11851156 188818 -7242082 -8125401
36663 -8125401 -4111595 1111705 3268187 978817 -1850223 -926236 1529718 -320541
36655 -320541 -6418312 -10470267 -9987566 -9629207 -12154752 -13243044 -9321759 -3867579 -685657
36646 -685657 2970573 10021684 15362550 11801804 1142392 -8217345 -12769331 -15595175
36638 -15595175 -18005829 -17642612 -15411401 -16458282 -21661688 -24306904 -18690279 -7777766
36630 -7777766 903820 3932903 3835234 4615712 7860952 11917058 13476628 10916283 6291142
36621 6291142 2730870 695049 -681300 432750 7092368 17649005 25471342 26228342
36613 26228342 22216257 17922345 14639298 11596869 9336357 8923076 9500481 9246173
36605 9246173 7957410 7077310 7974345 11065189 15356233 18334046 18268162 17213101 19045750
36596 19045750 23381350 24701363 19810077 12972117 10090234 10238854 7730064 1666814
36588 1666814 -1984162 709458 5266706 4759186 -390401 -2852889 1514021 7810572
36580 7810572 8069075 612818 -9095985 -15392246 -16694899 -13167595 -4657108 6582934
36572 6582934 14492575 14604458 9611556 5958366 5634222 5123614 2184169 -867002 -1795743
36563 -1795743 -2145641 -3796799 -4938707 -2504496 3204491 8952244 12341928 13011558
36555 13011558 11452387 9032480 8194017 10104163 12439225 11612973 7138191 2047828
36547 2047828 -956314 -2117198 -3162495 -4567598 -4791622 -1692686 5250526 13570561
36539 13570561 18999584 18984814 15225755 12238048 13200234 17242813 20634315 20517306 17589455
36530 17589455 15024215 14719595 15203459 13601850 8801864 2007216 -4573101 -8339591
36522 -8339591 -7145017 -1783432 3300771 4315744 2579510 2215209 4224272 5996931
36514 5996931 6101829 5681805 5006024 2771865 -511536 -2659115 -4228036 -8145352 -13475197
36505 -13475197 -14773956 -10298564 -5804991 -6590115 -10330158 -11843725 -10389325 -7429158
36497 -7429158 -1796456 6497690 11149403 5727023 -6545348 -15973823 -18472020 -17915895
36489 -17915895 -17279908 -14943181 -10617345 -7669868 -7231631 -6001577 -2470802 45162
36481 45162 -684083 -1840249 -514899 1825387 2861171 3120345 2943031 107816 -5473410
36472 -5473410 -8541560 -4923637 1327053 2336126 -3016847 -7314175 -3561755 7007619
36464 7007619 16367300 17229181 9404665 -368681 -5664188 -7223218 -9996203 -13557091
36456 -13557091 -10884586 401662 10972053 9803029 -1696499 -11857445 -13521116
36449 -13521116 -10010628 -6550674 -3051593 2005419 6507420 7973878 8319598 10907042
36441 10907042 14769328 15751597 12397790 7026339 1310174 -5418622 -12605438 -16668496
36433 -16668496 -15087904 -10336704 -7175526 -7058785 -7811988 -8190281 -9338911 -11089450
36425 -11089450 -10461397 -6099415 -1247907 820762 1889459 5305653 9407953 9787287
36417 9787287 7400123 8058819 12558395 13776398 6894462 -3119673 -8705026 -9356653
36409 -9356653 -8359961 -4358554 5795333 17622187 21235537 14421063 6341089 5420072
36401 5420072 9436349 11240064 9248693 7400164 7903917 9189283 9770034 9815937 9093524
36392 9093524 6675778 2958719 -360573 -2372740 -3227696 -2787365 -1074792 359967
36384 359967 -121594 -1529999 -1460095 -315107 -1549537 -6452934 -11170037 -11207787 -7551823
36375 -7551823 -5718504 -8876811 -14078654 -15960144 -12747397 -7693053 -5332994 -7107506
36367 -7107506 -10377756 -11349904 -9103683 -6566385 -6939870 -9683814 -11670878 -12391578 -15324365
36358 -15324365 -22063863 -27117171 -22469924 -7948340 6194106 9327619 1740054 -6219657
36350 -6219657 -5808742 1348821 6672104 5021223 -343806 -3261675 -2818942 -3542811 -8001288
36341 -8001288 -12626933 -12690921 -8813193 -5493374 -4689751 -4399468 -3025693 -1380002 -27474
36332 -27474 1784683 3788465 4752205 5789618 9764973 15905728 19178335 17342023 14215915
36323 14215915 12556648 8437447 -1730954 -12208899 -13516986 -6169898 -1081884 -4491177
36315 -4491177 -9343199 -5689689 5422359 13961466 14195142 10066736 7340000 5779529
36307 5779529 1886987 -3796326 -6360161 -3366864 1491488 3264953 1907889 981691
36299 981691 1674248 1505313 -1210579 -4964074 -7539568 -7650159 -3749665 4456725 11950377
36290 11950377 11003461 1201894 -7655997 -7230783 -1458991 -364494 -6303097 -12987792
36282 -12987792 -16322307 -18678991 -22062817 -23941341 -21895804 -17255032 -12190627 -7474800
36274 -7474800 -4422504 -4584304 -6055458 -4499355 589305 4894454 5857648 5556346 5512851
36265 5512851 3927429 438483 -1705574 -1368193 -2278579 -6339224 -9290511 -7793282
36257 -7793282 -6141560 -9860598 -15905088 -15956765 -8158086 623679 4331077 4293580 5084411
36248 5084411 7644463 8654931 5480621 510291 -310474 5325217 11333281 9402732
36240 9402732 136809 -6985661 -6366405 -3095392 -3789481 -7024748 -8221082 -8099241 -9005621
36231 -9005621 -7592605 19790 8609782 8645850 -212839 -8924807 -11876304 -11271538 -8963844
36222 -8963844 -3776133 1362710 -283151 -7855914 -10752304 -3142191 7076770 9802763
36214 9802763 6242419 3878268 3813067 1516811 -3290703 -5779630 -3750490 436032
36206 436032 4702120 8006231 7250821 -45711 -9621051 -12927739 -7216461 1285958
36198 1285958 5463119 4411895 1183447 -2258770 -5277565 -6763298 -6015599 -4134491
36190 -4134491 -2633922 -1492367 229626 2596604 4528341 4819192 2963778 -599945
36182 -599945 -4898534 -9286222 -13463883 -16303827 -15806052 -11462282 -5885060 -2678467
36174 -2678467 -3134201 -6054378 -9840967 -13178968 -14519921 -12902587 -9111033 -4665867
36166 -4665867 -394503 2440170 978569 -6202941 -15025331 -18148428 -12654905 -3506505
36158 -3506505 1945931 1369069 -1821455 -3591388 -3155013 -2013025 -1008569 380432
36150 380432 2067473 2213783 -387643 -3208314 -1672049 4937428 11393181 12467332
36142 12467332 9400967 7682325 9285811 10540657 8074846 3595862 1174099 2050270
36134 2050270 4069890 4829890 3424191 -142954 -5236587 -10046041 -12164323 -10614840
36126 -10614840 -6972811 -3760605 -1612154 1192185 5716628 9904343 10966550 9821671
36118 9821671 10295202 13101838 13881303 9317277 2009685 -3988625 -9346736 -16341520
36110 -16341520 -22063513 -21496187 -16971965 -16936107 -23186191 -26690943 -20470092 -10307741
36102 -10307741 -6432369 -9306002 -11289584 -9545877 -8495044 -9531877 -7131778 1623729
36094 1623729 10387722 11294217 5391108 672955 1879388 6089477 7216332 2010258
36086 2010258 -7253733 -13845408 -12052257 -4109678 272120 -5449722 -16060079 -20482861
36078 -20482861 -15248242 -7461724 -4101584 -3361699 969784 10125188 18759413 21239160
36070 21239160 17002538 10370319 6587914 7292092 8992828 7254091 2791574 951403
36062 951403 4016077 7484390 6820462 4514453 5691017 8884779 7477780 474292
36054 474292 -4605644 -2090853 3896712 5777597 2877109 657103 1866428 3526085
36046 3526085 2387033 -650298 -2114156 630078 7503163 14903302 17252117 11997691
36038 11997691 2768496 -4841830 -9567430 -13271735 -14837585 -10610183 -1662849 4849418
36030 4849418 4255007 124085 -1487332 195432 2106975 3129322 4158929 4862825
36022 4862825 4805591 5928594 9337205 11204634 7036853 -760849 -5028241 -3671134
36014 -3671134 -1896473 -3829916 -7483657 -9796326 -11079488 -11592689 -8961255 -3062400
36006 -3062400 821233 -1605407 -7352260 -10754309 -11277098 -11776916 -12010672 -10041601 -8159665
35997 -8159665 -10474331 -14997447 -14947859 -8693132 -1876261 1789152 5138477 10351736
35989 10351736 13702674 11705007 7031365 3383318 -850251 -8130784 -14796324 -15158538
35981 -15158538 -10441812 -7196217 -7804653 -8686977 -7682820 -7199321 -9265734 -12757022
35973 -12757022 -16556243 -20532026 -22320059 -18403704 -10255139 -4420549 -4221549 -6291094
35965 -6291094 -7963587 -12386867 -21615599 -29474694 -27860158 -17841595 -8288811 -4482792
35957 -4482792 -3986806 -3544686 -3658112 -4570275 -3395177 1069294 4301964 1092764 -6890248
35948 -6890248 -12194616 -9959708 -2352724 5609983 11861660 17179974 21021751 20589130
35940 20589130 14974189 7911984 3786329 1691631 -3182038 -11495211 -16714889 -12861932
35932 -12861932 -2746655 5285341 7352128 6340455 4719817 772128 -5720460 -9068786
35924 -9068786 -3950682 6083173 11657559 9196177 4814784 5036311 7883213 6933777
35916 6933777 1788289 -755819 3271389 8317614 5965845 -3848319 -12259362 -12077829
35908 -12077829 -5385345 837034 3551336 5119834 7464178 8672482 6408265 1947880
35900 1947880 -1449737 -3059222 -5050551 -8134437 -9363736 -6158832 -1012366 844573
35892 844573 -1470770 -3046164 -260839 4059062 5621746 5723917 8124717 10258446
35884 10258446 4347403 -10979405 -26196607 -31701131 -28500354 -23632474 -18997129 -10999129
35876 -10999129 564076 9985788 12794328 10425172 6482252 2419981 -1489371 -4365748
35868 -4365748 -5929680 -7194790 -8423200 -8194642 -5514256 -1221332 3152478 6182428
35860 6182428 6340033 3448976 362732 319938 2384008 2643152 291150 -1196742 127467
35851 127467 1730465 1147628 -481838 -1740182 -3854924 -7185550 -8427398 -5317104
35843 -5317104 -1248043 -653394 -1797735 913566 8279357 14642915 14987058 9695343
35835 9695343 1943291 -5656000 -10739578 -11162589 -7392769 -2927341 -824958 -1241608
35827 -1241608 -3016932 -5520187 -7640754 -7062578 -2942806 1301734 138294 -8235416
35819 -8235416 -19063610 -25270901 -24758134 -22357959 -23508902 -27188673 -27552703 -22250945
35811 -22250945 -15630581 -12357625 -11314047 -8635170 -4171604 -1310725 -1961706 -5340364
35803 -5340364 -10481910 -15889474 -17386830 -11145888 134497 8072661 7483495 1743375
35795 1743375 -2055526 -724700 3633968 7344493 8354668 7219894 6175385 6176214 4829054
35786 4829054 -651330 -8472138 -13297478 -12894843 -10405842 -8830610 -6983195 -3009959
35778 -3009959 1737708 5267490 8060433 10119865 8161525 547440 -7189137 -7483079
35770 -7483079 -1012500 3532002 637936 -6056561 -10470567 -11819547 -12660080 -13259017
35762 -13259017 -12384870 -11700840 -14585466 -20283407 -22819980 -17320527 -5622516 5736264
35754 5736264 12082223 13990987 14789053 16215227 17110949 15563221 11180991 5123569
35746 5123569 -1093861 -6128626 -8941481 -9561553 -9541565 -10698539 -13381681 -16462803 -18370658
35737 -18370658 -17246588 -11367816 -1760157 6099096 6405988 -38871 -5692327 -4773802
35729 -4773802 437347 3935543 4111314 4023431 5055540 4884935 2424863 872748 3695816
35720 3695816 9719086 14018688 12494361 4853795 -5017009 -10813482 -8481958 -955720
35712 -955720 3768345 1181502 -5019467 -8682886 -9156890 -10296560 -13381186 -15112941
35704 -15112941 -12331229 -5351244 3101232 9033059 7992864 -757133 -10409727 -11729510
35696 -11729510 -3895800 3693023 2585160 -5502077 -13040991 -16145026 -15890530 -13699379
35688 -13699379 -10466111 -8487113 -9207900 -9627923 -5613409 969177 2691123 -4817889
35680 -4817889 -18024885 -30227022 -37870858 -40796584 -39461615 -34684113 -28700857 -24016136
35672 -24016136 -21146484 -18452872 -14126799 -8024023 -1706131 3383171 7691048 12498583
35664 12498583 16892644 17932601 15296784 13316649 15474802 18788968 17631639 12132989
35656 12132989 8122676 8533197 9816620 8479285 6423533 6626471 7112112 3551281
35648 3551281 -3604280 -8525785 -6786466 -275126 5342736 6813025 6274538 8235590
35640 8235590 13887861 19379136 20625266 18668908 18237072 21660356 26709365 30053521
35632 30053521 29911506 25390948 16793026 7311760 937977 -2445621 -6494084 -11906793
35624 -11906793 -14618259 -12346258 -8612503 -7289968 -7095478 -5187169 -2731064 -2473304
35616 -2473304 -3459049 -2861546 -1143823 -751361 -1205013 -348793 573618 -1640861 -5621366
35607 -5621366 -5452947 1459114 10515304 15495018 15036180 12223065 10237291 9823198 9455286
35598 9455286 7198618 3308147 392887 -485317 -2397739 -8435289 -16164899 -19809364
35590 -19809364 -17551075 -12881500 -8688729 -4242953 968007 4590054 4834317 3625373
35582 3625373 3931294 5816957 7142720 6978763 6820087 8968089 14128646 19863003 21737256
35573 21737256 17325347 8751827 270974 -5332911 -6601507 -2597239 4222875 6977550
35565 6977550 1573151 -6294508 -7227591 -786695 4396046 3461802 787456 735065 1097366
35556 1097366 51147 2048330 10113482 17950654 17640960 11808889 10066886 14837026
35548 14837026 18526660 15273366 8701249 5889097 8409297 11809857 11217041 5970402
35540 5970402 542938 1062278 8851343 17739267 20086721 14921820 7771536 3675396
35532 3675396 3603184 6593230 11041191 13731829 11801325 6815496 3753300 4990745
35524 4990745 7961762 9145717 7276599 2225877 -5492580 -12663185 -14285131 -8981023
35516 -8981023 -1527691 1809719 -924804 -7059414 -12703543 -15304162 -14658550 -12721006
35508 -12721006 -11352046 -9995364 -7062005 -3141155 -187140 2241518 6291216 10767587
35500 10767587 10999194 5702352 164813 -266134 3243286 6110809 7208422 8786077
35492 8786077 11430437 13140295 12480485 9083476 1939454 -8830303 -18826041 -22394295
35484 -22394295 -19791807 -17475520 -19379611 -21075259 -15324994 -1551729 12981303 20608534
35476 20608534 19605186 13568847 6929723 1937057 -1219608 -2662339 -1700148 2264830
35468 2264830 7813158 11614600 11590706 9502437 9016702 11236529 13658303 13879714 12493407
35459 12493407 11132459 9361111 5612503 276923 -4554118 -8115381 -11282981 -13856711
35451 -13856711 -14279957 -12620362 -10955982 -9843085 -7618432 -4800674 -5444725 -11026561
35443 -11026561 -16107422 -14118100 -5343070 4768979 12852383 18259118 18793943 12835822
35435 12835822 5587427 5692904 13307118 17957680 11765268 -630951 -9347243 -11442879
35427 -11442879 -10828373 -10173618 -9151151 -8587906 -10226996 -12658439 -12271569 -8448491 -4216350
35418 -4216350 -1937220 -1511471 -2179723 -2855211 -1633948 1456450 2371369 -2089714 -8307786
35409 -8307786 -9694324 -6241623 -4714257 -8528455 -13131634 -13486577 -10746226 -8204868
35401 -8204868 -5207286 605512 8159663 14483866 19312256 23981756 27197652 26237853
35393 26237853 22054502 19285886 20551179 23659937 25357740 25473428 26091708 28123010
35385 28123010 30016978 29387595 25264983 18970182 13053828 9373103 8197159 8733232
35377 8733232 9666556 9368044 7005482 3926533 2597590 3410402 3793704 1507079 -2179152
35368 -2179152 -3674503 -869829 4846418 9672582 10226186 6393229 1685713 -371353
35360 -371353 -132797 -402138 -1449251 -482184 3230561 6198399 5546158 2966266 1613370
35351 1613370 2083407 4010075 8058825 12505935 11312182 1122179 -11786935 -17425341
35343 -17425341 -14080283 -8581134 -5244935 -1613321 3661048 6158226 2717664 -2523793
35335 -2523793 -3718318 -910753 2222704 4557261 6689603 6946395 3550247 -985283
35327 -985283 -2694111 -2353823 -4062291 -8298631 -11337169 -11669152 -12125880 -14531821 -16537999
35318 -16537999 -15528729 -12252307 -8677071 -5029744 -860159 3158057 6128020 7799554
35310 7799554 7506181 4520335 628929 -353901 2453773 4985431 3609977 531247
35302 531247 891866 5696874 10641203 11628598 8784630 4843068 1967188 930002 1544077
35293 1544077 2510323 1570500 -2965404 -10397114 -17330183 -19610730 -15587673 -8048574
35285 -8048574 -2273333 -1430556 -4156695 -6838432 -7338780 -5950478 -3992781 -2898532
35277 -2898532 -3991290 -7430172 -11150373 -12077099 -9124828 -4666833 -2430002 -3472173
35269 -3472173 -4327664 -258652 8729012 16364277 16642982 10993383 5890921 3689767
35261 3689767 238681 -7101016 -14174582 -16425728 -16290682 -18827528 -22850049 -22975298
35253 -22975298 -19354063 -18123021 -21131493 -22071757 -15749155 -5647225 1368610 3241580
35245 3241580 1685821 -2597915 -8554873 -11900649 -9394556 -4345056 -2622531 -4329740
35237 -4329740 -4574965 -1652717 1181236 2059881 2745937 3546165 1931637 -1549938 -1644619
35228 -1644619 3789302 9120240 8482866 4035366 1594079 1307413 -874969 -3993421
35220 -3993421 -1759245 7117692 14560444 12623121 3293031 -5072558 -8263360 -8681423
35212 -8681423 -8602283 -6094720 725756 8731978 12142976 9118848 3722078 1017650
35204 1017650 1949230 3981391 5270146 6103117 6655112 6033703 4664398 5230324 8835150
35195 8835150 11671781 8725503 819078 -5003570 -3105601 5009793 13607869 18867901
35187 18867901 20304650 18377616 13797738 8509530 4537109 1652293 -1643385 -4562020
35179 -4562020 -3796626 2002281 9172487 12126080 9033528 3363790 -103576 -88506 473210
35170 473210 -1798044 -6626954 -10345900 -10459127 -8949653 -9862591 -14109385 -18256805 -18627497
35161 -18627497 -15198752 -11047372 -9243312 -10864868 -14829238 -18791393 -20985989 -21709870
35153 -21709870 -22086686 -21163275 -16057134 -6272483 3645373 7877294 5466108 1171149
35145 1171149 272893 3666721 7937559 9131016 6420314 2921778 2815259 6947865
35137 6947865 11625030 12579856 9627843 6245249 4966235 4741661 3051909 -669309
35129 -669309 -4386910 -5739031 -4645735 -3679281 -5473429 -9742937 -13853121 -16459689
35121 -16459689 -18630803 -20407024 -18972863 -12950048 -6300745 -3896887 -4213797 -1194895
35113 -1194895 6237012 11478630 8930219 1072575 -5874279 -9616050 -11589361 -12188818
35105 -12188818 -10586873 -7661452 -4887810 -1123983 5563290 13081526 15992303 11528223
35097 11528223 2307109 -6930543 -12673210 -13228395 -9481224 -5444784 -4795222 -6222650
35089 -6222650 -5294605 -1376908 1050212 -843834 -4091702 -4683042 -2910738 -1088390
35081 -1088390 1101434 5482797 11551438 17078064 21176290 23891807 24282069 22071345
35073 22071345 19783423 19629239 19331131 15039390 7896089 3319681 3369284 4201331 2438983
35064 2438983 24373 580775 4243096 8546599 11734339 12719345 10346068 5563500
35056 5563500 2154656 2154838 2344616 -1254294 -6856239 -8910530 -6022187 -2566098 -1839651
35047 -1839651 -1729253 1008402 5419733 7940158 7406117 5866607 5068580 4149479 1094197
35038 1094197 -4239009 -8846368 -9033272 -5052431 -2179984 -4809973 -10028371 -10468766
35030 -10468766 -4080275 2905769 4565484 2761812 2695718 4521482 4346235 1680696
35022 1680696 367730 2196940 4550861 5118430 4372216 2171085 -3333388 -10961310
35014 -10961310 -14822396 -10849135 -2270118 4614829 7634554 8412142 7472768 4318347
35006 4318347 1099649 1104975 3094597 1562911 -5777297 -14251961 -18055804 -17141335 -15783582
34997 -15783582 -16130928 -16124682 -13344794 -8397290 -3932064 -1869642 -2376819 -4537359 -6893187
34988 -6893187 -7637043 -5636981 -2064100 -163955 -1894137 -4761280 -3731507 2777634
34980 2777634 10206423 12552689 8697462 2343358 -3359898 -8453844 -13173164 -15032636
34972 -15032636 -10947654 -1571239 7974838 12118213 9602102 4553408 2659641 5582950
34964 5582950 9011314 6712094 -3417908 -17425376 -28628880 -32130745 -27038125 -16082863
34956 -16082863 -3385786 8300843 18148943 24781767 24993813 17446070 6992243 1878174
34948 1878174 5343862 12383005 16323343 16400054 16660373 19162429 21449226 20720669 17783738
34939 17783738 15553337 14968523 14016840 10906330 7141275 6349971 9943910 15079927
34931 15079927 17852957 17526508 15994667 13858286 9769392 4173427 799043 2360185
34923 2360185 6500198 8413764 6738169 4573838 4830898 6821142 8196005 8523561
34915 8523561 9338770 11102146 11811115 9739096 6998410 8584965 16732073 27116396
34907 27116396 32312359 29067990 21107262 14917528 13888772 16206643 16978008 12587372
34899 12587372 4440451 -1929447 -2945266 -1059918 -353997 226971 4703534 11723692
34891 11723692 14561420 11222208 8330079 11195285 15724755 15679334 13082128 14115875
34883 14115875 17796300 17131339 10711378 4802062 2963663 1544762 -2027510 -3835479
34875 -3835479 -313419 5535165 9246891 11007654 11798466 8522912 -527568 -8734595
34867 -8734595 -6907973 5016933 18034030 25316591 27794662 28673669 28439265 26720165
34859 26720165 24035563 19657268 11875874 2364237 -3714370 -4368001 -3931876 -6720910
34851 -6720910 -10710342 -10935456 -6782489 -2259347 -514307 -1412540 -3378252 -4337281 -1697084
34842 -1697084 5157508 12635123 16434274 17154159 19010956 22704116 23491036 18008671
34834 18008671 9732628 5037460 5776325 8288670 8678554 6859534 5716253 7710426
34826 7710426 12193219 15613613 15150781 12175602 10422485 10610252 9702207 6538676 4565537
34817 4565537 6156557 7424539 3019761 -5586831 -11133525 -9315706 -2506633 4757850
34809 4757850 9788463 11489022 10729035 11286575 15697974 19739763 16566539 7461962
34801 7461962 1973064 4682884 8807639 7627546 5463216 10010023 18966499 23562576
34793 23562576 22859990 24539851 31111897 34931150 29984715 20662316 14066317 9664212
34785 9664212 2373273 -7846251 -15368568 -16465013 -13022124 -9184110 -7557626 -8549046
34777 -8549046 -10806757 -11808705 -9313738 -2774188 6238159 14067961 16410232 12462064
34769 12462064 7652699 8819056 15609242 20048868 16325161 7805822 2381742 4170504
34761 4170504 12220816 23592071 33712715 36566887 29604400 17733588 8617125 4595362
34753 4595362 2472845 73085 -1153879 204955 3220773 6395835 8501444 7585798
34745 7585798 2781324 -2411739 -2540199 2676592 7003225 5357065 -11991 -3112031
34737 -3112031 -1471745 2682109 6478168 8636700 8746166 7382921 6921860 9594182
34729 9594182 14009715 15602324 11719649 4962689 136170 -1175739 -1216499 -1576854 -513418
34720 -513418 4016772 10468348 15176371 17043866 18267703 20302364 21683294 20668356
34712 20668356 17562752 13066155 6744076 -774945 -6155482 -6668943 -3928980 -1604862
34704 -1604862 -302243 2328158 6768476 10166269 10371181 8787302 7972511 8358914 8840390
34695 8840390 9309503 10839197 13422631 14709181 11937146 5531258 227050 1241038
34687 1241038 8837979 17765495 22509003 21899202 18453831 15500660 15762370 19738997
34679 19738997 23385328 20313841 9488965 -1548390 -4787468 -1250383 1597448 227330
34671 227330 -2124817 -2203372 -670916 1398948 4621039 8026366 8317023 5085858 3296238
34662 3296238 7719428 17213537 26583354 31983212 32932798 31302004 29804056 29460402
34654 29460402 27835833 22377770 15628146 13080303 15114413 16174529 13896905 13200445
34646 13200445 17441164 21136538 17560440 9766461 7114544 12614558 20304489 24556842
34638 24556842 25645026 25665440 25010766 24625790 26747150 31034482 33874560 33898141 34757356
34629 34757356 39607243 45427293 46034509 39573512 30440981 24230295 22813937 24514903
34621 24514903 27325342 30498726 33096118 32736098 27834431 20780417 16207952 15206767
34613 15206767 13951779 9584874 4346475 1430457 171942 -920311 185287 4949698
34605 4949698 8631350 5952579 1222280 4304964 15341133 22495625 18772522 12378162
34597 12378162 13473071 17766019 13282771 33567 -8208112 -2810994 8589874 13784731
34589 13784731 11432754 9034545 10459527 12757764 13780111 15773975 19635284 20993323
34581 20993323 16050066 8695049 7194224 13815030 21578945 22743202 17378743 11061596
34573 11061596 6805069 3540168 1474510 3437779 9146518 12796533 10083868 4733932
34565 4733932 3658570 6996951 7653402 1147773 -7955730 -10901289 -3529937 10724039
34557 10724039 23999146 28857339 22684460 9852430 -1373940 -5618156 -3551121 1646223
34549 1646223 8138707 14177450 16358845 13182450 8864893 9101468 13101919 14406482
34541 14406482 10664074 7734249 11099550 17313952 18783994 14810542 12241179 15103850
34533 15103850 18883656 17166831 10166628 3806269 2728237 6982764 13905232 20195893
34525 20195893 22796527 20578018 15665450 11456752 8967387 6135076 659030 -7385776
34517 -7385776 -15434867 -20057747 -19377156 -15083057 -11363068 -10331016 -9034300 -2753760
34509 -2753760 8817581 20284997 25588493 23221423 16758962 11553416 10418009 10859052
34501 10859052 7037325 -3421228 -14973129 -19326900 -15323451 -10398764 -10967958 -14769806
34493 -14769806 -15374836 -11458924 -7612935 -7168193 -8608572 -9627354 -10714825 -12523461
34485 -12523461 -12497943 -7486574 1100473 7808666 9357587 8032808 7647581 7934191 5131758
34476 5131758 -2257625 -10269519 -12670302 -6622469 4739552 14417450 16557278 10985952
34468 10985952 3132264 -1649076 -3352011 -5151532 -6683001 -3279230 6674048 17288867
34460 17288867 21232742 18034664 13173160 10624371 9806394 8814184 7084113 5161205
34452 5161205 4641087 7550541 12920556 15426739 11285926 4276507 1396224 3648136
34444 3648136 6661854 9770776 17267554 29214276 38379385 39838576 37446183 36716669
34436 36716669 37255480 37218078 39190023 44497297 46184136 36329422 18711020 6078418
34428 6078418 4562896 7643508 6595660 791664 -4290814 -4365356 603833 7031232
34420 7031232 9604208 5305148 -3319655 -10952543 -15244712 -17151722 -16931913 -14134600
34412 -14134600 -10828507 -9757072 -9246308 -5257647 1061596 3744592 1191795 -1093271
34404 -1093271 820901 3867809 4259263 3304648 2982518 1258318 -3132579 -5988322 -3589329
34395 -3589329 195394 -1276154 -8012401 -14298883 -16608824 -15003641 -9101653 756294
34387 756294 9684291 12370367 10662464 10633569 12322349 9579485 1081941 -6047926 -6391400
34378 -6391400 -3294636 -1983168 -1626155 755086 3332160 2381199 -966542 -2820530
34370 -2820530 -3500841 -6567244 -11660817 -14176449 -12844148 -12443772 -16840918 -23246495
34362 -23246495 -26248838 -24901862 -22522817 -20675499 -16805734 -8618420 1416444 7733911
34354 7733911 7342460 2328324 -3433500 -8292169 -12175858 -13481188 -9723798 -1828826
34346 -1828826 5066582 7002044 5641316 5312165 7030298 7991573 6241632 2976252
34338 2976252 -75159 -3007628 -6421581 -9507705 -10761197 -9781768 -7649015 -6192019
34330 -6192019 -7019931 -10000076 -12336302 -10784680 -5723531 -1488083 -1261149 -2997521
34322 -2997521 -2423740 751568 2114351 -1816177 -9485072 -16592283 -20462759 -20878326
34314 -20878326 -18476779 -14591816 -11826727 -12324003 -15241737 -17758442 -18881327 -20515880
34306 -20515880 -24261773 -28862065 -31496346 -29900318 -22752000 -10780452 725035 3619229
34298 3619229 -4948037 -17341751 -22559001 -18479719 -13058552 -12886247 -15192143 -13343582
34290 -13343582 -6229339 1281343 4541906 2331522 -3885084 -10064866 -10792576 -4972164
34282 -4972164 455228 -2656755 -12760751 -19350345 -15944950 -7600849 -2795291 -2179046
34274 -2179046 50806 6124671 11583102 12308036 9930183 8162482 7009822 3997201
34266 3997201 -144526 -1131163 2057062 3216343 -4283875 -17457824 -25137179 -21152965
34258 -21152965 -11721997 -6178590 -4532494 -379753 6389690 8331169 2849266 -2618210
34250 -2618210 -1795963 1065600 -1365887 -8318132 -13847119 -16542650 -18653254 -18624356 -13172204
34241 -13172204 -5688490 -3824879 -7996121 -10327912 -6526703 -893782 2623089 5872174
34233 5872174 9135425 6867657 -2823739 -11317948 -9931586 -2490449 548041 -2937788
34225 -2937788 -6104665 -5482284 -5069625 -7881216 -11370880 -13069826 -14412732 -16819222
34217 -16819222 -19090603 -20388821 -21022871 -19044449 -11473249 -876647 4652063 963998
34209 963998 -7154815 -13067348 -15765795 -17358774 -17926357 -16853496 -15248764 -12900375
34201 -12900375 -6577285 4236964 13562881 15830576 13303854 11397801 10144957 6932099
34193 6932099 4692356 8844023 16873082 19919684 16027506 13061117 15299855 15626993
34185 15626993 6752946 -6509248 -13482225 -11796331 -7680286 -4667736 -261175 6026214
34177 6026214 8817403 3764912 -6490538 -15907817 -21211314 -22334430 -19953417 -15489465
34169 -15489465 -11660329 -10280460 -10153505 -8811925 -5854770 -3521407 -4364278 -8609791
34161 -8609791 -12955122 -12250641 -4312277 6595114 13174952 12673001 8969176 6680261
34153 6680261 6262796 6364875 7446543 10018135 11984241 11410470 9968506 9746458 8479872
34144 8479872 2860826 -4364090 -6386808 -2056569 2232765 2426528 2822287 8279735
34136 8279735 15183702 15836230 9329694 2210218 -847537 -1375485 -1506772 605413 7081128
34127 7081128 15463448 20823417 21113579 17724988 11677866 2340620 -9333047 -18784121
34119 -18784121 -21660179 -19388084 -18221276 -21208893 -23471077 -18709713 -8993248 -3068464
34111 -3068464 -4279783 -5939481 -1911387 3683438 3137395 -2378912 -4790733 -2174002
34103 -2174002 -1230457 -5282538 -8176483 -4469574 1115103 749209 -4503797 -7061866
34095 -7061866 -5110736 -4977217 -10633085 -17356818 -18558852 -14325671 -9607949 -6827391
34087 -6827391 -4403315 -1669337 -1275230 -5511756 -12638696 -18676091 -21558954 -21485943 -18005035
34078 -18005035 -10014268 247679 6434391 4544628 -1376443 -3662991 -749175 1439934
34070 1439934 -1582525 -6608063 -7424455 -2585341 4029172 7981360 7029873 1262217
34062 1262217 -6580319 -12286825 -14242225 -15004783 -16543389 -15898347 -9050144 2144991
34054 2144991 10944042 13653568 12939152 12563048 12268403 9633262 4636852 125881 -1500499
34045 -1500499 -553017 1042985 2442999 4884568 9420583 14135848 15427666 12538778
34037 12538778 8715205 6834049 6378844 6378972 8142335 11825309 13037236 7485794 -2265280
34028 -2265280 -9266322 -10828309 -10223776 -10209212 -10031484 -9376080 -9786570 -10335695 -6931262
34019 -6931262 1308964 9244197 12370410 12573029 13903216 16144193 16619810 15501778
34011 15501778 14587679 12601891 6794128 -992957 -4265829 1072374 12259378 22647733
34003 22647733 26900137 23489171 15049531 6910509 2722827 511715 -4891559 -14487686
33995 -14487686 -22280720 -21679134 -13622975 -6220904 -6140856 -11926057 -16782190 -16944254 -15317418
33986 -15317418 -16465635 -20254525 -22675120 -21813159 -19929653 -19395460 -19554490 -18764093 -16897158
33977 -16897158 -14130890 -9645402 -3794402 356918 406563 -1596947 -1457074 1503573
33969 1503573 3375110 190652 -8156124 -18168898 -25276564 -26565595 -22850117 -18049264
33961 -18049264 -15302551 -14068330 -12030806 -8709623 -5484716 -3192248 -1983452 -2812792
33953 -2812792 -6427780 -10994492 -13288953 -12751171 -12369937 -14949614 -19922662 -24100960
33945 -24100960 -24417152 -20301106 -14801054 -12528320 -14357396 -15055031 -9189931 986873
33937 986873 7300668 5949820 2186595 2946616 8288020 12856566 13091169 9648833 4591881
33928 4591881 -32558 -1509857 1978447 8547815 13838046 15434195 13947039 9804893
33920 9804893 2195128 -7439838 -13700695 -11817570 -3008603 6794383 12934177 14922955
33912 14922955 14195830 11770017 8717205 6632792 6178686 6391115 6459497 6922938 8082931
33903 8082931 8794768 8363594 8076335 8752029 8248575 4349662 -786959 -2793954 -1916037
33894 -1916037 -3694348 -11173106 -19599761 -21283681 -13760349 -1305925 9639887 14781327
33886 14781327 14006121 11502706 12184753 16119945 18515585 16800139 14259891 13598210
33878 13598210 10903411 1622334 -9873738 -13697745 -7582719 -137460 706985 -3270274
33870 -3270274 -5878340 -5646599 -5315308 -5648630 -4840609 -3135068 -3989352 -9958003 -19321365
33861 -19321365 -27223685 -29602400 -26574290 -22330408 -20787611 -21416888 -20842953 -17914204
33853 -17914204 -14271013 -10125631 -3874512 2734932 3981000 -1845911 -7880686 -6891868
33845 -6891868 -1292439 615548 -2964822 -4832602 609273 9797265 15430122 15323551
33837 15323551 12714808 10517079 8864803 7265578 6018654 5251268 4489389 3605145
33829 3605145 3006271 2714652 2364702 2345792 3689391 6006476 6546626 2823687 -3982714
33820 -3982714 -9837311 -12500088 -13745210 -15964321 -18418912 -18948893 -17955180 -17548796 -17085927
33811 -17085927 -13095058 -4647685 4174853 8698571 8115204 4190162 -1526209 -6907430
33803 -6907430 -8443716 -4690249 833096 3293383 2201015 647301 2865 -1159930
33795 -1159930 -3173332 -3966408 -2486906 -512556 291315 1044801 3985360 9389835 15155461
33786 15155461 18674936 18815159 16926826 15852346 16803283 17437729 14544830 8621988
33778 8621988 4082546 4419722 8396452 11511721 10433950 5819181 1341834 -185246
33770 -185246 154244 -639074 -2276994 -789054 4664651 7882355 3102887 -5221115 -5919966
33761 -5919966 4905744 18696343 25352417 24722078 23903065 26721408 30290364 30424800
33753 30424800 26485731 20978992 17071535 16693998 19304869 22317107 23578372 22984225
33745 22984225 21118960 17491718 11164508 2391700 -6710828 -12044788 -8779776 4000618
33737 4000618 19150432 25868264 20754824 11494498 6958131 7047451 6051077 2670456
33729 2670456 1047555 3255560 6621909 8740581 10016743 10313802 7783455 2696481
33721 2696481 -1409867 -2070890 -48684 3968351 10717399 18485341 22143100 19330025
33713 19330025 14525080 13578335 16547206 19114366 18836279 16532235 13430504 10770081
33705 10770081 10929919 14984525 19582481 19754593 14831829 8896758 5946605 7466450
33697 7466450 13755786 23657808 32934592 36831000 35104542 31451533 27693889 22210807
33689 22210807 14750490 8619678 6418821 7158869 9264494 12726334 16325995 16847311
33681 16847311 14001097 12383126 15034376 18557554 18620267 16767226 16781154 17600067 16329939
33672 16329939 16018156 22403910 32823199 36517377 28541408 16493643 9852813 8820589
33664 8820589 8450556 8233780 10917302 15134205 16413727 14683753 14637679 18426653 23314052
33655 23314052 27282781 31751421 36966733 39432428 36923522 32682050 31282312 32555629
33647 32555629 32869604 30842307 28339303 26593196 24978394 23943739 25597676 29673360
33639 29673360 31626640 27515541 19559418 14099289 14309811 17457851 19463388 19196142
33631 19196142 17163178 13122247 7703778 4190533 5112092 8047083 8461261 6448261
33623 6448261 6784122 11744813 17791170 20724966 20281693 17520252 11584799 2568977
33615 2568977 -5281368 -7446779 -4860096 -2220317 -1747820 -2089235 -2334804 -3082664 -3718648
33606 -3718648 -2591692 -479078 -440028 -3297780 -6253154 -6976397 -6189058 -4889291 -1853217
33597 -1853217 3919406 10033175 12328116 9444871 4666633 3144155 7130919 13388859
33589 13388859 15893252 12241432 6693452 5350238 9079034 13070064 12574851 6846817
33581 6846817 -1691461 -9252785 -12075447 -9179473 -3907925 -155415 2333596 5638246
33573 5638246 7651485 3406704 -7023003 -17019898 -21446881 -21598739 -20384893 -17644078
33565 -17644078 -13092010 -9067103 -6543977 -2655441 3595913 7231032 4075386 -1640185
33557 -1640185 -2394456 1939654 4599731 2246856 -1155871 -1141842 1695035 3986906 3374174
33548 3374174 -1008493 -8308102 -15137213 -17760418 -15840908 -11995561 -8212388 -5420096
33540 -5420096 -5325882 -8454007 -10854084 -7679624 -702057 2473512 -2006633 -9886094
33532 -9886094 -15471257 -17709470 -17048993 -11313384 619943 14067701 22375679 24207265
33524 24207265 23015720 20410290 14669836 6278492 509047 1751992 7256543 9469939
33516 9469939 4676502 -2763572 -5780401 -2580953 2770619 6644628 9025282 9824512
33508 9824512 6920147 1461821 961628 10815052 24416758 28756224 20378873 8993295
33500 8993295 3460893 1517716 -2415376 -5980771 -2718509 6224673 11833908 8555460
33492 8555460 308197 -5476752 -5483674 -1275013 3885742 7317061 8097545 7191738 5716869
33483 5716869 3558614 794041 -875234 -113291 1903854 3628258 5924991 9737815
33475 9737815 12420554 10440258 5309512 2401059 3028817 1876406 -5563695 -15943795
33467 -15943795 -21041439 -16454353 -5686494 3503926 5893750 2827554 -69908 144800
33459 144800 -18762 -5201422 -13189371 -16128133 -10586027 -2532999 -14086 -3895611
33451 -3895611 -8806019 -10867507 -10747233 -10150696 -9346425 -8816169 -10168787 -13605475 -16189569
33442 -16189569 -14624570 -9339297 -4356774 -3021765 -5144600 -8918941 -14033710 -20657617
33434 -20657617 -25803989 -24088711 -14088791 -1736675 5332315 5541477 2966166 951454
33426 951454 87507 1551250 7140795 14767446 18678490 16599252 12840815 11736577
33418 11736577 11848279 10060930 7745117 8257858 10919755 12550782 13398230 16277886
33410 16277886 20545166 22302998 20838892 19649890 20129054 19400047 16242196 14128683
33402 14128683 15344746 16307820 12585334 5458235 -566916 -4423792 -8270371 -12003601
33394 -12003601 -12590190 -8956738 -3861050 -313778 942694 -45255 -3357696 -7448729
33386 -7448729 -9001959 -6304969 -1462157 1870808 1836844 -1180815 -5919114 -10988790
33378 -10988790 -15546462 -20222033 -26006260 -31007587 -30040643 -19943554 -4869933 6189628
33370 6189628 7744218 1997197 -5482592 -11681450 -16166020 -17776822 -15002099 -9334986
33362 -9334986 -4643756 -2133176 833501 4947923 5321910 -2491723 -14536101 -20949419
33354 -20949419 -16396925 -4335007 8900344 19491484 24621980 21125504 9463921
33347 9463921 -4311718 -14398030 -20718283 -25524842 -27830738 -25851191 -22461397 -22439060
33339 -22439060 -25106464 -25251916 -21356463 -17475018 -16260486 -15519555 -13229234 -10924190
33331 -10924190 -9938283 -8817879 -6821881 -5620764 -5022119 -1710653 4429563 7377047
33323 7377047 2761181 -5224826 -9467375 -9114872 -7865262 -6175216 -1652591 4354942
33315 4354942 7303360 6633150 6437374 8280211 9031813 7359177 7056871 11210215 16953376
33306 16953376 18997642 15996998 11275564 8914029 10175508 12071622 9353956 433198
33298 433198 -8893293 -11095473 -6424575 -2627264 -4514987 -8752232 -10830874 -11826891
33290 -11826891 -14371391 -16179208 -12853522 -5203814 892097 1361929 -2683287 -7800712
33282 -7800712 -11288511 -11563234 -8222285 -2477726 3480679 7503818 7854894 4278455
$$ [...]
##END NTUPLES=NMR SPECTRUM
##END=
