##TITLE=31Pdec_DE_63_1_oil
 D2O, 64 sc
 6.8.2024
##JCAMPDX= 6.0         $$ Bruker NMR JCAMP-DX V2.0
##DATA TYPE= NMR SPECTRUM
##DATA CLASS= NTUPLES
##ORIGIN= UXNMR, Bruker Analytische Messtechnik GmbH
##OWNER= root
$$ XWIN-NMR		Version 3.5
$$ Tue Aug  6 13:52:33 2024 Russian Standard Time (UT+4h)  she@DPX200
##.OBSERVE FREQUENCY= 81.013821
##.OBSERVE NUCLEUS= ^31P
##.ACQUISITION MODE= SIMULTANEOUS
##.ACQUISITION SCHEME= undefined
##.AVERAGES= 64
##.DIGITISER RES= 17
##SPECTROMETER/DATA SYSTEM= spect
##.PULSE SEQUENCE= zgpg30
##.SOLVENT NAME= D2O
##.SHIFT REFERENCE= (INTERNAL, D2O, 0, 198.062)
##AUDIT TRAIL= $$ (NUMBER, WHEN, WHO, WHERE, WHAT)
$$ ##TITLE= Audit trail, XWIN-NMR		Version 3.5
$$ ##JCAMPDX= 5.01
$$ ##ORIGIN= Bruker BioSpin GmbH
$$ ##OWNER= she
$$ F:/spectra/data/she/nmr/P31/2/pdata/1/auditp.txt
$$ ##AUDIT TRAIL=  $$ (NUMBER, WHEN, WHO, WHERE, WHAT)
(   1,<2024-08-06 13:51:18.01 +0400>,<she>,<DPX200>,
      <created by zg, POWCHK disabled, PULCHK disabled
       configuration hash MD5:
       00 E9 B6 7A A2 85 ED C7 34 08 36 98 17 FE 4E 26
       data hash MD5: 32K
       A2 45 C4 DB 97 AB 58 EC 17 66 5F 8C 65 3A 51 14>)
(   2,<2024-08-06 13:51:20.34 +0400>,<she>,<DPX200>,
      <Start of raw data processing
       efp BC_mod = 2 LB = 1.5 FT_mod = 6 PKNL = 1 PHC0 = 2683.11 PHC1 = 55.8869 SI = 64K 
       data hash MD5: 64K
       4B 2A 69 35 3B 54 54 34 51 C3 27 7A B6 26 C6 A4>)
(   3,<2024-08-06 13:51:43.93 +0400>,<she>,<DPX200>,
      <pk PHC0 = -22.14182 PHC1 = 52.6 
       data hash MD5: 64K
       01 AA 0D 25 6C FE 10 D4 F2 B6 12 E6 7F C8 6B E2>)
(   4,<2024-08-06 13:51:53.15 +0400>,<she>,<DPX200>,
      <abs ABSG = 5 
       data hash MD5: 64K
       7D CB E1 0A 70 11 35 DF 7F 8F D1 8F A8 48 F4 38>)
$$ ##END=
$$ 
$$ hash MD5
$$ 86 0B 33 ED B1 37 84 8B 0F F9 B4 65 96 66 B6 57
##$RELAX= 
##$RELAX= 
##$RELAX= 
##$RELAX= 
##$RELAX= 
##$RELAX= 
##$RELAX= 
##$RELAX= 
$$ Bruker specific parameters
$$ --------------------------
##$DU= <F:/spectra>
##$EXPNO= 2
##$NAME= <P31>
##$PROCNO= 1
##$TYPE= <nmr>
##$USER= <she>
##$AMP= (0..31)
100 100 100 100 100 100 100 100 100 100 100 100 100 100 100 100 100 100 
100 100 100 100 100 100 100 100 100 100 100 100 100 100 
##$AQSEQ= 0
##$AQ_mod= 1
##$AUNM= <au_zg>
##$AUTOPOS= <>
##$BF1= 81.014009
##$BF2= 200.13
##$BF3= 200.13
##$BF4= 200.13
##$BF5= 200.13
##$BF6= 200.13
##$BF7= 200.13
##$BF8= 200.13
##$BYTORDA= 1
##$CFDGTYP= 0
##$CFRGTYP= 5
##$CHEMSTR= <none>
##$CNST= (0..31)
1 1 145 1 1 1 1 1 1 1 1 1 1 1 1 1 1 1 1 1 1 1 1 1 1 1 1 1 1 1 1 1 
##$CPDPRG= <waltz16>
##$CPDPRG1= <>
##$CPDPRG2= <waltz16>
##$CPDPRG3= <>
##$CPDPRG4= <mlev>
##$CPDPRG5= <mlev>
##$CPDPRG6= <mlev>
##$CPDPRG7= <mlev>
##$CPDPRG8= <mlev>
##$CPDPRGB= <>
##$CPDPRGT= <>
##$D= (0..31)
0 1 0 0 0 0 0 0 0 0.06 0 0.03 2e-05 3e-06 0 0 0.0002 0 0 0 0 0 0 0 0 0 
0 0 0 0 0 0 
##$DATE= 1722937877
##$DBL= (0..7)
120 120 120 11 120 120 24 19 
##$DBP= (0..7)
150 150 150 150 150 150 150 150 
##$DBP07= 0
##$DBPNAM0= <>
##$DBPNAM1= <>
##$DBPNAM2= <>
$$ [...]
##$SUBNAM3= <"">
##$SUBNAM4= <"">
##$SUBNAM5= <"">
##$SUBNAM6= <"">
##$SUBNAM7= <"">
##$SUBNAM8= <"">
##$SUBNAM9= <"">
##$SW= 400.765351723535
##$SWIBOX= (0..15)
0 1 3 0 0 0 0 0 0 0 0 0 0 0 0 0 
##$SW_h= 32467.5324675325
##$TD= 32768
##$TD0= 1
##$TE= 0
##$TE2= 300
##$TE3= 300
##$TEG= 300
##$TL= (0..7)
0 120 53 12 22 120 120 120 
##$TP= (0..7)
150 150 150 150 150 150 150 150 
##$TP07= 0
##$TPNAME0= <>
##$TPNAME1= <>
##$TPNAME2= <>
##$TPNAME3= <>
##$TPNAME4= <>
##$TPNAME5= <>
##$TPNAME6= <>
##$TPNAME7= <>
##$TPOAL= (0..7)
0.5 0.5 0.5 0.5 0.5 0.5 0.5 0.5 
##$TPOFFS= (0..7)
0 0 0 0 0 0 0 0 
##$TUNHIN= 0
##$TUNHOUT= 0
##$TUNXOUT= 0
##$USERA1= <user>
##$USERA2= <user>
##$USERA3= <user>
##$USERA4= <user>
##$USERA5= <user>
##$V9= 5
##$VALIST= <valist>
##$VCLIST= <CCCCCCCCCCCCCCC>
##$VD= 0
##$VDLIST= <DDDDDDDDDDDDDDD>
##$VPLIST= <PPPPPPPPPPPPPPP>
##$VTLIST= <TTTTTTTTTTTTTTT>
##$WBST= 1024
##$WBSW= 4
##$XGAIN= (0..3)
0 0 0 0 
##$XL= 0
##$YL= 0
##$YMAX_a= 18426
##$YMIN_a= -15113
##$ZGOPTNS= <>
##$ZL1= 120
##$ZL2= 120
##$ZL3= 120
##$ZL4= 120
##$ABSF1= 198.0616
##$ABSF2= -202.7028
##$ABSG= 5
##$ABSL= 3
##$ALPHA= 0
##$AQORDER= 0
##$ASSFAC= 0
##$ASSFACI= 0
##$ASSFACX= 0
##$ASSWID= 0
##$AUNMP= <proc_1d>
##$AZFE= 0.1
##$AZFW= 0.5
##$BCFW= 0
##$BC_mod= 2
##$BYTORDP= 0
##$COROFFS= 0
##$CY= -3
##$DATMOD= 1
##$DC= 0
##$DFILT= <>
##$DTYPP= 0
##$F1P= 0
##$F2P= 0
##$FCOR= 1
##$FTSIZE= 65536
##$FT_mod= 6
##$GAMMA= 0
##$GB= 0
##$INTBC= 1
##$INTSCL= 9.790993e-09
##$ISEN= 30
##$LB= 1.5
##$LEV0= 0
##$LPBIN= 0
##$MAXI= 10000
##$MC2= 0
##$MEAN= 0
##$ME_mod= 0
##$MI= 50
##$NCOEF= 0
##$NC_proc= -7
##$NLEV= 6
##$NOISF1= 182.463
##$NOISF2= 159.3651
##$NSP= 0
##$NTH_PI= 0
##$NZP= 0
##$OFFSET= 198.0616
##$PC= 4
##$PHC0= 2660.968
##$PHC1= 108.4869
##$PH_mod= 1
##$PKNL= yes
##$PPARMOD= 0
##$PSCAL= 0
##$PSIGN= 0
##$REVERSE= no
##$SF= 81.0140089999434
##$SI= 65536
##$SIGF1= 159.3651
##$SIGF2= -187.1042
##$SINO= 113.3802
##$SIOLD= 16384
##$SREGLST= <1H.CDCl3>
##$SSB= 0
##$STSI= 65536
##$STSR= 0
##$SW_p= 32467.5324675325
##$SYMM= 0
##$S_DEV= 0
##$TDeff= 32768
##$TDoff= 0
##$TI= <>
##$TILT= no
##$TM1= 0
##$TM2= 0
##$TOPLEV= 0
##$USERP1= <user>
##$USERP2= <user>
##$USERP3= <user>
##$USERP4= <user>
##$USERP5= <user>
##$WDW= 1
##$XDIM= 65536
##$YMAX_p= 364814555
##$YMIN_p= -10588333
$$ End of Bruker specific parameters
$$ ---------------------------------
##NTUPLES= NMR SPECTRUM
##VAR_NAME=  FREQUENCY,     SPECTRUM/REAL,   SPECTRUM/IMAG
##SYMBOL=    X,             R,               I
##VAR_TYPE=  INDEPENDENT,   DEPENDENT,       DEPENDENT
##VAR_FORM=  AFFN,          ASDF,            ASDF
##VAR_DIM=   65536,         65536,           65536
##UNITS=     HZ,            ARBITRARY UNITS, ARBITRARY UNITS
##FACTOR=    0.49542278885378, 1,            1
##FIRST=     16045.7642231865, 0,            0
##LAST=      -16421.768244346, 0,            0
##MIN=       -16421.768244346, -10588333,    0
##MAX=       16045.7642231865, 364814555,    0
$$ Real data points
##PAGE= N=1
##DATA TABLE= (X++(R..R)), XYDATA
$$ [...]
42448 -740362 -720535 -110055 715181 375758 -1161093 -2060235 -1144334 291066 313303 -940574
42438 -940574 -1821943 -1839933 -2051837 -2792216 -2765493 -1112463 918168 1416860 197492
42429 197492 -1248245 -1710175 -1221843 -350796 466485 837476 501809 -253769 -815265
42420 -815265 -981294 -957830 -660554 177649 1076006 969487 -213825 -1076863 -618005 281226
42410 281226 306000 -30124 974645 3491734 5612188 5847440 4871181 4139536 3850425
42401 3850425 3155603 1727130 249275 -327028 535746 2661085 5066506 6555696 6817403
42392 6817403 6551515 6254422 5538650 4054586 2283704 752607 -806507 -2685060 -4204613
42383 -4204613 -4404953 -3269180 -1463352 557686 2259945 2571497 1091484 -598603
42375 -598603 -309911 2025081 4231893 4561355 3291967 1627469 350940 -96689 503206
42366 503206 1540464 1760318 631071 -1107880 -2512309 -3284598 -3422298 -2974903 -2402907
42357 -2402907 -2240364 -2191506 -1562460 -684686 -614159 -1218035 -1167153 -347952 -485779 -2387030
42347 -2387030 -4317374 -4539740 -3898182 -4107617 -4801911 -4440779 -3293003 -3156333 -4366271
42338 -4366271 -5302990 -5038055 -4524299 -4784007 -5622731 -6572375 -7495885 -7737183 -6278361
42329 -6278361 -3515047 -1481221 -1431471 -2380474 -2854876 -2837875 -2927530 -2739144 -1548199
42320 -1548199 201037 1419122 2007661 2721657 3638655 3988890 3506861 2848778 2491129
42311 2491129 2183110 1810986 1936909 2907897 3994708 4108847 3222620 2511572 2937382
42302 2937382 4004611 4222554 2754790 289995 -1883703 -3310864 -4394971 -5193702
42294 -5193702 -4985718 -3355229 -1104970 466381 898246 681023 242307 -619435 -2222934
42285 -2222934 -4283129 -5902369 -6322132 -5760790 -5338612 -5737160 -5988058 -4364807 -811788
42276 -811788 2367605 3033949 1783953 946854 1428221 1922546 1308601 304602 22358
42267 22358 90720 -601413 -1962152 -2775227 -2521122 -1936800 -1644396 -1323618 -698330 -417858
42257 -417858 -1155163 -2340447 -2684419 -1876539 -1040787 -1370137 -2821276 -4334822 -4929528
42248 -4929528 -4385301 -3253411 -2511021 -2923183 -4384521 -6006241 -7042381 -7462860 -7362000
42239 -7362000 -6290620 -3915504 -1182366 141346 -526773 -1737512 -1776495 -807417 -506826
42230 -506826 -1773483 -3614054 -4416493 -3652104 -2047515 -637264 -33212 -173293 -294652
42221 -294652 536256 2323421 3754885 3497626 1828665 383763 218585 749177 846060
42212 846060 316446 -222099 -440979 -520120 -450337 88715 990327 1478237 944672 -338215
42202 -338215 -1636754 -2568622 -3188681 -3571113 -3757910 -3998754 -4580006 -5347091 -5717225
42193 -5717225 -5250488 -3955687 -2018243 347623 2529327 3415102 2261927 -325324
42185 -325324 -2762087 -3984448 -4190745 -3953215 -3234058 -1882236 -627565 -571631 -1654365
42176 -1654365 -2590609 -2639075 -2487791 -2824346 -3014728 -2216549 -1070517 -938410 -1774547
42167 -1774547 -2188400 -1650869 -1186267 -1538178 -2097906 -2322689 -2829769 -4029571 -4842140
42158 -4842140 -4149322 -2719564 -2185695 -2610533 -2662691 -1986085 -1640650 -1940067 -1581810
42149 -1581810 265907 2402598 3277678 3277425 3973899 5560157 6461901 5613807 3910839
42140 3910839 2838972 2492493 1764150 101207 -1844777 -3337679 -4423331 -5241071 -5245253
42131 -5245253 -3987249 -2260805 -1379514 -1366128 -1040727 -140863 4271 -1348281 -2797868
42122 -2797868 -2692402 -1658519 -1682181 -3150397 -4446475 -4365260 -3314709 -1975751 -394448
42113 -394448 1106194 1594097 884541 73330 -42808 -37919 -607941 -1326351 -1558455 -1618829
42103 -1618829 -1912167 -1730178 -153579 2343171 4353164 5277173 5561749 5505166 4923861
42094 4923861 3905892 2901735 2016095 981280 -165111 -1043129 -1504016 -1639887 -1392883
42085 -1392883 -786613 -321688 -448668 -859171 -980236 -892959 -1028736 -1313286 -1482541 -1877190
42075 -1877190 -2890049 -3928668 -4069901 -3485151 -2957455 -2284991 -787870 672316 166690
42066 166690 -2310743 -4264740 -4032821 -2909858 -2734248 -3123432 -2838504 -2385492 -2977627
42057 -2977627 -3809287 -2890732 -389920 1320906 1276328 1228686 2507164 3698990 2868687
42048 2868687 457244 -1704557 -3089469 -4335419 -5174350 -4523083 -2537466 -798785
42040 -798785 -216084 -233236 -365695 -897931 -1475644 -692701 1752725 3807559 3461151
42031 3461151 1537563 534134 1240685 2199518 2284773 1973190 1757438 1028430 -640154
42022 -640154 -2351659 -2979211 -2576326 -1954472 -1605609 -1697393 -2351438 -3232542 -3613098 -3480711
42012 -3480711 -3686585 -4278496 -3821681 -1517969 1022077 1593918 269502 -1061035 -1390769
42003 -1390769 -1146428 -549967 536162 1200162 58868 -2300540 -3364744 -1898506 546143
41994 546143 2055397 2594790 2865861 2632787 1631716 866993 1403742 2661750 3268405
41985 3268405 2916274 2156654 1140283 -60137 -572593 293682 1627301 1939632 1257720
41976 1257720 729241 493532 -329709 -1554033 -1632194 105661 2414039 3899921 4501524
41967 4501524 4546316 3634563 1488911 -947408 -2337234 -2484800 -2309441 -2623982 -3517997
41958 -3517997 -4606729 -5323763 -5201008 -4310438 -3250797 -2422253 -1610888 -559428 426807
41949 426807 805214 424897 -502308 -1752655 -3039630 -3879910 -3961173 -3562698 -3259014
41940 -3259014 -3194928 -2899077 -1906118 -465862 519184 409759 -386399 -885321 -827805 -942322
41930 -942322 -1610442 -2046000 -1609515 -1283097 -2546823 -4977499 -6380100 -5552304 -3617859
41921 -3617859 -2165979 -1384551 -821644 -782747 -1758102 -3182929 -3977034 -3965995 -3794696
41912 -3794696 -3756674 -3667946 -3668909 -4176590 -5057972 -5635740 -5544193 -4988266 -4246483 -3494010
41902 -3494010 -2968893 -2722600 -2365816 -1615214 -844339 -516213 -435342 -245628 -186513 -434886
41892 -434886 -196406 1295746 3166201 3733589 2941558 2410214 2850156 3116151 2415530
41883 2415530 1691483 1693696 1249121 -906798 -3643784 -4655558 -3693628 -2805247 -3403221
41874 -3403221 -4706998 -5337607 -5031644 -4257943 -3286881 -2325880 -1781227 -1721450 -1561520
41865 -1561520 -715943 815190 2661279 4283496 4823541 3603209 1239776 -469681
41857 -469681 -401406 675797 1276237 1034221 699365 780155 1025629 1073251 905762 720623
41847 720623 850054 1633653 2842418 3472492 2774545 1339532 466894 551617 867955
41838 867955 953498 1313974 2435896 3819739 4496392 4131109 3277740 2795520 3149230
41829 3149230 3969967 4290181 3634486 2792255 2873192 3690210 4022600 3576502 3447794 4113657
41819 4113657 4271037 2731077 441641 -720999 -445849 213694 970401 2409572 4054920
41810 4054920 4293063 2781490 1267307 1177920 1850429 2154569 2430241 3354874 4049606
41801 4049606 3234742 1736291 1806164 3829775 5560415 5218000 3765523 3142568 3500700
41792 3500700 3506803 2633527 1688412 1238663 822978 32613 -577094 -214892 971543 1899863
41782 1899863 1577425 -4340 -1770199 -2368622 -1492389 -432421 -772633 -2385462 -3412870
41773 -3412870 -2636051 -1120467 -739932 -1642596 -2256297 -1558071 -118357 1179158 2133775
41764 2133775 2489059 1543866 -507243 -1878165 -1166221 565202 1070022 -12961 -852987
41755 -852987 -223898 905556 1045777 131970 -961779 -1795976 -2325990 -2280532 -1605735
41746 -1605735 -1052826 -1377935 -2251941 -2781990 -2812495 -2819516 -2725215 -1866782 -310454 698675
41736 698675 80871 -1726819 -3143878 -2991974 -1526158 -106787 68096 -985615 -2228382
41727 -2228382 -2788031 -2687310 -2352235 -1950812 -1601037 -1720932 -2535147 -3524746 -3991366
41718 -3991366 -3947796 -3841819 -3641061 -2901875 -1596489 -165315 1121459 2139587 2448430
41709 2448430 1750786 736997 485159 944721 985638 68305 -1172997 -2156094 -2918819
41700 -2918819 -3097313 -1748522 970605 3156209 3297887 2160721 1413987 1239863 640019
41691 640019 -540427 -1439294 -1742179 -1938439 -2087442 -1784015 -1450872 -2135859 -3567725
41682 -3567725 -3843559 -1892069 826248 2050231 1397121 331001 -24132 13679 -348644
41673 -348644 -1164717 -1691961 -1166743 399279 2022805 2581924 2103162 1858090 2738439
41664 2738439 3880992 3584764 1508712 -766420 -1606912 -1225647 -1270225 -2729694 -4738452
41655 -4738452 -5613641 -4776039 -3240182 -2209572 -1728064 -1143530 -467923 -404600 -983025
41646 -983025 -1111947 -27381 1477649 1988380 1237371 209095 -254696 -143766 353624
41637 353624 1330932 2784170 4332146 5513112 5909528 4986036 2544383 -434025 -2196545
41628 -2196545 -1995444 -869191 -125192 298815 1164179 2196758 2235409 1092916 87818
41619 87818 256640 893887 549186 -1030596 -2641902 -3059730 -2145057 -641058 587805
41610 587805 1073159 925985 659573 650768 774743 732313 598799 715200 1075565 1206355
41600 1206355 759496 -67033 -819656 -1238588 -1294369 -1084379 -951430 -1449189 -2738813
41591 -2738813 -4004685 -3929013 -2108220 164893 978541 -200822 -1949426 -2560746 -1937806
41582 -1937806 -1291223 -1218436 -999401 -31817 976236 986680 202211 -253765 76913 645695
41572 645695 1002449 1263512 1414382 1119808 479748 70036 -118536 -880243 -2438562
41563 -2438562 -3742993 -3763515 -2754515 -1559889 -404509 828178 1847207 2456329 3163217
41554 3163217 4174789 4375234 2697825 178980 -938868 -184538 665687 427608 159921
41545 159921 1091247 2262964 1588889 -1362745 -4780466 -6544153 -6016210 -4242355 -3023015
41536 -3023015 -3434123 -4667616 -4720309 -2793277 -491328 69657 -1185110 -2524836 -2744283
41527 -2744283 -2137321 -1354694 -580340 -81921 -421797 -1486436 -2051098 -1031285 1147510
41518 1147510 2904567 3019210 1504904 -733203 -2699987 -3820360 -3941145 -3060609 -1341779
41509 -1341779 461562 1054540 -220660 -2305094 -3268831 -2468860 -1218979 -962810 -1440944
41500 -1440944 -1309325 -122827 1147245 1505661 1033956 334085 -479586 -1630136 -2756980
41491 -2756980 -2853019 -1448109 462647 1150024 -90681 -2155077 -3248424 -2669410 -1392344
41482 -1392344 -1004386 -2169707 -4072948 -5355004 -5649426 -5968714 -7203348 -8516899 -8145601
41473 -8145601 -5995198 -4310737 -4865478 -6342316 -5913660 -3123637 -621990 -710101 -2547671
41464 -2547671 -3575226 -2694957 -1028551 -120262 -443002 -1498033 -2496141 -2803974 -2271686
41455 -2271686 -1344712 -669539 -543201 -768262 -893822 -620519 -255927 -662083 -2209383
41446 -2209383 -3851894 -4070357 -2868650 -1816876 -1743377 -1629394 -632888 64086 -1107050
41437 -1107050 -3442715 -4665661 -3925153 -2377983 -880398 1008208 3333093 4879680
41429 4879680 4893143 4245541 3884557 3350343 2006351 697310 766506 2057496 3254725
41420 3254725 3814327 4256842 4788153 4937246 4533474 3834801 2645836 581015 -1558288
41411 -1558288 -2023325 -413579 1331711 1143443 -676959 -2066638 -1805056 -558375 396654
41402 396654 488292 -164121 -1198711 -2106719 -2468074 -2471658 -2795482 -3622503 -4165791 -3642714
41392 -3642714 -2425802 -1583408 -1346039 -797240 602045 1873902 1619857 -42744 -1439454
41383 -1439454 -1296680 -89615 753479 403864 -915492 -2497264 -3709120 -4310064 -4599228
41374 -4599228 -4996453 -5232837 -4412514 -2270868 127500 1504496 1743864 1542339 1219062
41365 1219062 760402 606480 1181355 1725979 869861 -1397932 -3482501 -4247209 -4140265
41356 -4140265 -3765786 -2670730 -547530 1459175 2001006 1459938 1331024 2072640 2865389
41347 2865389 3251154 3593395 3867873 3451654 2562850 2630218 4404259 6532870 6906682
41338 6906682 5031027 2424895 942771 1178750 2282136 2930018 2591860 1978731 2011824
41329 2011824 2426510 2049162 591064 -711488 -780253 -230146 -383800 -1299320 -1806213
41320 -1806213 -1297150 -445761 -25508 81571 336856 678955 709234 397228 173794 438863
41310 438863 1190608 2028001 2411573 2089722 1390946 966704 1152414 1668573 1963280 1723533
41300 1723533 1058077 336963 -128934 -373363 -736153 -1441840 -2275266 -2777969 -2661798
41291 -2661798 -1945750 -930886 -243495 -574973 -1951569 -3466368 -4218016 -4359371 -4653374
41282 -4653374 -5115293 -4869184 -3515736 -1900571 -1109267 -1235507 -1601208 -1764386 -1783786
41273 -1783786 -1755111 -1598957 -1227090 -604153 242893 1099110 1717480 2280652 3243267 4362524
41263 4362524 4478208 2971276 1008623 348904 998605 1113230 -490649 -2670601 -3373972
41254 -3373972 -2026374 171167 1813497 2366696 1998972 1272826 1036725 1761406 2678690
41245 2678690 2290435 230681 -1924044 -2361089 -1215237 -289347 -721493 -1812891 -2375850
41236 -2375850 -2329357 -2292739 -2227178 -1441887 181784 1809503 2617261 2541598 2018650 1592401
41226 1592401 1805984 2696373 3236053 2219301 139653 -810465 600284 2870888 3756971
41217 3756971 3328380 3596417 5404041 7344352 8009237 7743371 7489685 7237315 6600517
41208 6600517 5871552 5315185 4230622 2094320 138246 230588 2186063 3667763 3183953
41199 3183953 1927030 1905796 3222406 4177806 3518482 1573208 -613226 -2297190 -3081045
41190 -3081045 -2801450 -1855755 -1181675 -1358281 -1842195 -1559704 -351217 555076 -157445
41181 -157445 -2267662 -4114937 -4422113 -3599301 -2903452 -2684584 -2138473 -762094 716117
41172 716117 1231981 654857 -367137 -1419985 -2484485 -3277940 -3271657 -2550653 -1955988
41163 -1955988 -1969960 -1991322 -1243987 -6668 745338 761185 825847 1519451 2332723 2397064
41153 2397064 1637873 743464 287226 365691 895210 1670628 2115109 1551241 865
41144 865 -1588822 -2149257 -1366656 269198 1950807 2964642 3020990 2475243 1971477 1657047
41134 1657047 1107568 300869 127076 1283554 3007300 3761126 3135502 2209413 1888416
41125 1888416 1818190 1392369 970429 1297109 2245893 3001984 3207796 3108620 2753738 1946534
41115 1946534 992995 617498 936358 1280679 1271510 1276331 1447654 1167235 102035 -851887
41105 -851887 -506492 1088351 2759726 3575397 3441583 2651616 1605598 812336 439611
41096 439611 -34183 -1089241 -2341913 -3211748 -4029088 -5354566 -6430341 -5789186 -3577675
41087 -3577675 -1676908 -960435 -120647 1712896 2822388 1125239 -2495850 -5082317
41079 -5082317 -5343373 -4563303 -3949436 -3172963 -1947582 -1123670 -1296762 -1766741 -1833137
41070 -1833137 -1898958 -2288067 -2121473 -623063 1289999 2012683 1294723 105826 -1017124
41061 -1017124 -2185595 -3041190 -2827537 -1659752 -560916 -56455 244887 489193 89286
41052 89286 -1163237 -2428467 -2880122 -2786658 -2932966 -3456213 -3853716 -3813782 -3463967 -2953854
41042 -2953854 -2285569 -1575226 -1179066 -1462455 -2477435 -3805690 -4725875 -4688459 -3687653
41033 -3687653 -2164855 -726210 -49365 -653027 -2296652 -3875922 -4484959 -4415264 -4521825
41024 -4521825 -4868533 -4872224 -4650105 -5038579 -5970915 -6007942 -4201826 -1556214 183543
41015 183543 497430 5494 -894186 -2182635 -3397066 -3851787 -3670365 -3588699 -3646997 -3054694
41005 -3054694 -1616510 -400958 -502987 -1726157 -2917404 -3169657 -2385473 -1126902 -276513
40996 -276513 -450378 -1368426 -2080398 -2041166 -1593720 -1196872 -727175 72237 1012207 1868923
40986 1868923 2827304 3770396 3624991 1529121 -1424543 -2784687 -1453367 1085208 2654067
40977 2654067 2595880 1533423 -22451 -1657536 -2295594 -971217 1578696 3344035 3366997
40968 3366997 2589759 2048178 1398457 -52614 -1894701 -3221376 -3981278 -4633453 -4960938
40959 -4960938 -4383673 -3159174 -2125278 -1409671 -536277 310205 435531 131413 596219
40950 596219 1948956 2682952 1794733 266876 -421921 -225321 -26765 -153646 -449632
40941 -449632 -994542 -1584858 -1228128 526931 2296449 2282987 643249 -923609 -1642300
40932 -1642300 -2199803 -2949730 -3258415 -2899904 -2544796 -2385781 -1707551 -429632 290654
40923 290654 -220913 -1043596 -1099408 -532134 247096 1616510 3584095 4675819 3580419
40914 3580419 1235112 -307753 -623237 -890881 -1450890 -1266848 -26002 1016067 938241
40905 938241 445319 466632 742632 759331 937806 1666594 2033869 997968 -635619 -965757
40895 -965757 252046 1052233 -85590 -2191715 -3136906 -2156190 -189897 1673260 3014050
40886 3014050 3529415 2784357 902921 -1199649 -2792423 -4116928 -5668450 -6962355
40878 -6962355 -6712333 -4402520 -1211391 1015437 1585652 1437248 1774710 2565171 2731221
40869 2731221 1752476 548624 403051 1348067 2244399 2394880 2318349 2663181 3103837
40860 3103837 2908223 2055756 1065988 121876 -792985 -1171740 -419710 1011039 1950656
40851 1950656 2119922 2342918 2841534 2529322 765528 -1222687 -1787484 -1097475 -758904
40842 -758904 -1543839 -2664330 -3227069 -3280073 -3202294 -2982783 -2488062 -1813386 -1065529 -296704
40832 -296704 173047 -81104 -906455 -1579971 -1678343 -1399893 -874589 131515 1453079
40823 1453079 2160975 1598908 380911 -269440 36814 593236 648878 260070 109592
40814 109592 747178 1952195 2759216 2412048 1431224 1227343 2300485 3419349 3244279
40805 3244279 2238789 1988266 2872593 3602573 3212203 2289470 1651587 891522 -722205
40796 -722205 -2577601 -3225067 -2439336 -1638701 -1979347 -2894289 -2945257 -1485684 968941
40787 968941 3460033 5086023 5176628 3704079 1554256 -44548 -443969 234400 1625624
40778 1625624 3452630 5393190 6991403 7794911 7470616 5949712 3702360 1666517
40770 1666517 522513 118052 -88872 -198203 121193 967241 2045035 3063977 3808692
40761 3808692 3975761 3552617 3235214 3731526 4666965 4964682 4339907 3538890 3023082
40752 3023082 2489869 1959545 2089479 2782156 2686927 1049015 -926397 -1649914 -1271954
40743 -1271954 -1073277 -1482199 -2025473 -2662329 -3695282 -4698493 -4982717 -4879560 -5101694
40734 -5101694 -5096281 -3771459 -1812932 -1278749 -2452121 -3072856 -1590135 590511 1330130
40725 1330130 730667 402136 876697 1375091 1470185 1433985 1262840 698417 61767 -57864
40715 -57864 175714 126335 -140384 97138 1075513 2293227 3306262 3998725 4203303 3851069
40705 3851069 3369854 3148123 2761225 1569922 -52789 -1006840 -930208 -464400 -37113
40696 -37113 669887 1852358 3020382 3579163 3377299 2616816 1873811 2131103 3870958
40687 3870958 6020992 6748155 5571405 3833163 2834255 2477230 2163074 1987991 2289657
40678 2289657 2754769 2814600 2489958 2197314 2121099 2328362 3032111 4112054 4785868 4421504
40668 4421504 3364856 2359139 1504138 512899 -272006 19331 1615466 3678121 5150185
40659 5150185 5574352 5103051 4256383 3730905 3860769 4038366 3165359 1058815 -894999
40650 -894999 -942415 1198411 3995678 5665213 5831590 5455580 5336336 5180711 4311786
40641 4311786 2792162 1311000 215009 -672151 -1308330 -1271937 -561947 141123 419786
40632 419786 748257 1692860 2987843 3974637 4541916 5001860 5384853 5566372 5837254
40623 5837254 6548048 7277676 7169099 6158358 5092183 4448641 3736016 2546562 1500034
40614 1500034 1534468 2699186 4237891 5517621 6216874 5864882 4115530 1681101 207382
40605 207382 645417 2143114 3125212 3198704 3270346 3861251 4288599 4011627 3964760 5533903
40595 5533903 8461175 10827196 11293117 10453927 9581874 8905758 7902145 6732206 6412454
40586 6412454 7585542 9776957 11889509 12928832 12328621 10260308 7842199 6500785
40578 6500785 6710860 7533375 7602650 6471678 4952896 4340709 5370864 7744887 10513505
40569 10513505 12876459 14505348 15161245 14549276 13039185 12136986 13324461 16200656
40561 16200656 18445881 18116343 15687564 13492657 13390988 15304986 17777734 19445685
40553 19445685 19911085 19608152 19226293 19337263 20340248 22388620 25187291 28076552 30593891
40544 30593891 32877554 35353509 38278146 41910353 46757379 52922149 59330324 64588028
40536 64588028 68981580 74792883 83936182 95793756 108070948 119273660 129343560
40529 129343560 138053701 144032939 145912914 143705848 138426033 130797572 121005730 109554720
40521 109554720 97717661 86932670 77985811 70813606 64857229 59558961 54753354 50718592
40513 50718592 47753535 45652273 43711683 41338224 38593549 36123866 34637232 34455206
40505 34455206 35422468 37129602 39251045 41716916 44549465 47592717 50537343 53197949
40497 53197949 55603667 57868029 60315551 63838107 69652631 78235551 88687706 99620735
40489 99620735 110590571 122205477 134902215 148195001 161153697 172862261 182024533
40482 182024533 186783823 185686364 178715514 167018510 151946717 134887403 117683575
40475 117683575 102275868 89604846 79293128 70614325 63431115 57988409 54096969
40468 54096969 50855009 47219103 42851337 38431004 34981434 32746459 30916342 28635114
40460 28635114 25959408 23498582 21520961 20001418 19176831 19172184 19239435 18450542 17277587
40451 17277587 17285544 18753848 19812147 18912113 17198405 17076078 18917696 20627026 20370888
40442 20370888 18350150 15691308 13038495 10906286 10202769 11305752 13232122 14620096
40434 14620096 15048212 14603475 12854532 9549137 6037874 4490748 5345511 6707188
40426 6707188 6778994 5826184 5091292 4884289 4836442 5182048 6307163 7361300 6875893
40417 6875893 4943000 3408931 3448304 4174643 4320665 4115076 4468905 5245062 5661902
40408 5661902 5847233 6512623 7244198 6652422 4552898 2663418 2470677 3467752 4337781
40399 4337781 4957115 6042549 7334826 7549139 6293477 4904694 4831421 5920820 6962310
40390 6962310 7443362 7960820 9005230 10123654 10545548 10090173 9058645 7619529 5837704
40381 5837704 4145702 3210722 3230614 3720618 4055448 3931405 3396378 2917732 3353280
40372 3353280 5126591 7255369 7977462 6743157 4872961 3766766 3277284 2563319 1671757
40363 1671757 1144786 705039 -262826 -1225330 -1008199 183353 780545 226327 -141399
40354 -141399 768686 2095410 2353740 1395470 73263 -1109614 -1930748 -1860022 -828553
40345 -828553 -58757 -804672 -2497259 -3329872 -2519987 -772333 1413068 4413408 8020880
40336 8020880 10612899 10749287 8959875 7092460 6204351 5810304 5054090 3905207 2994627
40327 2994627 2684071 2646267 2319942 1557684 686410 -14525 -686320 -1606016 -2620443
40318 -2620443 -3064606 -2371104 -779863 667809 1062524 611292 403480 1010822 1705988
40309 1705988 1489277 517335 -139908 92066 909997 1960681 3060690 3636605 3161301
40300 3161301 2418323 3049123 5222744 6924902 6413512 4381372 2741015 2192542 2069793
40291 2069793 1755080 1007104 -463351 -2448562 -3736334 -3363365 -1970236 -776078 240970
40282 240970 1799153 3480623 4076683 3563157 3098252 3017068 2387154 765528 -1035939
40273 -1035939 -2238701 -2900537 -3217695 -3229374 -3327636 -3793707 -3786603 -2205990 381662 2210509
40263 2210509 2748580 2938094 2997018 2184990 1151484 1981915 4823415 6844235 6089021
40254 6089021 4247564 3788827 4332143 4065445 3085890 2775919 3029991 2731000 2220324
40245 2220324 2665061 3407029 2605608 475594 -715365 -204111 205684 -657183 -1417219
40236 -1417219 -662104 537109 245904 -1353844 -2230028 -1310730 227161 539829 -687948
40227 -687948 -1872123 -1303116 824440 2606946 2851311 2454034 2660993 3009263 2454714
40218 2454714 1761433 2704684 4995900 6171644 5066281 3438860 3247309 4022604 4150657
40209 4150657 3355360 2493676 1881420 1258292 796465 847305 1050925 785369 240782 120928
40199 120928 500017 810010 790119 687902 609125 317010 -323100 -1118050 -1690518 -1619312
40189 -1619312 -743618 401619 889656 527274 232389 819734 1823371 2075470 1152536
40180 1152536 -278936 -1314052 -1504165 -876978 258044 1526789 2724820 3754298
40172 3754298 4336879 4179093 3544375 3197462 3528131 4078513 4084478 3105863 1122914 -1367490
40162 -1367490 -3249628 -3520146 -2385252 -990351 77787 1186863 2394515 2909581
40154 2909581 2352998 1528981 1224026 1113276 553464 -450698 -1799558 -3757871 -5907025
40145 -5907025 -6742732 -5618493 -4169099 -4271265 -5281608 -5016328 -3082941 -1389031 -1281099
40136 -1281099 -1897476 -1780615 -701821 686987 1863681 2463355 2179886 1257455 498053
40127 498053 379505 615488 695096 292510 -795011 -2294678 -3040998 -1936124 383195
40118 383195 1769296 910377 -1244787 -2756937 -2675476 -1373558 334081 1761239 2412264
40109 2412264 2018416 555558 -1684656 -3819639 -4581120 -3518000 -1762697 -747740
40101 -747740 -376935 457964 1717812 2044164 1014531 45514 332885 1210995 1506664
40092 1506664 1372967 1582601 1845017 1156168 -579590 -2375391 -3351146 -3243952 -2126411
40083 -2126411 -567289 253428 -368454 -1577480 -1901772 -1211161 -777715 -1320539 -1970672
40074 -1970672 -1541721 -83747 1325318 1870624 1573591 793279 -328045 -1730053 -2954966
40065 -2954966 -3237490 -2394166 -1386475 -1403236 -2319766 -2679361 -1426738 924937 3098557
40056 3098557 4314848 4373984 3339480 1892092 1305965 2106313 3152624 2948743 1503362
40047 1503362 -18504 -1076480 -2024023 -2815729 -2779344 -1843266 -789351 58517 1286094
40038 1286094 3055241 4395904 4553240 4168969 4267354 4734991 4750026 4257068 3985737
40029 3985737 4171184 4249865 3952805 3850229 4410159 5059241 4683057 2887729 428378
40020 428378 -1588085 -2730278 -3439758 -4305187 -5274633 -5717185 -5230291 -4128211 -3004146
40011 -3004146 -2121298 -1594754 -1920004 -3620591 -6165283 -7869317 -7485999 -5651891 -4120046
40002 -4120046 -3626735 -3249646 -2073811 -675415 -259821 -794686 -897132 437917 2720616
39993 2720616 4683349 5460707 4866432 3200043 1276725 214596 592462 1848258 2765001
39984 2765001 2486111 1021377 -914984 -2380070 -2818596 -2439874 -1835063 -1269132 -738364
39975 -738364 -595106 -1323340 -2520251 -3014378 -2494555 -2164026 -3044891 -4402199 -4805685
39966 -4805685 -4150121 -3497014 -3309526 -3105159 -2754198 -2836387 -3468991 -3878674 -3564112 -3014278
39956 -3014278 -2792618 -2615583 -1887832 -694649 208519 164140 -836644 -2121246 -2798451
39947 -2798451 -2546707 -1884917 -1370238 -870995 -218918 -109678 -1268891 -2884295 -3191388
39938 -3191388 -1903949 -828216 -1484796 -3150581 -3960134 -3115237 -1315365 249908 655576
39929 655576 -274296 -1501453 -1430565 298903 2326872 3432961 3926419 4354742 3966530
39920 3966530 1890924 -907769 -2528202 -2661087 -2560302 -2584669 -1612873 651667 2549032
39911 2549032 2681626 2020117 2472425 4018357 4635030 3024622 327111 -1269256 -1001143
39902 -1001143 -63588 169513 -120466 329564 1837963 2967681 2217400 59418 -1465492
39893 -1465492 -1104262 335338 1104868 232532 -2049888 -4891926 -7337807 -8614376 -8424560
39884 -8424560 -7008132 -4853416 -2480557 -456885 747751 1114419 1098908 1161033 1335034
39875 1335034 1264484 621031 -377491 -869013 -188719 1023813 1225146 10613 -953951
39866 -953951 7380 2137241 3163678 2431365 1580664 1906357 2646844 2567390 1747863
39857 1747863 714872 -926320 -3489631 -5634661 -5487047 -3178316 -864347 -106224
39849 -106224 -382626 -374164 377459 1480079 2444113 2861528 2415659 1243042 -6390
39840 -6390 -770261 -996281 -850603 -363266 451176 1386642 2104876 2271679 1734454 807683
39830 807683 143958 -110032 -736315 -2336544 -4006658 -4096429 -2432657 -774608 -576240
39821 -576240 -1163266 -855135 738955 2394853 2876833 2023896 388300 -1377950 -2633810
39812 -2633810 -2884053 -2175340 -1162677 -604039 -807451 -1493511 -2094430 -2289247 -2284819 -2353901
39802 -2353901 -2149783 -1053357 576756 1227647 -52888 -2289155 -3712052 -3839913 -3475856
39793 -3475856 -2982042 -1890776 -352748 441033 -48313 -695736 -275691 814320 1375485
39784 1375485 1225408 1012759 748899 -40957 -847706 -412305 1207843 2186602 1258749
39775 1258749 -607997 -1734209 -1908707 -1876604 -1452438 239177 2766116 4204959 3422717
39766 3422717 1398967 -307412 -1411351 -2442559 -3270742 -3186342 -2137566 -940851 -326974
39757 -326974 -471600 -1287150 -2357096 -2686696 -1523987 358403 1125317 35244 -1644292
39748 -1644292 -2312431 -1774412 -678813 826401 2718084 3972382 3302948 1090579 -682820
39739 -682820 -771642 98191 711221 954447 1189241 1013116 -209748 -2045926 -3324985
39730 -3324985 -3661466 -3747417 -4138457 -4554213 -4472246 -3726075 -2423357 -919050 78098
39721 78098 124839 -68489 822627 2959731 4853848 5132915 4103883 2961464 2143503
39712 2143503 1361384 773289 967790 1787443 2241390 1946557 1807817 2663523 3827670
39703 3827670 3779810 2183868 495731 278066 1309832 1821826 581784 -1656713 -3048296
39694 -3048296 -2794005 -1971930 -2175141 -3719672 -5483860 -6275523 -5988222 -5469230 -5558261
39685 -5558261 -6294146 -6876501 -6395920 -4736153 -2717226 -1243407 -460318 43724 402686
39676 402686 260847 -579275 -1695530 -2470249 -2809115 -3222692 -4188056 -5499551 -6287052
39667 -6287052 -5741510 -3887131 -1618219 36490 628604 341453 -423305 -1392305 -2490453
39658 -2490453 -3640409 -4439139 -4240025 -2926270 -1407339 -662963 -315088 905525 3025868
39649 3025868 4393277 4172694 4032924 5820726 8336094 8404102 5123306 1109795 -983731
39640 -983731 -1387530 -1697449 -2038419 -1333989 394578 1601306 1044517 -932702 -2932887
39631 -2932887 -3705625 -3039944 -2009762 -2024116 -3157149 -3926885 -3298794 -2197898 -2116236
39622 -2116236 -2851523 -2878993 -1680918 -364667 125628 201234 683089 1630753 2577787
39613 2577787 3225722 3460253 3192245 2557388 1941639 1622953 1660428 2082220 2752372 3152569
39603 3152569 2845448 2104997 1562775 1352226 1159030 863786 423484 -544355 -2096767
39594 -2096767 -3194643 -2827897 -1753199 -1651305 -2497972 -2473131 -914011 473626 290587
39585 290587 -368138 210746 1652675 2330370 1983811 1789482 2343934 3158538 3841755
39576 3841755 4357966 4371351 3683707 3061082 3254422 3473525 2348299 235188 -1101819
39567 -1101819 -1140128 -1147695 -1772113 -1925911 -835220 420783 475909 -449152 -1270936 -1579486
39557 -1579486 -1427580 -582136 858749 1876514 1694302 913200 476038 191875 -565165
39548 -565165 -1355307 -1247276 -472122 -61773 -51552 417307 1121721 504367 -1992900 -4648721
39538 -4648721 -5449622 -4528051 -3672613 -3925733 -4631491 -4715583 -4045728 -3292085 -2964483 -2982883
39528 -2982883 -3055502 -3124655 -3262187 -3254205 -2570644 -864380 1588794 3928759 5070604
39519 5070604 4289970 2006786 -64656 -337631 784655 1222357 -176862 -2178482 -2939658
39510 -2939658 -2302588 -1292244 -235231 1084557 1936390 1215532 -405488 -764286 762915
39501 762915 2156541 1567785 -189851 -1120147 -842222 -506266 -697323 -913531 -794667
39492 -794667 -545354 -208514 397953 1025080 1206828 1131798 1427415 2022042 2042326 993934
39482 993934 -605108 -1856416 -2180077 -1430611 3689 1190234 1410529 1014187 941848
39473 941848 1407030 1686988 1188170 -9922 -1657057 -3505834 -4846934 -4813059 -3553107
39464 -3553107 -2346532 -2087256 -2268307 -1880444 -699148 771654 2026538 2677371 2354040
39455 2354040 1121084 -263929 -963512 -750018 99821 1173742 1967374 2132983 2054601
39446 2054601 2631051 4111784 5772059 7171009 8922529 11469240 13843979 14753860
39438 14753860 14534234 14916083 16878586 19589171 21467305 21575088 20049061 17944929
39430 17944929 16631617 16568418 16643257 15396154 12846490 10382306 8939314 8154549 7300187
39421 7300187 6104340 4559672 2902677 1955167 2464746 3844686 4616520 4401165 4269739
39412 4269739 4676353 4494242 3030990 1627652 1859834 3167734 3875259 3824668 4159489
39403 4159489 4824746 4300298 2139693 55971 -186042 1340932 3520821 5535593 6615951
39394 6615951 5772054 3038254 181676 -1084962 -1119418 -1481915 -2503648 -2966769 -2040184
39385 -2040184 -292943 1350065 2570455 3266194 3148590 2245190 1200872 656405 718504
39376 718504 1163461 1587037 1298637 -59765 -1508591 -1359677 532707 2140970 1846125
39367 1846125 794567 1325786 3548591 5127089 4557224 3035524 2436556 2790142 2821270
39358 2821270 2075162 1242168 778740 398656 -95550 -468089 -697698 -1143188 -1770958
39349 -1770958 -1916124 -1249007 -451316 -395606 -1009802 -1582147 -2005277 -2900681 -4273278
39340 -4273278 -4856929 -3606785 -1455022 -474417 -1156889 -1718201 -776303 453867 -49757
39331 -49757 -1976066 -3170089 -2955819 -2757484 -3034676 -2067336 864465 3332842 3008682
39322 3008682 1437879 1818273 3925121 4404917 2098366 -152032 101505 1605051 2048011
39313 2048011 1568448 1558995 1891614 1748957 1898589 3528597 5514238 5459198 3353608
39304 3353608 1769007 2101101 2871376 2483364 1631406 1767978 2696114 3103676 2571241
39295 2571241 1754445 1093224 417484 -421012 -1289463 -1937031 -1944583 -938579 640819
39286 640819 1521645 1020273 23669 -203986 178190 -130293 -1655335 -3459612 -4485760
39277 -4485760 -4707474 -4532696 -3783398 -2055782 114556 1281977 650639 -859643 -1677110
39268 -1677110 -1512369 -1473792 -2135659 -2480009 -1537698 -324244 -817312 -3139505 -5149535
39259 -5149535 -5233112 -4291336 -4205253 -5261098 -6075205 -5511906 -3723461 -1591322 39821
39250 39821 756742 900564 1339479 2370273 3135074 2710016 1373865 86086 -827166
39241 -827166 -1532664 -1689627 -860344 232666 270515 -660315 -1013901 -112353 924895
39232 924895 1249504 1746448 3240415 4579472 4193672 2686980 1920562 1920105 880361
39223 880361 -1513742 -2983634 -1886824 245925 913537 108292 -231393 504002 878089
39214 878089 -63208 -1393511 -1942572 -1833317 -1606889 -1042974 110762 1099641 997801
39205 997801 108664 -457311 -223667 571073 1900730 3772072 5332820 5530969 4820702
39196 4820702 4829346 5827789 5900176 3604276 364847 -1140063 -381879 667671 390963
39187 390963 -744729 -1560145 -1861247 -1967816 -1562699 -190815 1450365 1836479 416210
39178 416210 -1637853 -2787275 -2749773 -2408176 -2467118 -2723755 -2630922 -2124541 -1682234 -1794417
39168 -1794417 -2596370 -3878274 -5218562 -6189564 -6698559 -7105760 -7732657 -8279569 -8141511
39159 -8141511 -7415812 -7061453 -7606491 -8098252 -7083500 -4597101 -2375876 -1736741 -1882458
39150 -1882458 -983848 1380382 3686545 4422570 3771867 2886036 2103369 754471 -1365654
39141 -1365654 -3232587 -3717645 -2950614 -2041396 -1744946 -1935563 -2208273 -2345589 -2129764
39132 -2129764 -1311673 -62612 946750 1198330 710646 -464166 -2591188 -5490512 -7766087
39123 -7766087 -7746978 -5480938 -3094217 -2567953 -3483024 -3628224 -1757639 1018459 2858978
39114 2858978 3442903 3810999 4367447 4224325 2869232 1466477 1590819 3118034 4317868
39105 4317868 3956046 2482908 1084879 374340 282171 515963 645713 221205 -699493
39096 -699493 -1428434 -1449576 -1118472 -1233787 -2096888 -3267096 -4094245 -4299263 -4173768 -4281435
39086 -4281435 -4743324 -4860416 -3875065 -2123723 -851502 -727585 -1161886 -1298975 -951860
39077 -951860 -222007 908738 1963344 1818283 155689 -1533854 -1521741 -68607 1063246
39068 1063246 1129360 1132979 1833836 2274889 1023040 -1809073 -4531657 -5654745 -5223114
39059 -5223114 -4402676 -4000185 -3584497 -2239739 -68040 1609756 1780609 866528 -94725
39050 -94725 -739197 -1240912 -1629975 -2152295 -3595498 -6008005 -7624224 -6627049 -3842884
39041 -3842884 -2069686 -2545607 -3651175 -3511533 -2308361 -1288363 -895762 -876871 -1147268
39032 -1147268 -1551662 -1611630 -1376782 -1691223 -2783104 -3481927 -2796219 -1458453 -870830
39023 -870830 -1218770 -1675915 -1835302 -1834604 -1594640 -1039218 -661541 -877692 -1248472 -1263170
39013 -1263170 -1307640 -1818513 -2176273 -1731324 -1261055 -1816748 -2606693 -1892941 128288
39004 128288 1324587 796859 122676 757958 1973666 2419145 2229757 2231084 2152946 1166643
38994 1166643 -360343 -1043617 -268523 1249841 2615762 3542067 3939023 3538864 2268068
38985 2268068 595396 -750954 -1294059 -1014719 -206663 787853 1682378 2161037 2000124
38976 2000124 1483352 1312063 1647176 1644573 659918 -468247 -408831 561205 830680 62578
38966 62578 -29238 1649852 3477055 3006274 137141 -2964472 -4594939 -4809388 -4314053
38957 -4314053 -3551875 -3031794 -3273831 -3958750 -4028871 -3069428 -1888428 -1381051 -1500565
38948 -1500565 -1713494 -1780126 -1587978 -802479 694097 2371485 3600664 4364636 4949339
38939 4949339 5245430 4990392 4553827 4756479 5738817 6550192 6159921 4535988 2464428
38930 2464428 637992 -709032 -1531759 -1886470 -2110111 -2589954 -3180632 -3250078 -2548668
38921 -2548668 -1644834 -1117633 -679190 262799 1285302 1001634 -1184667 -3909663 -5072895
38912 -5072895 -4152806 -2772335 -2767930 -4053092 -4806777 -3713295 -1499959 86721 446670
38903 446670 571491 1376721 2495346 3169616 3493948 3875783 3830703 2546261 558683
38894 558683 -407012 345858 1457903 1304966 42442 -825902 -393255 757239 1235232
38885 1235232 11923 -2575455 -4580564 -3940226 -896985 1755450 1739698 -2850 -793999
38876 -793999 98547 777539 -257730 -1986710 -2447224 -1291065 152301 645824 -19114
38867 -19114 -1397000 -2814838 -3592628 -3525676 -3084164 -2679762 -2007334 -724044 518998
38858 518998 635125 -309839 -1062448 -1042077 -1206237 -2322553 -3285235 -2445877 -273502
38849 -273502 836387 -235392 -1653775 -1023761 1495989 3634441 4000773 3308310 2729075
38840 2729075 2371160 1755220 731296 -647448 -2324668 -3678790 -3518520 -1502714 893372
38831 893372 1741303 835793 -272967 -383944 20211 -200323 -1124984 -1664414 -1009889
38822 -1009889 356923 1353881 1651557 1746081 1690885 669330 -1476087 -3036882 -2068104
38813 -2068104 912465 3233495 3338621 2390503 2092946 2371217 2223968 1594129 980556
38804 980556 107974 -1439775 -2846675 -2924006 -1979454 -1227806 -607250 994364 3275743
38795 3275743 4248155 3028495 1185717 389683 197319 -652834 -1941190 -2388540 -1692891
38786 -1692891 -808984 -503669 -725158 -1232815 -1879260 -2271367 -1939832 -972963 -6760
38777 -6760 412122 114504 -833458 -2096397 -3033666 -3150667 -2549073 -1676270 -845927 -299621
38767 -299621 -392481 -1194101 -2085773 -2294809 -1809106 -1337684 -1369994 -1683824 -1876442 -2042337
38757 -2042337 -2671722 -3923376 -5153922 -5333338 -4029669 -1884408 16443 1087781
38749 1087781 1387080 1112839 397134 -558655 -1561461 -2454620 -2694956 -1413333 1309209
38740 1309209 3716009 4135486 3254867 3233574 4556427 5422235 4587575 2971691 1657528
38731 1657528 208796 -1710862 -2819956 -2167571 -1229740 -1925979 -3501260 -3672110 -2265431
38722 -2265431 -1247134 -1285740 -836257 932049 2612173 2777455 1794571 544944 -868512
38713 -868512 -2105789 -1947038 60896 2611385 4445329 5898369 7489310 8334932 7508101
38704 7508101 5913035 5146673 5224958 5002988 4198046 3356922 2327502 523114 -1508590
38695 -1508590 -2465255 -2204775 -1731472 -1327547 -393497 733804 679500 -696002 -1647689
38686 -1647689 -1029895 54811 86525 -734383 -1330988 -1493030 -1362400 -196439 2607439
38677 2607439 5723960 6855864 5509790 3479502 2493319 2620252 3120997 3550489 3595080
38668 3595080 2971468 2085537 1873685 2407660 2514824 1420389 -67088 -772536 -788041
38659 -788041 -968256 -1439181 -1709144 -1837121 -2275579 -2714857 -2322844 -1207138 -411607
38650 -411607 -191226 414968 1679494 2133445 570093 -1741929 -2304606 -647846 987009
38641 987009 466263 -1757243 -3421588 -2940575 -595084 2131189 3725139 3514605 2124264
38632 2124264 1069730 1344247 2301894 2392835 1153796 -28276 484044 2603872 4750100
38623 4750100 5863732 6327441 6619049 6014141 3603557 172644 -2166979 -2425309 -1792418
38614 -1792418 -1791040 -2316922 -2331281 -1787612 -1714083 -2563269 -3568253 -3937658 -3834569 -3771089
38604 -3771089 -3633195 -2805861 -997181 1395663 3580820 4853751 4988966 4359435 3601011
38595 3601011 3099061 2855764 2751832 2744106 2882561 3297370 4004321 4560566 4282338 3171230
38585 3171230 2181592 1965076 1799046 662960 -945850 -1476426 -581302 467113 966161
38576 966161 1922433 4128011 6348269 6745805 5394690 4078524 3987633 4769475 5501929
38567 5501929 5389855 3772843 842701 -1630754 -1736227 35941 949923 -712754 -3650864
38558 -3650864 -5448354 -5365475 -4293577 -2934406 -1429306 -363818 -639035 -2104869 -3413574
38549 -3413574 -3706252 -3691472 -4490566 -5929116 -6655889 -5795080 -3849779 -1839496 -94540
38540 -94540 1592515 2867383 2683464 695272 -1746216 -2753988 -1978972 -853188 -743779
38531 -743779 -1593006 -2527916 -2944108 -2550317 -1191842 645409 1834752 1949530 1993965
38522 1993965 2803814 3322771 1874604 -1071518 -2986768 -2388120 -420682 1105852 1756354
38513 1756354 1734706 619570 -1713609 -3853993 -4180910 -3096266 -2558144 -3513028 -4961922
38504 -4961922 -5477450 -4549176 -2561613 -626241 -346320 -2391218 -5136567 -6018642 -4512389
38495 -4512389 -2504965 -1493640 -976364 -161905 463606 381299 353080 1060743 1618667
38486 1618667 1030755 150114 384147 1151113 648794 -1108975 -2078798 -1186004 344599
38477 344599 1084449 1048471 553829 -857128 -3180729 -4870546 -4333190 -1887808 731570
38468 731570 2267083 2532849 1810487 679363 65386 491515 1382879 1767901 1502404
38459 1502404 1253200 1481305 1952798 2091255 1475834 271626 -623471 -422839 250532
38450 250532 -260740 -2318212 -3894847 -2903378 -71514 1775093 1119866 -786810 -1939612
38441 -1939612 -1836854 -1328035 -1208783 -1640712 -2370715 -2850746 -2402945 -813239 1227223
38432 1227223 2531531 2357112 984993 -559787 -1441572 -1758068 -2215983 -3045691 -3653942
38423 -3653942 -3586496 -3284123 -3311526 -3263850 -2240525 -234595 1786394 3207929 4338469
38414 4338469 5408025 5768468 4651308 2343348 78641 -1165939 -1444707 -1411056 -1395756
38405 -1395756 -1211085 -906006 -1226309 -2670825 -4268696 -4343350 -2880851 -2094258 -3774217
38396 -3774217 -6873979 -8774667 -8288464 -6181201 -3347016 -152192 2591976 3899742
38388 3899742 4265592 5353745 7325494 8057185 6082680 2963651 1360170 1721749 2389061
38379 2389061 2294178 1872005 1485656 644449 -771208 -1762528 -1438940 -307417 332376
38370 332376 -66422 -900703 -1443341 -1799422 -2618617 -3985842 -4975676 -4648259 -3300368
38361 -3300368 -2129235 -1600373 -938522 342514 1248259 584205 -1046642 -1741481 -847422
38352 -847422 166102 -85408 -812102 -222013 1648317 2603534 1195024 -1079701 -1490570
38343 -1490570 474987 2625918 3096643 2467566 2167035 2105230 1334428 188789 -136667
38334 -136667 105277 -607989 -2251789 -2717478 -1031377 837052 866463 12907 359116
38325 359116 1471053 1080290 -1033214 -2368128 -1269870 938395 2115317 1846080 923776
38316 923776 -192344 -1206219 -1352268 -196066 1501495 2630933 2923619 2602992 1593079
38307 1593079 11607 -1147586 -895105 481215 1876005 2732773 3053868 2486852 663342
38298 663342 -1547798 -2337222 -936060 1431641 2859691 2434747 572734 -1451905 -2118081
38289 -2118081 -792412 1243897 1761707 194383 -1528728 -1469190 -75875 975263 1412356
38280 1412356 2112590 2626004 1185637 -2188716 -4624028 -3897155 -1632828 -1168491 -2999590
38271 -2999590 -4412105 -3540913 -1689449 -961520 -1355821 -1436080 -701133 174849 876202
38262 876202 1787006 2857857 3287283 2603873 1326927 293590 -152265 -118626 227120
38253 227120 766063 1388914 1967655 2227859 1759921 468303 -1052505 -1950794 -1959670 -1530014
38243 -1530014 -1128454 -720377 -46334 815065 1337078 1038135 113452 -568400 -402558
38234 -402558 93024 -114836 -1034105 -1464686 -727504 285019 583030 849057 2484123
38225 2484123 5188246 6885745 6271768 4252145 2447170 1358357 654968 285963 313228
38216 313228 217789 -565546 -1610291 -1944344 -1596716 -1829136 -3417689 -5293318 -5547813
38207 -5547813 -3666356 -1159540 234324 487353 885297 1954557 2687008 2157987 1065351
38198 1065351 779432 1287088 1173686 -299599 -2139538 -3072491 -3227262 -3643175 -4554182
38189 -4554182 -5010921 -4245446 -2766145 -1721799 -1455616 -1209005 -398918 327068 -56051
38180 -56051 -1259164 -1824113 -1235674 -801554 -1626628 -2701591 -2333209 -844525 -175137
38171 -175137 -914900 -1506718 -764333 517345 1231674 1687395 2514339 3108495 2632721
38162 2632721 1731664 1672064 2190806 1760881 -16550 -1721923 -2190639 -2150149 -3126723
38153 -3126723 -5345784 -7371997 -7688729 -6288614 -4620476 -3945568 -3869115 -2911419 -615224
38144 -615224 1598021 2150680 1242311 293111 -29171 -179642 -358160 6069 1077181
38135 1077181 1881556 1357651 -363840 -2197506 -3284472 -3569946 -3473308 -3360865 -3278017
38126 -3278017 -2997115 -2336779 -1475257 -897636 -1024348 -1841751 -2709496 -2586708 -954279
38117 -954279 1239879 2123867 953721 -783720 -993846 618816 2548446 3608525 3977199
38108 3977199 4050250 3410441 1541276 -1164793 -3745230 -5559302 -6391181 -6211304 -5432565
38099 -5432565 -4943938 -5153171 -5259465 -4243693 -2476695 -1521240 -2179187 -3465425 -3851386
38090 -3851386 -2884444 -1097827 1038778 3208642 4610042 4354401 2769419 1405839
38082 1405839 1238883 1592445 1463203 1148959 1582338 2576548 2963016 2303704 1241495
38073 1241495 179618 -1009008 -1755570 -858937 1543001 3535778 3965829 4046946 5106162
38064 5106162 6017603 4767100 1789586 -411496 -817622 -965775 -2139489 -3453682 -3569183
38055 -3569183 -2728813 -1964440 -1402174 -527741 599160 1464536 1951519 2181926 1922322
38046 1922322 1004588 39094 -125093 469138 982646 940125 697328 763725 1185578 1672037
38036 1672037 1952897 1965415 1985476 2547787 3865787 5252694 5490152 4076799 1992747
38027 1992747 879687 1295184 1985585 1231624 -1083706 -3119228 -2940451 -436105 2762176
38018 2762176 4851069 5106979 4107485 3200801 3356954 4047514 3687419 1704704 -436419
38009 -436419 -1066280 -534244 -464552 -1234406 -1630583 -961316 -22935 332902 245274 8429
37999 8429 -522066 -1073716 -720280 695665 1925631 1925668 1142900 326746 -899046 -3041156
37989 -3041156 -5068376 -5192502 -3105196 -255832 2031608 3662824 4942933 5665995
37981 5665995 5455146 4446272 3241845 2394048 2079276 2126408 2252970 2255339 1987178 1404730
37971 1404730 874964 1056027 1892807 2112860 671280 -1505023 -2443905 -1870869 -1626913
37962 -1626913 -2934855 -4678635 -5158604 -4271693 -3016858 -1984645 -1339873 -1224387 -1147518
37953 -1147518 -91409 1673540 2126209 222800 -2141061 -2551162 -1321095 -386587 8568
37944 8568 1122935 2760110 3098787 1598875 -201841 -1116013 -1422753 -1161691 480518
37935 480518 3230783 5069980 4591971 2632145 759157 -420794 -717023 256636 2029512
37926 2029512 2956188 2173836 884157 670164 1495448 2289233 2482123 1979867 663525
37917 663525 -941712 -1389962 111594 2519666 4312662 5252374 5811203 5778162 4757346
37908 4757346 3393619 2704115 2532599 1896934 645882 -332019 -424684 71017 468329
37899 468329 154030 -1055802 -2274432 -1856218 635781 3284236 3812482 2386069 1204112
37890 1204112 1494174 2206751 1791654 124797 -1626644 -2217637 -1192083 748839 2099440
37881 2099440 1892127 762189 150741 551608 1151388 1038971 73585 -1291132 -2288761
37872 -2288761 -2063669 -407131 1731127 3095264 3364912 2987136 2191436 1049263 138913
37863 138913 56225 470519 786782 1509619 3556000 6221238 7417182 6376491 4718108
37854 4718108 4194305 4640824 4915798 4662379 4122195 3172913 1771048 797054 1302241
37845 1302241 3076594 4765556 5297968 4695165 3789342 3676663 5037952 7288534 8615468
37836 8615468 7530841 4396001 1068505 -775458 -684846 766327 2621558 4114945
37828 4114945 5063688 5707249 6084462 5934385 5399349 5261310 5992489 6980304 7233623
37819 7233623 6577607 5687172 5234842 5458409 6231771 7038192 7172033 6519111 5886296
37810 5886296 6025365 6600278 6701767 6139055 5591261 5654583 6360300 7496960 8803457
37801 8803457 9966787 11012813 12539032 14939612 17587577 19484816 20547394 21483886
37793 21483886 22616112 23775841 25214246 27385836 29695225 30807970 30710940 31163628
37785 31163628 33263504 35727823 36762444 36721068 37419067 39247142 40542986 39945523 38077168
37776 38077168 36504498 36012011 36337800 36799476 36671353 35558247 33887915 32583455 31886168
37767 31886168 30969878 29055467 26387252 23708653 21328451 19270434 17891671 17638191
37759 17638191 18345708 19304774 19870119 19619145 18260783 16001843 13779076 12471328 11996958
37750 11996958 11781260 11893433 12889761 14556126 15734083 15698323 15019806 14753565 15334027
37741 15334027 16475507 17526498 17728335 16900003 16162453 17061954 19441305 21155282 20746059
37732 20746059 19495778 19618475 21076116 21726662 20463460 18605043 17823527 18127246 18653441
37723 18653441 19307138 20475481 21730072 22041390 21285083 20640295 21210085 22782532 24296488
37714 24296488 25213272 25979681 27130662 28390962 29124424 29561321 30887586 33690688 36805447
37705 36805447 38423017 38215427 37690803 38446873 40720396 43693185 46442816 48314808
37697 48314808 49135012 49666200 51426033 55437064 61233996 67338233 72491725 76354113
37689 76354113 79563203 83488066 89361957 96998310 104622902 110589120 115190630 120380131
37681 120380131 127885941 138041860 150210479 163666123 177974557 193008862 208807241
37674 208807241 225247395 241951552 258787298 276239032 294718045 313466191 330651828
37667 330651828 344708745 355168510 362024844 364814555 362848394 356205199 346012864
37660 346012864 333558424 319297477 302941357 284512815 265107915 246406381 229460877
37653 229460877 214169861 199902250 186270328 173151659 160426082 148220717 137263193
37646 137263193 128395932 121529373 115429261 108880607 102007145 96170752 92385400 89899417
37638 89899417 86674214 81530969 75585648 71046182 68643580 66959879 64528685 61759142
37630 61759142 60039778 59512846 58801412 56859391 54109069 51572893 49799331 49063894
37622 49063894 49780455 51908064 54357170 55790562 55947647 55580864 55150983 54315338 52959796
37613 52959796 52086578 53011748 55808222 59089370 61429045 62561628 62984045 62858588 61888096
37604 61888096 60151630 58413869 57315939 56584662 55333272 52999494 49827178 46581876
37596 46581876 43912264 41817526 39665261 36950821 34058232 31912917 30812585 30081905
37588 30081905 29062556 27865161 26784156 25580778 23941468 22181342 20825746 19857023
37580 19857023 19029684 18512402 18423630 18154200 17167782 16168180 16248326 16987816 16816714 15486192
37570 15486192 14636363 15210170 15704326 14147205 10872359 8094447 7331680 8381446 10313308
37561 10313308 12191588 13085618 12702167 12097607 12630262 14003336 14395912 12878542 10718895
37552 10718895 9731440 10118046 10663536 10548547 10140452 10101869 10402998 10467767 10030797 9561582
37542 9561582 9716717 10439500 10897842 10497325 9634716 9057915 8776664 8241989 7496343
37533 7496343 7364502 8276459 9510662 9944133 9169642 7705111 6559584 6701159 8289371
37524 8289371 10138955 10634345 9616529 8673248 9005679 9806409 9646572 8742433 8489511
37515 8489511 9026112 8826046 7049176 4913758 3970390 4080551 4118482 3904998 4183026
37506 4183026 4983275 5337735 4861924 4585497 5648639 7810539 9841244 10986713 11430497
37497 11430497 11504816 11105523 10039875 8542469 7181997 6397646 6265302 6594725 7093871
37488 7093871 7477170 7572521 7424416 7292585 7473330 8014495 8582358 8732151 8411840 8080985
37478 8080985 8143080 8347126 8063075 7208418 6554031 6868000 8002959 9143277 9765703
37469 9765703 9962517 9943700 9746435 9507857 9518360 9806911 10139775 10682886 12107373 14512039
37459 14512039 16672203 17120878 15887303 14467584 13984929 14006572 13429890 12047270 10870673
37450 10870673 11135795 13192101 16194813 18803095 20376249 21461755 22871914 24519520
37442 24519520 25744147 26628841 28087081 30451233 32912047 34804692 36502416 38295705
37434 38295705 39273672 38450485 36495226 35124035 34942584 35003517 34457848 33513891 32594613
37425 32594613 31597044 30323123 28775875 26749030 24051276 21497919 20632855 21757382
37417 21757382 23051349 22488602 20069590 17410666 15705610 15033125 15279200 16579923
37409 16579923 18676189 20607604 21368638 20537900 18286737 15282762 12681834 11667706
37401 11667706 12553399 14374159 15551067 15070835 13148675 10844739 9059032 7961542
37393 7961542 7371704 7268227 7482487 7223353 5718849 3383126 1591119 1124277 1575333
37384 1575333 2447506 3876849 5811361 7405670 7913802 7465490 6397903 4711425 2890571
37375 2890571 2196304 3023513 3835941 3028964 1159747 -39890 -210254 -344878 -768719
37366 -768719 -988090 -1306642 -2536768 -3939223 -3552417 -1182747 899571 1189740 1055907
37357 1055907 2317948 4275473 4853350 3741682 2642617 2768960 3563784 3882383 3378312
37348 3378312 2595658 2281071 2556925 2513108 1077703 -1401896 -3179023 -3181843 -2202385
37339 -2202385 -1390450 -619900 619316 1655295 1331927 -278123 -2107495 -3519741 -4236549
37330 -4236549 -3488888 -954862 1698659 2075399 158676 -1397612 -564294 1817449 3598946
37321 3598946 3836713 3049771 2106432 1722118 2255532 3221864 3611148 3233128 3049269
37312 3049269 3688532 4513040 4811190 4983684 5615639 6157180 5655238 4288584 3050811
37303 3050811 2259952 1521667 940749 1128276 1958032 2486021 2351969 2197776 2335050
37294 2335050 2055537 879636 -402480 -730881 -174692 470980 951412 1518094 2005438
37285 2005438 1930184 1382031 901978 528836 -95205 -671410 -409440 504859 794708 26183
37275 26183 -486846 362794 1605824 1563218 439373 52097 1144762 2420916 2473819
37266 2473819 1438069 304857 -369584 -526405 -172756 536703 1269242 1872080 2325226
37257 2325226 2344067 1743213 1172953 1566574 2810363 4021774 5152248 6879375 8681059
37248 8681059 8837560 7163723 5941417 6820426 8366360 8312901 6846109 5655450 4832322
37239 4832322 3104865 661157 -683022 -233676 723985 1081509 1062006 882826 96120
37230 96120 -1129585 -1635710 -864470 423207 1442707 2080824 2007013 715259 -1002220
37221 -1002220 -1336201 -75912 682495 -440333 -1866391 -1258672 1190264 3206050 3421102
37212 3421102 2466261 1513084 1014689 797279 560866 338396 714155 2016359 3142822
37203 3142822 2356414 -205122 -2181206 -2076513 -1266839 -1584483 -2314291 -1528028 546991
37194 546991 1746167 1213071 226295 -332989 -1240012 -3023752 -4524664 -4319669 -2494829
37185 -2494829 -243198 1397746 1792198 652870 -1386258 -2734029 -2227836 -396277
37177 -396277 1094703 1070600 -311970 -2057728 -3364836 -4231447 -5037907 -5474043 -4345732
37168 -4345732 -1086194 2784288 4635512 3420883 770093 -874780 -678916 318771
37160 318771 825086 625241 411302 708833 1223134 1267780 615244 -397281 -1470989
37151 -1470989 -2444978 -2724509 -1487777 997897 3017684 3163511 1917053 678354 -214986
37142 -214986 -1428494 -2962630 -3814777 -3382043 -2156179 -809840 535841 1853027 2735036
37133 2735036 2755896 1952236 833134 109570 168631 513422 208425 -681030 -852289 281916
37123 281916 1339810 912191 -75207 378213 2259717 3682807 3935495 4202348 4938331
37114 4938331 4764066 2882053 688457 -210647 -52102 214600 685580 1746722 2720913
37105 2720913 2752081 2245521 2134794 2416630 2592639 2832061 3444928 3828051 3199540 1896520
37095 1896520 798642 -4775 -796768 -1065627 -147019 1305609 1886934 1376400 880350
37086 880350 1074945 1438356 1263293 437936 -785858 -1896830 -2084927 -1037858 303868
37077 303868 704235 207538 -200145 -293865 -802539 -1912879 -2757071 -2573272 -1419426
37068 -1419426 292518 1943752 2466731 1260863 -527369 -1041997 -338812 -451138 -2245896
37059 -2245896 -3822244 -3165267 -1068580 100914 -270839 -595717 315398 1725836 2281219
37050 2281219 1729024 887429 574450 948580 1507797 1521570 790258 93771 532657 2265717
37040 2265717 4202210 5130311 4905925 4310898 3949699 3637603 2865897 1500732 -188302
37031 -188302 -1903808 -3348152 -4087455 -3991474 -3809065 -4524004 -5802486 -5893289 -3780616
37022 -3780616 -786407 922548 952887 651066 736642 451335 -681268 -1718956 -1721517
37013 -1721517 -1224201 -1301752 -1902856 -2129779 -1649999 -806131 285084 1604132 2357134
37004 2357134 1488777 -633568 -2103744 -1653422 -213110 397260 -223902 -945084 -988919
36995 -988919 -799050 -779009 -283848 1235445 2765344 2685546 1109970 -35556 356667
36986 356667 1155942 1001857 485117 915834 1782799 1332842 -508330 -1781142 -1469792
36977 -1469792 -942841 -1457773 -1907580 -633928 1583209 2215340 401242 -1918575 -2494403
36968 -2494403 -1232383 215760 550308 83008 206852 1709012 3511392 3517738 1133306
36959 1133306 -1638444 -2372360 -997696 543605 934373 498484 -188027 -1136909 -2093736
36950 -2093736 -2267475 -1551875 -883968 -736465 -369865 637123 1275380 648408 -321175
36941 -321175 -107615 1093342 1685668 994300 -151099 -1000858 -1555351 -1537297 -262549
36932 -262549 1904330 3301659 2985693 1949090 1493357 1385527 720025 -168531 1749
36923 1749 1529712 3258406 4015337 3642531 2666868 1804414 1725454 2434685 2919982 2312164
36913 2312164 1316201 1391074 2461280 2786445 1513457 -37070 -430351 -150768 -367908
36904 -367908 -746213 -103054 1332705 2096007 1850107 1835424 2561885 2677129 1061848
36895 1061848 -1167696 -2018350 -1333259 -861230 -1786662 -3355957 -4189654 -3998063 -3405817
36886 -3405817 -2708811 -1718394 -794836 -1109387 -3237196 -5892932 -6904559 -5543600 -3222571
36877 -3222571 -1685663 -1261896 -1325619 -1590679 -1991537 -1861517 -486986 1600613 3019639
36868 3019639 3332879 3382464 3646927 3465664 2439615 1507481 1739259 2751802 3183745
36859 3183745 2313403 552366 -1191403 -2010868 -1409919 19535 772836 50446 -1197805
36850 -1197805 -1569160 -1009225 -378712 232788 1450484 3079382 4069761 4214852 4520438
36841 4520438 5377661 5614718 4219663 2077934 950437 1235704 1744646 1489645 811320
36832 811320 656126 1355032 2303795 2552784 1668298 202234 -765495 -694489 19557 878080
36822 878080 2068417 3908372 5801494 6521443 5689932 4398562 4034510 4825893 5868567
36813 5868567 6348881 6342026 6432423 6896451 7443027 7625308 7301928 6658738 5924159 5215074
36803 5215074 4637919 4359691 4453573 4727899 4817268 4464763 3692111 2707399 1656760 451553
36793 451553 -1103311 -2889691 -4224224 -4310580 -3161201 -1901738 -1798042 -2895067 -3871626
36784 -3871626 -3410545 -1560618 419449 1409042 1368947 1051650 1156850 1886700 3000227
36775 3000227 4006303 4446010 4288202 4037042 4228698 4815865 5241207 5141182 4821380
36766 4821380 5014365 6241647 8278430 10063362 10375304 9072745 7624235 7843270 9904346
36757 9904346 12110979 12917207 12662919 12822263 13983534 15332928 16011229 16149700 16275988
36748 16275988 16298793 15629645 14132854 12486394 11470316 11095882 10649886 9658873 8661578
36739 8661578 8762111 10357914 12579329 14154647 14547209 13980197 12710223 10851065 8770743
36730 8770743 6969824 5441294 3783445 2183472 1567606 2206878 2786774 1814695 -233335
36721 -233335 -1223340 -81276 1738350 2118941 877350 -431836 -842864 -847144 -834675
36712 -834675 -3053 2308817 4967898 5856011 4245833 1604509 5079 297185 1792064
36703 1792064 3124446 3344100 2673467 2272079 2876188 3831837 4034142 3545838 3343501
36694 3343501 3523889 2960682 1097043 -1046489 -2244919 -2421346 -1907625 -439388 1990927
36685 1990927 4088496 4417401 3251517 2098416 1657139 1399624 946074 563665 264854
36676 264854 -362937 -1193059 -1475778 -987885 -323356 201889 978588 2151944 3184275
36667 3184275 3686119 3735222 3059335 1032157 -1948074 -4193948 -4690624 -4417060 -4781015
36658 -4781015 -5547697 -5425188 -4092952 -2416248 -994426 224544 961747 563614 -682819
36649 -682819 -1236514 12258 2309233 3905531 4037567 3465417 3171167 3151218 2776181
36640 2776181 1942284 1260496 1046092 749290 -126650 -980419 -753043 518140 1621425
36631 1621425 1735036 1209753 544035 -438198 -1761922 -2510670 -1841798 -359187 492164
36622 492164 241218 -263320 -305783 -261657 -850671 -2043905 -3105928 -3426116 -2989503 -2149027
36612 -2149027 -1214705 -377091 90098 -129149 -937250 -1655000 -1692644 -1232682 -832271 -609911
36602 -609911 -459936 -770310 -1934723 -3267204 -3651073 -3397558 -3984894 -5490833 -5967298
36593 -5967298 -4352275 -2347994 -1890628 -2194158 -1303824 464201 1009326 -87230 -1013038
36584 -1013038 -703996 -74981 107733 339362 645465 -63161 -1729055 -2197251 -114571
36575 -114571 2721145 3644194 2625426 1709040 1821801 2119759 2104041 2360693 3005718
36566 3005718 3125793 2361868 1753670 2235193 3160903 3136975 1857258 427574 9590
36557 9590 604011 1228589 1086991 380900 -152254 -351107 -795604 -1713315 -2350381 -1995121
36547 -1995121 -1175889 -1037873 -1666615 -1834915 -540499 1833079 4040310 5059531 4451337
36538 4451337 2324385 -472031 -2476400 -2650320 -1426638 -356763 -536574 -1602724
36530 -1602724 -2435850 -2544834 -2306233 -1951392 -1062934 473768 1579608 903201 -1412309
36521 -1412309 -3645618 -4364218 -3772892 -3013929 -2782889 -2997445 -3253289 -3100420 -2240694
36512 -2240694 -886874 346843 1164634 1790179 2234659 2009334 1021598 104711 -27640
36503 -27640 134083 -411993 -1772338 -3146355 -3856415 -3658452 -2429390 -446771 1309612
36494 1309612 2134783 2714216 4171332 5997806 6169124 3761912 455624 -1260292 -761982
36485 -761982 455098 793308 208235 -73865 873127 2526563 3448304 2995117 2055895
36476 2055895 1686963 1566686 674104 -837757 -1631014 -1116954 -226556 118421 224593
36467 224593 714647 1292625 1185267 240713 -1022915 -1943391 -1810612 -132517 2507021
36458 2507021 4431731 4496477 3373012 2587760 2669825 2885174 2410189 1090247 -625450
36449 -625450 -1843605 -1682483 -306245 761031 82039 -2093787 -4234813 -5203248 -4897864
36440 -4897864 -3686004 -2125909 -1019028 -772356 -756898 -138576 761573 868104 56879
36431 56879 -597953 -435932 -22154 -8840 -180259 -189568 -412476 -1305913 -2405933 -2697410
36421 -2697410 -1813567 -372802 810098 1520402 2124331 2883202 3449936 3381340 3197726
36412 3197726 4193607 6568157 8441225 7838334 5260920 2969374 1922296 1065913 -153685
36403 -153685 -487566 968032 2913246 3532545 2966817 2609282 2642298 1839246 -400714
36394 -400714 -3127955 -4971274 -5250554 -4052987 -2096151 -488228 124825 150443 301252
36385 301252 628523 938726 1615423 3038921 4549924 5048829 4419008 3381516 2235558
36376 2235558 878438 -177905 -167937 529844 680019 48656 -310899 96646 397525
36367 397525 -119069 -853734 -925524 -362666 333966 895881 992769 197360 -1094478 -1623384
36357 -1623384 -885009 40253 25839 -559981 -700686 -328330 -33546 249642 1122196 2472011
36347 2472011 3309933 2949449 1808788 991627 1291568 2448732 3333795 3231336 2816213
36338 2816213 3129103 3769019 3385600 2106581 1777485 3021635 3799200 2287245 -258497
36329 -258497 -1354614 -991211 -1383223 -3434252 -5480424 -5692817 -4111179 -1980441 -288583
36320 -288583 780940 1813620 3511043 5330195 5412060 3094503 726758 1130674 3659691
36311 3659691 4941367 3575519 1781168 1789577 2825945 2828875 1406410 -281458 -1291161
36302 -1291161 -1261371 -44382 1825352 3095498 3240601 3207189 3875622 4632035 4407190
36293 4407190 3369452 2634519 2904793 4151856 5923831 7226006 6929800 5153052 3441993
36284 3441993 2753276 2159211 518896 -1539118 -2551722 -2356217 -1913976 -1543429 -736954
36275 -736954 517008 1482832 1665748 1101097 -121670 -1736808 -3030235 -3587421 -3911547
36266 -3911547 -4367254 -4056226 -1942887 1301802 3883266 5076477 5550372 5695919 5092631
36257 5092631 3774863 2641964 2140342 1561749 159229 -1718834 -2944321 -2608372 -709786
36248 -709786 1634294 2835687 2297626 989165 31578 -656362 -1453520 -1653361 -465493
36239 -465493 1178313 1627216 1126882 1503333 3091930 4007443 3069367 1544229 995737
36230 995737 1065985 684084 194330 816845 2732903 4931236 6468375 6961695 6344600
36221 6344600 4963622 3487598 2131072 553450 -1008655 -1464304 -504675 464209 137053
36212 137053 -706006 -309459 1449231 2884991 2757124 1505122 267943 -225585 312149
36203 312149 1741882 3191591 3558903 2779051 2034911 2279221 2976437 2796827 1342445
36194 1342445 -316428 -873948 -156284 1000766 1912263 2482547 2530237 1587475 -78388
36185 -78388 -1047884 -353332 995807 1273551 516306 333295 1289923 2113581 1876539 1290576
36175 1290576 1041394 450542 -964254 -1949482 -1154133 549501 1071391 17438 -981294
36166 -981294 -759081 6753 161541 -281842 -312857 825764 2776507 4188035 3873346
36157 3873346 2166019 736949 678175 1354568 1685242 1784454 2447444 3649649 4582112
36148 4582112 4715911 3929288 2232241 464775 485643 3072563 6055267 6296490 3517536
36139 3517536 536943 -362263 404102 1431012 2295660 2996439 3008803 2083307 1002346
36130 1002346 592372 796714 1429054 2795262 4618948 5358508 3880403 1235134 -433713
36121 -433713 -377790 448587 1201738 1967386 2737745 2813568 1726319 -9752 -1565222
36112 -1565222 -2705770 -3607950 -4215024 -4342750 -4216610 -4283123 -4396776 -3759062 -2078970
36103 -2078970 -450783 -425762 -2164877 -4100121 -4672248 -3874782 -2698576 -1602653 -256450
36094 -256450 1412593 2670514 2667619 1357827 -339680 -1204122 -778169 60314 -23378
36085 -23378 -1158144 -2081634 -1979167 -1656777 -2110525 -2785126 -2475398 -1379877 -797759
36076 -797759 -1027030 -1089657 -581106 -257456 -471690 -469733 237220 1081673 1600834 2168991
36066 2168991 2910398 3079704 2353215 1659722 1779529 2032358 1354616 -75361 -1259900
36057 -1259900 -1764900 -1741031 -1201114 -284852 259577 -138976 -953909 -1256747 -905713 -212738
36047 -212738 1014813 2989449 4841462 5231570 4102296 2787951 2162929 1500502 -463198
36038 -463198 -3797290 -6980799 -8061369 -6237869 -2518609 1186832 3580598 4360378
36030 4360378 3498173 1238026 -991682 -1058567 1471987 4331507 5064072 3818554 2431251
36021 2431251 1477562 -43878 -2243521 -3378203 -2025265 910457 3155906 3502064
36013 3502064 2755799 2558633 3581529 4838143 4809290 3223533 1281856 -10446 -923948
36004 -923948 -1928205 -2545618 -2321532 -2113361 -2996830 -4351829 -4563530 -3458596 -2526215
35995 -2526215 -2712432 -3542000 -4580072 -6051935 -7446385 -7148149 -4520716 -1228350 572248
35986 572248 555120 -127858 -675302 -1046022 -1129240 -674814 50138 372404 46792 -500182
35976 -500182 -754408 -640472 -512694 -742670 -1188860 -1158088 -235760 1009432 1721066 1977604
35966 1977604 2469528 3011533 2519615 791885 -837654 -1265383 -1052459 -1298388 -1956177
35957 -1956177 -2275476 -2284562 -2663681 -3367526 -3430242 -2284516 -581916 554302 791564
35948 791564 950045 2078274 4048691 5285675 4400728 1958965 -153739 -1084508 -1678838
35939 -1678838 -2588787 -3013202 -2059453 -316556 843536 783304 -294478 -1843025 -2780801
35930 -2780801 -1894268 472225 2157935 1874713 1061663 1473813 2077959 657727 -2088220
35921 -2088220 -2808193 -213615 2971086 3768391 2607451 1868958 2345503 2755923 1872197
35912 1872197 -291552 -2903991 -4857609 -5311478 -4538539 -3802980 -3756126 -3586945 -2444282
35903 -2444282 -878472 111944 748568 1972263 3705013 4863817 4974402 4671133 4603454
35894 4603454 4800461 5097234 5248667 4634780 2879847 885657 185682 939653 1558539
35885 1558539 830805 -452984 -667748 550292 2160635 3205985 3615956 3744606 3902475
35876 3902475 4392193 5366637 6407665 6620544 5438541 3268116 1246749 348712 633166
35867 633166 1301389 1578199 1516359 1686275 2087624 1903173 671572 -791896 -1293844
35858 -1293844 -834778 -526203 -969450 -1570334 -1738983 -1911872 -2689720 -3524024 -3195327
35849 -3195327 -1487888 452324 1571791 1992206 2312978 2465980 1859260 365453 -1409809
35840 -1409809 -2779552 -3457379 -3426458 -2784939 -1845522 -1067426 -731161 -843662 -1340544
35831 -1340544 -2071791 -2596851 -2483956 -2012792 -2060745 -2860411 -3335475 -2390716 -653524
35822 -653524 -37539 -1378084 -3298924 -3898413 -2920900 -1586183 -752245 -193836 371061
35813 371061 516713 -222603 -1523085 -2599165 -3045404 -2964108 -2494368 -1618163 -382284
35804 -382284 919525 1764558 1600273 317460 -1349597 -2270739 -2066380 -1517299 -1504293
35795 -1504293 -1833846 -1568786 -355868 1067090 1708775 1346263 687982 693800 1645826
35786 1645826 2785374 3116790 2677270 2527404 3193646 3755935 3073833 1314371 -561120
35777 -561120 -2251344 -3910719 -4891693 -4186477 -2232572 -842087 -893613 -1347077 -1078105
35768 -1078105 -424427 -177931 -260601 -362929 -822236 -1774556 -2398635 -2190286 -2045104 -2694300
35758 -2694300 -2998113 -1589502 398081 345634 -2169051 -4747436 -5534601 -5204549 -4889203
35749 -4889203 -4071157 -1851103 1067365 3146752 3959517 4111130 3885690 3198736 2431294
35740 2431294 2107908 1961137 1327790 326153 -256117 -128828 261199 556311 803312
35731 803312 1044673 1300823 1833703 2733353 3423475 3348571 2967704 3183112 3916330 4267505
35721 4267505 4060296 4029506 4226673 3540598 1526827 -331900 -239855 1570802 3040537
35712 3040537 2561456 364610 -2073238 -3304728 -2833164 -1513110 -982037 -2084263 -3886000
35703 -3886000 -4739857 -4164094 -3082962 -2404341 -2159057 -2045300 -1947108 -1645459 -781140
35694 -781140 452498 1134347 572783 -937155 -2538310 -3457832 -3034156 -970928 1788531
35685 1788531 3181660 1981634 -712646 -2720182 -3080873 -2256722 -676577 1438849
35677 1438849 2993851 2563497 566221 -643769 262407 1838199 2136061 1458696 1324566
35668 1324566 1669256 1049926 -683784 -1933258 -1804273 -1192241 -821733 71430 2014674
35659 2014674 3640249 3240428 1236033 -327639 -401648 195968 359331 -51197 -619296
35650 -619296 -1019317 -1021637 -645108 -486818 -1148514 -2164300 -2307191 -1233675 10303
35641 10303 522285 698233 1196699 1570839 952319 -377726 -1265813 -1437087 -1830853 -2971028
35631 -2971028 -4065464 -4260978 -3915186 -3849543 -3993341 -3727549 -3176786 -3035247 -3164767
35622 -3164767 -2590455 -1307887 -983052 -2931145 -6037069 -7749241 -6933319 -4767411 -2832985
35613 -2832985 -1403319 -40007 1065854 1271686 662182 164649 361468 769851 580877
35604 580877 -259498 -1115952 -1707462 -2620800 -4472730 -6752976 -8012075 -7403111 -5646027
35595 -5646027 -4107055 -3297491 -2865557 -2740444 -3276604 -4128508 -4083884 -2695487 -1256253
35586 -1256253 -1194827 -2031435 -2078066 -986410 -326677 -1320968 -3101499 -3925573 -3415773
35577 -3415773 -2784993 -3191274 -4604036 -6150533 -6910266 -6320784 -4380426 -1761712 477425
35568 477425 1532820 1329820 553261 278743 1275295 3336173 5358637 6278730 5846707
35559 5846707 4448687 2580107 807441 -218103 -347732 -293041 -704525 -1055437 -278557
35550 -278557 1503712 2891385 3122068 3022743 3434946 3676759 2601422 560437 -873701
35541 -873701 -905117 -159330 554446 1013494 1043068 373906 -551801 -594294 696524 2415612
35531 2415612 3499873 3862593 3808673 3145783 1744704 423546 254892 1135320 1822370
35522 1822370 1330558 -321785 -2590980 -4883674 -6514054 -6869073 -5920784 -4323559 -2929167
35513 -2929167 -2312591 -2509950 -2879403 -2471261 -979175 825727 1932326 2079378 1589249
35504 1589249 728217 -178063 -501028 -9602 530158 318063 -236040 -185489 357503 460505
35494 460505 -418 -298559 -396809 -935923 -1384217 15576 3493672 6415061 6074856
35485 6074856 2968294 -2068 -968199 -537059 -259236 -942331 -2415784 -3929149 -4604075
35476 -4604075 -4081043 -2780647 -1290414 115658 1018950 655013 -1053989 -2822242 -3260861
35467 -3260861 -2450729 -1449498 -704558 25189 514224 32903 -1492827 -3187150 -4130901
35458 -4130901 -3888653 -2391653 -191273 1415538 1582154 1138356 1542439 2679304 2937687
35449 2937687 1610610 -75203 -734315 -467174 -158607 -122064 -141952 -157623 -264194 -482506
35439 -482506 -868485 -1359601 -1393023 -384088 1300008 2658402 3379287 3782756 3427511
35430 3427511 1336322 -1871753 -3749765 -2992720 -1221166 -507909 -472018 474487 2097435
35421 2097435 2716572 2123656 1888570 2626592 3004797 2038220 610726 -170911 -679835
35412 -679835 -1700805 -2746701 -2736261 -1750198 -884969 -576279 -139438 906103 1839520
35403 1839520 1403537 -851202 -4030226 -6505039 -7054522 -5689278 -3553457 -2004644
35395 -2004644 -1654856 -2076766 -2270864 -1555081 -256247 544067 204214 -661096 -919214
35386 -919214 -336494 289383 398335 366044 679229 1096869 1151777 976442 970464 976234 548450
35375 548450 -54667 47205 1075641 2038497 1853055 623899 -583415 -933437 -376333
35366 -376333 720989 1948089 2884388 3246371 3114453 2693655 1870814 484543 -941512
35357 -941512 -1454776 -1028539 -956365 -2205967 -3932125 -4568384 -4032668 -3614440 -3673336 -2925988
35347 -2925988 -685382 1463048 1452388 -460852 -1960714 -1510408 234991 1854775 2865710
35338 2865710 3650010 4553858 5575496 6432754 6570094 5559302 3824989 2532963 2396431
35329 2396431 2938923 3222543 2901692 2231559 1492526 894063 676761 693414 103106 -1808204
35319 -1808204 -4455669 -6253122 -6360103 -5652800 -5546275 -6178657 -6338437 -5150455 -3202962
35310 -3202962 -1683615 -910180 -366384 75422 -60771 -637639 -554896 531645 963251
35301 963251 -1042362 -4459416 -5978899 -3962653 -538787 1153448 718623 228993 927850
35292 927850 1840915 1640931 391170 -1050459 -2227761 -3008128 -3151825 -2737119 -2444409
35283 -2444409 -2635594 -2527683 -1076252 1465151 3566377 4033272 3114443 2003341 1669898
35274 1669898 2188860 2834068 2796331 2054329 1409423 1381380 1400967 668719 -466486 -841357
35264 -841357 -155815 685613 1188575 2140663 4094303 5816128 5458101 3082765 911472
35255 911472 759881 1930491 2090736 -54495 -3267907 -4896320 -3455139 -152506 2308404
35246 2308404 2492158 1403498 752085 832296 879561 835036 1380448 2304641 2329944 1059976
35236 1059976 -176893 -219801 302254 287909 104847 745194 1679717 1402252 118610
35227 118610 -64611 1589863 2696620 772749 -3007030 -4954358 -3571267 -1292046
35219 -1292046 -1030705 -2571977 -3555221 -3000614 -2234116 -2498204 -3174384 -2900909 -1459847
35210 -1459847 143543 909617 602134 -221517 -442761 756354 2577387 2734536 -94618
35201 -94618 -4218637 -6418627 -5503034 -3348847 -2247172 -2366908 -2414300 -1777155 -994963
35192 -994963 -600461 -557471 -851152 -1816868 -3542366 -5310818 -5980901 -4949763 -2703869
35183 -2703869 -408871 1036481 1473048 1116922 194113 -791213 -991582 -137798 794823
35174 794823 702038 -52421 -164494 541811 809188 -30010 -1033077 -1263906 -1214649 -1709268
35164 -1709268 -2425829 -2639469 -2654583 -3229491 -4014763 -3784069 -2108852 107416 1668308
35155 1668308 1980060 1182699 80621 -358311 -81580 -157335 -1304725 -2767214 -3336964
35146 -3336964 -2830709 -1746605 -286616 1205024 1688942 718944 -373425 -84062 1038850
35137 1038850 1371336 835042 655120 915179 540091 -332604 -265751 863539 1409006
35128 1409006 707482 103751 443001 757426 543614 1141725 3292450 5204815 4861119
35119 4861119 2778136 741977 -833810 -2449699 -3671919 -3804768 -3562878 -4102221 -4984013
35110 -4984013 -4880349 -3709041 -2337706 -842414 1036368 2326244 1887553 748246
35102 748246 1138826 3165559 4614802 4316915 3513469 3286948 2749981 866654 -1589066
35093 -1589066 -3128101 -3422210 -3017031 -2165983 -1005639 -168434 -266935 -1169158 -2321039
35084 -2321039 -3297535 -3718492 -3314799 -2423826 -1717353 -1222276 -490503 97325 -558627
35075 -558627 -2368692 -3569338 -3022893 -1876037 -1853958 -2844912 -3421307 -3056478 -2454270
35066 -2454270 -2042254 -1485777 -687560 -145008 -135765 -395350 -768587 -1448499 -2369401 -2997299
35056 -2997299 -2999544 -2669994 -2439656 -2306769 -2003604 -1515034 -1156903 -1095676 -894052 228634
35046 228634 2421893 4602901 5304532 4275658 2828381 2373765 2997835 3737445 3832070
35037 3832070 3302351 2607073 2168086 2082345 2013699 1544867 816010 495624 895981 1524947
35027 1524947 1826861 1912478 2120242 2310213 2178175 1900970 1788878 1578998 873300 153268
35017 153268 447561 1816490 2999876 2995183 2339326 2254841 2990782 3728560 3929329 3957121
35007 3957121 4177521 4145199 3239038 1738344 611266 316797 461941 719909 1348058
34998 1348058 2422164 3262744 3348087 3375863 4544914 6842855 8760613 8774328 6645476
34989 6645476 3443586 917769 553981 2242470 3869584 3294762 937321 -671511
34981 -671511 -210285 803966 349578 -1377705 -2651820 -2675797 -2020855 -1150988 106615
34972 106615 1732897 3314090 4719219 6044369 6846299 6363927 4707296 3083958 2606113
34963 2606113 3385103 4826380 6197183 6842348 6479557 5469827 4401350 3456183 2614581
34954 2614581 2176722 2312484 2327374 1406573 92174 -124182 1045629 2087862 1786640
34945 1786640 879475 835600 1822739 2794957 2970217 2292935 959836 -486117 -962399
34936 -962399 131454 1823487 2561945 2282577 2387251 3539289 4719539 4968232 4865866
34927 4865866 5347787 5945296 5449835 3900247 2632024 2387046 2562583 2572470 2812039
34918 2812039 3665392 4447314 4208733 3146863 2446211 2959789 4620951 6798072 8504793
34909 8504793 8568652 6559519 3625992 1622271 1236579 1607725 1786551 1681133 1356203
34900 1356203 476050 -855373 -1492813 -419970 1854000 3866671 4910046 5401943 5765316
34891 5765316 5859874 5655915 5649632 6156837 6653553 6290396 4890564 3110040 1715609
34882 1715609 1047197 1226439 2457070 4612285 6590218 6830626 5048440 3011397 2742173
34873 2742173 4050549 4769186 3558466 1468057 305669 478356 1224042 2154763 3516714
34864 3516714 5327442 7190170 8738265 9558991 9089583 7442041 5922988 5716718 6344270
34855 6344270 6515035 6221948 6634594 7958709 8991431 9247730 10006720 12314691 15111352
34846 15111352 16523781 16303134 15788526 15834918 15907933 15180950 13595841 11661413 9842838
34837 9842838 8393714 7452837 7155590 7711992 9145796 10752933 11249247 10025747 8066159
34828 8066159 7012129 7339993 8009485 7946844 7282946 6910861 7327486 8276038 9192487
34819 9192487 9592295 9218905 8271995 7488012 7600837 8569745 9565687 9836088 9376482
34810 9376482 8648534 7933077 7227427 6566097 6109024 6036158 6624214 8133432 10081330
34801 10081330 10887359 9184495 5756999 3360439 4007662 6852458 9217369 9298211 7422889
34792 7422889 5179024 4009323 4391907 5702193 6873027 7513084 8176780 9336991 10634914
34783 10634914 11540355 12059395 12155581 11245048 9228113 7364426 6934121 7501931 7777609
34774 7777609 7729406 8246020 8914904 8040983 5251893 2369008 1010671 822755 870657
34765 870657 1315249 2599422 4152521 5154195 5765780 6487213 7021583 6897098 6626277
34756 6626277 7155901 8568092 10179617 11401909 11683083 10322326 7442970 4590878
34748 4590878 3225614 3080052 3106899 3403320 4692850 6288175 6380549 4576685 2583627
34739 2583627 1898189 2179855 2534059 3101538 4382533 5915611 6795385 7061608 7536709
34730 7536709 8435378 9041178 8849271 8278277 7971871 8006534 8277615 9197553 11149308
34721 11149308 13234021 13559375 11433462 8597233 7328313 7737791 8097403 7575374 7069520
34712 7069520 7089260 6608386 5002441 3615067 3951877 5373686 6162884 6118128 6386703
34703 6386703 7182662 7484003 6979982 6689291 7371902 8595303 9577734 9865224 9196209
34694 9196209 7914770 7411549 8705413 10633751 11134956 10392106 10617680 12181646 12304808
34685 12304808 9011071 4439051 2261704 3077929 4433080 4646363 4469459 5087568 6399950
34676 6399950 7689109 8653511 9311618 9793471 10527305 11905542 13622123 14997082 15924884
34667 15924884 16721214 17082427 16187940 14067937 11954750 10808021 10151217 8884934 6829577
34658 6829577 5017250 4694626 6275749 8965789 11153231 11472284 9872455 7657629
34650 7657629 6363352 6593288 7831761 9125770 9904874 10338296 10959787 11868958 12439274
34641 12439274 12068417 11130276 10810581 11845924 13583269 14434766 13347273 10946639 9163052
34632 9163052 9376361 10858638 11540633 10556003 9375357 9845888 11764031 13412003 14136948
34623 14136948 15031306 16822915 18390471 18152642 16104746 13653653 12022428 11626881
34615 11626881 12470145 14070645 15177435 14632471 12723319 10947769 10297907 10467831 10829356
34606 10829356 11272806 11716593 11701828 11179247 11005486 11768248 12570629 12015528 10273997
34597 10273997 9114429 9596892 10582188 10097594 7755276 5271877 4668666 6244644 8348626
34588 8348626 9071767 8104206 6771597 6293427 6534129 6756085 6874497 7121192 6960380
34579 6960380 5535299 3145046 1148213 294210 246552 817923 2256018 3932910 4343103
34570 4343103 3242545 2335746 2752777 3243165 2263842 570292 -8873 628964 1200098
34561 1200098 1374936 1661468 1517628 11143 -1690079 -988327 2447032 5834456 6879147
34552 6879147 6225338 5450754 4638546 3275047 1931604 1522679 1976806 2857801 4254212
34543 4254212 5974108 7027952 7088388 7269132 8134290 8145928 5731554 1980643 -438550
34534 -438550 -432049 1014926 2812462 4462457 5206187 4410102 2912250 2417910 3328689
34525 3328689 4433472 4846532 4966400 5323626 5704486 5790577 5740992 5817430 6062156 6375380
34515 6375380 6361313 5447141 3926221 3334564 4685417 6854772 8065064 8458823 9495878
34506 9495878 11109311 11544191 10247323 8830787 8468639 8213221 6891849 5055827 3880735
34497 3880735 3518581 3803684 5347791 8433285 11683886 13350549 13429294 13215343 13189144
34488 13189144 12650981 11229953 9507580 8107082 7170102 6828875 7312071 8365101 9221413
34479 9221413 9377721 8992671 8482380 8138787 8135223 8449667 8714505 8531626 8052406 7951309
34469 7951309 8666657 9816827 10511165 10233247 9332954 8550198 8140045 7796714 7477379
34460 7477379 7687838 8541197 9204724 9077916 8943176 9804514 10965987 10738323 9044714
34451 9044714 7686830 7626142 7698676 6901821 6372957 7687491 10252717 11915101 11583926
34442 11583926 9976656 8256714 7140597 6879228 6849343 5548270 2372279 -791268
34434 -791268 -1171823 1584709 4977802 6689948 6826621 6775204 7074045 7218831 6835465
34425 6835465 6178091 5662691 5402139 5184908 4789885 4372877 4370273 4793187 4951983 4335979
34415 4335979 3400649 2840266 2463771 1704327 991563 1427577 2957098 4022607 3514875
34406 3514875 2112299 1052666 378813 -732404 -2337267 -3361238 -2990165 -1910669
34398 -1910669 -1813745 -3594574 -6145838 -7270600 -5968738 -3380557 -1107260 702373
34390 702373 2701658 4431823 4606605 3314195 2300413 2534365 3009124 2806333 2828423
34381 2828423 4079329 5439360 5042377 3282738 2430901 3236703 3875691 2888793 1484975
34372 1484975 1781722 3884268 6030870 7004901 7049657 6588764 5414380 3581562 2150270
34363 2150270 2236137 3627920 4966244 5250580 4700583 4088426 3771266 3767508 4365000 5864558
34353 5864558 7640957 8260737 7058024 5044129 3592712 2728522 1684454 791116 1370022
34344 1370022 3495502 5345882 5597036 5171284 5404880 5630704 4340514 2064137 947907
34335 947907 1472766 1777759 827094 130525 1145122 2840088 3524537 3596619 4368214
34326 4368214 5152318 3957004 814277 -1933515 -2921236 -3152024 -3460741 -2687204 304913
34317 304913 4241664 6584980 6344823 4641410 3058652 2386910 2512762 2729511 2484982
34308 2484982 2254898 3039206 4626364 5413611 4679713 3873608 4481715 5624956 5319013
34299 5319013 3510468 2176364 2569850 3943473 5149612 6064560 6944146 7460042 7030234
34290 7030234 5568335 3589208 1949717 1442940 2127971 3204241 4099441 5302010 7301759
34281 7301759 9184467 9522878 8455921 7467436 7054866 6170638 4367751 2910526 2902187
34272 2902187 3618105 3767514 3353339 3054285 2587239 1151008 -815710 -1696389 -656227
34263 -656227 1440143 3273701 4443900 5315166 6121912 6652363 6559224 5740321 4549782
34254 4549782 3670169 3513390 3645582 3069192 1299564 -956067 -2407768 -2435958 -1519547
34245 -1519547 -419476 665748 1817843 2642020 2507332 1580263 885089 1021718 1463600
34236 1463600 1555004 1557489 2088070 3063222 3909972 4360791 4313214 3439191 1867856 779943
34226 779943 1161523 2210148 2196093 858215 -251390 115138 1594750 3156408 4176910
34217 4176910 4335470 3597471 2673621 2456579 2679206 2197995 900439 93133 502904
34208 502904 1129531 776495 -360559 -1333181 -1635603 -1070485 501730 2452237 3393591
34199 3393591 2746939 1440978 358893 -856161 -2632992 -4257770 -4868952 -4667759 -4119680
34190 -4119680 -2995305 -1281140 97379 689344 1426229 2672586 2731778 270820 -2881412
34181 -2881412 -3763959 -2489609 -1871907 -3031651 -4060313 -3508973 -2644752 -3087202 -4171286
34172 -4171286 -4128404 -2663974 -1067608 -488535 -997603 -1809789 -1930689 -1187218 -791325
34163 -791325 -1961376 -3877027 -4319228 -2736530 -1181813 -1380747 -2296991 -1903592 -337586
34154 -337586 308881 -997904 -2820028 -3047143 -1292877 784450 1223642 -281157 -2110772
34145 -2110772 -2500346 -1402272 -164744 340057 399593 383957 160017 -142686 34908
34136 34908 538171 304973 -961020 -1988853 -1725523 -926040 -814562 -1016168 -272128
34127 -272128 1251808 1919650 891714 -901586 -2298772 -3246157 -4105010 -4556382 -3947149
34118 -3947149 -2293508 -326749 1306194 2473191 3231555 3403269 2678678 1160025 -362899
34109 -362899 -972166 -544597 147757 408082 380071 585285 1021599 1201961 988962 869641
34099 869641 1215053 1601515 1226382 -1754 -1073202 -844933 629297 2035453 2202645
34090 2202645 1298142 403464 191140 375096 264654 -511202 -1665398 -2337823 -1838772
34081 -1838772 -697670 -494034 -1982036 -3815397 -4015862 -2411645 -631567 98861 5956
34072 5956 -301608 -652766 -872801 -749374 -744797 -1587209 -2893186 -3491202 -3417399 -4026285
34062 -4026285 -5532397 -6187296 -4949501 -3298039 -2937851 -3196917 -2525582 -1351529 -1230086
34053 -1230086 -1884567 -1505179 106888 1018024 251839 -594510 281347 2371035 3729835
34044 3729835 3418281 2210910 1515554 2215952 4046181 5627135 5586080 3971795 2118264
34035 2118264 976529 234651 -704688 -1654377 -2037213 -1817310 -1536040 -1680733 -2279053
34026 -2279053 -2874645 -2828362 -1993935 -1092709 -929561 -1209235 -729872 1074166 3318938
34017 3318938 4614617 4362238 2920464 960882 -1012803 -2723881 -3882315 -3877422 -2045408
34008 -2045408 1326257 4590304 6065863 5694084 4706660 3818024 2663900 1027102 -500119
33999 -500119 -1457027 -2128679 -2640143 -2304586 -688774 1262131 2087697 1589646 987662
33990 987662 1328909 2365209 3137903 3192991 2883437 2636235 2310230 1511362 364414
33981 364414 -479231 -680915 -548462 -310464 261993 1005466 950949 -241234 -1079807 75581
33971 75581 2338082 2963664 1027398 -1182272 -1231651 426865 1686775 1915691 2216358
33962 2216358 3031691 3208969 1815374 -274586 -1302487 -652642 575488 898727 44572
33953 44572 -888983 -831047 -74879 122097 -769971 -1810979 -1828317 -952659 -443791 -1200880
33943 -1200880 -2906297 -4577521 -5507771 -5485178 -4395151 -2114214 918836 3355415 3933862
33934 3933862 3064782 2636995 3611939 4556788 3622364 1416378 406367 1522330 2997171
33925 2997171 3063613 2256242 2058314 2467419 2225564 860743 -708434 -1424368 -1131605
33916 -1131605 -501418 -440257 -1324467 -2468271 -2784959 -2247885 -1974741 -2471636 -2769311
33907 -2769311 -2022758 -959888 -685454 -907771 -632374 47931 265968 -7035 -173059
33898 -173059 -496591 -1691971 -3070827 -2939902 -1282620 -334606 -1639031 -3921604 -4955331
33889 -4955331 -4429117 -3723150 -3606773 -3533373 -2934971 -1994304 -1074122 -319325 13101 -365087
33879 -365087 -1040163 -867383 827661 3284218 4937434 4933406 3775539 2563445 1900710
33870 1900710 1619330 1314024 901041 688125 1049633 2031265 3194793 3929381 4025575
33861 4025575 3810629 3566562 3067112 2050319 922334 400425 470488 338245 -412487
33852 -412487 -1197888 -1234663 -457487 623526 1475672 1693782 1162651 402507 199036 565446
33842 565446 708989 372899 360126 1107669 1641324 931533 -391358 -852239 -261287 196260
33832 196260 -131335 -542809 -193947 862727 2066361 2961980 3209732 2691319 1831352
33823 1831352 1228242 828141 46921 -1160579 -1934433 -1417576 366664 2614203 4366908
33814 4366908 5114449 5174372 5348126 5821896 5718613 4289304 2212182 1013138 1452919
33805 1452919 3142917 5327542 7142369 7523817 6134501 4382050 4361624 6540609 9287747
33796 9287747 10680000 9943114 7385570 4184248 2215715 2666017 4455165 5250240 4377098
33787 4377098 3511916 4119591 5524228 6106182 5207503 3203115 852319 -675618 -241770
33778 -241770 1918836 4151845 5331554 5861621 6133120 5341529 2965990 306495 -858305
33769 -858305 -480145 120562 248470 243965 318656 172923 -365377 -1170268 -2073902 -2687516
33759 -2687516 -2474094 -1691855 -1604586 -2865551 -4327773 -4475525 -3467381 -2648817 -2529525
33750 -2529525 -2461697 -1993797 -1287746 -315943 1188387 2951084 4308112 5173111 6014152
33741 6014152 6888509 7294451 6968120 6162542 5249321 4610032 4582026 4849325 4381234 2838721
33731 2838721 1530770 1911468 3528179 4608461 4373845 3584531 3068569 3025334 3654806
33722 3654806 5109005 6746174 7661705 8011826 8592882 9127075 8407070 6361712 4531451
33713 4531451 4042789 4401487 4771620 5129413 5463642 5060292 3559590 1936916 1545133
33704 1545133 2607518 4172496 5141349 5094630 4636185 4979784 6471509 7599908 6555735
33695 6555735 3851830 2084061 2712511 4368860 4916124 3954981 2609416 1995178 2651657
33686 2651657 4378668 5871016 5671332 4327859 4364964 7061298 10480667 11969815 11458528
33677 11458528 10767528 10660345 10431211 9827822 9464647 9468690 9422712 9684032 11142359 13428314
33667 13428314 14837042 14455566 13134880 11964564 11038902 10307253 10431993 11837735 13658867
33658 13658867 14648838 14884590 15826604 18682724 23100916 27487867 30431812 31818659
33650 31818659 32605965 33591972 34727554 35771450 37038977 38872639 40758914 41846602
33642 41846602 42251417 42945848 44229070 45181092 44974908 43984560 43126186 42702172 42434324
33633 42434324 42170772 41950740 41642389 41084980 40448762 39947893 39267290 37775645 35367588
33624 35367588 32677891 30360706 28574448 27353134 26961429 27355695 27615237 26684115 24747186
33615 24747186 23145559 22664709 22653214 22312054 22010796 22379227 22708453 21565657 18863080
33606 18863080 16030621 14021216 12427144 10874657 9928943 9955670 10278668 10280873 10268504
33597 10268504 10368643 9713173 7916115 6392582 6753689 8499764 9715576 9579623 8755411
33588 8755411 7701250 6222399 4648911 3906227 4187298 4806323 5483835 6481994 7345127
33579 7345127 6977334 5401375 4124038 4223070 5248153 6480027 7931758 9368787 9647152
33570 9647152 8110579 5730458 3857331 2651699 1729315 1492277 2539349 4307076
33562 4307076 5638234 6463938 7650331 9191012 9820199 8803365 7118613 6212020 6164310
33553 6164310 5803107 4445807 2880406 2391895 3180139 4195248 4498303 4218089 3855872
33544 3855872 3245275 1982557 601170 306044 1386611 2763012 3407250 3416435 3288385
33535 3288385 2948542 2124033 1089869 377070 102946 61659 60381 -245830 -1296270 -2840957
33525 -2840957 -3724772 -3115040 -1576245 -320405 250076 658438 1421603 2714019 4639290
33516 4639290 7006093 8879628 9050608 7131700 3960396 1062119 -146808 780359
33508 780359 2644985 3220994 1352005 -1677944 -3475075 -3116691 -1853308 -1388199 -2087187
33499 -2087187 -2960334 -3007345 -2441743 -2545380 -4022103 -5626136 -5257455 -2642662 113020
33490 113020 1196576 1163569 1476606 2234918 2756313 3309526 4373979 4885739 3413742
33481 3413742 860940 -296355 309806 299489 -1767632 -4272114 -5194586 -4911767 -4860317
33472 -4860317 -5045690 -4625230 -3783325 -3230743 -2646356 -1321021 232547 938958 990979
33463 990979 1436267 2241339 2353790 1556798 703559 96409 -809042 -1880608 -2023337
33454 -2023337 -900579 357260 741590 560240 489173 504819 440118 655498 1364646 2002150
33444 2002150 1979048 1484502 963862 452252 5525 57004 624152 866845 286412 -290815
33434 -290815 49817 629883 -6743 -1784773 -2899243 -2129617 -258998 1215773 1849140
33425 1849140 2104476 2158792 1723933 907700 554124 1426541 3186721 4404285 3828235
33416 3828235 1789075 114314 347157 2187686 3997984 4595814 4032874 2825691 1266603
33407 1266603 -288538 -1173169 -949586 120463 1411975 2427793 2827863 2470939 1679473
33398 1679473 962455 209882 -1207713 -3114647 -4050172 -2932649 -728649 499330 11555
33389 11555 -1085975 -1670331 -1896997 -2397577 -3155357 -3797163 -4369853 -5116798 -5803843 -5920716
33379 -5920716 -5463972 -4992322 -4825222 -4535317 -3416370 -1364988 790951 1898206 1491975
33370 1491975 190709 -980842 -1525859 -1574471 -1339463 -999424 -1056936 -2096356 -3838862
33361 -3838862 -4960563 -4386547 -2549675 -935826 -510256 -938045 -1201744 -574693 954822
33352 954822 2774843 4021013 4132675 3236146 1935198 733769 -221889 -890269 -1087293
33343 -1087293 -650085 260737 1244535 2135794 3235643 4819038 6436044 7066316 6167960
33334 6167960 4286313 2383825 917211 -67352 -399177 -63776 239127 -325506 -1629880
33325 -1629880 -2883922 -3951326 -5275489 -6383809 -5875519 -3590527 -1519642 -1432136 -2511117
33316 -2511117 -2616929 -1242587 169772 452756 -198416 -1238353 -2429021 -3306488 -3276906
33307 -3276906 -2593813 -2139177 -1891794 -753005 1600514 3814415 4571176 4297548 4253159
33298 4253159 4583667 4288820 2810366 745066 -1000094 -2137669 -3020781 -4076215 -5213019
33289 -5213019 -5685368 -4776761 -2716238 -522808 1194286 2739361 4384113 5567390
33281 5567390 5551987 4401096 2779944 1204318 -18841 -590309 -599314 -717902 -1345346
33272 -1345346 -1891732 -1612105 -843229 -621649 -1281194 -2242915 -3038610 -3641186 -3828406
33263 -3828406 -3239488 -2289395 -2088747 -3027920 -4191193 -4617627 -4413622 -4060029 -3341301
33254 -3341301 -1831988 -67104 697930 -93538 -1771468 -3351646 -4352765 -4588681 -3818178
33245 -3818178 -2078214 -64279 1311191 1760487 1752359 1738075 1464598 316688 -1598098
33236 -1598098 -2978987 -2409188 -60713 2113359 2374390 1151920 355696 819331 1378484
33227 1378484 885258 109408 545829 1901367 2251695 831269 -744272 -705477 548840
33218 548840 1335369 1057821 472218 57668 -490793 -1117294 -1023348 110670 1369562
33209 1369562 1569005 463844 -1260092 -2608343 -2639510 -906984 1930080 4329035 5131025
33200 5131025 4409364 2954581 1393238 48512 -840498 -1176190 -1034790 -471306 391862
33191 391862 1053560 937989 130298 -732661 -1369595 -1961471 -2276816 -1631350 -68280
33182 -68280 1339248 1836915 1743840 1378771 341470 -1332964 -2409313 -2015746 -1155506
33173 -1155506 -1394245 -2658543 -3624344 -3763343 -3612221 -3391527 -2851541 -2346441 -2593005
33164 -2593005 -3306240 -3409651 -2682549 -1901267 -1306645 -391868 612079 658419 -226881
33155 -226881 -568997 279448 970157 286747 -899687 -1121297 -715584 -1168475 -2606141
33146 -2606141 -3527990 -3055722 -2183818 -2398404 -3759345 -4732884 -3710335 -686157 2418586
33137 2418586 3331223 1574052 -1162727 -2862656 -2938635 -2073077 -1138836 -795966 -1403334
33128 -1403334 -2481932 -2689974 -1193265 1097070 2336064 1693937 -29640 -1531121
33120 -1531121 -2144605 -2011084 -1759046 -2061450 -3037317 -4021682 -4222046 -3562812 -2650193
33111 -2650193 -2066944 -1969826 -2159418 -2205614 -1698620 -742171 -61320 -277153 -1131598 -1667911
33101 -1667911 -1169093 114192 1074065 773943 -293095 -323244 1655908 4029802 4187095
33092 4187095 1937254 -132963 -216389 449956 -19403 -1040497 -605923 1496980 3450367
33083 3450367 3959933 3236928 1681871 -508100 -2336131 -2506169 -1401394 -925800 -1785408
33074 -1785408 -2476006 -1712957 -340007 222225 95596 215897 521640 364797 126220
33065 126220 899549 2672728 4078236 4127970 3304626 2739561 3008966 3954951 5131400
33056 5131400 6118965 6674448 6778733 6504983 5918175 5167785 4441624 3686631 2697470
33047 2697470 1681384 1280493 1629212 1844539 1102334 -74792 -451652 -22314 -394070
33038 -394070 -2711469 -5814425 -7302232 -6332567 -4551150 -3937727 -4437264 -4464925 -3351454
33029 -3351454 -2155638 -1839828 -1777161 -886632 538823 1279602 1108055 1037744 1623799
33020 1623799 2172144 1997236 1495415 1396738 1645227 1637172 1134979 429102 -145442 -534419
33010 -534419 -1019788 -2011533 -3417021 -4317568 -3942116 -2923220 -2652423 -3213862 -3042112
33001 -3042112 -1105077 1626139 3553077 4281414 4234036 3437088 1861510 256663 -622105
32992 -622105 -1163971 -2109906 -3053820 -3013478 -2158126 -1554703 -1336477 -628244 603185 1180827
32982 1180827 639563 102454 571120 1575639 2299735 2861079 3455062 3282103 1678277
32973 1678277 -342439 -1113707 -585365 -143365 -214013 369431 2089368 3291142 2194371
32964 2194371 -479044 -2304752 -2337551 -2041844 -2742568 -3550688 -2811915 -665673 1218785
32955 1218785 2032586 2396565 2478510 1281583 -1314972 -3189110 -2103503 1420437 4660532
32946 4660532 5761466 5020274 3458386 1684145 391325 526784 2220673 4400172
32938 4400172 5988021 6712087 6365598 4355150 817423 -2649900 -4438274 -4696921 -4733089
32929 -4733089 -4988095 -4665226 -3359896 -2017612 -1794419 -2543762 -3004110 -2340133 -1069856
32920 -1069856 -340150 -521634 -854972 -533094 274754 811293 786570 494770 163359 -23322
32910 -23322 617113 2736261 5638121 7485724 7294679 5863251 4291733 2680787 1055436
32901 1055436 367661 1223969 2405981 2224372 977185 512276 1466155 2528770 2640171
32892 2640171 2360371 2520187 2856365 2738785 2193344 1448267 403592 -666101 -771656
32883 -771656 496663 2004133 2297517 1255034 -264078 -1735067 -2946584 -3287391 -2321630
32874 -2321630 -833535 -106573 -206865 -66039 722032 1318588 1054239 365989 -52841
32865 -52841 -135233 -51582 239940 573389 449690 -133731 -397924 93750 650700 468553
32855 468553 -105691 -125586 447727 615937 -276371 -1607481 -2039759 -793794 1541225
32846 1541225 3376643 3660965 3166977 3627618 5328994 6492854 5762793 4323449 4271959
$$ [...]
##END NTUPLES=NMR SPECTRUM
##END=
