##TITLE=31Pdec_DE_63EA
 D2O, 64 sc
 1.8.2024
##JCAMPDX= 6.0         $$ Bruker NMR JCAMP-DX V2.0
##DATA TYPE= NMR SPECTRUM
##DATA CLASS= NTUPLES
##ORIGIN= UXNMR, Bruker Analytische Messtechnik GmbH
##OWNER= root
$$ XWIN-NMR		Version 3.5
$$ Thu Aug  1 14:11:30 2024 Russian Standard Time (UT+4h)  she@DPX200
##.OBSERVE FREQUENCY= 81.013821
##.OBSERVE NUCLEUS= ^31P
##.ACQUISITION MODE= SIMULTANEOUS
##.ACQUISITION SCHEME= undefined
##.AVERAGES= 64
##.DIGITISER RES= 17
##SPECTROMETER/DATA SYSTEM= spect
##.PULSE SEQUENCE= zgpg30
##.SOLVENT NAME= D2O
##.SHIFT REFERENCE= (INTERNAL, D2O, 0, 198.062)
##AUDIT TRAIL= $$ (NUMBER, WHEN, WHO, WHERE, WHAT)
$$ ##TITLE= Audit trail, XWIN-NMR		Version 3.5
$$ ##JCAMPDX= 5.01
$$ ##ORIGIN= Bruker BioSpin GmbH
$$ ##OWNER= she
$$ F:/spectra/data/she/nmr/P31/2/pdata/1/auditp.txt
$$ ##AUDIT TRAIL=  $$ (NUMBER, WHEN, WHO, WHERE, WHAT)
(   1,<2024-08-01 14:08:56.70 +0400>,<she>,<DPX200>,
      <created by zg, POWCHK disabled, PULCHK disabled
       configuration hash MD5:
       00 E9 B6 7A A2 85 ED C7 34 08 36 98 17 FE 4E 26
       data hash MD5: 32K
       C0 B8 A9 5F E2 51 45 4A E7 22 64 DD D7 39 77 6B>)
(   2,<2024-08-01 14:10:32.54 +0400>,<she>,<DPX200>,
      <Start of raw data processing
       efp BC_mod = 2 LB = 1.5 FT_mod = 6 PKNL = 1 PHC0 = 2721.219 PHC1 = -29.51311 SI = 64K 
       data hash MD5: 64K
       EC E1 C9 06 80 C8 54 A2 4E 53 F2 85 C4 1C C7 5C>)
(   3,<2024-08-01 14:10:58.43 +0400>,<she>,<DPX200>,
      <pk PHC0 = -58.46824 PHC1 = 130.8 
       data hash MD5: 64K
       FC F0 1F 12 2C 5C 6A F2 91 27 FB 71 66 3D 65 A0>)
(   4,<2024-08-01 14:11:05.89 +0400>,<she>,<DPX200>,
      <abs ABSG = 5 
       data hash MD5: 64K
       05 09 E7 94 3E 9B 17 1F CE 0F 74 08 DC 63 61 F3>)
$$ ##END=
$$ 
$$ hash MD5
$$ B7 6C 36 6B 83 D8 1F D1 62 4F 9C 5B 7E BF 8A 59
##$RELAX= 
##$RELAX= 
##$RELAX= 
##$RELAX= 
##$RELAX= 
##$RELAX= 
##$RELAX= 
##$RELAX= 
$$ Bruker specific parameters
$$ --------------------------
##$DU= <F:/spectra>
##$EXPNO= 2
##$NAME= <P31>
##$PROCNO= 1
##$TYPE= <nmr>
##$USER= <she>
##$AMP= (0..31)
100 100 100 100 100 100 100 100 100 100 100 100 100 100 100 100 100 100 
100 100 100 100 100 100 100 100 100 100 100 100 100 100 
##$AQSEQ= 0
##$AQ_mod= 1
##$AUNM= <au_zg>
##$AUTOPOS= <>
##$BF1= 81.014009
##$BF2= 200.13
##$BF3= 200.13
##$BF4= 200.13
##$BF5= 200.13
##$BF6= 200.13
##$BF7= 200.13
##$BF8= 200.13
##$BYTORDA= 1
##$CFDGTYP= 0
##$CFRGTYP= 5
##$CHEMSTR= <none>
##$CNST= (0..31)
1 1 145 1 1 1 1 1 1 1 1 1 1 1 1 1 1 1 1 1 1 1 1 1 1 1 1 1 1 1 1 1 
##$CPDPRG= <waltz16>
##$CPDPRG1= <>
##$CPDPRG2= <waltz16>
##$CPDPRG3= <>
##$CPDPRG4= <mlev>
##$CPDPRG5= <mlev>
##$CPDPRG6= <mlev>
##$CPDPRG7= <mlev>
##$CPDPRG8= <mlev>
##$CPDPRGB= <>
##$CPDPRGT= <>
##$D= (0..31)
0 1 0 0 0 0 0 0 0 0.06 0 0.03 2e-05 3e-06 0 0 0.0002 0 0 0 0 0 0 0 0 0 
0 0 0 0 0 0 
##$DATE= 1722506936
##$DBL= (0..7)
120 120 120 11 120 120 24 19 
##$DBP= (0..7)
150 150 150 150 150 150 150 150 
##$DBP07= 0
##$DBPNAM0= <>
##$DBPNAM1= <>
##$DBPNAM2= <>
$$ [...]
##$SUBNAM3= <"">
##$SUBNAM4= <"">
##$SUBNAM5= <"">
##$SUBNAM6= <"">
##$SUBNAM7= <"">
##$SUBNAM8= <"">
##$SUBNAM9= <"">
##$SW= 400.765351723535
##$SWIBOX= (0..15)
0 1 3 0 0 0 0 0 0 0 0 0 0 0 0 0 
##$SW_h= 32467.5324675325
##$TD= 32768
##$TD0= 1
##$TE= 0
##$TE2= 300
##$TE3= 300
##$TEG= 300
##$TL= (0..7)
0 120 53 12 22 120 120 120 
##$TP= (0..7)
150 150 150 150 150 150 150 150 
##$TP07= 0
##$TPNAME0= <>
##$TPNAME1= <>
##$TPNAME2= <>
##$TPNAME3= <>
##$TPNAME4= <>
##$TPNAME5= <>
##$TPNAME6= <>
##$TPNAME7= <>
##$TPOAL= (0..7)
0.5 0.5 0.5 0.5 0.5 0.5 0.5 0.5 
##$TPOFFS= (0..7)
0 0 0 0 0 0 0 0 
##$TUNHIN= 0
##$TUNHOUT= 0
##$TUNXOUT= 0
##$USERA1= <user>
##$USERA2= <user>
##$USERA3= <user>
##$USERA4= <user>
##$USERA5= <user>
##$V9= 5
##$VALIST= <valist>
##$VCLIST= <CCCCCCCCCCCCCCC>
##$VD= 0
##$VDLIST= <DDDDDDDDDDDDDDD>
##$VPLIST= <PPPPPPPPPPPPPPP>
##$VTLIST= <TTTTTTTTTTTTTTT>
##$WBST= 1024
##$WBSW= 4
##$XGAIN= (0..3)
0 0 0 0 
##$XL= 0
##$YL= 0
##$YMAX_a= 21743
##$YMIN_a= -19144
##$ZGOPTNS= <>
##$ZL1= 120
##$ZL2= 120
##$ZL3= 120
##$ZL4= 120
##$ABSF1= 198.0616
##$ABSF2= -202.7028
##$ABSG= 5
##$ABSL= 3
##$ALPHA= 0
##$AQORDER= 0
##$ASSFAC= 0
##$ASSFACI= 0
##$ASSFACX= 0
##$ASSWID= 0
##$AUNMP= <proc_1d>
##$AZFE= 0.1
##$AZFW= 0.5
##$BCFW= 0
##$BC_mod= 2
##$BYTORDP= 0
##$COROFFS= 0
##$CY= -3
##$DATMOD= 1
##$DC= 0
##$DFILT= <>
##$DTYPP= 0
##$F1P= 0
##$F2P= 0
##$FCOR= 1
##$FTSIZE= 65536
##$FT_mod= 6
##$GAMMA= 0
##$GB= 0
##$INTBC= 1
##$INTSCL= 9.790993e-09
##$ISEN= 30
##$LB= 1.5
##$LEV0= 0
##$LPBIN= 0
##$MAXI= 10000
##$MC2= 0
##$MEAN= 0
##$ME_mod= 0
##$MI= 50
##$NCOEF= 0
##$NC_proc= -6
##$NLEV= 6
##$NOISF1= 182.463
##$NOISF2= 159.3651
##$NSP= 0
##$NTH_PI= 0
##$NZP= 0
##$OFFSET= 198.0616
##$PC= 4
##$PHC0= 2662.751
##$PHC1= 101.2869
##$PH_mod= 1
##$PKNL= yes
##$PPARMOD= 0
##$PSCAL= 0
##$PSIGN= 0
##$REVERSE= no
##$SF= 81.0140089999434
##$SI= 65536
##$SIGF1= 159.3651
##$SIGF2= -187.1042
##$SINO= 113.3802
##$SIOLD= 16384
##$SREGLST= <1H.CDCl3>
##$SSB= 0
##$STSI= 65536
##$STSR= 0
##$SW_p= 32467.5324675325
##$SYMM= 0
##$S_DEV= 0
##$TDeff= 32768
##$TDoff= 0
##$TI= <>
##$TILT= no
##$TM1= 0
##$TM2= 0
##$TOPLEV= 0
##$USERP1= <user>
##$USERP2= <user>
##$USERP3= <user>
##$USERP4= <user>
##$USERP5= <user>
##$WDW= 1
##$XDIM= 65536
##$YMAX_p= 396374222
##$YMIN_p= -11220002
$$ End of Bruker specific parameters
$$ ---------------------------------
##NTUPLES= NMR SPECTRUM
##VAR_NAME=  FREQUENCY,     SPECTRUM/REAL,   SPECTRUM/IMAG
##SYMBOL=    X,             R,               I
##VAR_TYPE=  INDEPENDENT,   DEPENDENT,       DEPENDENT
##VAR_FORM=  AFFN,          ASDF,            ASDF
##VAR_DIM=   65536,         65536,           65536
##UNITS=     HZ,            ARBITRARY UNITS, ARBITRARY UNITS
##FACTOR=    0.49542278885378, 1,            1
##FIRST=     16045.7642231865, 0,            0
##LAST=      -16421.768244346, 0,            0
##MIN=       -16421.768244346, -11220002,    0
##MAX=       16045.7642231865, 396374222,    0
$$ Real data points
##PAGE= N=1
##DATA TABLE= (X++(R..R)), XYDATA
$$ [...]
39786B684072M15094O82402L84250J79482J03208l49615r17880o63677M50125
39777B967461J233555Q97575N8264l17526j47123R1223K34823M01965N22034M33290
39767F375541K16212O9244K0094k1087q1153j14267k6835K72494O58818P71345
39757H140406N13221L56273O91167J091390Q42045P0810l67974j28058K61052
39748A1470332L53492L57396N50726Q34741J108469J425990J571318J200393O53223
39739A9526080Q10179J751595K383213J940773J115918J030608J754217K581615
39731C2894198L220301L857696M420667M600993M441705M229681L961841L479432
39723F5106514K916340K448633J821382P00750p08428j958343l043736m187120
$$ plain form
39786 2684072 3099166 3781568 4165818 4345300 4448508 4098893 3181013 2517336 2967461
39777 2967461 4201016 5098591 5156855 4839329 4692206 4783429 5018252 5420217 5942251 6375541
39767 6375541 6591753 6660997 6681091 6660004 6578851 6464584 6437749 6710243 7369061 8140406
39757 8140406 8653627 9009900 9701067 10792457 11634502 11705312 11337338 11209280 11470332
39748 11470332 11823824 12181220 12731946 13566687 14675156 16101146 17672464 18872857 19526080
39739 19526080 20336259 22087854 24471067 26411840 27527758 28558366 30312583 32894198
39731 32894198 36114499 39972195 44392862 48993855 53435560 57665241 61627082 65106514
39723 65106514 68022854 70471487 72292869 72993619 72285191 70326848 67283112 63095992
39715F3095992n139500n354317m775495l877458l005409k205315j577583j227455
39707C5933460r59633n66501k95120m63599p72325o49728j74904N2348o8958J4037
39697C2049077N67841J176471J454272J557243J803209K285430K976616L729409
39689D7599568M136091L938550L599512L838599M544791M834602M294801L424996
39681H0211510K668442J804065O08033o75255j941193l531217n390280o629661
39673F7124444o596842n807317n138304m650459l979911l371032l317214l450916
39665C0812449k890123j743190j237135j994183l019460k975776j900003r76056
39657A4076523q85391j097010q45041k06452J40656r9518n56920q23964r11477
$$ plain form
39715 63095992 57956492 52602175 47826680 43949222 40943813 38738498 37160915 35933460
39707 35933460 34973827 34407326 34112206 33648607 32876282 32226554 32051650 32103998 32035040 32049077
39697 32049077 32616918 33793389 35247661 36804904 38608113 40893543 43870159 47599568
39689 47599568 51735659 55674209 59273721 63112320 67657111 72491713 76786514 80211510
39681 80211510 82879952 84684017 85292050 84616795 82675602 79144385 73754105 67124444
39673 67124444 60527602 54720285 49581981 44931522 40951611 37580579 34263365 30812449
39665 30812449 27922326 26179136 24942001 22947818 19928358 16952582 15052579 14076523
39657 14076523 13191132 12094122 11249081 11042629 11183285 11083767 10526847 9702883 8791406
39648H791406r43595q08775m34191j18328j71847l89647l27919k5777L2689l03509
39638E300507n91703m35610J9020L75674M35279K41569K03J1398L27928M69705
39628F153970o5401r71031j358410r19650k70295L1846J26831K26629R9596l14136
39618B739949m42236R4052P01265N85314p0791m39083k94908j85606m74202q95755
39608A317999j039870p19104P2985J026345J439236Q96474n21k14631L50883O90670
39598C820466J06142q07295r56317j65479O32380N32718l14632r22030o32822
39589A293131J11461L72188l9475l69716p6007L96887L85116M8824L2235L80241
39579B534885M81396J2265o64873j074213j103460q60160m68073q3322J70208
$$ plain form
39648 8791406 7847811 7039036 6604845 6486517 6314670 5925023 5597104 5571327 5604016 5300507
39638 5300507 4708804 4273194 4292214 4667888 5103167 5344736 5344939 5356337 5684265 6153970
39628 6153970 6088569 5117538 3759128 2839478 2569183 2601029 2727860 2954489 3054085 2739949
39618 2739949 2297713 2391765 3093030 3678344 3607553 3168470 2873562 2687956 2213754 1317999
39608 1317999 278129 -440975 -367990 658355 2097591 2994065 2993544 2778913 3129796 3820466
39598 3820466 3926608 3119313 2162996 1997517 2629897 3162615 2847983 1925953 1293131
39589 1293131 1404592 1776780 1737305 1367589 1291582 1688469 2073585 2122409 2154644 2534885
39579 2534885 3016281 3028546 2363673 1289460 186000 -674160 -1142233 -1225555 -1055347
39570a055347K88630K42692o6742m84350n48314j00705M05911O06202P68973J119329
39560A176279J170987N31178j17628J21081Q14264O96333l64057j136475r32837
39551A959125n04653o27557r27960p52986k75447O301J58566M68672P40469O01194
39541H45724J35960k96135n34384n45433l09442p7238k14855n06069k67277M87402
39531a281747P79822J08603o28075l86082N16574R85602P06018K19361j38335
39522H81741m45273n94951l71842p903P4307n9270r1761j41880m72157p27813
39512a956802l06699N95686J125539R50083N42563K87876P1096j84920l25460
39503G98962m13699o54567p66245k03655P98077J208896N88829k30223l15398
$$ plain form
39570 -1055347 -766717 -524025 -590767 -1075117 -1623431 -1724136 -1318225 -712023 56950 1176279
39560 1176279 2347266 2878444 2760816 2881897 3696161 4392494 4028437 2891962 1959125
39551 1959125 1454472 826915 -101045 -854031 -1129478 -1123177 -964611 -495939 244530 845724
39541 845724 981684 685549 151165 -394268 -703710 -780948 -995803 -1501872 -1769149 -1281747
39531 -1281747 -501925 -393322 -1021397 -1407479 -890905 94697 800715 1020076 881741
39522 881741 436468 -158483 -530325 -538228 -463921 -523191 -614952 -756832 -1228989 -1956802
39512 -1956802 -2263501 -1667815 -542276 407807 950370 1238246 1309342 1124422 798962
39503 798962 385263 -269304 -1035549 -1239204 -441127 767769 1356598 1126375 810977
39494H10977J19679K09987k41776n66848k14046N32805Q65088L12801o84932j123225
39484B0510n57020K33743J40832p50904j170865l83672P70256J021107L19387
39475c56626l17709k97151k9071k8606j51966j7296K97820M13026K74261J90791
39465b2527K79244K76630L0771j80805r3502N3961j40275n71287p60991o06538
39455a735319m72709m82976k93416K28400O61366O74649M98907M13495K99735
39446b07868J09088J87646N99103P13476J34688n31957o23267n45133r54627j327949
39436b446800o36384P66093J342555N83460l27525l99922r7593j41021k43780
39427a600917J02514M92104K27868m78287p90578l97583K72978O82465N39426
$$ plain form
39494 810977 930656 1140643 898867 332019 117973 650778 1515866 1828667 1143735 20510
39484 20510 -536510 -302767 -161935 -912839 -2083704 -2467376 -1697120 -676013 -356626
39475 -356626 -674335 -971486 -1000557 -1029163 -1181129 -1198425 -900605 -487579 -213318 -22527
39465 -22527 256717 533347 564118 383313 289811 343772 203497 -367790 -1128781 -1735319
39455 -1735319 -2208028 -2691004 -2984420 -2756020 -2094654 -1420005 -921098 -507603 -207868
39446 -207868 -98780 88866 687969 1401445 1536133 1004176 380909 -164224 -1118851 -2446800
39436 -2446800 -3083184 -2317091 -974536 -391076 -718601 -1118523 -1216116 -1357137 -1600917
39427 -1600917 -1498403 -1006299 -778431 -1256718 -2047296 -2444879 -2171901 -1489436 -950010
39418i50010q6988n83856k03819Q87083J514840R75963L1416k06104J99635L68152
39408A946312R260m15529o33207p68781p56188l61751K24704N07552L85630J66613
39398C04615j7412k18690k33668J83085P27816Q15736M12599p955k74653o22847
39388A068626j008232j015029n28362J21172P22116J245508J343660N85034o50732
39379A883761j325125j086970o98176p39717p08560j8188Q09931Q20183R9976
39370i62885l14230P8467O43841O19612P9113l79129m31534j62780K91929Q01562
39360B63966J024179N78615l97517j147299j048011l46345J69694J78560J14648
39351f09510L86793P58518P60563L52602j45936m72863m54759Q205N84155N49123
$$ plain form
39418 -950010 -1036998 -1620854 -1824673 -937590 577250 1553213 1584629 1378525 1578160 1946312
39408 1946312 1955572 1540043 906836 138055 -618133 -979884 -755180 -247628 138002 304615
39398 304615 287203 68513 -165155 17930 745746 1561482 1974081 1966126 1691473 1068626
39388 1068626 60394 -954635 -1482997 -1361825 -639709 605799 1949459 2534493 1883761
39379 1883761 558636 -528334 -1226510 -1966227 -2674787 -2692975 -1883044 -1062861 -962885
39370 -962885 -1277115 -1198648 -554807 64805 143918 -235211 -666745 -829525 -537596 263966
39360 263966 1288145 1866760 1469243 321944 -726067 -1072412 -902718 -724158 -609510
39351 -609510 -222717 535801 1296364 1648966 1503030 1030167 575408 583613 1167768 1716891
39341A716891k58285r15659n68290K37090K85015m35610o96825M3626Q47982Q23626
39331A079561L56014J79416J70584q7803l05482l1416L26311M4716o76365r98380
39321E7156p47744m63240k86688J37540O33721M80520k99859o89484k02063K78064
39311a102077j34864r17931r70958k86608K06996J71419J80330N20441O64891
39302a668361K41854k65067k43837J87387N27900O48019O75994M98339j6371n00779
39292H5078m33186N1115L04649J74421K27513P51026J134439O91041l15736r68439
39282A701921p83037n5401O73624J007883O85797k45042j176432j344056o53870
39273a88613K18493O37572N65651K51628j60660m88273m28078m965K20156j65731
$$ plain form
39341 1716891 1458606 542947 -25343 211747 496762 61152 -635673 -592047 255935 1079561
39331 1079561 1435575 1614991 1785575 1697772 1392290 1360874 1687185 1731901 1055536 57156
39321 57156 -690588 -1153828 -1440516 -1302976 -669255 -188735 -488594 -1178078 -1380141 -1102077
39311 -1102077 -1236941 -2154872 -3125830 -3412438 -3205442 -3034023 -2853693 -2333252 -1668361
39302 -1668361 -1426507 -1691574 -1935411 -1748024 -1220124 -572105 103889 602228 585857 85078
39292 85078 -348108 -296993 7656 182077 409590 1160616 2295055 2986096 2670360 1701921
39282 1701921 918884 863483 1537107 2544990 3230787 2985745 1809313 465257 -188613
39273 -188613 29880 667452 1233103 1484731 1324071 835798 407720 402755 622911 457180
39263D57180p36269o89994O2410P30358O27180m9670n63546m94111p6569J56951
39253e76080o0597m55978m76955P3350P19824Q42892M78110K49953M34775N16842
39243A746136j5360p76827q98503k22394M49281M03467j32592m21798j68625K58196
39233B20981L66091L9084m02091m85502o9302L82846K77529k46532l67255K27802
39223e6349P28375L38568m54291n83222p1813O3086m31970n88421J02616P00278
39213b53143K68210n95930o81903K093M17454J86306o938L36659Q54483J041458
39203A568749Q72580N23307J01051j76497p6558K42733L78176K50043N1265k59136
39193C475713p75281j068827o15876J80401L20518k60659n00142O9273M58789
$$ plain form
39263 457180 -279089 -969083 -906673 -176315 450865 401195 -162351 -656462 -733031 -576080
39253 -576080 -636677 -1092655 -1569610 -1496260 -776436 66456 544566 794519 1229294 1746136
39243 1746136 1730776 953949 55446 -166948 282333 685800 553208 131410 -37215 220981
39233 220981 587072 626156 224065 -261437 -330739 52107 329636 83104 -284151 -56349
39223 -56349 672026 1010594 556303 -26919 -98732 -35646 -467616 -1056037 -953421 -253143
39213 -253143 15067 -580863 -1262766 -1260673 -843219 -656913 -663851 -327192 527291 1568749
39203 1568749 2441329 2964636 3065687 2889190 2812632 3055365 3433541 3683584 3734849 3475713
39193 3475713 2700432 1631605 1015729 1196130 1516648 1255989 755847 825120 1283909
39184A283909j89425j066917p88827N25531J392469J028467K35304N3426L67436
39175B841373K98932m67190j253519j243611m65764K56998L00432p9300k54511
39166f6160j37944j21473k57345j57331K22656L93388J72135M3491L18687N71553
39156I81657L81438N0863K4782J11390j00156m78054o29415n59292m41019j40575
39146g98381L61734M99519j35516r15047q99831j97539K99769L42780M94261R19091
39136b9160J057433O76204K75911J51761o3055n33097p40104l92904j08429n36203
39126b41643j283311j350485l85357R70826J793220J607913O70017j92391k64007
39117A324782K70759N01862l4867p45222q39824l92416p3612j39699k49285j63354
$$ plain form
39184 1283909 1094484 27567 -761260 -235729 1156740 2185207 2420511 2473937 2841373
39175 2841373 3140305 2673115 1419596 175985 -289779 -32781 267651 188351 -66160
39166 -66160 -204104 -325577 -582922 -740253 -517597 -124209 47926 91417 410104 981657
39156 981657 1363095 1413958 1438740 1550130 1449974 971920 342505 -216787 -657806 -798381
39146 -798381 -436647 62872 -72644 -987691 -1887522 -2085061 -1785292 -1442512 -948251 -29160
39136 -29160 1028273 1704477 1980388 2132149 2069094 1535997 795893 402989 294560 -241643
39126 -241643 -1524954 -2875439 -3260796 -2289970 -496750 1111163 1781180 1588789 1324782
39117 1324782 1595541 2097403 2062536 1317314 477490 85074 11462 -128237 -377522 -540876
39107e40876p4460j65766k63276j12804K30530M63972L83571M5700l71459p34385
39097a139253r09651o64380J21342J045682J301063N43026n14217p84542n8711
39088a059641Q38561J140438R07796N89739L34636P1004j00544k6698J61717K00494
39078C057502R6570P2829J51982R8728j73317l92008k75498M9433J76434m6992
39068B815663l18208l15538j49590j51279l34759l94872j92273J32340N01073
39059A592557Q68420Q33764j9926j167672j333762j89572Q84503N30417o96768
39050A301961j144554l47260O02002P59070K79420l40018q88856j149209r22533
39041a849977n42334n16801n79431l3974Q97806J192835O78055L35262N91059
$$ plain form
39107 -540876 -615336 -781102 -1044378 -1157182 -926652 -462680 -79109 -33409 -404868 -1139253
39097 -1139253 -2048904 -2713284 -2591942 -1546260 -245197 297829 -216388 -1000930 -1059641
39088 -1059641 -221080 919358 1827154 2416893 2751529 2822533 2721989 2695291 2857008 3057502
39078 3057502 3154072 3226901 3378883 3477611 3304294 2912286 2636788 2686221 2862655 2815663
39068 2815663 2497455 2181917 2032327 1881048 1546289 1151417 959144 1091484 1592557
39059 1592557 2460977 3294741 3274815 2107143 773381 583809 1468312 1998729 1301961
39050 1301961 157407 -189853 412149 1171219 1450639 1110621 221765 -927444 -1849977
39041 -1849977 -2392311 -2909112 -3488543 -3522517 -2624711 -1431876 -753821 -418559 172500
39032A72500O04118j36294p84426n65753q1823j67245m37257j21899M66085N18649
39022e33345J73942J61702M57780M41251N8585k23374l22516m19375k77947L14715
39012a68582P94825N55166P3501K00253O74223N73003n2948l48458k70244n63989
39002A466750j139587j037682k49425J4238o39460j006494k92043N18846L19902
38993b044955k71960N228R44978J189288L04783o50193o25527K22351R53423R09461
38983I36877K41121l40600l22299M4496J42676r2260j63216L2989k1707m62130
38973d053o17534j07525M09590K89323L944K84419P09896K76330q58313j364331
38963i78254n94434N57703R63569N78401J8326m45930q42407r39883m81991J82984
$$ plain form
39032 172500 776618 640324 -144102 -709855 -791678 -958923 -1396180 -1518079 -1051994 -533345
39022 -533345 -359403 -197701 260079 701330 759915 536541 214025 -205350 -483297 -168582
39012 -168582 626243 1181409 1254910 1455163 2129386 2702389 2649441 2300983 2030739 1466750
39002 1466750 327163 -710519 -959944 -945706 -1585166 -2591660 -2883703 -2364857 -2044955
38993 -2044955 -2316915 -2311687 -1366709 -177421 127362 -522831 -1148358 -926007 27416 936877
38983 936877 1177998 837398 515099 559595 702271 610011 446795 479784 458077 -4053
38973 -4053 -621587 -729112 -319522 -30199 -26255 258164 968060 1244390 386077 -978254
38963 -978254 -1572688 -1014985 -51416 526985 545311 99381 -743026 -1682909 -2164900 -1981916
38953a981916L64990l0863l70978k42681j7820j39846l05658N6663P22281Q24989
38943a120839J66521l69663p9610N30759N59783N6217k01784K1630K12924J11389
38933a12673Q4421L40086M74358J09187n13984q53711o44107l2508N19776M86723
38923a42432j32644n36803k175J006528J301978N73779k79731n48912n31180o21250
38913H7158n11047J08940P88932R39636O67426L81272Q3291l21972m94895j38741
38903A590000L35148K93371j94100m88418k57601K62215O91782P80330M56331
38894C469058k8900k11360N3880M05212M75329K25048k94875r64493j293716q46309
38884I88874j28404j40116p78377q06536J29954P77323L37480j51746L34301R40717
$$ plain form
38953 -1981916 -1616926 -1647789 -2018767 -2261448 -2279268 -2419114 -2724772 -2668109 -1945828 -1120839
38943 -1120839 -954318 -1323981 -1403591 -872832 -313049 -256832 -458616 -436986 -224062 -112673
38933 -112673 -28252 311834 786192 895379 381395 -472316 -1116423 -1148931 -629155 -142432
38923 -142432 -275076 -811879 -814054 192474 1494452 2068231 1788500 1239588 708408 87158
38913 87158 -423889 -314949 473983 1413619 2081045 2462317 2545608 2223636 1728741 1590000
38903 1590000 1925148 2218519 2024419 1536001 1278400 1540615 2232397 3012727 3469058
38894 3469058 3440158 3228798 3282678 3687890 4163219 4388267 4093392 3128899 1835183 988874
38884 988874 860470 720354 -58023 -864559 -734605 42718 380198 228452 562753 1503470
38874A503470M76893l56717j92598M60222Q9491r48837q44589M47192Q64499m34035
38864A064991j697598j383179k95499J68597J44095L71474O11175L74523R6775
38855e44646K58298L09297k65433p20097j97615O84435P47537J07779k28056q0558
38845G0941l5144q5227K22044N15386o3648j232819j647550q38747J35364L34040
38835b625360J50291L61316Q40313Q92027L64760j74290j84784K60389N64239
38826D48901K28142n04041p86836k13730N52418O22053Q3152k18541R6504O10937
38816I18959Q85650Q25545L06533p30745j673358j561577l77238O91083P10392
38807d756J42140J6791M75448P67409M20371k26067o12759n82866l23739m1235
$$ plain form
38874 1503470 1980363 1623646 1431048 1891270 1980761 1031924 187335 634527 1499026 1064991
38864 1064991 -632607 -2015786 -2311285 -2142688 -1998593 -1627119 -1015944 -641421 -544646
38855 -544646 -286348 22949 -242484 -962581 -1160196 -475761 271776 379555 151499 70941
38845 70941 35797 -49430 172614 688000 624352 -608467 -2256017 -3094764 -2959400 -2625360
38835 -2625360 -2475069 -2113753 -1273440 -381413 -16653 -190943 -375727 -115338 448901
38826 448901 677043 173002 -613834 -827564 -275146 346907 430059 211518 308022 918959
38816 918959 1804609 2630154 2936687 2205942 532584 -1028993 -1406231 -715148 -4756
38807 -4756 137384 154175 629623 1397032 1817403 1591336 978577 395711 71972 30737
38797C0737J42486J49260k3476k47322l31987k18099q7543j76492m44256n80758
38787a787450m38918k57200k48460j69475L54902J153326J532347J065995J11703
38778A316770n58620m97231O7280M76784K59269l83416p76771n64939j05634J18492
38768f48016J97764N10402R49340R80861M62664j29265m08346n27755p06177p32833
38758e1361l07162L62594O76478L42607k68291n39650l00583j574j32636n55122
38748g74700o51370j59511M81363P68942P30091O07298L93022J09691J18942N41901
38738B165669P35796J05787q24282j028954n12949k17491m04330l07352L18682
38729C0576N30265k58497j113447q87320R4413O71821N92578N06666N69682K34060
$$ plain form
38797 30737 173223 322483 299007 51685 -280302 -498401 -585944 -762436 -1206692 -1787450
38787 -1787450 -2226368 -2483568 -2732028 -2901503 -2546601 -1393275 139072 1205067 1316770
38778 1316770 758150 260919 328199 804983 1064252 680836 -95935 -660874 -766508 -648016
38768 -648016 -450252 60150 1009490 1990351 2453015 2323750 1915404 1387649 681472 -51361
38758 -51361 -358523 4071 680549 1023156 754865 215215 -85368 -86942 -219578 -774700
38748 -774700 -1426070 -1585581 -1104218 -335276 394815 1002113 1395135 1504826 1623768 2165669
38738 2165669 2901465 3007252 2182970 1154016 641067 423576 19246 -288106 30576
38729 30576 560841 302344 -811103 -1698423 -1604010 -932189 -339611 167055 736737 970797
38719I70797n60648j022667n93576L21409R50063R36959L83600l75749q80840
38710A29348q63443n73525m32856m02414j53974K10493K28471j11252k96993j59985
38700b426130j19017l38542l67185J3461K83142N9712j42955K66310Q46812O72511
38690a251881k17443p48277k44590P48627J266551J016562M21780l2607j95084
38681G63638j82737j50006j05673M1110K13119J38474j94569l11308R6870M84741
38671G93659M0087j031995j518800p62772M21295Q39006L93521j23440l02410
38662a251849l99332m92924j95996N78008J191430J011757K09772n04996p06599
38653e60729n17000k32184k109J56042K53019K80491J97235k1696l03075n07227
$$ plain form
38719 970797 410149 -612518 -1206094 -884685 65378 1002337 1385937 1010188 129348
38710 129348 -734095 -1307620 -1740476 -2142890 -2296864 -2086371 -1857900 -1969152 -2266145 -2426130
38700 -2426130 -2545147 -2883689 -3250874 -3237413 -2954271 -2894559 -3037514 -2771204 -1924392 -1251881
38690 -1251881 -1469324 -2217601 -2462191 -1713564 -447013 569549 991329 958722 763638
38681 763638 580901 430895 325222 366332 579451 717925 523356 212048 308918 793659
38671 793659 833746 -198249 -1717049 -2479821 -2058526 -1219520 -825999 -949439 -1251849
38662 -1251849 -1651181 -2144105 -2340101 -1762093 -570663 441094 650866 145870 -560729
38653 -560729 -1077729 -1309913 -1312022 -1155980 -902961 -622470 -425235 -446931 -750006 -1257233
38643a257233n41943l64763O0920O30280R77225P80667K29714j22228o8974K75
38633C23940k68534o42748o59608k84881J14511L10666M17698O18312R13446J091732
38623A934534Q38045N8654p73434r24732l33030J21178k80518j025459j015687
38614a400449j11902O95657P01021L23471K72009N28328O15424M00450R6569k35759
38604A884819o46714r02122o50515q308M23710K39173l26518p02304n49096R922
38594a227953N30623N69412N7053n50177o46243j29328M37807M79012J17319j5940
38584c78415L14821N85063K74846l11460m46678p0481J15785k55006o51649n06715
38574a329889o5396J47664K15167M84646P05628L66530k65416l70181J07405L01276
$$ plain form
38643 -1257233 -1799176 -2163939 -2103019 -1472739 -495514 285153 514867 392639 323665 323940
38633 323940 55406 -587342 -1246950 -1531831 -1417320 -1106654 -688956 -70644 842802 1934534
38623 1934534 2772579 2831233 2057799 1133067 800037 921215 640697 -384762 -1400449
38614 -1400449 -1512351 -816694 -115673 207798 479807 1008135 1623559 2024009 2120578 1884819
38604 1884819 1238105 335983 -314532 -322840 100870 340043 13525 -688779 -1237875 -1227953
38594 -1227953 -697330 -127918 -70865 -621042 -1267285 -1396613 -958806 -479794 -362475 -378415
38584 -378415 -63594 521469 796315 484855 38177 -32304 83481 -171525 -823174 -1329889
38574 -1329889 -1395285 -1247621 -1032454 -547808 157820 524350 258934 -111247 -3842 297434
38564B97434j75097n94351l35228J03476k2604m63531m08948K24411P16530N87272
38554g0636P7473l31401l77961q9806J99576N3712m63667o25937N2813R92523
38544e83311J178349M49478m17327p90047p34919n34704k91228r0411j2727J29891
38534a696956N74967J044300R24439J57487n57984o58106l33253k4299K20596
38525c48809N31701P43117N88756K00608n83Q6375L9060n42385j378329j607655
38515a688144p43262N46185J016448L67977l06022l236P65376P74567l7853n11228
38505A80808r5439L42871m2216p64205q22428j90401K97506J85175k12561m80330
38495a601220n20849l46704J5754L69003M69747L54328K77912L45485M18732L40648
$$ plain form
38564 297434 122337 -472014 -807242 -703766 -726370 -1189901 -1598849 -1374438 -657908 -70636
38554 -70636 6837 -324564 -702525 -792331 -592755 -539043 -1002710 -1628647 -1575834 -583311
38544 -583311 595038 1044516 627189 -162858 -897777 -1432481 -1723709 -1814120 -1826847 -1696956
38534 -1696956 -1121989 -77689 846750 1004237 446253 -211853 -545106 -569405 -348809
38525 -348809 182892 926009 1514765 1715373 1714790 1801165 1840225 1297840 -80489 -1688144
38515 -1688144 -2431406 -1885221 -868773 -500796 -806818 -810054 -44678 729889 692036 180808
38505 180808 85369 428240 386024 -378181 -1200609 -1391010 -1093504 -908329 -1120890 -1601220
38495 -1601220 -2122069 -2468773 -2453019 -2084016 -1614269 -1259941 -982029 -636544 -217812 122836
38485A22836Q8149j97584k21553J99785P24948O57268j84814j066855j176105
38476a053925o03975p6705O1109Q7401K58828M70404N73650N70815M23673O0197
38466G71472l52758m90059k93011j2609J80099K71767J02348n16948j208215j061870
38456b609784K88328J880173K225146R56070o66316j095185j86768P30361N06457
38447B028482m55449q39156k29789L76999Q0730o08986n86387J87278P00978M28932
38437A083632q8028l39764n82424j010516j024086j23804R66439J017675J1085
38428h9791p48987l89088M29569N47440j21563o20591k90376M84132Q77343N62933
38418F41021q5501m90492m10497q4489P1740o6169k18368j47984p4441l41695
$$ plain form
38485 122836 210985 13401 -208152 -8367 716581 1373849 1189035 122180 -1053925
38476 -1053925 -1657900 -1734605 -1673496 -1586095 -1327267 -856863 -283213 287602 711275 771472
38466 771472 418714 -71345 -364356 -376965 -196866 74901 177249 -339699 -1547914 -2609784
38456 -2609784 -2321456 -441283 1783863 2739933 2073617 978432 791664 1522025 2028482
38447 2028482 1573033 733877 504088 881087 961817 352831 -233556 -46278 654700 1083632
38437 1083632 995604 655840 73416 -937100 -1961186 -2084990 -1118551 -100876 -89791
38428 -89791 -838778 -1227866 -798297 -250857 -372420 -993011 -1283387 -799255 78088 641021
38418 641021 555520 65028 -345469 -429958 -358218 -424387 -642755 -790739 -865180 -1206875
38408a206875p22288n16115M42820J303880J155381K03031n17015m63354m4443
38399c64978K40501M36372O67655O58235J78811m37428p19184p05503o85511n55937
38389a286967k4560O77583R22344N74696J87471J45550J34218k42164p20449o91015
38379c23293q8702M27504K49962m39561q56355n13211K03538N07322K04271q6417
38369g14942J73239O73565P23686K36497k13713k18979N4684K94912M13106L87294
38359A809349J53746j78791l38788k68469k04087k72551l13423k04959m1984J18617
38349B58660L45443N54551N20838K95095J94025K24655Q065m92098p15055l57812
38339H36367L4374j54449o71045q14892m54830N972L90099P55666Q40251L04151
$$ plain form
38408 -1206875 -1929163 -2445278 -2002458 -698578 456803 659834 142819 -320535 -364978
38399 -364978 -124477 311895 979550 1637785 1816596 1379168 659984 -45519 -731030 -1286967
38389 -1286967 -1311527 -633944 288400 863096 1050567 1196117 1330335 1088171 367722 -323293
38379 -323293 -411995 15509 265471 -174090 -1030445 -1543656 -1340118 -832796 -628525 -714942
38369 -714942 -541703 131862 855548 1092045 878332 659353 714037 1008949 1422055 1809349
38359 1809349 1963095 1784304 1445516 1177047 972960 700409 386986 182027 140043 258660
38349 258660 604103 1158654 1679492 1974587 2168612 2393267 2401332 1909234 1194179 836367
38339 836367 870741 716292 45247 -769645 -1224475 -1218503 -828404 -72738 767513 1071664
38329A071664m78027o65384j36757L13040K09774R2504N28717J073595Q65771
38320B874897q8953q93295r21923m73063k19986m11370p30474p11935k12967M02456
38310a386613N57616P3086n68936p42000m12697j38200k93244n30123j94422P89682
38300b845851J654190J535218M41524o79780r12357k68905N01379Q24521P33317
38291I83256M81126J57337j77951l56783l66707m58115o73594n49481K55698J196294
38281D91080J280580L53296n91452o25005K4148M61855L71898K36445M10322N40502
38271B953669J27224o76983j152815q20185M5769P00145O21745n4398o85307o82139
38261C76725j3478P70641J005039M57832m82697j106548r35242j14720O94140
$$ plain form
38329 1071664 593637 -71747 -208504 104536 314310 406814 935531 2009126 2874897
38320 2874897 2785944 1892649 970726 497663 277677 -133693 -864167 -1576102 -1789069 -1386613
38310 -1386613 -828997 -755911 -1324847 -2066847 -2479544 -2617744 -2910988 -3441111 -3635533 -2845851
38300 -2845851 -1191661 343557 785081 105301 -807056 -1075961 -574582 249939 983256
38291 983256 1464382 1621719 1443768 1086985 720278 262163 -411431 -960912 -705214 491080
38281 491080 1771660 2124956 1533504 908499 932647 1394502 1766400 2002845 2413167 2953669
38271 2953669 3080893 2403910 1251095 430910 476679 1176824 1798569 1744171 1058864 376725
38261 376725 363247 1133888 2138927 2596759 2114062 1007514 72272 -42448 651692
38252F51692Q82842M20391j66222l16606N2022M87573M30558j96460p78874n74931
38242H91985L56173J017545N90245m72412r34974l46807M40303M92995m3713l97550
38232A593790k93926o6573N0629J22588J36905N065j10954O70J27938p5582l64397
38221A126153j28949N70258R17107N25640m382j03574j05125n12009r74029p74116
38211E36974n224N37706N07334K80796Q9297l43661j051417j378158p61625L87409
38201a200569J050361P35310p2307n52196l90804N1474K32696k0771l99334m50423
38191a016563l1095N04379N74507k0988p11847o30989L08357J092017P80812k05298
38181F43292n86001N9088Q15174Q21899L21867o4942l11378n98963o52739k65214
$$ plain form
38252 651692 1534534 1954925 1788703 1472097 1524119 2011692 2442250 2245790 1466916 891985
38242 891985 1248158 2265703 2855948 2383536 1448562 1101755 1542058 2035053 1991340 1593790
38232 1593790 1299864 1233291 1283920 1406508 1543413 1548478 1437524 1438194 1566132 1490550 1126153
38221 1126153 997204 1567462 2484569 3010209 3005827 2902253 2797128 2285119 1311090 536974
38211 536974 531750 1069456 1576790 1857586 1946883 1603222 551805 -826353 -1587978 -1200569
38201 -1200569 -150208 585102 512795 -39401 -430205 -378731 -146035 -166806 -566140 -1016563
38191 -1016563 -1047658 -543279 31228 10240 -701607 -1332596 -1024239 67778 848590 643292
38181 643292 57291 116379 931553 1753452 2075319 2010377 1698999 1100036 447297 182083
38171A82083M5258k09727n03535o6171O80642O32794j39431l25637N78872J377817
38161B252965Q94811m07321j272427j345507j157325r28908l45334N79416J174558
38152e55072Q47895j87018j053476j013657j77902O07431P35682N50063P06283
38143D60229J027939P04675l34899j088293q37849q6432L20011L07244K45990
38134G18615J50503j01194k39462j9794K02160m372l74560l71714o1546J31782
38124C0418K32907N09768P00244K78445n91908j137384r89108m50245J61574P17278
38114e38011R01578M44670k29510l62768M3599K54662R335j36850J23666L09218
38104H19589L5336l41597m16239l60198l51894o5897O24362J008895L99564o91400
$$ plain form
38171 182083 227341 17614 -485921 -552092 128550 761344 621913 296276 875148 2252965
38161 2252965 3147776 2740455 1468028 122521 -1034804 -1963712 -2309046 -1729630 -555072
38152 -555072 292823 105805 -947671 -1961328 -2139230 -1531799 -796117 -246054 460229
38143 460229 1488168 2192843 1857944 769651 -68198 -154630 165381 472625 718615
38134 718615 869118 767924 528462 508668 710828 706456 331896 -39818 -101364 30418
38124 30418 263325 773093 1473337 1751782 1159874 22490 -966618 -1416863 -1255289 -538011
38114 -538011 363567 808237 578727 215959 259558 514220 523555 386705 510371 819589
38104 819589 854925 513328 97089 -263109 -615003 -680900 -56538 952357 1351921 660521
38094F60521j013668j52237R86182J306907O69183k12011o47183n63740l62182
38085F71772l52760m29654l32176n9460J92488L68295N02633M54680J30826j13896
38075A032748J43569O21550O05030P6516k06928j5437j29348r74353j624049j036172
38065a506874L03207R83364O08331R9392J28525K81320J8502l99083m22586q9100
38055D998J22486L363k35460l58105l06352p5609L19429O94300P02068J75853
38045A046971n40415q04477l80611K20098L69034J52237J56698M89308N98612
38036A307455K14234j69414q2214K29111L40004L29224L73782J95856l86215p99864
38026A551959m42856K31581K49963m08828p92187m20750J42272K93261J15135
$$ plain form
38094 660521 -353147 -505384 480798 1787705 2456888 2244877 1597694 1033954 671772
38085 671772 319012 -110642 -442818 -502278 -309790 58505 561138 1015818 1146644 1032748
38075 1032748 1176317 1797867 2402897 2479413 2272485 2257048 2127700 1153347 -470702 -1506874
38065 -1506874 -1203667 -220303 388028 487420 615945 897265 915767 516684 94098 4998
38055 4998 127484 130847 -104613 -462718 -769070 -844679 -525250 169050 871118 1046971
38045 1046971 506556 -297921 -678532 -458434 -89400 62837 219535 708843 1307455
38036 1307455 1521689 1352275 1270061 1499172 1839176 2168400 2542182 2738038 2351823 1551959
38026 1551959 1109103 1340684 1590647 1181819 389632 -31118 111154 404415 519550
38017E19550j10039l25584l62926O8646P12626P94450J37692l89921k7525Q27494
38007A844463J216588Q03459k4433q03021j215646j024763l32013K91118L57139
37998A112891j5346m02561o04154n87984k88983J57516L38272J25837k6721K25662
37988C4429N18842L66387k2374j08379Q7094J14641p5666j14628O4269J29186
37978I93801k3158j18842j8189J20905J88860J62090j31352p34053j121584p07268
37968a388790J84141N58431J24829k85047L7243O84179Q29035L77170j06769k55162
37958G59260j59001Q599J73378K64389K55324K12358J12772j93139o54991r21880
37948a42931q09778n96741n73452n82618l48755q180R8441j8061n5465R5071L11974
$$ plain form
38017 519550 409511 83927 -278999 -210353 502273 1296723 1434415 1044494 1016969 1844463
38007 1844463 3061051 3864510 3840077 3037056 1821410 796647 464634 755752 1112891
37998 1112891 1097545 694984 90830 -497154 -786137 -628621 -290349 -164512 -191233 34429
37988 34429 553271 919658 897284 788905 875999 990640 914974 800346 864615 993801
37978 993801 970643 851801 833612 954517 1143377 1305467 1174115 440062 -681522 -1388790
37968 -1388790 -1204649 -646218 -521389 -806436 -769193 -85014 744021 1121191 1014422 759260
37958 759260 600259 608858 782236 1046625 1301949 1514307 1627079 1433940 778949 -142931
37948 -142931 -952709 -1549450 -2122902 -2705520 -3054275 -3062455 -2964014 -2982075 -3037540 -2942469 -2630495
37937b630495N60656Q41110R43314P08317M30452M78257N79017J25256p26465
37928A309419r99285k68189O00677O46044J81641J85303O71249O63280j81239
37919B808900r26651p54433j70760j22227m96972m14105K62384O88698L92277
37910A267111n9906p1958R6307l2529k89105k84753j93849l60228n02483j56097
37900e87490L31157J85145m74900p04295k55039K0817l24071m72114K95152J237617
37890g48021J148074J73368m04462K3911P90456J112280R36332M91384j62135
37881C361187q13990r84999n28167O1869K43381J6196k72540l72984k14747J21520
37871F16726L63714K94253J16546J97204L99815J93509m43681q35467n99853k27090
$$ plain form
37937 -2630495 -2069839 -1228729 -285415 422902 853354 1331611 1910628 2035884 1309419
37928 1309419 310134 41945 642622 1288666 1470307 1655610 2326859 2990139 2808900
37919 2808900 1882249 1127816 957056 834829 337857 -76248 186136 874834 1267111
37910 1267111 1207205 1135247 1231554 1199025 909920 625167 431318 71090 -431393 -587490
37900 -587490 -256333 -71188 -546088 -1250383 -1505422 -1484605 -1808676 -2280790 -1985638 -748021
37890 -748021 400053 573421 168959 192870 983326 2095606 3031938 3523322 3361187
37881 3361187 2547197 1562198 1034031 1095900 1339281 1355477 1082937 709953 495206 616726
37871 616726 980440 1274693 1391239 1588443 1988258 2181767 1738086 902619 302766 75676
37861G5676k59807m72207m01438j78202j57992j30582L23695R27520R72497M23243
37851A122403k7135m6424l3302k34221k66971J08960M11899J59253k96504k53208
37841F44750K74227N68176K44831k35607k33713K35423N66635L24034k88237p29948
37831A370571p11697l28806K36751P99352R51190K71782r37399j595742j061385
37822a005383p2371J90238k81377m83368n8292K59110M5286p2586L74148P37770
37812c66825L20002l82509m55010j4078J39932r1579j36251R4101J75591J63044
37802e53582M72528P87611K97490p85755j183454m32577L75278L29565J9272K77257
37792c96367O58875L04757m44178n67164m9517K25590N9306J38751O08297O57698
$$ plain form
37861 75676 -184131 -656338 -1057776 -1235978 -1393970 -1524552 -1200857 -273337 699160 1122403
37851 1122403 1095268 1048844 1015542 781321 514350 623310 1035209 1194462 897958 644750
37841 644750 918977 1487153 1731984 1496377 1262664 1498087 2064722 2388756 2100519 1370571
37831 1370571 658874 330068 566819 1366171 2317361 2589143 1651744 56002 -1005383
37822 -1005383 -1077754 -887516 -1168893 -1652261 -1710553 -1451443 -1406157 -1478743 -1104595 -366825
37812 -366825 -46823 -429332 -884342 -898420 -758488 -850067 -986318 -892217 -716626 -553582
37802 -553582 -81054 706557 1004047 218292 -965162 -1397739 -1022461 -692896 -673624 -396367
37792 -396367 262508 567265 123087 -444077 -493594 -268004 -208698 -69947 538350 1196048
37782A196048j12335r10002q60423j79398K87588J85519j74767l97165l38131
37773a303066r2845P7521p010j43627L6043M63562O11701K11001l74168o37778
37763a158666m50877L2701N85141Q64272N95579N874l20315k02752n1096j15916
37753b16055j00780J90510M03244K56300P6413J88420K74142m1586m13749l18270
37743B98589k0840j68147o08407n33973J71052O15907K00788n04064n94898m0583
37733a184576M09878K56317k10177l44112O8276N23744L98894j62553l15013K90352
37723b68970Q40683M52595m67574p62766k13469K69843J51108o1232R8944K94175
37713C33337J69157J1070N4827o3281n10758o98156k74494P0702k73385o13093
$$ plain form
37782 1196048 1083713 173711 -686712 -866110 -578522 -393003 -567770 -964935 -1303066
37773 -1303066 -1395911 -1318390 -1325400 -1469027 -1432984 -969422 -357721 -146720 -520888 -1158666
37763 -1158666 -1609543 -1576842 -991701 -127429 468150 474024 153709 -49043 -100139 -216055
37753 -216055 -316835 -126325 276919 533219 609632 798052 1072194 1030608 616859 298589
37743 298589 277749 109602 -498805 -1032778 -861726 -245819 -45031 -549095 -1143993 -1184576
37733 -1184576 -774698 -518381 -728558 -1072670 -1004394 -480650 -81756 -244309 -559322 -268970
37723 -268970 571713 1024308 556734 -206032 -419501 -149658 1450 -59782 39162 333337
37713 333337 502494 513564 568391 505110 -5648 -703804 -978298 -907596 -1180981 -1794074
37703a794074L73J013842J033359L5135n41486m5044M88909J74751l21113o4946
37693b0294N12746L79234l67591p06366l41280k2615k02970l71101j5648N20286
37683f35599N95193J68054l17133o00536p00144n57042q0235M90948P06503M88663
37673d41328K62734L57736N59952M67122N1676l77113n77866m70977l5091N23883
37663C20728O80823J56346n11032n17054Q3016M34737J56140k01189k07598k12351
37653A82566m40256l06735N44861J256811Q66086j24042m75122j63498k37097
37644A103574q34708q74307m883O27561K23150l79151j71501L58364J61525n80653
37634c71029q26559l44076J63464L23088L97103M58030K59839r3451k39054k93256
$$ plain form
37703 -1794074 -1793701 -779859 253500 288635 -252851 -297895 191014 365765 44652 -20294
37693 -20294 492452 871686 504095 -202271 -543551 -566166 -769136 -1140237 -1155885 -635599
37683 -635599 -40406 127648 -189485 -790021 -1490165 -2047207 -2127442 -1636494 -929991 -441328
37673 -441328 -178594 179142 739094 1206216 1257892 880779 302913 -168064 -203155 320728
37663 320728 1001551 1157897 646865 129811 212827 647564 803704 602515 394917 182566
37653 182566 -257690 -564425 -19564 1237247 2103333 1979291 1504169 1340671 1103574
37644 1103574 268866 -605441 -610324 17237 240387 -138764 -310265 48099 209624 -371029
37634 -371029 -1197588 -1541664 -1378200 -1055112 -658009 -199979 59860 -33591 -272645 -565901
37624e65901o28812r33973m59826O48211J238502P26182p4804j76148K58207M19645
37614D51283J30373j05891l9617K1475j95471n54412q06054q83759p69480l41029
37604c092582M05899J078971J117841M48265k59914k56680M06968R61355Q86883
37595A697006M20488J8616k04599k82176j44210Q1582q182m54338p00514m58635
37585c4962k42416m39897n04186Q3857O66986L42443m30510m79003J06981J51511
37575g79196m88908o43616L2852L50955k99647p52314j8222R81542R36261K30944
37565d49349M5180K95091J01782l17047L8199R95809J258394M81184k07974n5180
37555B186089K98741R7805l88425n79939n05163m05447j85208J55286J81770k80630
$$ plain form
37624 -565901 -1194713 -2128686 -2588512 -1940301 -701799 24383 -50421 -226569 31638 451283
37614 451283 581656 475765 436148 457623 262152 -292260 -1098314 -1982073 -2751553 -3092582
37604 -3092582 -2686683 -1607712 -489871 -41606 -301520 -558200 -151232 810123 1697006
37595 1697006 2117494 2136110 1931511 1649335 1505125 1586707 1578525 1124187 423673 -34962
37585 -34962 -277378 -717275 -1221461 -1137604 -470618 -128175 -558685 -1037688 -930707 -779196
37575 -779196 -1268104 -1911720 -1878868 -1527913 -1827560 -2579874 -2598096 -1616554 -680293 -449349
37565 -449349 -404169 -109078 -7296 -324343 -286144 709665 1968059 2449243 2241269 2186089
37555 2186089 2484830 2582635 2194210 1614271 1109108 703661 518453 673739 855509 574879
37545E74879o21105k03448O83839J154502Q08764J11357k05647R6718N23445L61582
37535C284886m00590q68845l69962M54807L94875n63893j125269n42441L51525
37526F15093M72571J679j74767R2117K33202P2535k971J08145N0957k11941k12653
37515A043967J70944L32585j33700n99710j48009J009388J558726P34709o26667
37506C342233j152028o59675j42838j81199k58766R2503L65963n3477p64952r47080
37496c59316o36682m64624l98804J62121J068658J316520N19210m88080q65518
37487a46515o95692l16328L15588J017785J043974J41216p44586o49511O9495
37478C5426L98198J72936K3051J72390K53189J39579P7535N1238j73292m08591
$$ plain form
37545 574879 -46226 -249674 434165 1588667 2397431 2508788 2303141 2399859 2923304 3284886
37535 3284886 2884296 2015451 1645489 2100296 2495171 1931278 806009 263568 615093
37526 615093 1087664 1089343 914576 1006693 1239895 1312430 1309459 1417604 1468561 1256620 1043967
37515 1043967 1214911 1547496 1413796 814086 666077 1675465 3234191 3968900 3342233
37506 3342233 2190205 1530530 1387692 1206493 947727 1040230 1406193 1352716 587764 -359316
37496 -359316 -995998 -1460622 -1859426 -1697305 -628647 687873 1207083 719003 -146515
37487 -146515 -842207 -1158535 -842947 174838 1218812 1360028 615442 -34069 35426
37478 35426 433624 606560 629611 802001 1055190 1194769 1272304 1323542 1150250 741659
37468G41659k36727J53346J17424l56901n02886N8715P13454P41158K32181k37287
37458A424136l68949k17815J08896M53327N67308L76581R7493j05555l45661p02547
37448A287214r41268q00339l90504o0021M0604O4378J99066M46356O49866O54010
37438A149362M37393J11848k11526m99560o99472o81776m12013q7835O1318N3335
37428g78926P5615J97409L44938N12771P74665J038133R61364K64416q43394j617984
37418I29007j371800k74689O35793N80006J3132k4963N60755P79755R0990p67827
37408A150159r36991o28056m70882l48308K11536R37453J095559O27430P7706
37399A715606m32717j167545j768114j361286R2214J442085J668125Q90919j32162
$$ plain form
37468 741659 504932 658278 775702 418801 -84085 -25370 688084 1429242 1661423 1424136
37458 1424136 1055187 837372 946268 1399595 1966903 2343484 2440977 2335422 1989761 1287214
37448 1287214 345946 -454393 -844897 -904918 -864314 -799936 -600870 -154514 495352 1149362
37438 1149362 1586755 1698603 1487077 987517 288045 -393731 -805744 -893579 -832261 -778926
37428 -778926 -703311 -505902 -160964 351807 1126472 2164605 3125969 3390385 2546991 929007
37418 929007 -442793 -717482 -81689 498317 511449 486486 1047241 1826996 1917986 1150159
37408 1150159 213168 -414888 -885770 -1234078 -1022542 -85089 1010470 1637900 1715606
37399 1715606 1282889 115344 -1652770 -3014056 -2921842 -1479757 188368 1079287 947125
37390I47125q24380q94396l35972L70502O13587M03551K37410J86404j51846p19100
37380a67115q87610n02859j52616j00895J29635P24284J076675Q42659N71642
37371A533800O67162O23267L5455m98217l69976q7498m10686r87704r14717k10357
37361f19471L11052L34500K51812L08583M16355N93482P98389O12015j17359o87109
37351B202249m85461r9823m21003j016204o70499N95975J398419R98309K04374
37342B706336j3605K90276N75495N51640M5627r43616j746319j488731l68609
37333c91506M32725L70834Q1934M3698j30899n84234o17316P1376O52427N13103
37323D42142L04308O81337R93682L99325n41478o96236j72040O0712q9624R2380
$$ plain form
37390 947125 122745 -771651 -1107623 -737121 -123534 280017 517427 703831 551985 -167115
37380 -167115 -1054725 -1557584 -1710200 -1811095 -1681460 -957176 119499 962158 1533800
37371 1533800 2200962 2824229 2859684 2361467 1991491 1903993 1493307 505603 -409114 -619471
37361 -619471 -308419 26081 277893 586476 1002831 1596313 2394702 3006717 2889358 2202249
37351 2202249 1716788 1616965 1195962 179758 -490741 105234 1503653 2501962 2706336
37342 2706336 2692731 2983007 3558502 4110142 4155769 3212153 1465834 -22897 -391506
37333 -391506 41219 412053 493987 537685 406786 -177448 -794764 -723388 -70961 442142
37323 442142 746450 1427787 2421469 2820794 2279316 1583080 1411040 1471752 1382128 1474508
37313A474508N37390L56794n09664r82590n06992J47394J92184r4765j34031l4481
37303D45747j79527m50616m88868l20003k11468k05658j73585p2110J22259M60793
37293a073036Q01048Q40132N34350J70344p9591k75424l08717P5768O65831P73636
37283B124341J78275m49714m68426j13486M8696L7149J95243L53904N447p52230
37273A159199j113881n59871M80300J109467Q36058r7017j000802j280961q70042
37264a337550j92984L26260O10095P26882O27744L29680J22057K43621M94714
37255A950519N07180K80830J03015M2232q5921k97142l81966k87199j96898j95733
37245A438917j69601o6523M5875J81691L81376M79983K75893j07785m10750o97796
$$ plain form
37313 1474508 2011898 2368692 1859028 876438 369446 516840 709024 614259 480228 445747
37303 445747 266220 -184396 -673264 -993267 -1204735 -1410393 -1583978 -1656088 -1533829 -1073036
37293 -1073036 -271988 568144 1102494 1272838 1193247 917823 609106 684874 1350705 2124341
37283 2124341 2302616 1852902 1384476 1270990 1319686 1356835 1552078 1905982 1911429 1159199
37273 1159199 45318 -514553 -34253 1075214 1911272 1814255 813453 -467508 -1337550
37264 -1337550 -1530534 -1204274 -594179 132703 760447 1090127 1212184 1455805 1950519
37255 1950519 2457699 2738529 2841544 2883776 2797855 2500713 2118747 1831548 1634650 1438917
37245 1438917 1269316 1202793 1248668 1430359 1811735 2291718 2567611 2459826 2049076 1351280
37235A351280j129770j344989p68232L39879R04030M51501j90099j03028M51267
37226c8161O13001K35100j69128m12713o97089q64830m78213L23476Q34076P72758
37216A18277N54520M27946J10046m23298n44649R1796P89054O30655k43859q00101
37206G10387m25926M21459Q81540O13200j7106m16906l36822l1681J21656Q4339
37196A604140N5390M715k98890p37083q12374m08690q9079k33501l37434K33004
37186a019802J091921J182654K54174o99629o75204J84489R50253J043529O66639
37177B979024K93181P6275j80732n96810q91999o46054P6980N97315L56660l58811
37167A705029p44414m61774L6282J84095j3325r5679K41477P44732P60023r6901
$$ plain form
37235 1351280 221510 -1123479 -1891711 -1551832 -647802 -196301 -386400 -489428 -38161
37226 -38161 574840 809940 640812 228099 -468990 -1333820 -1812033 -1488557 -654481 118277
37216 118277 672797 1100743 1210789 787491 242842 334638 1123692 1754347 1510488 710387
37206 710387 284461 705920 1587460 2200660 2183554 1766648 1429826 1398145 1519801 1604140
37196 1604140 1659530 1664245 1365355 628272 -184102 -592792 -681871 -915372 -1252806 -1019802
37186 -1019802 72119 1254773 1508947 809318 134114 318603 1268856 2312385 2979024
37177 2979024 3272205 3348480 3167748 2570938 1678939 1032885 1109865 1707180 2063840 1705029
37167 1705029 960615 498841 535123 719218 705893 610214 851691 1596423 2356446 2259545
37157B259545j288393j616513n01994J151317J835198J128936J3520m95578l98329
37148B087709k07034n6747K03833M66792M67284K37998K3316j12070k07682j15951
37138B787448K69072O05334M29375r2535k38629K77543Q14607N96752k74954r50737
37128D223276q62095l02933N1807l2342j63737R9890O24171P56740P9438r57323
37118C516892j358829o79039L71947O87472Q5771m93497k33365N27841Q56030
37109C281223M85023l2431k87350m39346n77471l66261K98384Q48199P56917K78142
37099D245029l1010j23025k25871j90945K00091N60114L52405j29549j17080L43735
37089D883894M18247r7069m22473j83611q5166n96018r41675k97312P53749J013244
$$ plain form
37157 2259545 971152 -645361 -1147355 3962 1839160 2968096 2981616 2486038 2087709
37148 2087709 1880675 1823928 2027761 2494553 2961837 3199835 3223151 3111081 2903399 2787448
37138 2787448 3056520 3661854 4091229 3998694 3760065 4037608 4852215 5448967 5174013 4223276
37128 4223276 3361181 3058248 3110055 3077713 2913976 3013866 3638037 4394777 4474215 3516892
37118 3516892 2158063 1479024 1850971 2538443 2624214 2130717 1897352 2425193 3281223
37109 3281223 3766246 3733815 3446465 3007119 2429648 2063387 2361771 3209970 3966887 4245029
37099 4245029 4214019 4090994 3865123 3674178 3874269 4434383 4786788 4657239 4540159 4883894
37089 4883894 5302141 5205072 4782599 4598988 4513822 3917804 2976129 2678817 3432566 4445810
37079D445810M79669K61445Q15803J325888J006246J94113k17538Q7588O20173
37070I019197P16324K11847l73294l42483L40615R20318Q07480L51136K01838
37061A1852978K32377k04189j071495j516065j074177k97149J08056J54835K25548
37052H410719L45256K65503k4589k65996k43188J01651O51690J036753Q73906
37043A1151705L12923J2718K85492O06719L67534j97396l60238M663K89569J27775
37033A2601464j19869o6118P2341l6520j39685K05221P08608N42912l76346r59102
37023A2432906k71600J121629J782307J196957K78177L6468M47306R10783J199805
37014A9134738J426375J483180J156684O55724M79985P59675J142983J363233
$$ plain form
37079 4445810 4925479 5186924 6002727 7328615 8334861 8528974 8311436 8399024 9019197
37070 9019197 9735521 9947368 9574074 9231591 9572206 10492524 11300004 11651140 11852978
37061 11852978 12085355 11881166 10809671 9293606 8219429 7922280 8030336 8185171 8410719
37052 8410719 8755975 9021478 8996889 8730893 8487705 8589356 9241046 10277799 11151705
37043 11151705 11464628 11477346 11762838 12369557 12737091 12539695 12179457 12184120 12473689 12601464
37033 12601464 12481595 12415477 12487818 12451298 12311613 12516834 13225442 13768354 13392008 12432906
37023 12432906 12161306 13282935 15065242 16262199 16540376 16576844 17024150 17934933 19134738
37014 19134738 20561113 22044293 23200977 23856701 24336686 25096361 26239344 27602577
37006B7602577J549303J888604K249310K254819J666723P59648L41718J097975
36998C9410677K705456L955207M103910L740140L837058M364162M594361M524126
36990G1235097M988027O252730P465198P914233Q058364Q733782R960827J1235017
36982A35843275J2582341J4500534J6921849J8976691K0049693K0628274K1711189
36975B61213846K3477797K4869452K4613053K2414881J8794103J3878993P112097
36968C96374222j433356j0105037j6897660k1350149k4342355k6232597k6400492
36961B69612576k4793846k2607451k0772632j8869129j6404857j4182179j3192761
36954A38789721j2851838j1751599r881165q648027q611869q584879p438895n644333
$$ plain form
37006 27602577 29151880 31040484 33289794 35544613 37211336 37970984 38312702 39410677
36998 39410677 42116133 46071340 50175250 53915390 57752448 62116610 66710971 71235097
36990 71235097 76223124 82475854 89941052 97855285 105913649 114647431 124608258 135843275
36982 135843275 148425616 162926150 179847999 198824690 218874383 239502657 261213846
36975 261213846 284691643 309561095 334174148 356589029 375383132 389262125 396374222
36968 396374222 394940866 384835829 367938169 346588020 322245665 296013068 269612576
36961 269612576 244818730 222211279 201438647 182569518 166164661 151982482 138789721
36954 138789721 125937883 114186284 104305119 95657092 87045223 78460344 71021449 65377116
36946F5377116m319939l662214l179135k856381l102639l754951m014890l470430
36938C7016537k588612k035367j924865j914227j729439j382347j024327p66601
36930B3650752o26112n90691p18790j089235j570781j755984j331348n06167J37216
36921A5598860K82776J73104J48654J20399k18125p62904r85711o72213l15976
36912A3368864m61924q86230q75024k76615K25412P1890l89105m74469k19620
36903A0083179k86162q47832j198191p81991j34891k12368r75590j351506p41499
36894C553149J22221K82867n7493k3906M00904L49330l65009p22076j5985R97057
36884D521059J197250O42874J55816n1473l06929m50937o6704M28057J78667n50255
$$ plain form
36946 65377116 61057177 57394963 54215828 51359447 48256808 44501857 40486967 37016537
36938 37016537 34427925 32392558 30467693 28553466 26824027 25441680 24417353 23650752
36930 23650752 23024640 22433949 21715159 20625924 19055143 17299159 15967811 15461644 15598860
36921 15598860 15881636 16054740 16203394 16323793 16105668 15342764 14357053 13684840 13368864
36912 13368864 12906940 12020710 11145686 10869071 11094483 11166373 10777268 10302799 10083179
36903 10083179 9797017 8949185 7750994 6969003 6834112 6621744 5646154 4294648 3553149
36894 3553149 3675370 3958237 3900744 3876838 4277742 4627072 4262063 3539987 3524002 4521059
36884 4521059 5718309 6361183 6516999 6465526 6158597 5707660 5640956 6069013 6247680 5697425
36874E697425n18913M59093R36577o4390j516090j850156j052252k73176m3273
36865A774845k732Q477k61585o94448p50321k57613M21025R73923J283462J113930
36855C608963L51893m84641o61145k00738J49343j9408l11330k32353J31628L18468
36845B650680O9501l83090m63151J69255J011748J044721k582j131628j294964
36836A670490o80865j62257M6610L28863O22434M55055r1596m03811k98924r8902
36826A387097J64950O53805R18925L46382n31271m26522P20301J430732Q47313
36817E511712o6903k04555J6641l46700j082902j317139j004552p54908o15824
36808A34870j71426M00271M48670k7044l00004j5246L75019L51187q1369n63381
$$ plain form
36874 5697425 5178512 5637605 6574182 6509792 4993702 3143546 2091294 1818118 1774845
36865 1774845 1772113 1780590 1519005 824557 74236 -183377 237648 1211571 2495033 3608963
36855 3608963 3960856 3476215 2815070 2614332 2763675 2744267 2432937 2200584 2332212 2650680
36845 2650680 2720181 2337091 1873940 2043195 3054943 4099664 4097082 2965454 1670490
36836 1670490 989625 827368 873978 1202841 1825275 2280330 2188734 1784923 1485999 1387097
36826 1387097 1552047 2205852 3124777 3471159 2939888 2513366 3233667 4664399 5511712
36817 5511712 5444809 5240254 5256895 4910195 3827293 2510154 1505602 750694 134870
36808 134870 -36556 363715 812385 785341 485337 470091 845110 1196297 1114928 551547
36798E51547o77183j66537O74550J015067M10481m92455p38383l10115O9037J44941
36788D80950L11324O30950N60702j39854r29343j189530q85977l32116K06008
36779a286886M95986M18296K38152L50929O33380N52470N6778k26228O4648M59439
36769A756964M03569N6815j02186l7269m037K7301K22838L61807O6684m78923
36759B273563o04353o7555N48187N68833N0162l81839l07276J34032N62125P43281
36749C519160O06193J11556o64984j349500j413528o94072K92125P72761N35631
36740A715342J54401K50916O68548O61922o6230q41408p84985O8500P78132O29342
36730C234480q2122n34413l53714J24550L54843Q3705m93369q33551m67428M13484
$$ plain form
36798 551547 -125636 -292173 382377 1397444 1807925 1315470 577087 266972 336009 480950
36788 480950 792274 1423224 1983926 1844072 914729 -274801 -1160778 -1492894 -1286886
36779 -1286886 -790900 -372604 -134452 216477 849857 1402327 1459105 1232877 1297525 1756964
36769 1756964 2160533 2217348 2115162 2077893 2073856 2101157 2323995 2685802 2752486 2273563
36759 2273563 1669210 1601655 2149842 2718675 2768837 2386998 2079722 2213754 2775879 3519160
36749 3519160 4125353 4236909 3571925 2222425 808897 114825 406950 1179711 1715342
36740 1715342 1869743 2120659 2789207 3451129 3384899 2543491 1758506 1827006 2605138 3234480
36730 3234480 3152358 2617945 2264231 2388781 2743624 2827329 2333960 1500409 1032981 1446465
36720A446465R73205O70804J192j36691L24969N69102Q3339o70939r54287o35433
36710A671726j29200J98601L08614L75291N25576N69790J36686o39189q98158
36701B119737j52476O88457L47283q51666j242518k70706O60529M06121k22229
36692A482532k1019N40925K74881n42639o05119K00172O70097L26717o956J35647
36682B455238J30198l78693p18946m00615M8214J11104J33319M41179N63452J37241
36672B521691k54461m7050K31528j61624q18007p76027j18239J41874l53668q65890
36662d99873p59964k36174K99680P67636J047043Q22473J92030j66552J03215
36653A569514M34835J37946n55184q09226l63023J94005L04021N8126j76091k32120
$$ plain form
36720 1446465 2419670 3090474 3091666 2954975 3279944 3849046 3932385 3261446 2307159 1671726
36710 1671726 1542526 1741127 2049741 2425032 2950608 3520398 3657084 3017895 2119737
36701 2119737 1967261 2655718 3003001 2151335 908817 638111 1298640 1704761 1482532
36692 1482532 1461513 2002438 2277319 1734680 1129561 1329733 1999830 2326547 2319591 2455238
36682 2455238 2585436 2206743 1487797 1087182 1135396 1246500 1379819 1820998 2384450 2521691
36672 2521691 2267230 2220180 2451708 2290084 1472077 696050 577811 719685 366017 -499873
36662 -499873 -1259837 -1496011 -1196331 -428695 618348 1440821 1632851 1466299 1569514
36653 1569514 2004349 2142295 1587111 777885 414862 608867 912888 971014 794923 562803
36643E62803j6208N95637J306006J267176N8464j407632j712003o91653L89117
36634C51707O07575M61209P14350J025099N86259m11141r70001p36264l20247
36625A308546k12254k47291k20857k28186k28548J4623L92527N10441M01129M67430
36615A957560O12175K68825m79825p35478j51484M12147J67697m52383n95773
36606A003461k54142J9794R7164J98529K78006K32600L40424P48963Q92389K18603
36596C775791p77552j066174m68904K23690L99592J54285k37547o27181p59526
36587F16474m21044J14707L56791L02928L12913L60070Q6327m13761o01830l81302
36577C32273k49943l95533l62312Q5335M31533J71607l87613n43314r8831N07828
$$ plain form
36643 562803 546595 1142232 2448238 3715414 3773878 2366246 654243 -37410 351707
36634 351707 959282 1420491 2134841 3159940 3746199 3335058 2365057 1628793 1308546
36625 1308546 1096292 849001 628144 399958 171410 186033 578560 1089001 1490130 1957560
36615 1957560 2569735 2838560 2358735 1623257 1471773 1883920 2051617 1599234 1003461
36606 1003461 749319 769113 866277 1064806 1342812 1575412 1915836 2664799 3557188 3775791
36596 3775791 2998239 1932065 1463161 1686851 2086443 2240728 2003181 1376000 616474
36587 616474 195430 310137 666928 969856 1282769 1642839 1729166 1315405 713575 332273
36577 332273 82330 -313203 -675515 -590180 -158647 12960 -374653 -917967 -1016798 -508970
36567e08970P52716M68506l7426j73022L39226R59139Q20666j19184q74689o41503
36557I85459K13333P35967N97857K48077N7180j64333p21163j443782j739794
36548a231199j188835l0849R73104J212311P26491R194n14340o50961l23060L20345
36538f97799P73654O13339J02602p0818K63888N40748L36512o550N6622M58558
36528B370756O46768L17763k99943p67357p91437l71447J95254N09618L94957
36519B204932j6104m86108p89418p01335k09798K57085K23943j36973j64825K98453
36509D79852O18755L45569r8377j57466m9193k98770p49793p85889l56183k3528
36499a075023j7434K4457K64531L30382L3248k13763q8622N0764k31955o46550
$$ plain form
36567 -508970 243746 712252 674826 501804 841030 1800169 2620835 2501651 1626962 985459
36557 985459 1198792 1934759 2532616 2780693 2837873 2673540 1952377 508595 -1231199
36548 -1231199 -2420034 -2450883 -1477779 -265468 461023 470217 -44123 -695084 -1018144 -697799
36538 -697799 75855 689194 791796 720978 984866 1525614 1862126 1855576 1912198 2370756
36528 2370756 3017524 3335287 3035344 2267987 1476550 1105103 1300357 1809975 2204932
36519 2204932 2188828 1702720 913302 211967 2169 259254 483197 346224 181399 479852
36509 479852 1098607 1444176 1345799 1188333 1139140 840370 90577 -695312 -1051495 -1075023
36499 -1075023 -1092457 -1068000 -803469 -473087 -439839 -653602 -742224 -691460 -923415 -1569965
36489a569965n57747K0785M13659K79062Q6697L99250J038031J263758O55472
36480B029002m10787j135185j036487l46648K69895L96453K45175K87979N68988
36471H68385O10424Q7599o36177q89060n08354k4630j2659m44224p36508l46287
36461b031491O56179J495650J292784M938j304482j472058n26047L88823M35959
36452a059745j8664j39260K43508O54277P76387O95688N12947K38185K5208M9384
36442A977915J52784L1788k18436j85909J83524M43299L03802K1490m5249R4496
36432B759504K43471L43173L83472K39332j54238o17934q89170q47791n17040
36423I42779k7777L64620M50090L08516J76700R3163l5998r1260R0774K19791
$$ plain form
36489 -1569965 -2127712 -2106927 -1693268 -1414206 -1327509 -928259 109772 1373530 2029002
36480 2029002 1618215 483030 -553457 -900105 -630210 -233757 11418 299397 868385
36471 868385 1478809 1566408 930231 41171 -467183 -491813 -504472 -948696 -1685204 -2031491
36461 -2031491 -1375312 120338 1413122 1418060 113578 -1358480 -1884527 -1495704 -1059745
36452 -1059745 -1078409 -1217669 -974161 -319884 456503 1152191 1665138 1903323 1928531 1977915
36442 1977915 2130699 2162487 1944051 1758142 1941666 2384965 2688767 2710257 2665008 2759504
36432 2759504 3002975 3346148 3729620 3968952 3814714 3196780 2307610 1459819 942779
36423 942779 915002 1279622 1729712 2038228 2214928 2308091 2272093 2180833 2271607 2491398
36413B491398j78343q65582r53991k01067M39589J12655o78166q26985k21660
36404h82152K56709J22686j86475j75258J07974M65902Q33873R46708M03567n74690
36394A318844j028180l76753P31435J160285O09556k34258o61476n95393l69877
36385E54183k71228l47642m05000j64624L82196Q13088O82894P0403m81861n43141
36375B89268j23666M80684Q93761P65959M8434p60524r87175n53713q0596n6696
36365h4264k48686j96701N1588J15556n1276j54025r7904n9825q9992j29472l44317
36354a289318q36823j047235k35183J228259J896910J070905j72613m48691J10055
36345B76266L90583J31973Q0759N06385P55120M49083Q4929P9426R7710k14557
$$ plain form
36413 2491398 2313055 1447473 493482 292415 732004 844659 166493 -660492 -882152
36404 -882152 -625443 -502757 -689232 -864490 -756516 -290614 543259 1489967 1893534 1318844
36394 1318844 290664 -86089 645346 1805631 2415187 2180929 1519453 924060 554183
36385 554183 282955 -64687 -469687 -634311 -252115 560973 1243867 1314270 832409 289268
36375 289268 165602 646286 1540047 2306006 2354440 1593916 606741 53028 -27568 -84264
36365 -84264 -332950 -529651 -478063 -362507 -413783 -567808 -665712 -725537 -815529 -945001 -1289318
36354 -1289318 -2126141 -3173376 -3408559 -2180300 -283390 787515 614902 166211 276266
36345 276266 666849 798822 879581 1385966 2141086 2590169 2675098 2754524 2852234 2637677
36335B637677n69977o04338m73690l98433k02492J70612K56870j93489n70190
36326E2550j90867O15081R14653M31694k64416o55087o95604m47052M0724M54071
36316B55747M18931P2194o9818J02385J28984k56392o66223o02605j21581L14219
36306d24159M38605L88133L82989L88734J65557l48985p99891p43136k22268K45719
36296e28702L40377K58587K07430J4263m04425o06192k10368L42829K68328m06510
36286g24383p96804l59059M10803O72311K28042l94099n63017p8552P14265J223463
36276C32970J136775O59629J60143k34985m97139m46592o6258J47204l07677j138139
36266b54069j510677j122396m85148q1465J74301M44864N25477K63378m287J21139
$$ plain form
36335 2637677 2067700 1463362 989672 591239 388747 559359 816229 622740 52550
36326 52550 -138317 476764 1391417 1823111 1558695 903608 208004 -239048 -198324 255747
36316 255747 674678 746872 677054 779439 908423 652031 -14192 -616797 -738378 -424159
36306 -424159 14446 402579 785568 1174302 1339859 990874 190983 -552153 -774421 -528702
36296 -528702 -188325 70262 277692 291955 -112470 -718662 -929030 -586201 -317873 -724383
36286 -724383 -1521187 -1880246 -1469443 -797132 -569090 -963189 -1526206 -1604758 -890493 332970
36276 332970 1469745 2129374 2289517 2054532 1557393 1110801 1044543 1191747 884070 -254069
36266 -254069 -1764746 -2887142 -3372290 -3453755 -3279454 -2834590 -2309113 -2045735 -2050022 -1928883
36256a928883M68169N02314P0722l97831m52630j39285J46290K00900K18310L72592
36246i39332M06666j5369n91006n37997L09615J081787R61036K40701k21773j86339
36236E07989k9007N3463O3573k57614j004467j429053p24686N63030J023739L91642
36226h41391j21988J88442M75792q7905q56591p62305N9877P18357R58973J051603
36216G82864Q10175j06688j155009j283460l85606N17942O37613J98423k26326
36207b10072m37360m57502k45272J61767N65640Q09830Q11791M53394j95764o32001
36197F24451l70639L36919O96696L67602j43311k10011J33611L32691K7907n29997
36187A265919p50356l84390R9062K3412n83171r37996n20226K78128P74194P94160
$$ plain form
36256 -1928883 -1460714 -958400 -887678 -1285509 -1738139 -1877424 -1731134 -1530234 -1311924 -939332
36246 -939332 -532666 -548035 -1139041 -1677038 -1367423 -285636 675400 916101 694328 507989
36236 507989 478982 532445 596018 338404 -666063 -2095116 -2819802 -2256772 -1233033 -841391
36226 -841391 -963379 -774937 -299145 -387050 -1243641 -2005946 -1946069 -1227712 -268739 782864
36216 782864 1593039 1486351 331342 -952118 -1337724 -819782 -182169 16254 -210072
36207 -210072 -647432 -1104934 -1350206 -1188439 -622799 187031 998822 1452216 1256452 624451
36197 624451 253812 590731 1287427 1655029 1511718 1301707 1435318 1768009 1795916 1265919
36187 1265919 515563 131173 230235 253647 -329524 -1267520 -1787746 -1509618 -735424 58736
36177E8736M72815k14473j115840j525577q94419K94316J034550J005659O43450
36168b40783K71369o7269j23725L05761P06558L46249n05884p92155k33214K79610
36158e3483J18177k20756j09920K37269L37691K39321J82579R4486n3276O311
36148G78399K28634N4106o45719j103713p60008j37957P7325J04215L64839M64944
36138e74935m4763n07631l9960Q51552R36192L13784K48984Q99758Q87161l75547
36128B594595j501675j169022m6814M21931J46117L8546K79664K88707L1490L9229
36118A122768K51825M5903n44231p29543k44179K67605L40770K18468O5451l44785
36108D50052q04998n82088K98954O95071K0926o73677k80386N70366N43165k03298
$$ plain form
36177 58736 531551 317078 -798762 -2324339 -3218758 -2924442 -1889892 -884233 -240783
36168 -240783 30586 -36683 -160408 145353 851911 1198160 692276 -99879 -333093 -53483
36158 -53483 64694 -156062 -265982 -28713 308978 548299 730878 825364 772088 778399
36148 778399 1007033 1061139 415420 -688293 -1448301 -1586258 -1508933 -1404718 -1039879 -574935
36138 -574935 -619698 -1127329 -1167289 -315737 620455 934239 1183223 2082981 2970142 2594595
36128 2594595 1092920 -76102 -122916 299015 445132 483678 763342 1052049 1083539 1122768
36118 1122768 1374593 1420496 876265 146722 -97457 170148 510918 729386 794837 450052
36108 450052 -354946 -937034 -638080 56991 77917 -595760 -876146 -305780 237385 34087
36098C4087l53861L04296N98418Q7395j79110L99458P74898j6359j121153j153282
36088f25213l81707j89724p81742r54433j76358N38662K82950l74518l84429K20588
36078b825924N85992L95592J60239K97861N91602O21832K96428j41309l55032
36069c72719j37309L63453O29923K55893m98221q79117n04327J41509K70582k59819
36059i90152q08247p59840k15609K68221M04133L43497K27929j7509l26936l21085
36049b195598J82995P25162O73003O8023l98253k92071O7748J74336K8429l5786
36039a002012K8740l2587k12686j25476L49129O64146K45132o29697j065045o99864
36029b480220j30637K6393q035K98959Q15769R43075N87613K21248J5969k93615
$$ plain form
36098 34087 -319774 -15478 582940 670335 491225 890683 1665581 1649222 528069 -625213
36088 -625213 -1006920 -1196644 -1978386 -2932819 -3109177 -2570515 -2287565 -2662083 -3046512 -2825924
36078 -2825924 -2239932 -1844340 -1684101 -1386240 -794638 -172806 123622 -17687 -372719
36069 -372719 -510028 -146575 483348 739241 241020 -638097 -1142424 -1000915 -730333 -990152
36059 -990152 -1798399 -2558239 -2773848 -2505627 -2101494 -1757997 -1530068 -1547577 -1874513 -2195598
36049 -2195598 -2012603 -1287441 -614438 -546415 -944668 -1236739 -1168991 -994655 -966226 -1002012
36039 -1002012 -973272 -1005859 -1218545 -1344021 -994892 -330746 -85614 -715311 -1780356 -2480220
36029 -2480220 -2610857 -2584464 -2592499 -2293540 -1477771 -534696 52917 274165 290134 -3481
36019c481n79969k42316O60707J045538K38034q74636r48906k8971N85254J33188
36009a5558p68141j104623o18491J38293M56326J24430k86582K4889R55971J352954
35999B59468N57084m30540k43155P75657R95221o8438j077759r56360l61814l71361
35989i21997p40334m65334N21262J210658Q75647j27784q46087o08564M22855
35980f79678J315399J220485L24948m26215o00339n90959n25169J17502J227793
35971A383767J477308O5202j701402j858478m15618P79932O49503k3512k54183
35962A02519k24472m10799m76089O3188P48722P02763n4180o06632l98203J65612
35952c87571M42355L34005R4326k48887q22716j336832j092908J15681J411085
$$ plain form
36019 -3481 -583450 -825766 -165059 880479 1118513 243877 -705029 -734000 -148746 -15558
36009 -15558 -783699 -1888322 -2506813 -2368520 -1912194 -1787764 -2074346 -2049457 -1093486 259468
35999 259468 816552 386012 142857 918514 1913735 1845297 767538 -188822 -550636 -921997
35989 -921997 -1662331 -2127665 -1606403 -395745 479902 352118 -493969 -1102533 -679678
35980 -679678 635721 1856206 2181154 1754939 1154600 563641 38472 155974 1383767
35971 1383767 2861075 2926277 1224875 -633603 -1049221 -269289 380214 356702 102519
35962 102519 -121953 -532752 -1008841 -945653 -196931 505832 451652 -154980 -553183 -387571
35952 -387571 54784 388789 483115 234228 -588488 -1925320 -3018228 -2902547 -1491462
35943a491462J652554P97271j18122m23265n38568r31941j132960n23300M37779
35934b272014P32180K89781Q568K97033N60290L17329p3144j57728p9471p5202
35924d52378M2283L79397N25175K13292o2285K44770P68483O94116n661n26795
35914A820397m18477j33812k16986m93413m21553N6059L97490J57605m39381p23924
35904d15995l34350L54300O47703L28925j43184k48147L0874L73500N87011O60416
35894A841053N50185K30211j20708k64130k01475r0237O4339L26419M80704J69311
35884B985672n14233r51533p59398l24038k63926n81442p32230m24594O9664M02695
35874a093363N30825N09425L16718Q2561J16321M19548N12851J16919l12680k16744
$$ plain form
35943 -1491462 161092 958363 840241 416976 -121592 -1053533 -2186493 -2709793 -2272014
35934 -2272014 -1539834 -1250053 -1241485 -944452 -384162 -66833 -139977 -297705 -377176 -452378
35924 -452378 -410095 -30698 494477 707769 645484 890254 1658737 2352853 2347192 1820397
35914 1820397 1401920 1268108 1051122 557709 136156 192215 589705 747310 307929 -415995
35904 -415995 -750345 -396045 251658 580583 437399 189252 220126 593626 1180637 1841053
35894 1841053 2391238 2621449 2500741 2236611 2035136 1944899 2009238 2335657 2816361 2985672
35884 2985672 2471439 1519906 760508 436470 172544 -408898 -1141128 -1565722 -1496058 -1093363
35874 -1093363 -562538 -53113 263605 346166 462487 882035 1394886 1511805 1199125 982381
35864I82381J58518J04377m20249p15197m52192j20660j26526j68353P7802L09669
35854c70430K02448J08996M52420Q12361M10808o69371j500475j494759r04080
35845b952082j66193N36979R77323Q39886K48236k00971j81034L9225K02633M65620
35835a90378Q82080R86610L73343n93806j111243q63570k82109N8743K7909q0394
35825g92815K8788L01495M00578J35467k66857m45385l40472j44564L7418J85095
35815i01252J66147o3888j73086J64546O56031O92550K54290r4168j54500l14264
35805B32406o28949m97878L02036R90047Q16856J61752r7535J34559K72753J10865
35795A796912k4053k8497j58461m09556m43768k09286m1713o1487l4221N4852
$$ plain form
35864 982381 1140899 1245276 825027 109830 -342362 -463022 -589548 -757901 -680099 -370430
35854 -370430 -167982 -58986 393434 1205795 1616603 947232 -553243 -2048002 -2952082
35845 -2952082 -3118275 -2581296 -1603973 -764087 -515851 -716822 -897856 -858631 -655998 -190378
35835 -190378 691702 1678312 2051655 1457849 346606 -516964 -799073 -740330 -712421 -792815
35825 -792815 -764027 -462532 -61954 73513 -193344 -638729 -979201 -1123765 -1086347 -901252
35815 -901252 -735105 -798993 -972079 -807533 -151502 541048 795338 701170 546670 232406
35805 232406 -396543 -894421 -592385 397662 1214518 1376270 1278735 1413294 1686047 1796912
35795 1796912 1772859 1744362 1585901 1176345 732577 523291 481578 420091 385870 440722
35785D40722j40164o73844j014980p08248J6852N66769O48980M09131J50779J06456
35775a97547K75873L55458N5386m19748n18100j18853K03439k1374m26232l15913
35765a127611K66071N15039J288o20378l67335P81713J717607J416050J13379
35756B695823r46036q99542j55254K49381l3408l50378r1861L75728K12482o24261
35746D32674j146223n72480N94862J142399O05334l21271p97405p16318m00272
35737a178700J2076M39610N47511J65983j97765R7282Q40973J163277P35747J29186
35727B755180j48526k69180m59361m64779j27014R9326j56920m10900J8438Q33869
35717A670133J035735L45441l88808l96074J3299L486o06188j140244r49754j72111
$$ plain form
35785 440722 300558 -373286 -1388266 -2096514 -2079662 -1512893 -863913 -454782 -304003 -197547
35775 -197547 78326 433784 489170 69422 -448678 -567531 -364092 -385466 -811698 -1127611
35765 -1127611 -861540 -346501 -345213 -965591 -1332926 -551213 1166394 2582444 2695823
35756 2695823 1749787 850245 694991 944372 910964 560586 468725 844453 1056935 432674
35746 432674 -713549 -1286029 -691167 451232 1056566 735295 -62110 -778428 -1178700
35737 -1178700 -1166624 -727014 -179503 -13520 -211285 -114003 726970 1890247 2625994 2755180
35727 2755180 2606654 2337474 1878113 1413334 1286320 1385646 1228726 817826 836264 1670133
35717 1670133 2705868 3051309 2662501 2266427 2279726 2283212 1677024 536780 -412974 -585085
35707e85085M94654O22530M28352K65357N8042l82105o95079k94489N70142Q33753
35697A316072P3237p75549p57037k84131l28987p45014n27966M17589R80346N18385
35687a13055k44719m56579l56309n93550r97245q30281L1567Q79386J080895P38331
35677h61559M14985M83874P68471P37513J40468n81104p84256m91606l07052l94521
35667h74787j81561N68981J033762L60141r40656j431905n49870P31231J191148
35658i3516P52001K60090K71254M98452L91133j01331n23227n49230l80152l77129
35648A48345m82556l18962J54363M76129L40639N4499K4144Q2132k27216q28140
35638e76623j080342o26108J41399O12255O34932M47974K06812j09705m28414
$$ plain form
35707 -585085 -90431 532099 960451 1225808 1283850 901745 206666 -87823 482319 1316072
35697 1316072 1389309 613760 -143277 -427408 -756395 -1501409 -2029375 -1611786 -631440 -113055
35687 -113055 -357774 -814353 -1170662 -1764212 -2761457 -3591738 -3560171 -2680785 -1599890 -861559
35677 -861559 -446574 37300 805771 1543284 1683752 1102648 318392 -173214 -480266 -874787
35667 -874787 -1056348 -487367 546395 906536 -34120 -1466025 -2015895 -1284664 -93516
35658 -93516 658485 918575 1189829 1688281 2079414 1978083 1454856 905626 525474 148345
35648 148345 -334211 -653173 -498810 -22681 317958 372457 396601 478733 251517 -576623
35638 -576623 -1656965 -2283073 -2141674 -1529419 -894487 -446513 -239701 -349406 -777820
35629g77820n31185l39765o6127K4957q8032k10659j90908n0495J05533J86789
35619a937712J21384r1807k73602j64424K27628N10300L53617j1989j1492N13224
35609g64873J006838Q21349j3271q14055r83566n71713r1701R8061J11779K27208
35599i73944M04629L34447j2359j75961J99593P52574P57196P3912o29213p17432
35589A3442l18627N044M8412Q6966K96929M12302J13050m25493o19242j66803
35579e54020N13667P29555L40640j26580k53021k76442o02333j053409j069073
35570b351016n63148o7669Q4760K37176P66597J322393J176562K65137n58109
35561C12683m97064K06978N89157K21002k34797P226O51160O61521k14282r71374
$$ plain form
35629 -777820 -1309005 -1648770 -1714897 -1689940 -1777972 -1988631 -2179539 -2230034 -2124501 -1937712
35619 -1937712 -1816328 -1908135 -2181737 -2346161 -2118533 -1608233 -1254616 -1266605 -1278097 -764873
35609 -764873 241965 1063314 1050043 235988 -747578 -1319291 -1410992 -1312931 -1201152 -973944
35599 -973944 -569315 -234868 -247227 -423188 -223595 528979 1286175 1360087 730874 13442
35589 13442 -305185 -300141 -251729 -164763 132166 544468 657518 232025 -387217 -554020
35579 -554020 -40353 689202 1029842 903262 650241 373799 -228534 -1281943 -2351016
35570 -2351016 -2914164 -2981833 -2897073 -2659897 -1893300 -570907 605655 870792 312683
35561 312683 -184381 22597 611754 832756 597959 605185 1256345 1917866 1703584 732210
35551G32210p28328N1647L35536N7313M7036N86665R35303M88233l07459n80404
35541A617752j39402M16859M65074k1612n30887o21458m85959o70132j089735
35532a059500q47317M36406J628799J343164q5387r80334o37212m0687o5514k75157
35522e82739q1594J21154j42329l87673n2905L55932J02477l85933j31329P42921
35512d42018J128704N90448j11250k00062K19337N21182K23429o63117j475973
35503b09320j344821l09969M44311J47660l54239O9018Q92153P08562l64678p14976
35493a036299J73181Q29994J30539r68236j009778k10689J53754k05376m20814
35484b563724k5736M45428M34971J05322p0147P2031L41932M71290L44476J01598
$$ plain form
35551 732210 3882 55529 391065 448378 495414 1082079 2017382 2505615 2198156 1617752
35541 1617752 1478350 1895209 2360283 2338671 1807784 1186326 700367 30235 -1059500
35532 -1059500 -1906817 -1470411 158388 1501552 1416165 435831 -201381 -242068 -307582 -582739
35522 -582739 -664333 -543179 -685508 -1073181 -1126086 -770154 -667677 -1053610 -1184939 -442018
35512 -442018 686686 1277134 1165884 965822 1185159 1706341 1929770 1266653 -209320
35503 -209320 -1554141 -1864110 -1419799 -1272139 -1626378 -1557360 -665207 43355 -321323 -1036299
35493 -1036299 -863118 -33124 97415 -870821 -1880599 -2091288 -1937534 -2142910 -2563724
35484 -2563724 -2589460 -2144032 -1709061 -1603739 -1673886 -1601855 -1259923 -788633 -444157 -342559
35474c42559j3828L8679R3854Q9606R1081o544l75050p66996o59839r8216J77456
35463a772356k00947n94785l06625L20973M25349o2996l78432j25096J95339L9919
35453b459657l50076l41062J67464O15380N68899L08643L94466P81781P84802
35444D70640P1969p26369q14301l12985K1545o2262j75011j89734m01309o57461
35434b775278k84389P17322J293243P74086o0382j17885M33439O26626K71412
35425H78194M2923J83294J50995l12056o42106l30861K54054L33652k97209j045676
35415g84796j173365n56672J78365L46269K8193p1475L19944O06237K49009l83553
35405a241844o16955m62362l32855j55819L81285R21288P36711m8540m73276j51454
$$ plain form
35474 -342559 -356387 -317708 -223854 -134248 -43167 -49711 -424761 -1191757 -1851596 -1949812 -1772356
35463 -1772356 -1973303 -2568088 -2874713 -2553740 -2128391 -2191387 -2569819 -2694915 -2499576 -2459657
35453 -2459657 -2809733 -3150795 -2983331 -2367951 -1799052 -1490409 -1095943 -314162 470640
35444 470640 542609 -183760 -998061 -1311046 -1289501 -1351763 -1526774 -1716508 -2117817 -2775278
35434 -2775278 -3059667 -2342345 -1049102 -275016 -335398 -453283 -19844 606782 878194
35425 878194 921117 1104411 1255406 943350 301244 -29617 224437 558089 260880 -784796
35415 -784796 -1958161 -2514833 -2336468 -1990199 -1962006 -2033481 -1713537 -1107300 -858291 -1241844
35405 -1241844 -1858799 -2321161 -2654016 -2809835 -2428550 -1507262 -770551 -819091 -1292367 -1443821
35395a443821K16751M6785k80551k43108p0869j60718k04632L03535J032691J098127
35385B94190L23983m51074m54022J19535M84106K37448k89382n58492n04230n46854
35375a344792q90321j023427k92324J022159J694155R41353n20261j261140p89268
35366b463866Q7762M84304M05549K88813J66235j55616l82829N3017R67844J304092
35356G55305M71687o88742r09371j46891N51328P03352R20385J526602J686474
35347D870129O39815r31422j702850j431485r32729o50430l17624O0219L3795
35338c62582k97217k01228M04832O05208m7273o60436l27846M93652Q11771O28616
35328A047497O12523P25451L42596m52440q48378o28058m38024n51112m15120
$$ plain form
35395 -1443821 -1227070 -1180285 -1460836 -1703944 -1774813 -1935531 -2140163 -1836628 -803937 294190
35385 294190 618173 167099 -286923 -167388 316718 554166 264784 -293708 -797938 -1344792
35375 -1344792 -2235113 -3258540 -3550864 -2528705 -834550 106803 -413458 -1674598 -2463866
35366 -2463866 -2376104 -1891800 -1486251 -1197438 -1031203 -1186819 -1569648 -1516631 -548787 755305
35356 755305 1226992 538250 -371121 -518012 33316 736668 1657053 3183655 4870129
35347 4870129 5509944 4578522 2875672 1444187 511458 -138972 -456596 -396377 -362582
35338 -362582 -659799 -861027 -456195 149013 101740 -558696 -886542 -392890 418881 1047497
35328 1047497 1660020 2385471 2728067 2275627 1427249 799191 361167 -189945 -605065
35319f05065J83141N12924P9034m43909k45164L21959L84945P829m3529K50661
35309D02826Q7504o95874j161554o65760J72856M43930J52695j76014m45106p39767
35299b624264o60526J12687Q74064N96863m29279p75690O3134Q79546N66353k70663
35289a667775l57883L31116P48439M50999L0266k9912O7121J02154K29359M47810
35279C51694M02724L0581j94335r81K06920N92l84441m36404j43496M1680j38600
35268b64066m59909n37825k42467J84661L79089K78236K04184L58588M50982J90231
35258E41704r9344N0888L22102m3936r12403j195195m40016M24642M60196j621
35248h92983j36242Q4736K37286M05437P67505P44366k38049j418474j420935
$$ plain form
35319 -605065 -421924 91000 170034 -273875 -519039 -197080 187865 195694 152165 402826
35309 402826 490330 -205544 -1367098 -2032858 -1860002 -1416072 -1263377 -1439391 -1884497 -2624264
35299 -2624264 -3284790 -3172103 -2298039 -1701176 -2130455 -2906145 -2843011 -1963465 -1397112 -1667775
35289 -1667775 -2025658 -1694542 -946103 -495104 -464838 -494750 -427629 -325475 -96116 351694
35279 351694 754418 784999 590664 589683 796603 797195 412754 -23650 -167146 -125466 -264066
35268 -264066 -723975 -1261800 -1504267 -1319606 -940517 -662281 -458097 -99509 351473 541704
35258 541704 442360 493248 815350 771414 -140989 -1336184 -1776200 -1351558 -891362 -892983
35248 -892983 -1029225 -944489 -707203 -301766 465739 1210105 972056 -446418 -1867353
35239a867353k96904M25529m0560p03862m45610M11572Q93407Q31228O83272N45762
35229D36481K16682j56098k61168j62938q341M40820J255115J674012R13524m95906
35219C852183j135106n55801J85002J17195l80947m31802o3305L37m01417o20824
35209E65515k32775L21066L60842j34066n62576m90872j32326l992k69005n65673
35199a143862m70800K5383N87626R23570R25541N60448p1243n74127n10630L6704
35189B88610M31903K09035l89379p79890o95009k36486M37388J081280J221556
35180A569008N75035l80836p48211k68291L56339L86261q0496m28172l96081k49536
35170C35020k37734k68700j46948J10214K66557J01411l21999o05161l89605J48049
$$ plain form
35239 -1867353 -2164257 -1738728 -1779288 -2483150 -2928760 -2517188 -1623781 -792553 -109281 436481
35229 436481 653163 497065 235897 72959 64618 505438 1760553 3434565 4348089 3852183
35219 3852183 2717077 2161276 2346278 2463473 2082526 1650724 1587419 1587756 1186339 565515
35209 565515 332740 653806 1014648 880582 318006 -172866 -305192 -309184 -578189 -1143862
35199 -1143862 -1614662 -1589279 -1001653 -78083 847458 1407906 1336663 762536 251906 288610
35189 288610 720513 929548 540169 -239721 -934730 -1171216 -733828 347452 1569008
35180 1569008 2144043 1763207 1014996 746705 1103044 1489305 1408809 980637 584556 335020
35170 335020 97286 -171414 -318362 -208148 58409 159820 -162179 -767340 -1156945 -1008896
35160a008896M09056J32569k22039j08176L44468N65527L62682N3753j55306m26377
35150e2739q10906r39721m46506N08829J321064J434102P29870l67430j127753
35141B48810j087851m80348O9915K69441L29985M41269M49545J91908j86265m46370
35131a99961n28642m41107j54751J98908L15525J44575N5703K98754N56103L75394
35121F20501j56184n49849n84339m30169j80640K83805Q71348J105109O22531
35112A602113l07578r68188q92523l13802J12939N3949j21628J30855O88348Q16443
35102H00928K13986m22678k85230L87289O02766J998o55021n64467P0411M32045
35092E82027K14267j12539r5375Q3622k4727m00871n22419r9572M29247L78482
$$ plain form
35160 -1008896 -599840 -467271 -689310 -797486 -453018 112509 475191 528944 373638 -52739
35150 -52739 -863645 -1803366 -2249872 -1741043 -419979 1014123 1743993 1376563 248810
35141 248810 -839041 -1319389 -1249474 -980033 -650048 -208779 240766 432674 246409 -199961
35131 -199961 -728603 -1169710 -1324461 -1125553 -810028 -665453 -609750 -310996 245107 620501
35121 620501 464317 -85532 -669871 -1100040 -1280680 -996875 -125527 979582 1602113
35112 1602113 1294535 326347 -566176 -879978 -767039 -713090 -834718 -703863 -15515 800928
35102 800928 1014914 592236 307006 694295 1297061 1299059 644038 79571 149982 582027
35092 582027 796294 683755 588380 672002 647275 246404 -276015 -375587 53660 432142
35082D32142l02704r19514q51428k20144L84470N90018M40402J29099j46751j55699
35072f20109K11184P03152Q69283N52769Q4080r6516Q9858L38944L52981J62455
35062B648081K1648L0706K865k12603m42760m37927k74185k00083j73094L3382
35052I96030K72845J00263m56915p50218m16704P5393J59055m3395j27749j32359
35042c23754k68088l21053j4730L16177J60992k29333j21981N24564R43795O97094
35032A363683K02675l0015k2011M7509K21144M63004M62602M3096n69504j034975
35022A147208j118743o40569K71336Q77277M74012n14650q53820j75355M69401
35013f3903J89470m23941k80021N26762R10918L72939m65252q29099n90562n5302
$$ plain form
35082 432142 129438 -790076 -1641504 -1861648 -1477178 -887160 -446758 -317659 -464410 -620109
35072 -620109 -408925 294227 1163510 1716279 1800359 1703843 1793701 2132645 2485626 2648081
35062 2648081 2669729 2700435 2703300 2490697 2047937 1610010 1335825 1135742 962648 996030
35052 996030 1268875 1369138 912223 162005 -254699 -179306 -20251 -63646 -191395 -323754
35042 -323754 -591842 -912895 -927625 -611448 -450456 -679789 -801770 -277206 666589 1363683
35032 1363683 1566358 1536343 1514332 1561841 1782985 2245989 2708591 2751687 2182183 1147208
35022 1147208 28465 -612104 -340768 536509 1010521 495871 -357949 -533304 -63903
35013 -63903 125567 -298374 -578395 -51633 859285 1232224 766972 -62127 -652689 -707991
35003g07991M73835P81976P74832N53240K61764r5238m93590o96375n09694j23074
34993B19685R1249L4395j16611k50699l82942m42117k79977R0004M39011N35023
34983f2979L59526J53919K06977M49823L74873l27629j143724j220025m91822
34974a701061K20759L53527K19573K62024L40448J66105r9629j34024Q6870M48614
34964A63206Q26805Q03175l6064j144644j231835n1729R15684M15407q02061j202174
34954a344230o86910l02202l33471j89237J35848L7316l18020r8352N89743O82970
34944a826545J6856k60855M09054J070678Q61280K88082J42550K51777J42756
34935A095633r032O1832M2647k58936l29667J52394N95522M44350Q1978j0714
$$ plain form
35003 -707991 -234156 547820 1322652 1875892 2137656 2042418 1548828 852453 342759 219685
34993 219685 310934 345329 228718 -21981 -404923 -847040 -1127017 -1037013 -598002 -62979
34983 -62979 296547 450466 657443 1107266 1482139 1154510 10786 -1209239 -1701061
34974 -1701061 -1480302 -1126775 -907202 -645178 -304730 -138625 -238254 -372278 -285408 163206
34964 163206 990011 1793186 1757122 612478 -619357 -671086 244598 660005 -142056 -1344230
34954 -1344230 -2031140 -2333342 -2666813 -2856050 -2720202 -2682886 -3000906 -3099258 -2509515 -1826545
34944 -1826545 -1809689 -2070544 -1661490 -590812 270468 558550 701100 952877 1095633
34935 1095633 1086601 1148433 1191080 932144 602477 754871 1350393 1794743 1876721 1866007
34925A866007j72997p31996j067564n69387J79486L11359J38474M87308J100673
34916A541363J036234L07817k18526l49725o31736j000484p77737r8189N5399
34907a35584m73134o19777J57581R32749P25417j20671o42653n56423k11204J14864
34897h28835K93887K24790O4754J22373K78548J16068k07059m3235N13841M88578
34887A023710l77236r40902l66424M62660K99307m83065n43375K62421P36552
34878G3648K51958m60999o09588l39034j05119P2996L05726M31311L24966J35088
34868H0953o8984m32115q72964r84706o20438j29965K08336N07024P79972P01354
34858h31533K45782K1790M05462P77680L27415o36930r63929k37885O69878Q26569
$$ plain form
34925 1866007 1693010 961014 -106550 -675937 -496451 -185092 -46618 440690 1541363
34916 1541363 2577597 2885414 2666888 2317163 1685427 684943 -92794 -190983 -135584
34907 -135584 -608718 -1228495 -1070914 -138165 587252 466581 -176072 -732495 -943699 -828835
34897 -828835 -534948 -310158 -245404 -123031 155517 271585 64526 21291 535132 1023710
34887 1023710 646474 -294428 -660852 -198192 101115 -381950 -925325 -662904 73648
34878 73648 325606 -135393 -744981 -1084015 -1189134 -1116138 -810412 -379101 -54135 80953
34868 80953 11969 -420146 -1293110 -2277816 -2898254 -3028219 -2819883 -2312859 -1532887 -831533
34858 -831533 -585751 -563961 -158499 619181 946596 309666 -654263 -892148 -222270 604299
34848F04299L48550q2716k41643l18184k31997K66552Q57187P53763j79480r89261
34838G87070p74137J12609N68286K51141q5927J61557N45911K94349n15690j058581
34828B86588q66806l08462O4104J79104K68951L72012L28861J32910l5208j36729
34818B85325l62729p52354r27521m80329M13611J051479R64557M01349o3553j52932
34808C76903N8055M08791O44476L97951l54590r65466p62130L9230O04433O06810
34798A054463M24087K23456k69138q49997o79116L71440J102036N60128m98824
34789A438535p28114j61135J35583m5072O9866N50736M74521l74417r09855m34495
34779A6153K98493M45872L61264O02381O88182K9464o92887m48118L19005K24228
$$ plain form
34848 604299 952849 870133 628490 310306 78309 344861 1202048 1955811 1776331 787070
34838 787070 12933 125542 693828 944969 859042 1020599 1566510 1860859 1345169 286588
34828 286588 -580218 -888680 -824576 -645472 -376521 -4509 324352 457262 422054 285325
34818 285325 -77404 -829758 -1757279 -2237608 -1823997 -772518 192039 593388 529835 376903
34808 376903 434958 843749 1488225 1886176 1531586 566120 -196010 -156780 447653 1054463
34798 1054463 1478550 1702006 1432868 582871 -96245 275195 1377231 1937359 1438535
34789 1438535 710421 549286 684869 639797 709663 1260399 1734920 1360503 450648 16153
34779 16153 314646 760518 1121782 1724163 2412345 2441809 1748922 1300804 1619809 1844037
34769A844037q32860j408350o93699L20116L74784l61159q13976n27491O3264
34760b035334M88101P01481P92562P09929L66829j26072l94521r6205N68745Q53370
34750A828885L10099n44018q62872n97308l85556m27102k34060L90046R03575
34741C81689Q54700M95131K27596L8780j64693k34873j72148k76525n48016n40068
34731F1573j89733r0103m47147n46338O7684O64121M58976l6745J19730O67422
34721G29440O24656L3281j59616J62019R4836n96860j000112o36429k31405l50298
34711a330488m61332p9159K35038j03724n83030m68976p4528j14218l53358q689
34701c342464Q27798J240078Q62608K81147O3721J82600M30236O97151P64474
$$ plain form
34769 1844037 1011177 -397173 -1090872 -770756 -395972 -757131 -1571107 -2098598 -2035334
34760 -2035334 -1547233 -845752 -53190 656739 1023568 897496 502975 406770 975515 1828885
34750 1828885 2138984 1594966 732094 134786 -250770 -677872 -911932 -521886 381689
34741 381689 1236389 1731520 1959116 1997896 1833203 1598330 1426182 1149657 601641 61573
34731 61573 -128160 -218263 -665410 -1211748 -1144064 -479943 -20967 -57712 62018 729440
34721 729440 1354096 1387377 1227761 1389780 1484616 887756 -112356 -748785 -980190 -1330488
34711 -1330488 -1791820 -1870979 -1635941 -1739665 -2322695 -2791671 -2866199 -2980417 -3333775 -3342464
34701 -3342464 -2514666 -1274588 -411980 -130833 -67112 115488 545724 1242875 2007349
34692B007349M32637p4860l48042m06010n49730o83322m11287J89466N37650L72744
34682A066595L2523j84353l63440n64573o17531m79536l09705q7377L29829O98304
34672d79264N53154L0598j37456K72899N28229J3185p86222q93203q5506R29590
34662e3996J350778R50902J41409l56347j46895L32269K57128m58979r44332n58136
34652E13801J97028L98984o2757n00322l96471J35050O64532P96343L81192k63931
34642A863449n58732l78135k33551m03107l72144L03831J052861R79035J99623
34633B453130l63195l71915l55495o06351p19775m27565n9559J20326K93640M77326
34623D40567K78311l13952o05866k28866J56176j23804n79253k70211O24678R29141
$$ plain form
34692 2007349 2439986 2365126 2017084 1611074 1061344 378022 -33265 156201 693851 1066595
34682 1066595 1099118 914765 551325 -13248 -630779 -1110315 -1420020 -1507397 -1177568 -479264
34672 -479264 73890 104488 -32968 239931 768160 781345 -4877 -898080 -983586 -53996
34662 -53996 1296782 2247684 2389093 2032746 1885851 2218120 2475248 2016269 1071937 513801
34652 513801 710829 1109813 1047056 546734 150263 285313 949845 1746188 2127380 1863449
34642 1863449 1304717 926582 693031 289924 -82220 221611 1274472 2253507 2453130
34633 2453130 2089935 1718020 1362525 756174 36399 -391166 -450725 -330399 -36759 440567
34623 440567 718878 404926 -200940 -429806 -273630 -397434 -976687 -1246898 -622220 306921
34613C06921J86481o33743m76933L91100Q13143K42877o67303r15337k36515P36463
34603b52846J193131Q63169P2426p01098j156168j151265o68692N5889N63307
34594a182147N61931K49476R8389L44758P86632J038878Q85706M17498q9236m24471
34584B687414n82956o14030m27155L6660M60953L32881l52807q80854o34728O8155
34574I3533L59689l5972m91590m05672j2334N2588k60661l16114K73838R93451
34564B50756R90647J58247o79097p09355j522O99445Q08544L25355l60119p75140
34554G07761o09928j4088L96667J73817l52967m64836j9740M26889M86252L58723
34544A088550K38535q4644o72781j027861p17960k2534M98140O83035N60535l7862
$$ plain form
34613 306921 493402 -140341 -617274 -226174 586969 829846 162543 -752794 -989309 -252846
34603 -252846 940285 1803454 1875880 1174782 18614 -1132651 -1801343 -1745454 -1182147
34594 -1182147 -620216 -370740 -272351 72407 859039 1897917 2783623 3201121 3111885 2687414
34584 2687414 2104458 1490428 1063273 1099933 1560886 1893767 1540960 660106 25378 93533
34574 93533 453222 417250 -74340 -480012 -492346 -439758 -700419 -1016533 -742695 250756
34564 250756 1241403 1399650 720553 11198 9676 709121 1517665 1843020 1482901 707761
34554 707761 97833 83745 480412 654229 301262 -163574 -183314 243575 729827 1088550
34544 1088550 1327085 1242441 569660 -458201 -1176161 -1198695 -700555 -17520 543015 505153
34534E05153r79248j390433o19187N86952Q39697K7185n37726o7420O34705N25013
34524d75309j76546n55726m21888l10308m18710l66910N3017N42469P81519P90932
34514e57460P25434O24289M35650J02822l48908o88334o00544j14419K97684K81751
34504A57965L9005p1541r3603k45208l70758j41150K97798M22300J16688j35253
34494b3757K2342L40595M32514L53749M13748O10821N60733k2318r17909j506417
34484B64101j303617m40751M33036P83804O20400K32867k24367o38555p06343
34475i79425k49381L52707N24543K66650R2838K09566L14266K72820L41057M95668
34465A641309K60648l68006n28319K80507J135193P81001n10708j240640q44368
$$ plain form
34534 505153 -474095 -1864528 -2483715 -1896763 -1057066 -1029881 -1567607 -1635027 -1000322 -475309
34524 -475309 -651855 -1207581 -1629469 -1939777 -2358487 -2725397 -2672380 -2129911 -1348392 -557460
34514 -557460 167974 792263 1227913 1330735 981827 293493 -307051 -421470 -123786 157965
34504 157965 196970 125429 31826 -213382 -584140 -725290 -427492 -5192 111496 -23757
34494 -23757 -1415 339180 771694 1125443 1539191 2150012 2710745 2688427 1770518 264101
34484 264101 -1039516 -1480267 -1047231 -263427 356973 589840 365473 -273082 -979425
34475 -979425 -1228806 -876099 -351556 -84906 7932 217498 531764 804584 1145641 1641309
34465 1641309 1901957 1533951 1005632 1286139 2421332 3202333 2691625 1450985 606617
34456F06617m18710q73450j411869p39365Q65547J793571J251796J26905m58171
34447G42871m86376m63825l15046K93152R61118Q81089J29248k92955L4607K61750
34437A745633l72698j222551j130990k21362K45494k29309o64705j23809R18095
34428a056202J343198R13992K96851m8257k12106k39799Q103L36352K71016j60437
34418A452711l38165m3257P6620m59478r81574m76097Q27002J516390Q09705m23737
34408A960120q70389m42356r6673k98631m86313j51141L21451L32963O1453J48663
34398D79147O56186R91656Q39657N41313M20497L11219L3171j54095L3579L97376
34388D549706N88816O64706Q41300R14425M76558l49424r26453r19812o49451
$$ plain form
34456 606617 187907 -685543 -2097412 -2836777 -1971230 -177659 1074137 1201042 742871
34447 742871 256495 -207330 -522376 -229224 731894 1612983 1742231 1449276 1483883 1745633
34437 1745633 1372935 150384 -980606 -1201968 -956474 -1185783 -1850488 -1974297 -1056202
34428 -1056202 286996 1200988 1497839 1449582 1237476 997677 1005780 1342132 1613148 1452711
34418 1452711 1114546 1071289 1147909 688431 -293143 -769240 57762 1574152 2383857 1960120
34408 1960120 1089731 647375 550702 252071 -234242 -385383 -63932 269031 330484 479147
34398 479147 1135333 2126989 2966646 3507959 3928456 4239675 4272846 4118751 4152330 4549706
34388 4549706 5138522 5803228 6644528 7558953 8035511 7686087 6759634 5839822 5190371
34379E190371n30337n93449p17788r07223j061686q21604k0310Q76518J140194
34370B554686N79012k51114o51669m62671j17180q0260k84079k22256L22416Q43691
34360B230576P05683O1549k72752P9817N83565O36263L76896K42531J69530j60586
34350D653072n50086m63638P3198M35064L49776K28045L12242J60323n62156j297609
34340C338231j229838m20404L16081N36796N29712N46479L66109j12489m08903
34331C461774n0981O95970J147195J058481P28407L69528j02530o05735p38737
34322E963372l52758J00246J46979k8533R5368N08165O24365K13125j00009L86784
34312G557104J426453K026597J663561Q91287N92882R59525J497285J806764J925899
$$ plain form
34379 5190371 4660034 4066585 3348797 2441574 1379888 558284 537974 1414492 2554686
34370 2554686 3133698 2882584 2230915 1768244 1651064 1570804 1286725 1064469 1386885 2230576
34360 2230576 2936259 2997808 2725056 2804873 3388438 4024701 4401597 4644128 4813658 4653072
34350 4653072 4102986 3639348 3712546 4147610 4497386 4725431 5037673 5197996 4635840 3338231
34340 3338231 2108393 1687989 2004070 2540866 3070578 3617057 3983166 3870677 3461774
34331 3461774 3410793 4106763 5253958 6312439 7040846 7410374 7307844 6702109 5963372
34322 5963372 5610614 5710860 5857839 5829306 5924674 6432839 7057204 7270329 7170320 7557104
34312 7557104 8983557 11010154 12673715 13565002 14157884 15117409 16614694 18421458 20347357
34303B0347357J957621J857953J766580K091087K891156L519975L396706K947592
34295D0776027L152021M146645M957303M844735M256100L973440L865044L174706
34287G3146021J756165K51949r22576k054445l417975m669499n270049n142917
34279E3676674m640406m128257l814479l743933l755348l606383l241904k769993
34271B3975971k202472j528356r96427q65584q68038n16161m2582k70291j224594
34262A5461466j736848j083947k30430m71783j439376j686863r67430n09403q99842
34253F435544j136093l77396O03701O71987J15541K1332M20689L30807m89325
34244F596787j047928o44552J07492K89516j1026m4192L75562O82374M85813Q4329
$$ plain form
34303 20347357 22304978 24162931 25929511 28020598 30911754 34431729 37828435 40776027
34295 40776027 43928048 48074693 53031996 57876731 62132831 66106271 69971315 73146021
34287 73146021 74902186 75154135 74231559 72177114 68759139 64089640 58819591 53676674
34279 53676674 49036268 44908011 41093532 37349599 33594251 29987868 26745964 23975971
34271 23975971 21773499 20245143 19248716 18383132 17515094 16998933 16956351 16686060 15461466
34262 15461466 13724618 12640671 12410241 11938458 10499082 8812219 7844789 7335386 6435544
34253 6435544 5299451 4922055 5525756 6197743 6313284 6334616 6755305 7086112 6596787
34244 6596787 5548859 4904307 5011799 5301315 5290289 5246097 5621659 6304033 6789846 6874175
34234F874175p3388j9885j02464m03750o28644n38696k36135Q0441M16554Q06544
34224F174752R80962N79368k45973q02856o62687k25567j83582o14383r81046
34215D018988r37253o98587n48697l85151O905M81738O23749K47909l69242p39385
34205A700974n59672O4766O82696Q25767L94823k51370o19115m96679p7410K67460
34195A932240L27734K11766J62183J97308M1642m57980r49431q64204j25612O59333
34185A134979Q18017K60545n50415j061243r56036k93420M49678O63779K21829
34176F87713l00548k82428J80043M81105L68303J61106Q2348j12884n72778q39053
34166a47073l81382N27592R72758N02876l01954n59949j36486L01729J87946k80845
$$ plain form
34234 6874175 6800787 6780902 6678438 6274688 5646044 5107348 4871213 4951654 5368208 6174752
34224 6174752 7155714 7735082 7489109 6686253 6023566 5797999 5614417 5000034 4018988
34215 4018988 3081735 2383148 1834451 1449300 1456205 1937943 2561692 2809601 2440359 1700974
34205 1700974 1141302 1206068 1888764 2714531 3109354 2857984 2238869 1742190 1664780 1932240
34195 1932240 2259974 2471740 2633923 2831231 2872873 2414893 1465462 601258 475646 1134979
34185 1134979 1952996 2213541 1663126 601883 -354153 -647573 -197895 465884 687713
34176 687713 387165 104737 284780 765885 1134188 1295294 1377642 1264758 691980 -147073
34166 -147073 -528455 -863 971895 1474771 1172817 612868 476382 778111 966057 685212
34156F85212m93216k45173O2017O9265q703K24793O26088O55427K73393J41764
34146A990867O22331J062269O31502m26737j067176q68596m43572l26510k52400
34137I21978R2034L47798J49359o4876K64583O83603K59448q00502j115368o1392
$$ plain form
34156 685212 191996 -53177 8840 78105 69402 294195 920283 1575710 1849103 1990867
34146 1990867 2613198 3675467 4306969 3880232 2813056 1944460 1500888 1174378 921978
34137 921978 1014012 1361810 1511169 1446293 1710876 2394479 2653927 1853425 738057 676665
$$ [...]
##END NTUPLES=NMR SPECTRUM
##END=
