##TITLE=31Pdec_DE_46H_D2O
 D2O, 64 sc
 6.8.2024
##JCAMPDX= 6.0         $$ Bruker NMR JCAMP-DX V2.0
##DATA TYPE= NMR SPECTRUM
##DATA CLASS= NTUPLES
##ORIGIN= UXNMR, Bruker Analytische Messtechnik GmbH
##OWNER= root
$$ XWIN-NMR		Version 3.5
$$ Tue Aug  6 16:33:31 2024 Russian Standard Time (UT+4h)  she@DPX200
##.OBSERVE FREQUENCY= 81.013821
##.OBSERVE NUCLEUS= ^31P
##.ACQUISITION MODE= SIMULTANEOUS
##.ACQUISITION SCHEME= undefined
##.AVERAGES= 64
##.DIGITISER RES= 17
##SPECTROMETER/DATA SYSTEM= spect
##.PULSE SEQUENCE= zgpg30
##.SOLVENT NAME= D2O
##.SHIFT REFERENCE= (INTERNAL, D2O, 0, 198.062)
##AUDIT TRAIL= $$ (NUMBER, WHEN, WHO, WHERE, WHAT)
$$ ##TITLE= Audit trail, XWIN-NMR		Version 3.5
$$ ##JCAMPDX= 5.01
$$ ##ORIGIN= Bruker BioSpin GmbH
$$ ##OWNER= she
$$ F:/spectra/data/she/nmr/P31/2/pdata/1/auditp.txt
$$ ##AUDIT TRAIL=  $$ (NUMBER, WHEN, WHO, WHERE, WHAT)
(   1,<2024-08-06 16:32:55.71 +0400>,<she>,<DPX200>,
      <created by zg, POWCHK disabled, PULCHK disabled
       configuration hash MD5:
       00 E9 B6 7A A2 85 ED C7 34 08 36 98 17 FE 4E 26
       data hash MD5: 32K
       2E 3F 58 C2 9F 75 B4 D7 87 89 CA 9A 50 32 BC B8>)
(   2,<2024-08-06 16:32:57.92 +0400>,<she>,<DPX200>,
      <Start of raw data processing
       efp BC_mod = 2 LB = 1.5 FT_mod = 6 PKNL = 1 PHC0 = 2627.862 PHC1 = 185.2869 SI = 64K 
       data hash MD5: 64K
       6B 65 19 31 8B 96 53 3D 38 8F AB EB 28 1D AD 8E>)
$$ ##END=
$$ 
$$ hash MD5
$$ 05 F2 5D 60 97 AB C5 3B E2 B0 A3 41 3A 12 50 20
##$RELAX= 
##$RELAX= 
##$RELAX= 
##$RELAX= 
##$RELAX= 
##$RELAX= 
##$RELAX= 
##$RELAX= 
$$ Bruker specific parameters
$$ --------------------------
##$DU= <F:/spectra>
##$EXPNO= 2
##$NAME= <P31>
##$PROCNO= 1
##$TYPE= <nmr>
##$USER= <she>
##$AMP= (0..31)
100 100 100 100 100 100 100 100 100 100 100 100 100 100 100 100 100 100 
100 100 100 100 100 100 100 100 100 100 100 100 100 100 
##$AQSEQ= 0
##$AQ_mod= 1
##$AUNM= <au_zg>
##$AUTOPOS= <>
##$BF1= 81.014009
##$BF2= 200.13
##$BF3= 200.13
##$BF4= 200.13
##$BF5= 200.13
##$BF6= 200.13
##$BF7= 200.13
##$BF8= 200.13
##$BYTORDA= 1
##$CFDGTYP= 0
##$CFRGTYP= 5
##$CHEMSTR= <none>
##$CNST= (0..31)
1 1 145 1 1 1 1 1 1 1 1 1 1 1 1 1 1 1 1 1 1 1 1 1 1 1 1 1 1 1 1 1 
##$CPDPRG= <waltz16>
##$CPDPRG1= <>
##$CPDPRG2= <waltz16>
##$CPDPRG3= <>
##$CPDPRG4= <mlev>
##$CPDPRG5= <mlev>
##$CPDPRG6= <mlev>
##$CPDPRG7= <mlev>
##$CPDPRG8= <mlev>
##$CPDPRGB= <>
##$CPDPRGT= <>
##$D= (0..31)
0 1 0 0 0 0 0 0 0 0.06 0 0.03 2e-05 3e-06 0 0 0.0002 0 0 0 0 0 0 0 0 0 
0 0 0 0 0 0 
##$DATE= 1722947575
##$DBL= (0..7)
120 120 120 11 120 120 24 19 
##$DBP= (0..7)
150 150 150 150 150 150 150 150 
##$DBP07= 0
##$DBPNAM0= <>
##$DBPNAM1= <>
##$DBPNAM2= <>
##$DBPNAM3= <>
##$DBPNAM4= <>
##$DBPNAM5= <>
##$DBPNAM6= <>
##$DBPNAM7= <>
##$DBPOAL= (0..7)
0.5 0.5 0.5 0.5 0.5 0.5 0.5 0.5 
##$DBPOFFS= (0..7)
0 0 0 0 0 0 0 0 
##$DE= 6
##$DECBNUC= <off>
##$DECIM= 4
##$DECNUC= <off>
##$DECSTAT= 4
##$DIGMOD= 1
##$DIGTYP= 9
##$DL= (0..7)
0 0 52 120 120 21 21 25 
##$DP= (0..7)
$$ [...]
##$SUBNAM3= <"">
##$SUBNAM4= <"">
##$SUBNAM5= <"">
##$SUBNAM6= <"">
##$SUBNAM7= <"">
##$SUBNAM8= <"">
##$SUBNAM9= <"">
##$SW= 400.765351723535
##$SWIBOX= (0..15)
0 1 3 0 0 0 0 0 0 0 0 0 0 0 0 0 
##$SW_h= 32467.5324675325
##$TD= 32768
##$TD0= 1
##$TE= 0
##$TE2= 300
##$TE3= 300
##$TEG= 300
##$TL= (0..7)
0 120 53 12 22 120 120 120 
##$TP= (0..7)
150 150 150 150 150 150 150 150 
##$TP07= 0
##$TPNAME0= <>
##$TPNAME1= <>
##$TPNAME2= <>
##$TPNAME3= <>
##$TPNAME4= <>
##$TPNAME5= <>
##$TPNAME6= <>
##$TPNAME7= <>
##$TPOAL= (0..7)
0.5 0.5 0.5 0.5 0.5 0.5 0.5 0.5 
##$TPOFFS= (0..7)
0 0 0 0 0 0 0 0 
##$TUNHIN= 0
##$TUNHOUT= 0
##$TUNXOUT= 0
##$USERA1= <user>
##$USERA2= <user>
##$USERA3= <user>
##$USERA4= <user>
##$USERA5= <user>
##$V9= 5
##$VALIST= <valist>
##$VCLIST= <CCCCCCCCCCCCCCC>
##$VD= 0
##$VDLIST= <DDDDDDDDDDDDDDD>
##$VPLIST= <PPPPPPPPPPPPPPP>
##$VTLIST= <TTTTTTTTTTTTTTT>
##$WBST= 1024
##$WBSW= 4
##$XGAIN= (0..3)
0 0 0 0 
##$XL= 0
##$YL= 0
##$YMAX_a= 8447
##$YMIN_a= -5847
##$ZGOPTNS= <>
##$ZL1= 120
##$ZL2= 120
##$ZL3= 120
##$ZL4= 120
##$ABSF1= 0
##$ABSF2= 0
##$ABSG= 0
##$ABSL= 0
##$ALPHA= 0
##$AQORDER= 0
##$ASSFAC= 0
##$ASSFACI= 0
##$ASSFACX= 0
##$ASSWID= 0
##$AUNMP= <proc_1d>
##$AZFE= 0.1
##$AZFW= 0.5
##$BCFW= 0
##$BC_mod= 2
##$BYTORDP= 0
##$COROFFS= 0
##$CY= -3
##$DATMOD= 1
##$DC= 0
##$DFILT= <>
##$DTYPP= 0
##$F1P= 0
##$F2P= 0
##$FCOR= 1
##$FTSIZE= 65536
##$FT_mod= 6
##$GAMMA= 0
##$GB= 0
##$INTBC= 1
##$INTSCL= 9.790993e-09
##$ISEN= 30
##$LB= 1.5
##$LEV0= 0
##$LPBIN= 0
##$MAXI= 10000
##$MC2= 0
##$MEAN= 0
##$ME_mod= 0
##$MI= 50
##$NCOEF= 0
##$NC_proc= -11
##$NLEV= 6
##$NOISF1= 182.463
##$NOISF2= 159.3651
##$NSP= 0
##$NTH_PI= 0
##$NZP= 0
##$OFFSET= 198.0616
##$PC= 4
##$PHC0= 2627.862
##$PHC1= 185.2869
##$PH_mod= 1
##$PKNL= yes
##$PPARMOD= 0
##$PSCAL= 0
##$PSIGN= 0
##$REVERSE= no
##$SF= 81.0140089999434
##$SI= 65536
##$SIGF1= 159.3651
##$SIGF2= -187.1042
##$SINO= 113.3802
##$SIOLD= 16384
##$SREGLST= <1H.CDCl3>
##$SSB= 0
##$STSI= 65536
##$STSR= 0
##$SW_p= 32467.5324675325
##$SYMM= 0
##$S_DEV= 0
##$TDeff= 32768
##$TDoff= 0
##$TI= <>
##$TILT= no
##$TM1= 0
##$TM2= 0
##$TOPLEV= 0
##$USERP1= <user>
##$USERP2= <user>
##$USERP3= <user>
##$USERP4= <user>
##$USERP5= <user>
##$WDW= 1
##$XDIM= 65536
##$YMAX_p= 490976821
##$YMIN_p= -304702953
$$ End of Bruker specific parameters
$$ ---------------------------------
##NTUPLES= NMR SPECTRUM
##VAR_NAME=  FREQUENCY,     SPECTRUM/REAL,   SPECTRUM/IMAG
##SYMBOL=    X,             R,               I
##VAR_TYPE=  INDEPENDENT,   DEPENDENT,       DEPENDENT
##VAR_FORM=  AFFN,          ASDF,            ASDF
##VAR_DIM=   65536,         65536,           65536
##UNITS=     HZ,            ARBITRARY UNITS, ARBITRARY UNITS
##FACTOR=    0.49542278885378, 1,            1
##FIRST=     16045.7642231865, 0,            0
##LAST=      -16421.768244346, 0,            0
##MIN=       -16421.768244346, -304702953,   0
##MAX=       16045.7642231865, 490976821,    0
$$ Real data points
##PAGE= N=1
##DATA TABLE= (X++(R..R)), XYDATA
$$ [...]
41650i5002747K8172169q26055j9904103L019716L4248783K8735856n65236j2609607
41642c4731224o316059q094856j4349619o85669K4130952K6420608N327904o701072
41634a4999035r05823k232614j7362317j8613669P029647L1822945K8456190P979595
41626B1174919j557260O906852J8234601J7541169L942818q720857l856621J5035916
41618F8701537K0583127l163809l2218997l3153401j2566951n979127k2399865
41611b0197486l4052371k2883344l202200R228463J8569341K7673598K4353394
41604e10605M948768j0725149m726723J3945586K2315299R917468j4976059l4220451
41596a4031866l1648422q727813J1097281P372382j1042152k0610297j6733568
$$ plain form
41650 -95002747 -66830578 -67656633 -87560736 -84541020 -50292237 -21556381 -22121617 -34731224
41642 -34731224 -41047283 -49142139 -63491758 -64177427 -40046475 -13625867 -8297963 -14999035
41634 -14999035 -15904858 -18137472 -35499789 -54113458 -47083811 -15260866 13195324 21174919
41626 21174919 19617659 26524511 44759112 62300281 66243099 57522242 53665621 68701537
41618 68701537 89284664 86120855 53901858 20748457 8181506 2202379 -20197486
41611 -20197486 -54249857 -77133201 -80335401 -71106938 -52537597 -24863999 -510605
41604 -510605 4438163 -6286986 -11013709 2931877 25247176 35164644 20188585 -14031866
41596 -14031866 -45680288 -54408101 -43310820 -35938438 -46980590 -67590887 -84324455
41589h4324455j0438954l47595K0817712L6190780J9093639j8533024l0854041
41582f8395938k815304K6314092K0116248q051553k4313541j8792979N16567K8163534
41574d7258874N0845979M4091056O658374k4878964k2087345k239013O403237
41567A1534450J0276753K6920885L9221856J7050182k7202659m8916625l4844634
41560e959792j5787462j2753162j0475105L825525J1707879m341863k5134112
41553e8918092j8089028J4425481L4150177J5558345k0703336l1922446n226558
41546g0725457K6742944K7829580N106155l799901J3655242K7856198J4149365
41539D0814126r621878j2739850K545216J1438207Q045147O405660Q488733K278293
$$ plain form
41589 -84324455 -94763409 -95111004 -74293292 -38102512 -19008873 -37541897 -68395938
41582 -68395938 -71211242 -44897150 -24780902 -32832455 -57145996 -75938975 -75422408 -47258874
41574 -47258874 3587105 47678161 54336535 29457571 7370226 5131213 11534450
41567 11534450 21811203 48732088 87953944 105004126 77801467 28884842 -5959792
41560 -5959792 -21747254 -34500416 -44975521 -41149996 -29442117 -33783980 -58918092
41553 -58918092 -77007120 -62581639 -28431462 -12873117 -33576453 -65498899 -70725457
41546 -70725457 -43982513 -16152933 -11046778 -14846679 -1191437 26664761 40814126
41539 40814126 31192248 18452398 20997614 32435821 40480968 46886628 55375361 57653654
41531E7653654j0328914j3316261o055662n421066j4541962j6458720n308174
41524a3777105K747581r79244k891833O089749J3256549Q555969L339688O603968
41516B2945322L823578j7966473m1036834l8531670j4168519M834999P314452
41509g2785145N479469O589691L486695m792488p269610k210830k915991j3433854
41501h7852063j7541189m295040J1182933P993505r888705j9196960p943101J3972333
41493a13568287L1534561L8281487L3792062K0535255O120905j022620j509219
41486A4164144k907091n852610j501760J2850200K4714210K0736727M323604r271972
41478E7255452j1922741q476000n840752n451012p247973j2134508j6590433j2084595
$$ plain form
41531 57653654 47324740 34008479 27952817 22531751 7989789 -8468931 -13777105
41524 -13777105 -11029524 -12008768 -14900601 -8810852 4445697 13001666 16341354 22945322
41516 22945322 26768900 8802427 -32234407 -70766077 -84934596 -80099597 -72785145
41509 -72785145 -67305676 -60715985 -57229290 -62021778 -69291388 -71502218 -74418209 -87852063
41501 -87852063 -105393252 -109688292 -98505359 -90511854 -100400559 -119597519 -127540620 -113568287
41493 -113568287 -82033726 -43752239 -9960177 10575078 16695983 15673363 14164144
41486 14164144 11257053 5404443 3902683 16752883 41467093 62203820 66527424 57255452
41478 57255452 45332711 36856711 31015959 25564947 18316974 6182466 -10407967 -22492562
41470b2492562L733736J9440249K0816449Q465316k468282j471175N084790M839283
41462C5947804l135290r156797q498383o790335q434178q902419l731240K617369
41454a0083469M582499O127740J3718217K2474169K0823809Q513419j252294J02916
41446F5007006N808090M358085o768836k0495501k6404607j6908411M503116K0715949
41438B9814891J6352423l604189k0488290k5682761k3834294j4755089O681847
41431c5515462K9563605L1109391J2353674M348927K1944424L6085330J6458323
41424A16348212j9216157k9374138q485790J0441838O664986p972331j8710680
41417D9695940k6017634k9033374j9289042m26331Q609810N45897p906506k39606
$$ plain form
41470 -22492562 -18758826 681423 21497872 29963188 27494906 26023731 31108521 35947804
41462 35947804 32812514 23655717 15157334 8366999 -67179 -8969598 -12700838 -10083469
41454 -10083469 -5500970 626770 14344987 36819156 57642965 66156384 64904090 65007006
41446 65007006 70815096 75173181 68404345 47908844 21504237 4595826 9098942 29814891
41438 29814891 46167314 42563125 22074835 -3607926 -27442220 -42197309 -35515462
41431 -35515462 -5951857 25157534 37511208 41860135 63804559 99889889 116348212
41424 116348212 97132055 67757917 59272127 69713965 76378951 68406620 49695940
41417 49695940 23678306 -5355068 -24644110 -25070441 -16460631 -15914734 -23821240 -24060846
41409b4060846J7128507K3936152Q738645j9434979l4670188j5750330K4298636
41402a9814403M2456704J8222244j3369401r098198J7279272J6596656j7424923
41395C4847951l9405860k4895845j545887O069541J3621640L4776268M5650614
41388F9118422K3816791j1208822k8747775k9820652k9552161k5119859j2327785
41381d3841841o777489j5584735j3997381J5303112M5009413M2241113K0114904
41374D2467096J0214951P832447r289279k8418297k0580788J142883k859731k9579607
41366b9070325l4552242m978462K1268579J9333724J0312182J4728951J8167411
41359A5209818N019291j0164703q094746O243201J8155761K2516188J5635521
$$ plain form
41409 -24060846 -6932339 17003813 25742458 6307479 -28362709 -44113039 -19814403
41402 -19814403 22642301 40864545 27495144 18396946 35676218 52272874 34847951
41395 34847951 -4557909 -29453754 -30999641 -24930100 -11308460 23467808 69118422
41388 69118422 92935213 81726391 52978616 23157964 -6394197 -31514056 -43841841
41381 -43841841 -50619330 -66204065 -80201446 -64898334 -19888921 22352192 42467096
41374 42467096 52682047 60514494 51225215 22806918 2226130 3369013 509282 -29070325
41366 -29070325 -63622567 -68601029 -47332450 -27998726 -17686544 -2957593 15209818
41359 15209818 20229109 10064406 1969660 8212861 26368622 48884810 64520331
41352F4520331o433275l0192478l1957555j3199786j002550m361969j687642J6999355
41344g315569L0114739K2632940R849361M086893p792298l0502806l8111589j4745996
41336c1784325J2207776J1493887n075736q359972j321568n799386j7716464j4541280
41328f0897068K814157J2342472R785275J1312770J9519175J8305831L688173
41321A6870785p356002l074928R100537J7418909J7272882Q121732m900138q957553
41313D4496224J019677R841090J971902j2917204j3934151j612105N963761M522190
41305C9351384O207526J2614911J0871209q90209p818649l138110K030289r47303
41297E8281048o657151r479724j1294408j0626507j604665J1010159J2684598
$$ plain form
41352 64520331 58087056 27894578 -4062977 -17262763 -18265313 -22627282 -24314924 -7315569
41344 -7315569 22799170 45432110 55281471 59368364 51576066 21073260 -17038329 -31784325
41336 -31784325 -19576549 -8082662 -13158398 -21518370 -22839938 -28639324 -46355788 -60897068
41328 -60897068 -58082911 -45740439 -35955164 -24642394 -5123219 13182612 16870785
41321 16870785 9514783 6439855 15540392 32959301 50232183 58353915 53453777 44496224
41313 44496224 45515901 55356991 57328893 44411689 30477538 28865433 34829194 39351384
41305 39351384 45558910 58173821 69045030 68154821 60336172 57198062 59228351 58281048
41297 58281048 51623897 42144173 30849765 20223258 18618593 29628752 42313350
41290D2313350P77021j0329858j0698584n573645l56643P325861J4230904Q665225
41282D6353631r342218k1322814j4695252J32725P262972O169854M101449J285563
41274A9945910l085062j748190R004016J6923811P396222j5637871l3827239l4741323
41266c5769726j9261837L529052J8382718J0346381j5894528l0572280j1222500
41259h0462720K2687227K8338520m219409l5338464k6073744J1527549L1767672
41252e1773369J4020505j6061071k4428282r041652O420880O035686n172961j5346638
41244i5346902j7626039p770916J5064296L9379194M5351982K7289202L777941
41237A0118758m479512J52505P01089p185794j2009644q670817o796633j2228689
$$ plain form
41290 42313350 43090371 32760513 22061929 16488284 16131641 23457502 37688406 46353631
41282 46353631 37011413 15688599 993347 1126072 8389044 14558898 18660347 19945910
41274 19945910 16860848 15112658 24116674 41040485 48436707 32798836 -1028403 -35769726
41266 -35769726 -55031563 -51502511 -33119793 -22773412 -38667940 -69240220 -80462720
41259 -80462720 -57775493 -29436973 -33656382 -68994846 -95068590 -83541041 -51773369
41252 -51773369 -37752864 -53813935 -78242217 -87283869 -80862989 -74827303 -80000264 -95346902
41244 -95346902 -112972941 -120743857 -105679561 -66300367 -20948385 6340817 10118758
41237 10118758 5639246 5791751 6492840 -692954 -12702598 -21373415 -28170048 -40398737
41229d0398737j4628116k255228K0305317L7440406L8603585K2650570n536716
41222E6181081l3699701m4484562l0763534o034169J0220780J4868096J8164238
41215a5547771K1312693J3010422p076208j7514752j498314K4741685K7325637
41208D4753392j410210l0263143k7069650K368845K3840866J6647355o147009
41201B2720446j8304185j0497383L633565N416097q520346k2069900j6228763
41194d3850469Q175393K8434526K6131788J0231639M031999J2516240J7062668
41187F2733784M441839j4107905k0129130j2031439j780806L837179P528090J1753071
41179D2244683J4225721J1327276P31422j6014083l0260006l1796138k1383738
$$ plain form
41229 -40398737 -55026853 -57282081 -36976764 463642 39067227 61717797 56181081
41222 56181081 22481380 -22003182 -52766716 -58800885 -48580105 -33712009 -15547771
41215 -15547771 5764922 18775344 11699136 -5815616 -7313930 17427755 44753392
41208 44753392 43343182 13080039 -13989611 -11620766 12220100 28867455 22720446
41201 22720446 4416261 -6081122 -2447557 2968540 -5551806 -27621706 -43850469
41194 -43850469 -35675076 -7240550 18891238 29122877 33154876 45671116 62733784
41187 62733784 67175623 53067718 32938588 20907149 19126343 22963522 30491612 42244683
41179 42244683 56470404 67797680 68529102 52515019 22255013 -9541125 -30924863
41172c0924863j0320963m358095J290338O773317K928544q633676q014876J3395116
41164c7865158L0406392J4291513k2833240l9486920j8849955J3193646K6189156
41157c4954566J7560092J011721j4406278k2238616j4685109M448283J6057914
41150d7206559R252295j288477N010750K5121735L6114197K4099642k437612k5916640
41142B2749331l5373889k8988039j1037462Q957753J8721476J1252964o564574
41135b0282440j5538435j439207K5511284L5694781J3351963k0392640k9460340
41128a2555034n336933K5293696L4917137K2554929M034870r930383j8165033
41121D0813249k2164037k3071787k0052743r099369R314090K2408111J7396557
$$ plain form
41172 -30924863 -41245826 -45603921 -44313583 -37540266 -34611722 -43245398 -51260274 -37865158
41164 -37865158 -7458766 6832747 -16000493 -55487413 -74337368 -61143722 -34954566
41157 -34954566 -17394474 -16382753 -30789031 -53027647 -67712756 -63264473 -47206559
41150 -47206559 -37954264 -39242741 -34231991 -9110256 27003941 51103583 48665971 22749331
41142 22749331 -12624558 -41612597 -52650059 -43692306 -24970830 -13717866 -20282440
41135 -20282440 -35820875 -37260082 -11748798 23945983 37297946 16905306 -12555034
41128 -12555034 -17891967 7401729 42318866 64873795 68908665 58978282 40813249
41121 40813249 18649212 -4422575 -24475318 -33574687 -24260597 -1852486 15544071
41114A5544071J672113n346087k322673p686938k5162812l1293556j1007632J6818350
41106d8785164K8613442L0230444L6781854L6824692J0515740k6067409l3266490
41099C4847109o713273J2927429L87792j7652130o596726K3140472L5208546K1495272
41091I7044491N913473J617336m179535k0063784l2734390l0064745k0855855
41084c323009j7133679j2498436M147110K3425198K4397272N948785r949814q943623
41076F069804r68980j47524m578700p084066j1622805k2980479l0131699j9358262
41068i0802711M22544O096075m943801r197245P427099K7753403K8961786J4593810
41060a9689040M876891N262829L141964p206053j3881117n489355J1492047J9759700
$$ plain form
41114 15544071 17216184 11870097 9547424 1860486 -23302326 -54595882 -65603514 -48785164
41106 -48785164 -20171722 10058722 46840576 83665268 94181008 68113599 34847109
41099 34847109 28133836 41061265 41449057 23796927 17200201 40340673 75549219 97044491
41091 97044491 102957964 104575300 100395765 80331981 47597591 17532846 -3323009
41084 -3323009 -20456688 -32955124 -28808014 -5382816 19014456 24963241 15013427 6069804
41076 6069804 5100824 4953300 374600 -6709466 -18332271 -41312750 -71444449 -90802711
41068 -90802711 -90380167 -84284092 -89227893 -98425138 -90998039 -63244636 -34282850 -19689040
41060 -19689040 -14812149 -9549320 -6407356 -13613409 -27494526 -32983881 -21491834 -1732134
41052a732134J0779407o513466j5088963p195590P206262J1408313J703208q640477
41044h073440o984825L743071J2065503J3000732R278107L385872k692069l195333
41036B0527618O321227J9407952K1568558N135474k1104091l7329151k8509087
41029a3981500J94315K3213030J7738803r895990k9935616k4638282n559504J0163901
41021c2700843K2715850L4407605L0137410j210465l6115478l7916621q235377
41014b8917919J3383602O550966m053743P433025K8008638L1345805J9221020
41007G2971394R572262Q15728j8947021l6485788k4087320J1914165K8278550
41000D4031970L615003k9018968k8484226k175714R989801n332180k2063152j9013908
$$ plain form
41052 -1732134 9047273 2533807 -12555156 -19750746 -12544484 -1136171 567037 -8073440
41044 -8073440 -15058265 -11315194 750309 13751041 23029148 26415020 23722951 20527618
41036 20527618 26848845 46256797 67825355 72960829 51856738 14527587 -13981500
41029 -13981500 -13787185 9425845 27164648 17268658 -12666958 -37305240 -42864744 -32700843
41021 -32700843 -9984993 24422612 54560022 53349557 17234079 -20682542 -28917919
41014 -28917919 -15534317 -8983351 -13037094 -5604069 22404569 53750374 72971394
41007 72971394 82543656 83359384 64412363 27926575 3839255 15753420 44031970
41000 44031970 47646973 18628005 -9856221 -12031935 -2042134 -7374314 -29437466 -48451374
40992d8451374p821105o821621r586999K016462K4483717L2633097J3432062j4965707
40984a5081468k4772424j1378308M005067K865820q276542r672460K322961R171725
40976e0815629k532127j8843282j6152522M594011J8697924J3970976O764756
40969d4315893J2439755J8334654M619350j9920502k6582045q045958J2495524
40962e0975115J6895790J4695633K0870005K9852485K6497638J0367876o537726
40955F1666586j8296066k6215476k6833221j4796531K796501R597620J771090
40948a0309497m105513Q024334L0221158L5995210J0889277k6546045m0729993
40941C438931j8622953J3315686K0205347J640981j1143009o64459J3923195Q318150
$$ plain form
40992 -48451374 -56272479 -63094100 -72681099 -70664637 -46180920 -13547823 -115761 -15081468
40984 -15081468 -39853892 -51232200 -47227133 -44361313 -52637855 -62310315 -59987354 -50815629
40976 -50815629 -53347756 -72191038 -88343560 -83749549 -65051625 -51080649 -44315893
40969 -44315893 -31876138 -13541484 -8922134 -28842636 -55424681 -63470639 -50975115
40962 -50975115 -34079325 -19383692 1486313 31338798 57836436 68204312 61666586
40955 61666586 43370520 17155044 -9678177 -24474708 -21678207 -12080587 -10309497
40948 -10309497 -14415010 -6390676 23830482 59825692 70714969 44168924 3438931
40941 3438931 -15184022 -1868336 18337011 19977992 8834983 8170524 22093719 30411869
40933C0411869j1056500k0061654j3394158o646725o804298k694165J2385839
40926a7859792K6286035K3427953M171500j6041418j9990525j226456K7503504
40919B6270801L9759113K1297910r842998k2401587j0978706J09400o029386j8067451
40911B0117096k0804247j9097974k1485075j7788578L710896K7232291K4574866
40904c540725j986697j7964604m089050J8052700K0407235Q035014M469546J1607874
40896C4991293J0122760l780464r052986N397496J9000014P689244k0859916l7464115
40888F043326k8335139m980797J6894611L0225603L0372184J4949978o797609
40881E8372157j9536118k0246376j7589001j1901269N834899L0233596L7579084
$$ plain form
40933 30411869 19355369 -706285 -14100443 -20747168 -27551466 -30245631 -17859792
40926 -17859792 8426243 31854196 36025696 19984278 -6247 -1232703 26270801
40919 26270801 66029914 87327824 77484826 55083239 44104533 44213933 38184547 20117096
40911 20117096 -687151 -19785125 -41270200 -59058778 -55347882 -28115591 -3540725
40904 -3540725 -5527422 -23492026 -27581076 -9528376 10878859 18913873 23383419 34991293
40896 34991293 45114053 41333589 32280603 37678099 56678113 64367357 43507441 6043326
40888 6043326 -22291813 -27272610 -10377999 19847604 50219788 65169766 58372157
40881 58372157 38836039 18589663 1000662 -10900607 -5065708 25167888 62746972
40874F2746972J7388039r564839j8869177j2803531p691609o213433j784297J661953
40866B4870078l495016r723711m560804N320664K582848j0758170j4535344k779339
40858a3078794O530859j437805j9083052k8888278k1277961J631791K6175963
40851d9427277L2165679J4001705n501096j346757J6949645J8980737J606299
40844B7428935p789856p53001m109658l0437344m6532859j9646591K9256399N1281776
40836a302199L4409776J0620065N831985J3830715J9521320J9518769J2970940
40829A15401371n381570l1642925m6767712l6047066q325800J2183309J1339211
40822A0758818j391495n056635P593285K0130596J3067210q495626j9457895q057646
$$ plain form
40874 62746972 80135011 70570172 51700995 38897464 31205855 24992422 23208125 24870078
40866 24870078 21375062 11651351 7090547 12411211 14994059 4235889 -10299455 -13078794
40858 -13078794 -6547935 -7985740 -27068792 -55957070 -77235031 -75603240 -49427277
40851 -49427277 -17261598 -3259893 -8760989 -10107746 6841899 25822636 27428935
40844 27428935 19639079 18886078 14776420 -15660924 -62193783 -81840374 -52583975 -1302199
40836 -1302199 33107577 43727642 49559627 63390342 82911662 102430431 115401371
40829 115401371 110019801 78376876 31609164 -4437902 -12763702 -580393 10758818
40822 10758818 9367323 4310688 11903973 32034569 45101779 36606153 17148258 9090612
40814I090612J0050318J6622337J3864465J2224039J0019594L67182j1830108
40807F0408439j5277797q366494J934604R854042R603389m441697k4095085k6651139
40799B968262l403110K3125712K7458137J4076867K860589m127454j6109596k5682153
40791B1167254j7993057k043610j085739j2896493j1753431P039357J7233062
40784c32657M429515j1812104j0785458J771089J2230520J9289968K1010433P533556
40776D3334862j5527787k1048349J320784K3100984J6334108n733316j3471616
40769B8309670p355268q265694j5077237p452200J3846665K4031986J4255792
40762D2293714L616512M130916J690323j5739133l3838879l2090810j3159966
$$ plain form
40814 9090612 19140930 35763267 49627732 61851771 71871365 72238547 60408439
40807 60408439 45130642 36764148 38698752 48552794 58156183 53714486 29619401 2968262
40799 2968262 -434848 22690864 50149001 64225868 67086457 62959003 46849407 21167254
40791 21167254 3174197 1130587 44848 -12851645 -24605076 -17565719 -332657
40784 -332657 4096858 -7715246 -18500704 -16729615 -4499095 14790873 35801306 43334862
40776 43334862 27807075 6758726 8079510 31180494 47514602 41781286 28309670
40769 28309670 20954402 12688708 -2388529 -9840729 4005936 28037922 42293714
40762 42293714 45910226 50041142 51731465 35992332 2153453 -29937357 -43097323
40755d3097323L025346N138931j595639o583499l676813N382904J1738462Q955324
40747b0712307M112390J0359642K5591743L0953602J7236400k5196k522339M719962
40739F9713897L434659q870108j6352738r540615K626944P639301L492728o275342
40731D5868726k0215128l4310012l7639014k1886201O939101L1869910L9321757
40724I949139K8455077J0141054r92232J251954O416784l009505k8405962m7919301
40716b4112992m1073016j5052832M908354P701149M361709M378853K092999o345212
40708f3140988r463963K205614J6893603J6389174L848901l78123J0940125K2249983
40700d55674J8453999L991711o512485o386785j37430M064758M73416j0361017
$$ plain form
40755 -43097323 -40071977 -34933046 -36528685 -43112184 -46788997 -41406093 -29667631 -20712307
40747 -20712307 -16599917 -6240275 19351468 50305070 67541470 67516274 64993935 69713897
40739 69713897 73148556 64278448 47925710 38385095 41012039 48651340 52144068 45868726
40731 45868726 25653598 -8656414 -46295428 -68181629 -61242528 -29372618 9949139
40724 9949139 38404216 48545270 47553038 48804992 55221776 52212271 23806309 -24112992
40716 -24112992 -65186008 -80238840 -75330486 -67629337 -63267628 -58888775 -56795776 -63140988
40708 -63140988 -72604951 -70399337 -53505734 -37116560 -33267659 -33645782 -22705657 -455674
40700 -455674 17998325 21990036 15477551 9090766 8953336 13018094 13491510 3130493
40692C130493k1017668k4557736k2094941j7931955j0564866K348656J3433636
40685g7254381J2954892N597212M955613J0559585P902317m673037q855503M580061
40677d4233241J8631752J5850416M214995k30878j405538j1505383k1917913j2207663
40669e2803453J4180862K8264007J3924854j1920985k3646469j4912171L763465
40662d3149890J9798161K2935880Q633181j2886852k1069035q250198Q925806
40655b5062947R713963n255072j6389038q232259J6275967M0328549M6447219
40648E7826382K9242572N07489k0725545k6045357k2603587j9956049j8874863
40641b0628958j5693094r988319l015799N533974J4535704K0314560K2000617
$$ plain form
40692 3130493 -17887175 -42444911 -64539852 -82471807 -93036673 -90688017 -77254381
40685 -77254381 -64299489 -58702277 -53746664 -43187079 -35284762 -39957799 -48813302 -44233241
40677 -44233241 -25601489 -9751073 -5536078 -5766956 -7172494 -18677877 -40595790 -52803453
40669 -52803453 -38622591 -10358584 3566270 -8354715 -32001184 -46913355 -43149890
40662 -43149890 -23351729 -415849 8217332 -4669520 -25738555 -33988753 -25062947
40655 -25062947 -15348984 -20604056 -36993094 -45225353 -28949386 11379163 57826382
40648 57826382 87068954 87576443 66850898 40805541 18201954 -1754095 -20628958
40641 -20628958 -36322052 -46310371 -49326170 -43792196 -29256492 -8941932 13058685
40634A3058685K2196057J9648350R203612o911488j6767033j3739885n378226
40627B1310072p06650J961866O204709O678040q12005o472397J923985J9270216
40619D9357836K8732477K3973716J2396309o47409j5715501k8424970l0570724
40612C9101734k3719109j7498884j3215890m487149M631438J137005j2032075
40605b6082930j2943196O703717K4576088J8447517j856887j1466656o695202
40598i317549l038071n302588l052066O286245J1723293Q644128N907705Q920037
40590B0771134J2011895J2598969J7243440K6534620K7720286J1696756j2031283
40583A16545817k5239704j9766159l141990P165710m889587l6566869n9710398
$$ plain form
40634 13058685 35254742 54903092 64106704 57195216 40428183 26688298 21310072
40627 21310072 20603422 22565288 28769997 35448037 34636032 28163635 30087620 49357836
40619 49357836 78090313 102064029 114460338 113812929 98097428 69672458 39101734
40612 39101734 15382625 -2116259 -15332149 -19819298 -15187860 -14050855 -26082930
40605 -26082930 -39026126 -32322409 -7746321 10701196 8844309 -2622347 -9317549
40598 -9317549 -12355620 -17658208 -20710274 -14424029 -2700736 5943392 11851097 20771134
40590 20771134 32783029 45381998 62625438 89160058 116880344 128577100 116545817
40583 116545817 91306113 71539954 68397964 75563674 70674087 34107218 -25603180
40576b5603180m6946401p862904J8146426J0650338r714302j6388285j1233663
40569h8951971q096490m472003P010603J6194572J1687597O529395J7696660K9720749
40561a2680888J3423699k2141204l4169272q520610J8718617J5849231j478216
40554c0998643k555062J1230986J7779594J2348185O244831R19938r584852j8713470
40546a3328493j5063759m773382l030403o986054l96486J5884297K1510700Q083419
40538A899839p480095o946505Q121180K4433563L1657439K4738628N969111j0455228
40530G1937932r637691L424306P837022m263113j7828235j9903095j7729817k1225627
40522g388318k2471216q197578J6055513K9554783K1102393k54458j6520716j5525043
$$ plain form
40576 -25603180 -72549581 -80412485 -62266059 -51615721 -61330023 -77718308 -88951971
40569 -88951971 -97048461 -101520464 -94509861 -78315289 -66627692 -60098297 -42401637 -12680888
40561 -12680888 742811 -21398393 -55567665 -64088275 -45369658 -29520427 -30998643
40554 -30998643 -33553705 -22322719 -4543125 7805060 14049891 14969829 5384977 -13328493
40546 -13328493 -28392252 -33165634 -36196037 -43182091 -43578577 -27694280 -6183580 1899839
40538 1899839 -5580256 -12526761 -4405581 20027982 51685421 76424049 82393160 71937932
40530 71937932 62300241 65724547 73561569 69298456 51470221 31567126 13837309 -7388318
40522 -7388318 -29859534 -38057112 -22001599 7553184 28655577 28401119 11880403 -3644640
40514c644640R68073J6961293J5495661j071573j0931890n65442J5821250J5303411
40506D8336143k779285j8188741j7395960n686427O058690J2409662J0952214
40499C3706296K150664o108504n030659K281281N276052L568287O529882J3221303
40491E5594602R251180r109573k3633594j8899654n123697j233767n718413k723788
40483a596704R213366J5321390J0473787N961533O709861K397146j0122358j5207677
40475B3150344l117912J0627084Q587984l78276Q38686K920120j5807145m3500345
40467a6679460l9030538O967084M8468483M3562949J1050491j915862J1035544
40460F3458691J5824801j529747j5723907q567915K626240j887088j2763010j2835948
$$ plain form
40514 -3644640 -2676567 14284726 29780387 28708814 17776924 17211482 33032732 48336143
40506 48336143 45556858 27368117 9972157 4285730 10344420 22754082 33706296
40499 33706296 35856960 29748456 24717797 26999078 32275130 35843417 42373299 55594602
40491 55594602 64845782 55736209 32102615 13202961 8079264 6845497 1127084 -1596704
40483 -1596704 7616662 22938052 33411839 39373372 46083233 48480379 38358021 23150344
40475 23150344 20032432 30659516 39247500 38869224 39707910 42628030 26820885 -16679460
40467 -16679460 -55709998 -48742914 -274431 43288518 54339009 52423147 63458691
40460 63458691 79283492 77753745 62029838 53461923 56088163 54201075 41438065 28602117
40452B8602117o233600m654667m191248J110214p2729j5967958k6551267r190711
40444c7149849J9781078K2706071k726873j9457015q251863O658472K498230m991068
40436b0932817P160277K6621918K4655388K843940r656732n07541J1322639O916240
40428D8423312q698714j8803215j4676815J506271J9923362K5585454J0255433
40421F3515088j4174602k5583978j7849957n119885K469620J1168591K4185738
40414C8610615K6974598P890561j7096739k0111098M47594J5938272N689971j6478166
40406D1865608k2801204o909376J3895807K4741491K6289824K2452104J0802446
40399A10336700q219300k4478584l0308017l0853340l1427861k3325804J637408
$$ plain form
40452 28602117 22368517 17713850 13522602 14632816 14560087 -1407871 -27959138 -37149849
40444 -37149849 -17368771 5337300 2610427 -16846588 -25098451 -18439979 -15941749 -20932817
40436 -20932817 -13772540 12849378 37504766 40348706 30691974 30184433 41507072 48423312
40428 48423312 39724598 20921383 6244568 7750839 27674201 53259655 63515088
40421 63515088 49340486 23756508 5906551 786666 3256286 14424877 38610615
40414 38610615 65585213 73475774 56379035 36267937 36715531 52653803 58343774 41865608
40406 41865608 19064404 12155028 26050835 50792326 77082150 99534254 110336700
40399 110336700 102117400 77638816 47330799 16477459 -14950402 -38276206 -36638798
40392c6638798K7784274K8097099K491892j7860572j2824447Q43791l534q156863
40384a6267158j639839J7465761K5945837J5436970k60029j2356176k5130594
40377C194772l3716633k1543523R199304K8914731J8781595j423139k225935J4088283
40369A5269455K2060589J2599012Q98107j206204R64697K50995j746444m149653
40361D4940554j1484164k1440317k0007644Q03171K6617859L2515140J1247055
40354F3191654j6967185k5947651j2097957L206272P14249j3241859j7105571
40347a8248048l962252J0853315J3892312J2025733J7793695K5962347J8441798
40340G6758900r001867l6537248m1050052k2228899l135570l680546j6237883
$$ plain form
40392 -36638798 -8854524 19242575 21734467 3873895 -8950552 -8106761 -8110295 -16267158
40384 -16267158 -17906997 -441236 25504601 40941571 40681542 28325366 3194772
40377 3194772 -30521861 -52065384 -42866080 -13951349 4830246 3407107 1181172 15269455
40369 15269455 37330044 49929056 50827163 49620959 50585656 50836651 49090207 44940554
40361 44940554 33456390 12016073 -7991571 -7188400 19429459 51944599 63191654
40354 63191654 46224469 20276818 8178861 11385133 12099382 -1142477 -18248048
40347 -18248048 -22210300 -11356985 2535327 14561060 32354755 58317102 76758900
40340 76758900 67757033 31219785 -9830267 -32059166 -35194736 -38875282 -55113165
40333e5113165j4674089R325732K9870210J9329132j1512570k6242219j2868218
40326f1885187M259725O422481N598681J4485783J9547575O209795j1368074j1956479
40318b8685700j313867K982695N056418J7327054K5709928N169984l3575185m9592077
40310e6920750k7643428L976563J7676609J7851786J8717909J9498136J4935134
40303H091959Q310119K565931l615207n631894R32306L195520j3098834k9612696
40295b8862796j2871757K7002113L6526631l579595m1944037k6932927K1539277
40288b9123091M6587660L2449526P450921r922365k3347693k8002342j1564170
40281a5471554J4588051K2220294P883160l127815K023785P722746J286379o331376
$$ plain form
40333 -55113165 -69787254 -60461522 -30591312 -11262180 -22774750 -49016969 -61885187
40326 -61885187 -57625462 -51202981 -45604300 -31118517 -11570942 -5361147 -16729221 -28685700
40318 -28685700 -29999567 -27016872 -21960454 -4633400 21076528 26246512 -7328673 -56920750
40310 -56920750 -84564178 -80587615 -62911006 -45059220 -26341311 -6843175 8091959
40303 8091959 16402078 18968009 15352802 9720908 10653214 13848734 749900 -28862796
40295 -28862796 -41734553 -14732440 21794191 18214596 -23729441 -50662368 -29123091
40288 -29123091 17464569 49914095 57365016 47442651 24094958 -3907384 -15471554
40281 -15471554 -883503 21336791 29219951 26092136 28115921 35838667 37125046 30793670
40273C0793670j815464Q161802P126224r576733k9051607l0699006m834075L0697565
40265H02376M1296350J5156693j8653376k6513209j1642867o69423l725394j1987507
40257a5936357k1046317k8239970j8978970J1949925L5956852K3872347m841998
40250a7264488p406357J3239111J3579100j3479257k1709137J0754482L9407800
40243A7121254K0894078j9373385k6194930P713602M1602230M4867833K0785219
40236A07415901j3280312l7875908l4778593o480129J6294539R759661j1238737
40229B9816422j8692379j3683878j6111215k5080162k1101956j991138J3149936
40222e3694370J4359556R675371N074250j21494P38547J5260385L1051351K5706416
$$ plain form
40273 30793670 28978206 37140008 44266232 34689499 5637892 -25061114 -29895189 802376
40265 802376 42098726 57255419 38602043 12088834 445967 -223456 -3948850 -15936357
40257 -15936357 -36982674 -65222644 -84201614 -72251689 -36294837 -12422490 -17264488
40250 -17264488 -24670845 -11431734 2147366 -11331891 -33041028 -22286546 17121254
40243 17121254 38015332 18641947 -7552983 160619 41762849 86630682 107415901
40236 107415901 94135589 56259681 21481088 15000959 31295498 41055159 29816422
40229 29816422 11124043 -2559835 -18671050 -43751212 -64853168 -66844306 -53694370
40222 -53694370 -39334814 -29659443 -24585193 -24706687 -23968140 -8707755 22343596 48050012
40214D8050012Q55224j6750385j2871680k769565l911550j1643186j1303458Q97329
40206i447259J7480740K7960645K2454412N3940k2149604k2522082k484157J3436805
40198B4783440J0456601P41089k11804K276373m334585j4249078r720457J0671771
40190B0413350K6729226K2859439Q112655L120281J2884116K1323981J3540828
40183A28983876m445483j5002973j3625116j3027653k0814322k5754140j5002542
40176B1311647M364002J3409196O411823m516542q535678p935280r081062j1498883
40168C929223j0861307p434422o606354j1669628j8247775j8291131j1167827
40161h0349221o326655q654868o952515R813241K8876022K7272964J0825415J2132928
$$ plain form
40214 48050012 48905236 32154851 19283171 16513606 12602056 958870 -10344588 -9447259
40206 -9447259 8033481 35994126 58448538 58502478 36352874 13830792 11346635 24783440
40198 24783440 35240041 35981130 35769326 38045699 33711114 19462036 9741579 20413350
40190 20413350 47142576 70002015 78114670 81234951 94119067 115443048 128983876
40183 128983876 124538393 109535420 95910304 82882651 62068329 36314189 21311647
40176 21311647 25675649 39084845 45496668 40980126 32444448 24509168 15428106 3929223
40168 3929223 -6932084 -14366506 -20972860 -32642488 -50890263 -69181394 -80349221
40161 -80349221 -86675876 -95330744 -102283259 -92470018 -63593996 -36321032 -25495617 -13362689
40153a3362689L7867935M8158303J3530283l3284387l8589911m787349J6050984
40146B5583169O25814j8685327j2810469J632797o62199r605379j681447J7084206
40138A481165K0743585M139235j2297634j2869618j027321J2868953K1261443
40131C4299808J9789396J1629051P567202J0314232O118640j3887273l2210126
40124D3620930k4024153N920939K6092883J9783210M579322L738012J4913165
40117I4624308J8753867P658210o960865j1718751n355351L494252O260305J931445
40109A08687420k677808j638547K57981q091761k6091101l5011900j9016400J0856361
40101B7274245K6060261J5928989J646080P766659K9372158L8776142K0310113
$$ plain form
40153 -13362689 24505246 72663549 86193832 52909445 14319534 9532185 25583169
40146 25583169 26208983 7523656 -5286813 -3654016 -4316215 -13921594 -15603041 1481165
40138 1481165 22224750 26363985 14066351 1196733 169412 13038365 34299808
40131 34299808 54089204 65718255 73285457 83599689 89718329 75831056 43620930
40124 43620930 19596777 25517716 51610599 71393809 75973131 79711143 94624308
40117 94624308 113378175 121036385 114075520 102356769 97001418 100495670 106755975 108687420
40109 108687420 106009612 104371065 104629046 96537285 70446184 35434284 16417884 27274245
40101 27274245 53334506 69263495 70909575 78676234 108048392 146824534 167134647
40094A67134647j2925210l5629671l3666103j1773730J1684676J7320240K143976
40087A04288825j5017926j5404841n867103q013393k2204403k2928399K594109
40080A7446869L1621396L5597057J6312067l669519j2746912j4523139j2038695
40073E7999124p164728o907710j1906970p839185J2460300K9019138K0250338
40066H5910307j093498n146527Q433570J2585095k37782p735394O88720O389544
40058I9794035l108886j2750708r542288m964438r816573j3156071o500989l602887
40050C6351195j2794328j4209744P035524K6582075J3741387j6822920k3901420
40043A5981769k193551J3300481N551228j318152J2238582K7333274J8859851
$$ plain form
40094 167134647 154209437 118579766 84913663 73139933 84824609 102144849 104288825
40087 104288825 89270899 73866058 67998955 59985562 37781159 14852760 17446869
40080 17446869 49068265 84665322 100977389 97307870 84560958 70037819 57999124
40073 57999124 50834396 43926686 32019716 24180531 36640831 65659969 85910307
40066 85910307 84816809 79670282 88103852 100688947 100451165 92715771 93404491 99794035
40058 99794035 96685149 83934441 74392153 69427715 59611142 46455071 39954082 36351195
40050 36351195 23556867 9347123 16382647 42964722 56706109 39883189 15981769
40043 15981769 13788218 27088699 32639927 31321775 43560357 70893631 89753482
40036H9753482l679748j2346365l347776J075806j1310894k5520437k1302512
40029A3321556J069823K3149063K9968092K3289829J4519914R387444L607838
40022A18313559o906810j7144932j8038515p053003R856563K3096270K2779944
40015A24903076M259633k1557365k9962927p892527K4090227L0081175K017585
40008A25938877k9880700l6138072k2247604j1620364q732359j134821Q068729
40001B4253686j565602k9289491l9977238j0774320K7939986K8258520o916789
39994h071248k6434368n436709K0035349J1127599j4574453j3951774J3615506
39987b3690098K8923629J5727787P87123O686661J9649896J7322570J725796j1089927
$$ plain form
40036 89753482 86073734 73727369 70379593 71455399 60144505 34624068 13321556
40029 13321556 14391379 37540442 67508534 90798363 105318277 114705721 118313559
40022 118313559 111406749 94261817 76223302 69170299 79026862 102123132 124903076
40015 124903076 129162709 107605344 77642417 69749890 93840117 123921292 125938877
40008 125938877 96058177 59920105 37672501 26052137 17319778 16184957 24253686
40001 24253686 22688084 -6601407 -46578645 -57352965 -29412979 -1154459 -8071248
39994 -8071248 -34505616 -39942325 -19906976 -8779377 -23353830 -37305604 -23690098
39987 -23690098 5233531 20961318 21748441 28435102 48084998 65407568 67133364 56043437
39979E6043437j4442544j0125943o97639N344948l444226k1816273k6791646q078045
39971b4007931J5348990K0771617R174210m369792j2204563j2766524k572204
39964a0626197J5746095K9256403L0575659K5481707J6211448m056639k8465043
39957G4123433l1616199o267133J7432525J2776032m634553o464399J055708m820979
39949E1584435j4055761L730795M1751663N5096159K4277111j8466327l8287892
39942A05630183l8768586l7339486l0655774q280006J9895943L3991361L0349777
39935G4823412J9270722O569577o237459j1806583l774733R787192J2901690R94625
39927A02528443j4648502k0625564j4006870k684101L410348K901165M709691
$$ plain form
39979 56043437 41600893 31474950 30777311 36122259 32678033 10861760 -15929886 -24007931
39971 -24007931 -8658941 12112676 21286886 16917094 4712531 -8053993 -10626197
39964 -10626197 5119898 34376301 64951960 90433667 106645115 102588476 74123433
39957 74123433 42507234 36240101 53672626 66448658 61814105 55349706 56405414 51584435
39949 51584435 37528674 41259469 83011132 138107291 162384402 143918075 105630183
39942 105630183 66861597 29522111 -1133663 -9413669 10482274 44473635 74823412
39935 74823412 94094134 100663711 94426252 82619669 78844936 88632128 101533818 102528443
39927 102528443 87879941 67254377 53247507 50563406 53973754 56874919 61584610
39920F1584610J5122427K5140356J9264119k790251k3051929k6717551j7141532
39913E1410249n325503N695868J8016499K7012244K3109823O127003r673078j0266030
39905A06107075N00841M837881n266221j6940964j6675573j1256683j2238430
39898D9067926q611588J7456310M8404357M0921399q911378m6972546l3640264
39891E7714216j159717j029712k2967592j7343924J7511788K9848193j090841
39884F1482411l2064631k4694553J111256Q459028j726682q452320j1855524k1974114
39876b9715129k8043548j3604215J0487335J8964004J0645590P137606J7263226
39869f865131K7144291K5539722J8388816J4568976J2341514N818138k933732
$$ plain form
39920 61584610 76707037 101847393 121111512 118321261 95269332 68551781 51410249
39913 51410249 46084746 51780614 69797113 96809357 119919180 126046183 116373105 106107075
39905 106107075 106607916 111445797 106179576 89238612 72563039 61306356 49067926
39898 49067926 40456338 57912648 106317005 147238404 138327026 91354480 57714216
39891 57714216 56554499 55524787 32557195 15213271 32725059 62573252 61482411
39884 61482411 29417780 4723227 5834483 14293511 12566829 4114509 -7741015 -29715129
39876 -29715129 -57758677 -71362892 -60875557 -41911553 -31265963 -24128357 -6865131
39869 -6865131 20279160 45818882 64207698 78776674 91118188 96936326 94002594
39862I4002594l435362J0974282K9390099K7104792o435466m6409459n5425982
39855D9765498k8820411P26307P135767j556454o832362p265037q298762n389909
39847e35363M078132Q264220o28312q702056l23191J5686078J9004383P545537
39839D4389428m466742j0036007j2264073r875448J790151J8423902K9978049
39832E7939260L2618727K6060775O926328k1137966l9058335l1232389q016550
39825B4099850O337799M068528k443102k756626J610582O583550J0202968R020918
39817E6724467K143955k655108K513566J3564163K0226070J9535526J4376714
39810A26429353M819299q698038k0035498k5552397l0008648l3902079k5497840
$$ plain form
39862 94002594 90567232 101541514 130931613 158036405 151600939 105191480 49765498
39855 49765498 20945087 21671394 28807161 27250707 20418345 13153308 4854546 -535363
39847 -535363 3542769 11806989 11178677 2476621 2153430 17839508 36843891 44389428
39839 44389428 39922686 29886679 17622606 7747158 9537309 27961211 57939260
39832 57939260 90557987 116618762 123545090 102407124 63348789 32116400 24099850
39825 24099850 30437649 34506177 32063075 29306449 30917031 37500581 47703549 56724467
39817 56724467 58868422 56213314 58726880 72291043 92517113 112052639 126429353
39810 126429353 131248652 122550614 102515116 76962719 46954071 13051992 -12445848
39803a2445848M99197K6731582L2824100K2956472J5724087J4156569O688003
39796A07134162o712330j1907798m341686M667700P823906J0402456J5539806
39789A22606216J6621071Q505934o206582k3999583m0640353m3851648k1815469
39782A1219586J5420936L6673098K1498972j4706972l4716508j7553297J9515803
39775C7351618L7708392J7816796j7063324k7669416o236003J6743707J6720827
39768G5372597N444335M685175J0493553N728640o502958q578699l50100P92629
39760H7085172r922573j8127385j5224864q893192n661369r13352R780704K2843622
39752F0966763L1407172K7209688L034814l2143191m8306490k5723128J3284973
$$ plain form
39803 -12445848 -11946651 14784931 47609031 70565503 86289590 100446159 107134162
39796 107134162 100421832 88514034 84172348 88840048 96663954 107066410 122606216
39789 122606216 139227287 147733221 141526639 117527056 76886703 33035055 11219586
39782 11219586 26640522 63313620 84812592 70105620 35389112 17835815 37351618
39775 37351618 75060010 92876806 75813482 48144066 41908063 58651770 75372597
39768 75372597 80816932 85502107 95995660 101724300 95221342 86642643 86292543 87085172
39760 87085172 77162599 59035214 43810350 34917158 29255789 28342437 38123141 60966763
39752 60966763 92373935 119583623 122618437 90475246 42168756 16445628 29730601
39745B9730601K7143383Q216024j1165164p102519P895107J2494205P052370K978491
39737G7242498N17473o126227j1917609m373216J8119187L9076044L6993766P862656
39729A57394572k4601224k9930764p492917J0604988L071474j1440289p121632
39722I0484208N358294k486447k5842422k9661143k194221K8115953L4936556
39715I8710778K3625583J0356094j223321j1463026j5467852j3490548j2779015
39708G8268693j2178434k725882J2250977J7308529Q821293j442209q619309j8043717
39700G3639941k4714878j5233979O089691J9159342J9719554K1700901K5449137
39693A25809709J5405482n732883j5468542j1519693j5562988k7065075j6636206
$$ plain form
39745 29730601 56873984 65090008 53924844 46822325 54717432 67211637 74264007 77242498
39737 77242498 77759971 71633744 59716135 55342919 73462106 112538150 149531916 157394572
39729 157394572 132793348 102862584 95369667 105974655 109046129 97605840 90484208
39722 90484208 95842502 93356055 67513633 37852490 35658269 63774222 98710778
39715 98710778 122336361 132692455 131469134 120006108 104538256 91047708 78268693
39708 78268693 66090259 63364377 75615354 92923883 101745176 100302967 91683658 73639941
39700 73639941 48925063 33691084 39780775 58940117 78659671 100360572 125809709
39693 125809709 141215191 135482308 120013766 108494073 92931085 65866010 49229804
39686D9229804J7264176L1402404N650264j6100831Q879476N2813516N8437693
39679B07576502K2494665r606678j5713056j6072719k6802077l6078716k9117364
39672I6680557o965076K0599930L9359486L3621239N398840j9282989k3263545
39665A46148442k1697176k9368431k6789853O111818M1636417L5200961l486047
39658A47756131j8642790Q884506L4082079J7218756k0443986l4573129k0738721
39651A13542846r411565j4720928j8401336l520459J8093670K2100670O524158
39644A14207056l466410R373816K6751433J9919602l373124n042195K4086849
39637A82457027M3350566K0173929k0072642l1725858j3962792k514439j0683868
$$ plain form
39686 49229804 66493980 97896384 103546648 87445817 96325293 149138809 207576502
39679 207576502 230071167 220464489 204751433 188678714 161876637 125797921 96680557
39672 96680557 89715481 110315411 149674897 183296136 188694976 169411987 146148442
39665 146148442 124451266 95082835 68292982 74404800 116041217 151242178 147756131
39658 147756131 129113341 137997847 172079926 189298682 168854696 134281567 113542846
39651 113542846 104131281 89410353 71009017 67488558 85582228 107682898 114207056
39644 114207056 110740646 120114462 146865895 166785497 163412373 158370178 182457027
39637 182457027 225807593 245981522 225908880 194183022 180220230 177705791 167021923
39630A67021923j7876031j2685499r984986j9984694k9603706k2935807n72783
39623E3378417K5379596M0354555L3460794R768043r264133j2183839j2674545
39616A28218888k1339088k1248787K157678K6278700K1524434Q24434j288027
39609A35128232J2747827J1534197n092163m515129J7525240K5509502M901854
39602A97739560j3850056q550028K468761J334204Q37551R392478O919893j4417628
39594A81874735k2626321N304801L7302659K8520680j1112918l1179241j1086677
39587A76997718J9563326K6646164P906167j6755542k8699082k1058249l70136
39580A64230366J9053627K7557662K4839573J3189680l082406j2139870n200877
$$ plain form
39630 167021923 149145892 136460393 126475407 106490713 76887007 53951200 53378417
39623 53378417 78758013 119112568 152573362 162341405 153077272 140893433 128218888
39616 128218888 106879800 85631013 87788691 114067391 135591825 136416259 135128232
39609 135128232 147876059 159410256 154318093 149802964 167328204 192837706 197739560
39602 197739560 183889504 175339476 177808237 179142441 179979992 189372470 196292363 181874735
39594 181874735 159248414 164553215 201855874 230376554 219263636 188084395 176997718
39587 176997718 196561044 223207208 231113375 214357833 185658751 164600502 164230366
39580 164230366 183283993 210841655 235681228 248870908 245788502 233648632 228447755
39573B28447755O101231K679732j0160466q480130Q889205J4525012k420850j6817596
39565B22763893q771575O411157R127842P003508J2056507J3549323N44477j1822287
39557B50862845o342052O653660J0742228J3656071K6951204L5289496J8756271
39550C56569723r109263j7877842l616848J3144358K0441034J7065253m014738
39543C72601677m1436912o5875357m9680647r683048J2395768O754056J18190
39536B25193727Q249431J8179046J7681268J0563190N30811j1901950j5800825
39529B52694698p96615J8576295J7444681j301613j2106146q120656n905742r648825
39521B50836077o069425J843596o301108k6718193k5919085P977990M1455182
$$ plain form
39573 228447755 234548986 237228718 227068252 218588122 227477327 242002339 239581489 222763893
39565 222763893 213992318 220403475 229531317 236534825 248591332 262140655 262685132 250862845
39557 250862845 244520793 251174453 261916681 275572752 302523956 337813452 356569723
39550 356569723 347460460 329582618 325965770 339110128 359551162 376616415 372601677
39543 372601677 331164765 265289408 215608761 205925713 218321481 225075537 225193727
39536 225193727 233443158 251622204 269303472 279866662 280397473 268495523 252694698
39529 252694698 251898083 270474378 287919059 286617446 274511300 266390644 260484902 250836077
39521 250836077 244766652 246610248 240309140 213590947 187671862 195649852 237105034
39514B37105034M1727367J8497358P07713k733611R06013Q036443J3476773M954482
39506C22677572j6161881k5317837o014369K3770822L4871092K3164589N089305
39499C62079293r108756j8236878j7601932m031536J2414035J7781213J0922738
39492C54218177J85342q810841j2307554n895467O005982R276538J30432o419578
39484C36383031m48740N437398j110198p170703N361849K5539592K5172465J049140
39476C90213834j9780832j8576029o166086n7419q7702L062643R217577J0285121
39468C68111107L343573o329836j1413326p219482N284084J7421133J8348382
39461C87545635P106842l575003K03132J7337570L0641153K3901811M67305j7744602
$$ plain form
39514 237105034 278832401 297329759 298037472 295303861 296209874 304246317 317723090 322677572
39506 322677572 306515691 281197854 275183485 298954307 333825399 356989988 362079293
39499 362079293 352970537 334733659 317131727 313100191 325514226 343295439 354218177
39492 354218177 354403519 345592678 333285124 327389657 333395639 342672177 342802609 336383031
39484 336383031 335934291 341371689 340261491 333090788 338452637 363992229 389164694 390213834
39476 390213834 370433002 351856973 345690887 345633468 345545766 348608409 357825986 368111107
39468 368111107 371454680 365124844 353711518 346492036 351776120 369197253 387545635
39461 387545635 394652477 391077474 391280606 408618176 439259329 463161140 463628445 445883843
39453D45883843j3498955N098036J3709635K085266j3620577j3715005j595071
39446D24347172K405297r945598k3261476j8763288J520561J6862250J2679909
39439D05844827k003692n758004Q082532K2424060J8885708K493661o128193r6106
39431D43744793N872027n14727j1262038j2818381p758001q862690j6620857j6452824
39423C75327302J3627K1125712K7973693J6105006p23243p042753j218593O941530
39415D38502281R740046P024513l99951j3528136k7106505k7507004p620235K0698617
39407C99803626L7577126L4995982J8600087l736073k4298040l2697035k4955133
39400D05290540j2291894p123748m237514Q412461K4809061K6844698J3129198
$$ plain form
39453 445883843 432384888 437482924 451192559 453277825 439657248 425942243 424347172
39446 424347172 426752469 416806871 393545395 374782107 376302668 393164918 405844827
39439 405844827 403841135 398083131 406165663 428589723 447475431 449969092 443840899 443744793
39431 443744793 449616820 449102093 437840055 425021674 417263673 408400983 391780126 375327302
39423 375327302 375340929 396466641 424440334 440545340 439822097 432779344 431560751 438502281
39415 438502281 448242327 455266840 454866889 441338753 414232248 386725244 379105009 399803626
39407 399803626 437380752 472376734 490976821 487240748 462942708 430245673 405290540
39400 405290540 392998646 385874898 381637384 390049845 414858906 441703604 454832802
39393D54832802l70624p996849j7344848k3024204q128613K0034565K8376143
39386D46378372P224456j1201334m129303M906292j0533651l0385562k0654821
39379C81604449P961358J8059797O702614J602540M814218q899296l6385093m0638353
39371C34822234j2886522Q222732q12173j1408446M160051K3067350J0952149
39364C56117375k0238967l2883067k0603238n576686M966004J9434553K9075783
39357C30291757J5620676j0127342j5469647N223230K3486173K3704853K1451181
39350C94180881K4847877J4316319j9038448m5865400l6916848p735935L800780
39343C27589226r177495k0184621j2499255L551369J5004205K1894005K3981469
$$ plain form
39393 454832802 454462178 446465329 429120481 406096277 397967664 418002229 446378372
39386 446378372 453602828 442401494 438272191 443178483 432644832 402259270 381604449
39379 381604449 389565807 407625604 414328218 415930758 420744976 411845680 375460587 334822234
39371 334822234 321935712 330158444 329346271 317937825 322097876 345165226 356117375
39364 356117375 335878408 302995341 282392103 276815417 281781421 301215974 330291757
39357 330291757 345912433 335785091 320315444 325538674 349024847 372729700 394180881
39350 394180881 419028758 433345077 414306629 368441229 331524381 323788446 327589226
39343 327589226 318411731 298227110 285727855 289279224 304283429 326177434 350158903
39336C50158903J3787723q288436k7757663l3854771l1361552k7011763j6540204
39329B19132237M026954K3679810K6268666J1403154n655653j3838738j5664502
39322B49351928j5257335p360707J3564362L7174551M0632823J3598188k4638367
39315C07065443m1015994k2784775J0532808L0996002K9905411J6827959J194889
39308C32721743j2890388j9011904j1518950K268779O495298k453538j1096519
39301B84514521r140630k466373M36257K197569O776287P208013l663613j7992853
39293B67869178k2374209j7131170j2234742q451654J338964J3542603J4321364
39286B36880334K317039n200401L435679J6704650J6366161K280778r931182j0430732
$$ plain form
39336 350158903 363946626 355658190 327900527 294045756 262684204 235672441 219132237
39329 219132237 223159191 246839001 273107667 284510821 278855168 265016430 249351928
39322 249351928 234094593 226733886 240298248 277472799 318105622 331703810 307065443
39315 307065443 266049449 243264674 253797482 284793484 314698895 331526854 332721743
39308 332721743 319831355 300819451 289300501 291569280 298064578 295611040 284514521
39301 284514521 275373891 272907518 273343775 275541344 282317631 289525644 285862031 267869178
39293 267869178 245494969 228363799 216129057 207677403 209016367 222558970 236880334
39286 236880334 239197373 233996972 237432651 254137301 270503462 272784240 262853058 252422326
39278B52422326m064141j3342j090714l644549k988875J305534L429448k619059
39270B42736628j2509853j2543074K520748J6957922R472593j8500141m0083616
39263A88051207l3765165r206664O262741K466885m088073L118037J6925162J8487455
39255A88251585N050431p668398r582031q833127j5458491k3925750k1561894
39248A06272325q064915M147010P549394P855080J2353715J7090028J2055808
39241A59258445k146371r904838J214473K0808545K4727724O793779j1637862
39234A89113895j3395364j1774793k5420707l9224027k1659949K0158736L9323315
39227A37121106J4772547j6632406j5016738O898878J2835030J252421k891424
$$ plain form
39278 252422326 248358185 248344843 247254129 243609580 240620705 241926239 245355687 242736628
39270 242736628 230226775 217683701 220204449 237162371 246634964 228134823 188051207
39263 188051207 154286042 145079378 151342119 153809004 149720931 152838968 169764130 188251585
39255 188251585 193302016 185633618 176051587 167218460 151759969 127834219 106272325
39248 106272325 98207410 102354420 109903814 117758894 130112609 147202637 159258445
39241 159258445 157112074 147207236 148421709 169230254 193957978 200751757 189113895
39234 189113895 175718531 163943738 138523031 99299004 77639055 97797791 137121106
39227 137121106 151893653 135261247 120244509 127143387 139978417 141230838 138339414
39220A38339414L212569J100407q519649p192178K646806P48099q853738n63962
39212A20917768K2553717K4703316l685917k5366935j4636374L567448j84190
39205A27868833j0624005M42824K0924559J6690758j2786617l4056423k7509980
39198H0949949n129756J4116554K0241656R117212j1667713j8802658R05774K5418776
39190A15149794K2424837m288977j8753841k588253K3861495L3146066K1146732
39183A90097853K67131j8607358k9193579k8209752j7913887l284903J3696322
39176A06851827K9619766L4129729K0480452j991945j7443715k1096990j6697058
39169A33852066n557545O820933L851375k1123011m4554584l8423947j2430265
$$ plain form
39220 138339414 141551983 142652390 134132741 126940563 129587369 130335468 121481730 120917768
39212 120917768 143471485 168174801 164488884 139121949 124485575 128053023 127868833
39205 127868833 117244828 117687652 138612211 155302969 142516352 108459929 80949949
39198 80949949 75820193 89936747 110178403 119295615 107627902 88825244 89731018 115149794
39190 115149794 137574631 133285654 114531813 111943560 135805055 168951121 190097853
39183 190097853 190364984 171757626 142564047 114354295 96440408 93155505 106851827
39176 106851827 136471593 170601322 191081774 189089829 171646114 150549124 133852066
39169 133852066 128294521 135115454 138966829 117843818 73289234 34865287 22435022
39162B2435022k882860j8705468k8459703r390823J9271251K7848962J7738451
39155B7854832J0286651R937033K739904j3663502k0775750n160425J9595588
39148C0814331K6435870P382023j5506552j5802571N502484K2852353J9277091
39141H0955029L253484j0575770j9972280k4180398j3055437J4300192L4605828
39134F5330648K7120183N206334l103564K566665K10785j2128446j1709737Q365057
39126H1857925K5287220K2083494R799007L191789q17842p239828p914947K418579
39118A28665397J2952118J3682526R444952M950304p041489k8489640m2592295
39111I1571873l3410800p911552J4541415K4495893K3539953J4451963J747212
$$ plain form
39162 22435022 19552162 846694 -27613009 -37003832 -17732581 10116381 27854832
39155 27854832 38141483 48078516 50818420 37154918 16379168 11218743 30814331
39148 30814331 57250201 64632224 49125672 33323101 38825585 61677938 80955029
39141 80955029 84208513 73632743 53660463 29480065 16424628 30724820 65330648
39134 65330648 92450831 97657165 94553601 97120266 97331051 85202605 73492868 81857925
39126 81857925 107145145 129228639 139027646 142219435 141401593 134161765 126246818 128665397
39118 128665397 141617515 155300041 164744993 169695297 162653808 134164168 91571873
39111 91571873 58161073 50249521 64790936 89286829 112826782 127278745 129025957
39104A29025957o788760q210901o708905m198226K38229N10505j0076918k0498180
39096G3292801j1447666J1788402K0320654M465902j0569572m836416P582579
39089I0596684P627947K522770N543966Q707982J285742n716367n08246M279353
39081A14339831m051047r398899M524070J6549973r65143k8527528k3190879J0524020
39073G9804398K2954402l250901k6928222j4648597J1140378J4359921j029779
39066H2401600j0188284j2571408k3012624l4084766k2813664R211600L2136233
39059B1078687K7759245J0979502M560026R274188R584639r74183j2533985j5387703
39051E4340416j3354075j5398366j9594267j4787435J649453J7630053K2025631
$$ plain form
39104 129025957 122237197 114026296 107317391 103119165 103357394 103867899 93790981 73292801
39096 73292801 61845135 73633537 93954191 98420093 87850521 83014105 90596684
39089 90596684 98224631 100747401 106291367 114999349 116285091 110568724 110060478 114339831
39081 114339831 110288784 100889885 105413955 121963928 120998785 92471257 69280378 79804398
39073 79804398 102758800 99507899 72579677 57931080 69071458 83431379 82401600
39066 82401600 72213316 59641908 36629284 2544518 -20269146 -11057546 21078687
39059 21078687 48837932 59817434 64377460 73651648 83236287 82262104 69728119 54340416
39051 54340416 40986341 25587975 5993708 -8793727 -7144274 10485779 32511410
39044C2511410J7367068J1073979M177125k443175j343034R125748J5069718N432946
39036I0971785p572194n137713O469970L248896j7883827l1437954k0457979j56321
39028A8044663O223969j628140p121204j611093R842371J9768436K3843070J9707890
39020H7069962Q972101k411199j0924981j8604897k5322445k3462981o490757
39013H824803J9448603L7256121L3346204J1013386j0575461j4726523o155466
39006G8431667m255963j3807373j5117310N211148K6901417J9929617j1054823
38999H6238380l0525990k0222096J037783J0810201J1925104J6235560K0057464
38992I5556406J2636102l671883j7136979k2447896k0759894j1316317N801591
$$ plain form
39044 32511410 49878478 60952457 65129582 62686407 61343373 70469121 85538839 90971785
39036 90971785 83399591 78261878 84731848 87980744 70096917 38658963 18200984 18044663
39028 18044663 24268632 22640492 15519288 13908195 23750566 43519002 67362072 87069962
39020 87069962 96042063 93630864 82705883 64100986 38778541 15315560 8824803
39013 8824803 28273406 65529527 98875731 109889117 99313656 84587133 78431667
39006 78431667 74175704 60368331 45251021 50462169 77363586 97293203 86238380
38999 86238380 55712390 35490294 36528077 47338278 59263382 75498942 95556406
38992 95556406 108192508 104520625 87383646 64935750 44175856 32859539 38661130
38985C8661130K3353403L1373910K4428433K644629k5335492l9216406k2448440
38978C3461167J2230393K8387431Q163996k4554706l5423655k0764760k725127
38971a225261M277517L722106J539980k06916K420761J0262439J2283757j947886
38963C1126497k1483743k2018453K348617K9090286L3737013J5894622n939920
38956F2754919j6937378j7453384j6556872j8744771j7569026m385073J5992944
38949a2898641K5624020J5490675P5910r570J5170530K7239306K5234901J5162341
38941A11089472M375073q262135k2073483k7718820j9171558m486471L253420
38934C7005498Q03560m855833n833525J991768J7834935L3053602L4026474J5793980
$$ plain form
38985 38661130 62014533 93388443 117816876 120461505 95126013 55909607 33461167
38978 33461167 45691560 74078991 82242987 57688281 22264626 1499866 -1225261
38971 -1225261 3052256 6774362 8314342 8107426 10528187 20790626 33074383 31126497
38963 31126497 9642754 -12375699 -10027082 19063204 52800217 68694839 62754919
38956 62754919 45817541 28364157 11807285 -6937486 -24506512 -28891585 -12898641
38949 -12898641 12725379 28216054 28291964 28282394 43452924 70692230 95927131 111089472
38941 111089472 115464545 107202410 85128927 57410107 38238549 33752078 37005498
38934 37005498 37809058 32953225 27119700 29111468 46946403 80000005 114026479 129820459
38926A29820459r217332k2782825j9758779r358812l34532N515413M922029r080156
38918F9725465l3344334m8031650l6453128q169957J0667252J0284117O766307
38911b8555928J4411785K3615048J7530046o94257j3155117j3448731j0191117
38904a0488271o223354O318728K5618266L3070220J7646021n428723j3686480
38897D6826407o961101l887096j3014541k2040793j7349412k298270R633054J2521456
38889C429704J1558423J1839726J1153972O072005k44379k269785k151994p317526
38881C2070146j6141233j5572799j00296J5261314J2391579m436957j3915196
38874I556558o763621N067891R419862Q769494Q910462P097051K84838n863048
$$ plain form
38926 129820459 120603127 97820302 78061523 68702711 68368179 73883592 78805621 69725465
38918 69725465 36381131 -11650519 -48103647 -56273604 -45606352 -35322235 -28555928
38911 -28555928 -14144143 9470905 27000951 26306694 13151577 -297154 -10488271
38904 -10488271 -16711625 -10392897 15225369 48295589 65941610 60512887 46826407
38897 46826407 39865306 35978210 22963669 922876 -16426536 -18724806 -9091752 3429704
38889 3429704 14988127 26827853 37981825 44053830 43809451 41539666 39387672 32070146
38881 32070146 15928913 356114 255818 15517132 27908711 23471754 9556558
38874 9556558 2792937 7860828 17280690 26050184 34960646 42057697 42342535 36479487
38866C6479487o008344m624075o817624p243774J023501J1992411J2868761K931213
38858D0601556m242583Q03447J0154484P945373r268628k5599828k2447628j512210
38850c566017J5070875J1355576l375256j0216468o653102l365622k314289K867617
38842a96686Q058271L008889m708859M128105K4378469K4849998m371005l0755805
38834B4391377k5582810n906157l478943j2861750m343184K3359232L9173443
38827C4751208K6572805L093949r867413j0056138l202740O278323P884894q314282
38819D7140606l0224678l0493254l573533K3625636K7503740J4986676M029436
38812E2994629l661576j4377327k1915244j4797439K751322J3266616P510655
$$ plain form
38866 36479487 30471143 25847068 19029444 11785670 12809171 24801582 37670343 40601556
38858 40601556 36358973 37162420 47316904 55262277 45993649 20393821 -2053807 -3566017
38850 -3566017 11504858 22860434 19485178 9268710 2615608 -750014 -3064303 -196686
38842 -196686 7861585 10870474 6161615 10289720 34668189 59518187 55147182 24391377
38834 24391377 -1191433 -7097590 -10576533 -23438283 -27781467 -4422235 34751208
38827 34751208 61324013 64417962 54550549 44494411 41291671 47569994 55454888 47140606
38819 47140606 16915928 -13577326 -17150859 6474777 33978517 48965193 52994629
38812 52994629 49333053 34955726 13040482 -1756957 994365 14260981 21771636
38805B1771636p413040j9550484k3166666j9354068j1611924j154496J3932155
38798d6546887L1787482M1378938L2831028J2822305j947361q173697j7967875
38791D4183933l2171362k9929078L78093L3847815L4657924M724787j5623701
38784D0068411l01739K8392130L0633071J423043k5598225k3660865l878680N929486
38776E3006632j189219r701734j0435886j1861923j9711258k2847392j0096011
38769c2836791J0268156K0417719J5716686O319693J210556J265907L689987L371002
38761B9422915m934671j5620607j0955609J5435862M0977258L7958771J0989351
38754A03273270r401723r720100p531399j7871023k8499133k1228452j120077
$$ plain form
38805 21771636 14358596 -5191888 -28358554 -47712622 -59324546 -60479042 -46546887
38798 -46546887 -14759405 26619533 59450561 72272866 70325505 62151808 44183933
38791 44183933 12012571 -17916507 -17538414 16309401 50967325 55692112 40068411
38784 40068411 39766672 68158802 98791873 100214916 74616691 50955826 47077146 53006632
38776 53006632 51817413 42115679 31679793 19817870 106612 -22740780 -32836791
38769 -32836791 -22568635 -2150916 13565770 19885463 21096019 22361926 26051913 29422915
38761 29422915 24488244 8867637 -2087972 13347890 54325148 92283919 103273270
38754 103273270 93871547 84151447 76620048 58749025 30249892 9021440 7901363
38747G901363J1260969P288497l547338r468754p526460j474131L948196P159746
38739A5542088J0327389J3713403J1752333J545489p997138o753527j025954n599119
38731C1504964j7648356j6781792L245588K1223893J7572561J138970o586518
38724C3669310j521336M133657M126504K761824J346463m809451j5189090k0637988
38716C879893j3773841K438228J7284558K1151366J3463635L210285r35204q7041
38708D6631879M3539O59917O606345J3428093J0710434n32514p680036o561435
38700F3306222o984275j3721932j7497320j1724388l355000O26992K903184M561062
38692A8114545L30397o494256k712943J0199896J0284064j0968422k9253985k2283305
$$ plain form
38747 7901363 19162332 26450829 22903491 13434737 5908277 4434146 8382342 15542088
38739 15542088 25869477 39582880 51335213 52880702 44883564 38130037 37104083 31504964
38731 31504964 13856608 -2925184 320404 21544297 39116858 40255828 33669310
38724 33669310 32147974 36281631 40408135 43169959 44516422 39706971 24517881 3879893
38716 3879893 -9893948 -7455720 9828838 30980204 44443839 47654124 46718920 46631879
38708 46631879 46675418 47335335 53941680 67369773 78080207 77547693 69867657 63306222
38700 63306222 56321947 42600015 25102695 13378307 10023307 10650299 13553483 18114545
38692 18114545 18444942 11950686 9237743 19437639 29721703 18753281 -10500704 -32784009
38684c2784009n522016q128228k7429360l5357014k1249405K93055J9203475L8202156
38676g2771346N1147994M2098115J3242382r322707p498074P988219J6514813
38669D1399396J2542935L829668l022829o892275r269902j1757346j1962200l327578
38661A1539869J3899342K5679785J8876064k05796j3354868j3522441q739778
38654C4172177o635152p742458j1225503j5039555j3692776o474429j470351o39543
38646b8747590P527107K5512633L2194518J2847593j1459116j3205467l306822
38639B1362856j0548600k6836752j8277438J0939378J7125171r948196k4647312
38632d0830893J225705L0970960K2236698p062690j2768550P106000K1725865
$$ plain form
38684 -32784009 -38306025 -46434253 -73863613 -109220627 -130470032 -130176977 -110973502 -72771346
38676 -72771346 -21623352 20474763 33717145 24394438 16896364 24884583 41399396
38669 41399396 53942331 57771999 54749170 47856895 38586993 26829647 14867447 11539869
38661 11539869 25439211 51118996 69995060 69789264 56434396 42911955 34172177
38654 34172177 27537025 19794567 8569064 -6470491 -20163267 -26637696 -28108047 -28747590
38646 -28747590 -21220483 4292150 36486668 49334261 37875145 24669678 21362856
38639 21362856 10814256 -16022496 -34299934 -23360556 -6235385 -16183581 -40830893
38632 -40830893 -39605188 -8634228 13602470 6539780 -6228770 877230 22603095
38625B2603095K1861922K0576084J6440753M22536j2270173j366995J5378429
38618H3645651L612194k6528618k8608402O230482L1235904J3903431j9143702
38611F4346940k8140276j4488753l462274j751180j08165K420472K361503M351185
38603B5529452R263544N772521p625858j0967765N584886J8501000N367391j6215457
38595C5209714j6352460m261050j2784024l8254113l9524734k900169L3425795
38588d5441041L5967000K0728144J7434145J9670604L803709k1982421k5502264
38581D677876k261973J4896467K951850k1386954k8732839j3477008Q569238K3184434
38573a1578909K5067554J3274958o591924k1140335k1512975j4062310j0539008
$$ plain form
38625 22603095 44465017 65041101 81481854 81904390 69634217 68267222 83645651
38618 83645651 87257845 60729227 32120825 38351307 69587211 83490642 64346940
38611 64346940 36206664 21717911 18255637 16504457 16396292 18816764 21178267 25529452
38603 25529452 34792996 40565517 32939659 21971894 27556780 46057780 51425171 35209714
38595 35209714 18857254 14596204 1812180 -36441933 -75966667 -78866836 -45441041
38588 -45441041 -9474041 11254103 28688248 48358852 52162561 30180140 4677876
38581 4677876 2415903 17312370 20264220 -1122734 -29855573 -43332581 -34763343 -11578909
38573 -11578909 13488645 26763603 20171679 -968656 -22481631 -36543941 -47082949
38566d7082949j1540843q614126J19661O595472N601771K442918M756602J2056908
38558c5664586J7080519J5170633R267667N103387K660620m446740j8061834k7039146
38550c5929480j7535382P237205K6241486K3952945O946453p851187j2854039
38543i791999j0328796k532153O865829Q157598l482032j5772370j2372261L323349
38535c5932835J2428947Q747536N985993J3095127J9491441J3220509p29830j1007819
38527B5299069j6549677k0368309j7216014k302521J4505321J8892671J3402395
38520A5662935J3330439K1586269K2953789P791627j1451786j5908413m783946
38513D9180914N249284K355787p459192j1522584q462131q748794j7837647k5893810
$$ plain form
38566 -47082949 -58623792 -67237918 -67118257 -60522785 -54921014 -52478096 -47721494 -35664586
38558 -35664586 -18584067 -3413434 5854233 10957620 13618240 9171500 -8890334 -35929480
38550 -35929480 -53464862 -46227657 -19986171 3966774 10913227 3062040 -9791999
38543 -9791999 -20120795 -22652948 -15787119 -7629521 -11111553 -26883923 -39256184 -35932835
38535 -35932835 -23503888 -14756352 -8770359 4324768 23816209 37036718 36306888 25299069
38527 25299069 8749392 -11618917 -28834931 -31137452 -16632131 2260540 15662935
38520 15662935 28993374 50579643 73533432 81325059 69873273 53964860 49180914
38513 49180914 54430198 56785985 49326793 37804209 29342078 20593284 2755637 -23138173
38505b3138173j9941391k416115J0917936J1440561O728126O234729P579649L791356
38497A196678l530241p365697o837747o418804o438325l377234J842092M624629
38489b6304649N492499R612410J6383861J7263316O782398r647574k1058875j9921308
38481b1397922n664743J4694229K7948413K3408501M535354j2097166j3712208
38474A7714458n046012j675608j0982348k3477969k4097365r891083O504993J1769164
38466c9181770O897271L407018O983443J1917423J1940367P828236J465929p582206
38458C675711j3887602o098130J4394253K5658913J1914545r997964j0998050
38451A4661676P263530J4179332k253777j6341585n273257J5471822J7678220
$$ plain form
38505 -23138173 -43079564 -45495679 -34577743 -23137182 -16409056 -10174327 -2594678 1196678
38497 1196678 -2333563 -9699260 -16537007 -22955811 -29394136 -32771370 -30929278 -26304649
38489 -26304649 -20812150 -11199740 5184121 22447437 29229835 19582261 -1476614 -21397922
38481 -21397922 -27062665 -12368436 15579977 38988478 43523832 31426666 17714458
38474 17714458 12668446 10992838 10490 -23467479 -47564844 -57455927 -50950934 -39181770
38466 -39181770 -32284499 -28877481 -21894038 -9976615 1963752 9791988 11257917 3675711
38458 3675711 -10211891 -16310021 -1915768 23743145 35657690 25659726 14661676
38451 14661676 21925206 36104538 33850761 17509176 12235919 27707741 45385961
38444D5385961L344209l178051M583419R698050K819919p232471j4742278k3728210
38436A6950548k8782860j5155718J1648008K1152060j75742k3147244j4344643
38429c1855591J5004569K5123549M649178j6527178j1810520J0215670K5250255
38422B0049932K3649784J0702599p460471k4968200l2257131k2739924r61124
38415c3984535K0092101K6661087J1401152j7263093l4571632k2409816O150892
38408d3923844K1104712J5531210J0664467J6459071J3932050q801597k9415654
38401d449585k3965428n125236R42906j623649P643919J9994288P488308k2598231
38393b1692708k6835454R564068M5592993M1609917J1293900q212178j1019558
$$ plain form
38444 45385961 48730170 45552119 50135538 59833588 62653507 55421036 40678758 16950548
38436 16950548 -11832312 -26988030 -15340022 5812038 5636296 -17510948 -31855591
38429 -31855591 -16851022 8272527 12921705 -3605473 -15415993 -5200323 20049932
38422 20049932 43699716 54402315 46941844 21973644 -10283487 -33023411 -33984535
38415 -33984535 -13892434 12768653 24169805 6906712 -27664920 -50074736 -43923844
38408 -43923844 -22819132 -7287922 3376545 19835616 33767666 24966069 -4449585
38401 -4449585 -28415013 -33540249 -32597343 -34220992 -26577073 -6582785 905523 -21692708
38393 -21692708 -48528162 -38964094 6628899 48238816 59532716 51320538 40300980
38386D0300980j6684117k8119000k9227844j7489606q311390o415114J563997
38379f4382094K0989712L6442336L3220962J6668829J120670r441671j9377395
38372A5241349k6228536j9543085K566213K3320218K2628361K679654j2020282
38365H643892o277969N285354K368307p193859k03336K0032741K3847828K477197
38357D8980155j5170053p200376Q041894M639056r800315j2572718n176565l173958
38349H567120k153216J1844454K7759841K1898250R96313m169106J0354513J4674419
38341H9772588m093771k1418203j9559828j6359993k8580855l7841341k1195639
38334e9277042P704376J8569447R414834R96806k204055j2805357k6294893j8751601
$$ plain form
38386 40300980 23616863 -4502137 -33729981 -51219587 -59530977 -65946091 -64382094
38379 -64382094 -43392382 -6950046 26270916 42939745 44060415 34618744 15241349
38372 15241349 -10987187 -30530272 -27964059 -4643841 17984520 20664174 8643892
38365 8643892 2365923 7651277 10019584 2825725 2622389 22655130 46502958 48980155
38357 48980155 33810102 26609726 34651620 39290676 29490361 16917643 11741078 8567120
38349 8567120 6413904 18258358 46018199 67916449 68912762 64743656 75098169 89772588
38341 89772588 85678817 64260614 44700786 28340793 -240062 -38081403 -59277042
38334 -59277042 -51572666 -33003219 -23588385 -22591579 -24795634 -37600991 -63895884 -82647485
38326h2647485J4883918M6007033M6974300K3124993K41256o190003K34432P364389
38318D9992833M471821r500169k0311489j0881923J2717191K0125100m959391
38311D1653973l6433121l6307642q233622N849320j2701981k9794612r306366
38304h5274051L0457625M1751842J6850079m103612M016516J7601781P578080
38297B8878260j5685161k4332950j5945970o493219K510036J8625706L0125205
38290A7681907J5803757j7540871l6187922k2479037N887337K3158354K1436581
38283G760106O484424j1381906j8133725p283501O477118M170100o424714n80915
38275a8913013K0486191K5815691K553192k2140166k2321488r400033p302492
$$ plain form
38326 -82647485 -67763567 -21756534 25217766 48342759 48584015 42394012 42628444 49992833
38318 49992833 54464654 44964485 24652996 13771073 26488264 46613364 41653973
38311 41653973 5220852 -31086790 -39320412 -33471092 -46173073 -75967685 -85274051
38304 -85274051 -54816426 -13064584 3785495 -318117 3698399 21300180 28878260
38297 28878260 13193099 -11139851 -27085821 -33579040 -31069004 -12443298 17681907
38290 17681907 33485664 15944793 -20243129 -42722166 -36834829 -13676475 7760106
38283 7760106 14244530 2862624 -15271101 -22554602 -16077484 -11907384 -18332098 -18913013
38275 -18913013 1573178 27388869 29942061 7801895 -14519593 -23919626 -31222118
38268c1222118j4880244j6169510r795979m247499K414864J5520562K7255196
38261c1124728K7375835K0666203J6049708J0030923r89009n529927M939010J5792652
38253E7210667R962991l323298n396998k037578j1818029k9128582l0406128j3836721
38245b8773676j514319k091160k275873K121044j323726j1751346r443011Q775418
38237d6276649J8302890N541913r458258o379717M978085Q170818J0155875K2492639
38229G527596L1696013J7918522q203241j6949002l201008Q070942k53096j7982013
38221A8624713k8699413k8612829j9109595q7969K0998026K9422848K1900822
38214A4436603J2037773Q260783o9967k1733924m0249498k9912477P093697L6672579
$$ plain form
38268 -31222118 -46102362 -62271872 -72067851 -76315350 -73900486 -58379924 -31124728
38261 -31124728 -3748893 16917310 32967018 42997941 42008932 36479005 41418015 57210667
38253 57210667 67173658 63850360 58453362 56415784 44597755 15469173 -14936955 -28773676
38245 -28773676 -30287995 -32379155 -34655028 -32533984 -33857710 -45609056 -55052067 -46276649
38237 -46276649 -27973759 -22431846 -31890104 -38269821 -33291736 -25120918 -14965043 7527596
38229 7527596 39223609 57142131 48938890 31989888 28788880 36859822 36606726 18624713
38221 18624713 -10074700 -38687529 -57797124 -57885093 -36887067 -7464219 14436603
38214 14436603 26474376 34735159 34665192 12931268 -27318230 -57230707 -50137010 -13464431
38206a3464431L1049624K57628k1330864j3452202J2066881K8735910K4098084
38199D7960630R751146N496288J5800852K4447832J4543350r434002k6123002
38192H2443094k3125801r395043N02006L436099K191667n387871j8635851k3909098
38184H119202r529561J2515352J8178855M824241o064117k738291J421237m912410
38176B1814508r236322L821627K5083114L2117401J8348935m422313k3929810
38169F3597140l3508096k9276092j6405279r866174j4246962j2925614O094144
38162d6536933K5835336K3789456Q606107N581739J2528195L438728k2716092
38155A0526536l2059023n956508K9259904L9479843K4943427O757856o253797
$$ plain form
38206 -13464431 17585193 17842821 -3488043 -16940245 -4873364 23862546 47960630
38199 47960630 57711776 63208064 79008916 103456748 118000098 108566096 82443094
38192 82443094 59317293 49922250 50424256 53860355 56052022 50664151 32028300 8119202
38184 8119202 -1410359 11104993 29283848 34108089 28043972 25305681 26726918 21814508
38176 21814508 12578186 16399813 41482927 73600328 91949263 87526950 63597140
38169 63597140 30089044 812952 -15592327 -25458501 -39705463 -52631077 -46536933
38162 -46536933 -20701597 3087859 11693966 17275705 29803900 33242628 10526536
38155 10526536 -21532487 -27488995 1770909 41250752 66194179 72952035 66698238
38148F6698238j4758330j1002002R968942L1140182L0291413J1109675l920523
38141A19527595p718732j3041004k3186878k2848695o180466O674719l892961
38134D9333578k6466840l2023228j3282380O539312P165214k095914j94841J1526962
38126E01863J1431667o558697j9559091q803548J0053510P964384j4931768k8629938
38118d8531618j3606837J7252307L8847627L8484461J7415769j3977006l6472584
38111e87881l4385508j5474040l502469m668329J52186K0301872L4016015J9980915
38103A5832761p107606j5706423k023556Q576851J075414j0903454q650370P461086
38095a1445297K2253316K2252287M953558j8603852k9237926j6915182O567801
$$ plain form
38148 66698238 51939908 40937906 50906848 82047030 112338443 123448118 119527595
38141 119527595 111808863 98767859 75580981 52732286 46551820 53226539 49333578
38134 49333578 22866738 -9156490 -22438870 -15899558 -8734344 -10830258 -11025099 501863
38126 501863 11933530 5374833 -14184258 -22987806 -12934296 -4969912 -19901680 -48531618
38118 -48531618 -62138455 -44886148 -6038521 32445940 49861709 35884703 -587881
38111 -587881 -34973389 -50447429 -53949898 -58618227 -58466041 -38164169 -4148154 15832761
38103 15832761 8725155 -6981268 -9004824 -427973 647441 -10256013 -18906383 -11445297
38095 -11445297 10808019 33060306 38013864 19410012 -9827914 -26743096 -20175295
38088b0175295K0282164J8119666J0689867O031315J629846l764797m482442R73895
38080B9304219M457935J54785o691890r176455q801028q931032n553079N305959
38072F9414J4822626Q153904j3682254k8645948j7896897R384508K4174962J0834475
38064G214790j5506660k7737908j6404024M286388J4502205O280757j2888869
38057d0253321k6482778k1341888m79083J8290999K1266407J1839629N7866j0847376
38049d7949545j7909786j1037007J0572004K5226419J4845625l522542k69822
38042c0044654J7612023J5433102q627229j3855853J6350086L9845286J7136368
38035E3849129k6893002m0873789k1565580p026956j0076340n357718J8719574
$$ plain form
38088 -20175295 106869 18226535 28916402 34947717 36577563 32812766 28330324 29304219
38080 29304219 33762154 33916939 27225049 18048594 9247566 316534 -5236545 69414
38072 69414 14892040 23045944 9363690 -19282258 -37179155 -27794647 -3619685 7214790
38064 7214790 -8291870 -36029778 -52433802 -48147414 -33645209 -27364452 -40253321
38057 -40253321 -66736099 -88077987 -88557070 -70266071 -48999664 -37160035 -37102169 -47949545
38049 -47949545 -65859331 -76896338 -66324334 -41097915 -26252290 -29774832 -30044654
38042 -30044654 -12432631 3000471 -5626758 -19482611 -3132525 36712761 53849129
38035 53849129 26956127 -13917662 -35483242 -42510198 -52586538 -57944256 -39224682
38028c9224682L7875649L0706726P066182j2499534j9803312j3235298O674017
38021b440252K6416729K5475607K737885k0373101k9038799k8849831k5900864
38014e1972626j4964451L654994J5650763J2430455L149260k249831n752481p988310
38006d8042227K57515K0991614L8052227L6056919J9242412J305172j2009928
37999E5853704k0415996k1061122j4098704p005778m113602o10991N916023Q744657
37991C208191M691394K260779Q040774J5350517J5728407J1799371Q959554L513645
37983G3552632j0006253k6187103l3300686k7032691j3652017k858404p0399j570884
37975d1125805J842939J0518287J1097840k415178j1374307L233544K5182378
$$ plain form
38028 -39224682 -1349033 29357693 36423875 23924341 4121029 -9114269 -2440252
38021 -2440252 23976477 49452084 52189969 31816868 2778069 -26071762 -51972626
38014 -51972626 -66937077 -63282083 -47631320 -35200865 -32051605 -34301436 -40053917 -48042227
38006 -48042227 -47784712 -26793098 11259129 47316048 66558460 67863632 55853704
37999 55853704 35437708 14376586 277882 -6727896 -10841498 -11452489 -5536466 3208191
37991 3208191 7899585 10160364 18201138 33551655 49280062 61079433 70038987 73552632
37983 73552632 63546379 37359276 4058590 -22974101 -36626118 -39484522 -39554921 -41125805
37975 -41125805 -39282866 -28764579 -17666739 -20081917 -31456224 -28222680 -3040302
37968c040302J9780730j2975310l3751404k0334854L774618J1331307R181563
37961b6033652J3085564J5498334O576699J732170J5841915K9598474J5733068
37954G2032572j5225199k9182330j8362149m191144J791193O738701J0909356
37947B4511000N978944k366692l01884O787883K351273p868565k658702J4227631
37939D0660888J5361325l988429j6309842p999322J89278o664003j0912916L256199
37931A3593178J7742349Q600630j4960589k5400162j5918387j676890O670931
37924a1348940R738236Q139201K578014j108603o23549k966773j0101959j0203900
37916a5898273L403284J6457583J2591706k156403r607685n188771K393456Q316971
$$ plain form
37968 -3040302 16740428 3765118 -29986286 -50321140 -46546522 -35215215 -26033652
37961 -26033652 -12948088 2550246 9126945 10859115 26701030 56299504 72032572
37954 72032572 56807373 27625043 9262894 5071750 6862943 13601644 24511000
37947 24511000 30489944 28123252 27821368 34609251 36960524 29091959 26433257 40660888
37939 40660888 56022213 52033784 35723942 27724620 27913898 21249895 10336979 13593178
37931 13593178 31335527 39936157 24975568 -424594 -16342981 -18019871 -11348940
37924 -11348940 -1610704 6528497 9106511 7997908 7374359 4407586 -5694373 -15898273
37916 -15898273 -12494989 3962594 16554300 14397897 4790212 -398559 1994897 10311868
37908A0311868J1680072O439755r599967k2817927j9068436o466680m500076j3539160
37900d7560551j4879257j738350Q772808P9653k1007060l1754863j6149916K0785821
37892a03451715N3783008N5442303K4326897q156234j1687033N303997P931009
37885B3492232j6061110l9089034l1609214L51412K6915328L1078553J9717721
37878A4795888M689024j1331119k7306529l2705589j4536148K2124777M8232527
37871C962831L7192705j119007k5643587j1598240J9449062K9904352J4709377
37864F6857493n06930k178873k956900j1333057j4791471n116919J938593j0121082
37856B1790854l0732588l6042566k1203034k658117N252203J776329o299512r125067
$$ plain form
37908 10311868 21991940 28431695 18831728 -3986199 -23054635 -29521315 -34021391 -47560551
37900 -47560551 -62439808 -64178158 -55405350 -55325697 -76332757 -108087620 -124237536 -103451715
37892 -103451715 -49668707 5773596 30100493 21944259 10257226 15561223 23492232
37885 23492232 7431122 -31657912 -63267126 -62915714 -36000386 -4921833 14795888
37878 14795888 19484912 8153793 -19152736 -51858325 -66394473 -44269696 3962831
37871 3962831 41155536 40036529 14392942 2794702 22243764 52148116 66857493
37864 66857493 66350563 64171690 61214790 49881733 35090262 29973343 31911936 21790854
37856 21790854 -8941734 -44984300 -66187334 -68845451 -63593248 -61816919 -68116431 -77241498
37848g7241498J691451K0094415K4384242M273783j7932393j2301285J6578682
37841d0452603L4303493K4178325O445760K852367N040886o110893k6291328l3251221
37833c3285214j9234909M60458R880258Q694197N186251N222930J0995812K0822064
37825H741847K6225596J7413977k867672j6993054j1058761O650387J3027310
37818D1139630k838735k6070446l3834212k2384715q007003j548231N900409K4379353
37810b3263950M2688972L9944476J6175905n599450j0307316p370167j0151556
37803D2116914j5370549j4097923q839186n181118J288172J2520945J3573984
37796B6011239p199433l0177389k2839366J2998772L7964883K6031971m557568
$$ plain form
37848 -77241498 -75550047 -55455632 -31071390 -26797607 -44730000 -57031285 -40452603
37841 -40452603 -6149110 18029215 24474975 27327342 32368228 26257335 -33993 -33285214
37833 -33285214 -52520123 -52059665 -42179407 -33485210 -28298959 -23076029 -12080217 8741847
37825 8741847 34967443 52381420 49513748 32520694 21461933 28112320 41139630
37818 41139630 38300895 12230449 -21603763 -43988478 -51995481 -53543712 -47643303 -23263950
37810 -23263950 19425022 59369498 75545403 69945953 59638637 52268470 42116914
37803 42116914 26746365 12648442 3809256 -1371862 -83690 12437255 26011239
37796 26011239 18811806 -11365583 -34204949 -21206177 16758706 42790677 38233109
37789C8233109k1599267j7856116m530912J3548538L3820847M0447002J8874566
37782A00937767j7123656l5174046k3652717m329184j441984j2323166j6005626
37775i112612j960142J7890136K3568236R486150q805167j2221196j151364O600572
37767B4294613K185912k172473N218050J4942500J1496352r79859n799095j115554
37759D8070446r67265j0024359j6037829j0010898K486129J3481704K0713804
37752D7711732K0026202N556382j6828736l0723508k9874312k4431228k1915689
37745e0479157j7288054p677653L33311O303450J9937347L7737720L5885852N050028
37737B9802844k4734652j8308093J5524128L4514869J8460541j0488066k3788239
$$ plain form
37789 38233109 16633842 -1222274 -5753186 7795352 41616199 82063201 100937767
37782 100937767 83814111 48640065 24987348 20658164 19216180 6893014 -9112612
37775 -9112612 -11072754 6817382 30385618 39871768 31066601 18845405 17694041 24294613
37767 24294613 26480525 24308052 29526102 44468602 55964954 54985095 49186000 48070446
37759 48070446 47103181 37078822 21040993 11030095 13516224 26997928 47711732
37752 47711732 67737934 73294316 56465580 25742072 -4132240 -28563468 -50479157
37745 -50479157 -67767211 -75444864 -75111553 -68808103 -48870756 -11133036 24752816 29802844
37737 29802844 5068192 -13239901 2284227 36799096 55259637 44771571 20983332
37730B0983332j9467004j2805750j2968934j8349662k2293884j5314628Q205570
37723g2010960L8431354N3699671M2362591J5065815q571092j8881932j8828916
37716C1266531j5600653j4254434j4490916j0895477p36859R121027J0496883
37709e093898P753707J2191018K1764229K0397276K841961j3718612j2781534
37702C3354147k118454j679789j5127956k6718721k3345294q002981P580728J4072153
37694b1986167R242631M58190J399080J7119580L3161040K9859285Q137670j0478143
37686F6913166j2939358j1404239k2413526l9191683l8453084j2452337J9104822
37679e0836239L3202080L0037763K7563719L3873408L4820280J2794253k6767821
$$ plain form
37730 20983332 1516328 -11289422 -24258356 -42608018 -64901902 -80216530 -72010960
37723 -72010960 -33579606 20120065 62482656 77548471 68977379 50095447 31266531
37716 31266531 15665878 1411444 -13079472 -23974949 -24711808 -15590781 -5093898
37709 -5093898 2659809 14850827 36615056 57012332 59854293 46135681 33354147
37702 33354147 31235693 29555904 14427948 -12290773 -35636067 -43639048 -36058320 -21986167
37694 -21986167 -12743536 -12285346 -10886266 6233314 39394354 69253639 77391309 66913166
37686 66913166 53973808 42569569 20156043 -19035640 -57488724 -69941061 -50836239
37679 -50836239 -17634159 12403604 39967323 73840731 108661011 121455264 94687443
37672I4687443n4374161m5301646p756326K2625074J9381394o874518k2730004
37665c42744j2326390O566036J0807389M166510P236978K0981061K1202674m675047
37657E3616467l4344040l9097611k2438639j0064229q383678J844655K7473235
37650c1393840M3797956K8051784m862677j9354022m058950J7890903K0649255
37643E0720409K078907k1714855l4400400k9301039j2391325J153146J700498
37636d2154659k350202M023398J8696058K3135098J0256347l080979j3191J2383278
37628B0895148J5305776N551235l384232k936833J466558K008688k340645q968690
37620B7597005j5047406j7293943j5092876j2262407r267516J054235J9612506
$$ plain form
37672 94687443 40313282 -4988364 -12744690 9880384 29261778 22387260 -342744
37665 -342744 -12669134 -6103098 4704291 8870801 16107779 37088840 58291514 53616467
37657 53616467 19272427 -19825184 -42263823 -52328052 -60711730 -58867075 -31393840
37650 -31393840 12404116 40455900 35593223 16239201 12180251 30071154 50720409
37643 50720409 52799316 31084461 -3315939 -32616978 -45008303 -43855157 -42154659
37636 -42154659 -44504861 -40481463 -21785405 1349693 11606040 8525061 8511870 20895148
37628 20895148 36200924 41752159 38367927 35431094 36897652 38906340 36565695 27597005
37620 27597005 12549599 -4744344 -19837220 -32099627 -41367143 -40312908 -20700402
37613b0700402K9248301J3499517j4757029k3214875k518033K1029194K3498929
37606B6085602J4361204J4757137K1240413J2410502j5440000l9382781l6835932
37599b803855q687500K3824530L5953211J7331026j6183600l2993288j9117817
37592b677293M560755J0214024n00835n312960J234742L392293m201670p205097
37584d96041J34541K805934o682055j0116797Q992169L6355622M4311732K7285290
37576A02590395K516938j5255394k2168128j6202861J56077J1115617P14980k3244715
37568D0222909l3984101j8237766Q337438K2041460J6530358K688122p235022
37561C0363398q341729j659318Q519842J6234473J6796919J0548113M387011P214245
$$ plain form
37613 -20700402 8547899 22047416 7290387 -15924488 -18442521 2586673 26085602
37606 26085602 40446806 55203943 76444356 88854858 73414858 34032077 -2803855
37599 -2803855 -11491355 12333175 48286386 65617412 49433812 16440524 -2677293
37592 -2677293 1883462 12097486 11596651 6283691 7518433 10910726 6709056 -496041
37584 -496041 -361500 2444434 -4237621 -14354418 -5362249 30993373 75305105 102590395
37576 102590395 105107333 89851939 67683811 51480950 51637027 62752644 63467624 40222909
37568 40222909 6238808 -11998958 -3661520 18379940 34910298 37598420 30363398
37561 30363398 22021669 20362351 28882193 45116666 61913585 72461698 76848709 84062954
37553H4062954J9099170K5566539J0669883k1121235m4695363m2257928k3734232
37546G589788j1023883r721338q648846k419116J257705j837848l140422M083825
37538b3860135J0662970K690577j6611488k6941793j5776682N086759J5752917
37531d8996875J5750233K1514193L5334578L5744639J1164612j4584808j2994749
37524D2931823N067196N894026j2113214j6798893M00542O617363j5907370l4966786
37516a8875313j8793279J1990018J9040567O108466K366710O409951n326616k5086348
37508b2165844j9129253J3236270L3144366K1942587M551117K276581L142658
37501C6998482n402708j1854585p786489o770421j6363142k0393673p985655P492438
$$ plain form
37553 84062954 103162124 128728663 139398546 118277311 73581948 31324020 7589788
37546 7589788 -3434095 -13155433 -21804279 -24223395 -22965690 -24803538 -27943960 -23860135
37538 -23860135 -13197165 -10506588 -27118076 -54059869 -69836551 -64749792 -48996875
37531 -48996875 -33246642 -11732449 23602129 59346768 70511380 55926572 42931823
37524 42931823 47999019 53893045 41779831 24980938 25381480 31998843 16091473 -18875313
37516 -18875313 -37668592 -25678574 -6638007 -529541 1837169 8247120 2920504 -22165844
37508 -22165844 -41295097 -28058827 5085539 27028126 31579243 33855824 36998482
37501 36998482 31595774 19741189 11954700 5184279 -11178863 -31572536 -39558191 -32065753
37493c2065753J5408829K4177173L3513995K3878676m891834j9391962l593071
37486C7036053J1509681J026433p913090J5065413M2438429K8551266j3333937
37479A14380248l1268133j8070490j4147898l0574958l1847028m917717J3954279
37472b491697K840768p548089J0518498L1298479J7976511j6542237l1289441
37465D762792j8907489o409304n379717J165156K2236862L9521129L2558985M956101
37457G4504515k1891480l0854540k1264327o426497p91510n528331q352443q16868
37449b1421481R149801P676556o124512j8421956j6693857k826289J0231021J3377957
37441b5052760J1870234J7793358L0988945L4944689J8494173n502102j3990917
$$ plain form
37493 -32065753 -16656924 7520249 41034244 64912920 60021086 40629124 37036053
37486 37036053 48545734 49572167 41659077 56724490 99162919 127714185 114380248
37479 114380248 83112115 65041625 50893727 20318769 -11528259 -16445976 -2491697
37472 -2491697 349071 -7199018 3319480 34617959 52594470 36052233 4762792
37465 4762792 -14144697 -20554001 -25933718 -24768562 -2531700 36989429 69548414 74504515
37457 74504515 52613035 21758495 494168 -5932329 -6723839 -12252170 -20604613 -21421481
37449 -21421481 -12271680 -4595124 -10719636 -29141592 -45835449 -48661738 -38430717 -25052760
37441 -25052760 -13182526 4610832 35599777 70544466 89038639 83536537 69545620
37434F9545620j714420J5744038K2370221J3383453p467367k7565681k8528340
37427E5767524p278792J1770867O000304j0449747o963868J3328856J7260193
37420G9435337k762890j5396856l718690P553771j301451r053860N740961K1028786
37412H1525108O553318k2189519k8477530j5859698j8328890l6883110l5056104
37405f8716425j908493K6585053K3310456P927557Q773129J9482355J8835821
37398C4289453R277143P663043J2899809R416784m686938j5298220j4845504r627455
37390B9088115o305181n295545o574103j0231730j1816064o556754K720610R322487
37382e648165J1673057J1374904O568850l723775j2288784j1090139l881629r08557
$$ plain form
37434 69545620 67831200 83575238 105945459 119328912 111861545 84295864 55767524
37427 55767524 48488732 60259599 66259903 55810156 48846288 62175144 79435337
37420 79435337 76672447 61275591 57556901 65110672 63809221 54755361 60496322 81525108
37412 81525108 88078426 65888907 37411377 21551679 3222789 -33660321 -68716425
37405 -68716425 -70624918 -44039865 -20729409 -12801852 -4028723 15453632 34289453
37398 34289453 43566596 51229639 64129448 73546232 68859294 53561074 38715570 29088115
37390 29088115 22782934 17487389 10913286 681556 -11134508 -17691262 -14970652 -5648165
37382 -5648165 6024892 17399796 23968646 20244871 7956087 -3134052 -7015681 -7924238
37374g924238k131712K495653J4343262J9348223N578159j9938513l7198552l1451717
37366e6879435l855984K8603319M1742793K3479074q848246k0509015J232256
37359D964762K8373641K5806646l584398k5104194k0557556q721791j2387654
37352a1210544k5615720k6489031p732380J9386789M0447313M4075419K4792092
37345E7653938m899712j7154209k069900J2962581m18681k6776942k7787943j461322
37337i952190J5852056R204332O625382K6141662L9649662J7246036k1510392
37330H3256548l4313617j5337457N857323J2141019J1818539J0644562M104582
37323G8171499l240104r38833L027965j0170374l4284744l8345125j1421387J9251618
$$ plain form
37374 -7924238 -10055950 -7560297 6782965 26131188 31709347 11770834 -25427718 -56879435
37366 -56879435 -60735419 -32132100 9610693 33089767 24241521 3732506 4964762
37359 4964762 33338403 59145049 55560651 30456457 9898901 1177110 -11210544
37352 -11210544 -36826264 -63315295 -71047675 -51660886 -11213573 32861846 57653938
37345 57653938 52754226 35600017 33530117 46492698 46074017 19297075 -8490868 -9952190
37337 -9952190 5899866 15104198 21729580 47871242 87520904 104766940 83256548
37330 83256548 48942931 33605474 39462797 51603816 63422355 74066917 78171499
37323 78171499 74931395 73992562 77020527 66850153 32565409 -5779716 -17201103 2050515
37315B050515K6294224J4412114J235840j0575650k3109361k4248078l273041
37308a7213437K4071251K8992260O482588j8427919k2232260p659221N758068
37301b28670O059433r24354j568295R003178K1069520K1278236P523289j0046128
37293E2166209k0564164k0419551j2820675o068118q856804j8778639j9626064
37286e4967806j703541J9212704J9080946N63895q309213N756444K2158642J6389166
37278A8181237p784344k8126567l2326691k3609046q590343P201488J8141506
37271e6912760K2574965K2875463J7422572K971365j1317196q280580J0816646
37264A50475K1922832J1993985j278019Q15063P359386j779163k0789638k8502169
$$ plain form
37315 2050515 28344739 42756853 43992693 33417043 10307682 -13940396 -17213437
37308 -17213437 6857814 35850074 42332662 23904743 1672483 -5986738 -228670
37301 -228670 5830763 4906409 3338114 12341292 33410812 54689048 62212337 52166209
37293 52166209 31602045 11182494 -1638181 -7706299 -16563103 -35341742 -54967806
37286 -54967806 -56671347 -37458643 -18377697 -17813802 -26123015 -20366571 1792071 18181237
37278 18181237 10396893 -17729674 -50056365 -73665411 -82255754 -75054266 -56912760
37271 -56912760 -34337795 -11462332 5960240 8931605 -2385591 -10666171 150475
37264 150475 22073307 34067292 32789273 33604336 40963722 39184559 18394921 -10107248
37256a0107248k2843563j8241643j6788027r342155L75790J506373K430014K0508310
37248e2502149M4980244M2843207Q291183k4838201l0240544j9191359j0891536
37241d1549155l316508P839420R612800m190059j2295924L444103K4603863K1588820
37233E737360j438450j6245783j4743644j2844595j5774444j0697342N480144
37226f0526754J8658099K1001688J7693519Q589494j1048634k8387130k0147453
37219e4167171R794542K7760828J7391573K260840N304829J3093000M181637j0332957
37211A5287121n230916J4607435K0781604N674159j0235600j3781912j2915688
37204A4186203j2446616l787447J3091597K1700787J4374674N470757O666893
$$ plain form
37256 -10107248 -32950811 -51192454 -67980481 -77322636 -76946846 -75440473 -73010459 -52502149
37248 -52502149 -7521905 35321302 43612485 18774284 -11466260 -30657619 -41549155
37241 -41549155 -44865663 -37026243 -27413443 -31603502 -43899426 -40455323 -15851460 5737360
37233 5737360 4298910 -11946873 -26690517 -39535112 -55309556 -66006898 -60526754
37226 -60526754 -41868655 -20866967 -3173448 5416046 -5632588 -34019718 -54167171
37219 -54167171 -44372629 -16611801 779772 3040612 8345441 21438441 25620078 15287121
37211 15287121 10056205 24663640 45445244 51119403 40883803 27101891 14186203
37204 14186203 1739587 -2047860 11043737 32744524 47119198 52589955 59256848
37197E9256848O811319q467388l0613733l7876317k3292020J24724J6167222J7206226
37189f83119N627131o915259p398281L588499J1081282N984717l078787n042789
37181C163394k045561l34292K311565P701622P112554n525460j9909267k3148934
37173c0674379j7399250r520782L594391K0882347K3456097J160949j9503662
37166b8004289o580936K4934396K9261253r22038k1858090n518021K0938834K2421587
37158C4672696P028173K179311Q069678P251836M39576l63415p01031j3264232
37150D5312592k7457861k0615451M212434J9686881J2101138o207415j9864252
37143G168066k2349895q603630J8391479L5593383K1638998q978155k0619393
$$ plain form
37197 59256848 66068167 57600779 26987046 -10889271 -34181291 -34056567 -17889345 -683119
37189 -683119 4944012 -1971247 -9369528 -5781029 5300253 11284970 8206183 3163394
37181 3163394 1117833 783541 3095106 10796728 17909282 12383822 -7525445 -30674379
37173 -30674379 -48073629 -57594411 -54000020 -33117673 -9661576 -8500627 -28004289
37166 -28004289 -34585225 -9650829 19610424 18688386 -3169704 -8687725 12251109 34672696
37158 34672696 41700869 43880180 51949858 59201694 59641270 59277855 58576824 45312592
37150 45312592 17854731 -2760720 1451714 21138595 33239733 27032318 7168066
37143 7168066 -15181829 -23785459 -5393980 30199403 51838401 42860246 22240853
37136B2240853o372451O226620J949710l742454k002538r644308l2135435m1200358
$$ plain form
37136 22240853 15868402 22095022 24044732 20302278 18299740 8655432 -23480003 -64680361
$$ [...]
##END NTUPLES=NMR SPECTRUM
##END=
