##TITLE=31Pdec_DE_44H_D2O
 D2O, 64 sc
 6.8.2024
##JCAMPDX= 6.0         $$ Bruker NMR JCAMP-DX V2.0
##DATA TYPE= NMR SPECTRUM
##DATA CLASS= NTUPLES
##ORIGIN= UXNMR, Bruker Analytische Messtechnik GmbH
##OWNER= root
$$ XWIN-NMR		Version 3.5
$$ Tue Aug  6 16:40:13 2024 Russian Standard Time (UT+4h)  she@DPX200
##.OBSERVE FREQUENCY= 81.013821
##.OBSERVE NUCLEUS= ^31P
##.ACQUISITION MODE= SIMULTANEOUS
##.ACQUISITION SCHEME= undefined
##.AVERAGES= 64
##.DIGITISER RES= 17
##SPECTROMETER/DATA SYSTEM= spect
##.PULSE SEQUENCE= zgpg30
##.SOLVENT NAME= D2O
##.SHIFT REFERENCE= (INTERNAL, D2O, 0, 198.062)
##AUDIT TRAIL= $$ (NUMBER, WHEN, WHO, WHERE, WHAT)
$$ ##TITLE= Audit trail, XWIN-NMR		Version 3.5
$$ ##JCAMPDX= 5.01
$$ ##ORIGIN= Bruker BioSpin GmbH
$$ ##OWNER= she
$$ F:/spectra/data/she/nmr/P31/2/pdata/1/auditp.txt
$$ ##AUDIT TRAIL=  $$ (NUMBER, WHEN, WHO, WHERE, WHAT)
(   1,<2024-08-06 16:39:05.03 +0400>,<she>,<DPX200>,
      <created by zg, POWCHK disabled, PULCHK disabled
       configuration hash MD5:
       00 E9 B6 7A A2 85 ED C7 34 08 36 98 17 FE 4E 26
       data hash MD5: 32K
       5D 2E 9E 57 3A BB E7 FE 0A 8A 03 A3 76 3B C6 3D>)
(   2,<2024-08-06 16:39:07.12 +0400>,<she>,<DPX200>,
      <Start of raw data processing
       efp BC_mod = 2 LB = 1.5 FT_mod = 6 PKNL = 1 PHC0 = 2627.862 PHC1 = 185.2869 SI = 64K 
       data hash MD5: 64K
       AC 29 E9 53 F3 7D 9A D0 A2 15 C0 C1 04 09 BC 29>)
(   3,<2024-08-06 16:39:19.35 +0400>,<she>,<DPX200>,
      <pk PHC0 = -65.74931 PHC1 = 0 
       data hash MD5: 64K
       F0 8C FE AC 60 B2 17 CF 03 F4 7E 37 9F 0E 33 61>)
(   4,<2024-08-06 16:39:42.26 +0400>,<she>,<DPX200>,
      <pk PHC0 = -277.7726 PHC1 = 831.6008 
       data hash MD5: 64K
       C7 26 16 B3 65 47 9B F2 FA C8 B5 AF BB 41 57 35>)
$$ ##END=
$$ 
$$ hash MD5
$$ 4B BC 1B E8 19 69 B3 67 B2 00 53 C1 4A 38 80 71
##$RELAX= 
##$RELAX= 
##$RELAX= 
##$RELAX= 
##$RELAX= 
##$RELAX= 
##$RELAX= 
##$RELAX= 
$$ Bruker specific parameters
$$ --------------------------
##$DU= <F:/spectra>
##$EXPNO= 2
##$NAME= <P31>
##$PROCNO= 1
##$TYPE= <nmr>
##$USER= <she>
##$AMP= (0..31)
100 100 100 100 100 100 100 100 100 100 100 100 100 100 100 100 100 100 
100 100 100 100 100 100 100 100 100 100 100 100 100 100 
##$AQSEQ= 0
##$AQ_mod= 1
##$AUNM= <au_zg>
##$AUTOPOS= <>
##$BF1= 81.014009
##$BF2= 200.13
##$BF3= 200.13
##$BF4= 200.13
##$BF5= 200.13
##$BF6= 200.13
##$BF7= 200.13
##$BF8= 200.13
##$BYTORDA= 1
##$CFDGTYP= 0
##$CFRGTYP= 5
##$CHEMSTR= <none>
##$CNST= (0..31)
1 1 145 1 1 1 1 1 1 1 1 1 1 1 1 1 1 1 1 1 1 1 1 1 1 1 1 1 1 1 1 1 
##$CPDPRG= <waltz16>
##$CPDPRG1= <>
##$CPDPRG2= <waltz16>
##$CPDPRG3= <>
##$CPDPRG4= <mlev>
##$CPDPRG5= <mlev>
##$CPDPRG6= <mlev>
##$CPDPRG7= <mlev>
##$CPDPRG8= <mlev>
##$CPDPRGB= <>
##$CPDPRGT= <>
##$D= (0..31)
0 1 0 0 0 0 0 0 0 0.06 0 0.03 2e-05 3e-06 0 0 0.0002 0 0 0 0 0 0 0 0 0 
0 0 0 0 0 0 
##$DATE= 1722947944
##$DBL= (0..7)
120 120 120 11 120 120 24 19 
##$DBP= (0..7)
150 150 150 150 150 150 150 150 
##$DBP07= 0
##$DBPNAM0= <>
$$ [...]
##$SUBNAM2= <"">
##$SUBNAM3= <"">
##$SUBNAM4= <"">
##$SUBNAM5= <"">
##$SUBNAM6= <"">
##$SUBNAM7= <"">
##$SUBNAM8= <"">
##$SUBNAM9= <"">
##$SW= 400.765351723535
##$SWIBOX= (0..15)
0 1 3 0 0 0 0 0 0 0 0 0 0 0 0 0 
##$SW_h= 32467.5324675325
##$TD= 32768
##$TD0= 1
##$TE= 0
##$TE2= 300
##$TE3= 300
##$TEG= 300
##$TL= (0..7)
0 120 53 12 22 120 120 120 
##$TP= (0..7)
150 150 150 150 150 150 150 150 
##$TP07= 0
##$TPNAME0= <>
##$TPNAME1= <>
##$TPNAME2= <>
##$TPNAME3= <>
##$TPNAME4= <>
##$TPNAME5= <>
##$TPNAME6= <>
##$TPNAME7= <>
##$TPOAL= (0..7)
0.5 0.5 0.5 0.5 0.5 0.5 0.5 0.5 
##$TPOFFS= (0..7)
0 0 0 0 0 0 0 0 
##$TUNHIN= 0
##$TUNHOUT= 0
##$TUNXOUT= 0
##$USERA1= <user>
##$USERA2= <user>
##$USERA3= <user>
##$USERA4= <user>
##$USERA5= <user>
##$V9= 5
##$VALIST= <valist>
##$VCLIST= <CCCCCCCCCCCCCCC>
##$VD= 0
##$VDLIST= <DDDDDDDDDDDDDDD>
##$VPLIST= <PPPPPPPPPPPPPPP>
##$VTLIST= <TTTTTTTTTTTTTTT>
##$WBST= 1024
##$WBSW= 4
##$XGAIN= (0..3)
0 0 0 0 
##$XL= 0
##$YL= 0
##$YMAX_a= 6308
##$YMIN_a= -4011
##$ZGOPTNS= <>
##$ZL1= 120
##$ZL2= 120
##$ZL3= 120
##$ZL4= 120
##$ABSF1= 0
##$ABSF2= 0
##$ABSG= 0
##$ABSL= 0
##$ALPHA= 0
##$AQORDER= 0
##$ASSFAC= 0
##$ASSFACI= 0
##$ASSFACX= 0
##$ASSWID= 0
##$AUNMP= <proc_1d>
##$AZFE= 0.1
##$AZFW= 0.5
##$BCFW= 0
##$BC_mod= 2
##$BYTORDP= 0
##$COROFFS= 0
##$CY= -3
##$DATMOD= 1
##$DC= 0
##$DFILT= <>
##$DTYPP= 0
##$F1P= 0
##$F2P= 0
##$FCOR= 1
##$FTSIZE= 65536
##$FT_mod= 6
##$GAMMA= 0
##$GB= 0
##$INTBC= 1
##$INTSCL= 9.790993e-09
##$ISEN= 30
##$LB= 1.5
##$LEV0= 0
##$LPBIN= 0
##$MAXI= 10000
##$MC2= 0
##$MEAN= 0
##$ME_mod= 0
##$MI= 50
##$NCOEF= 0
##$NC_proc= -11
##$NLEV= 6
##$NOISF1= 182.463
##$NOISF2= 159.3651
##$NSP= 0
##$NTH_PI= 0
##$NZP= 0
##$OFFSET= 198.0616
##$PC= 4
##$PHC0= 2284.34
##$PHC1= 1016.888
##$PH_mod= 1
##$PKNL= yes
##$PPARMOD= 0
##$PSCAL= 0
##$PSIGN= 0
##$REVERSE= no
##$SF= 81.0140089999434
##$SI= 65536
##$SIGF1= 159.3651
##$SIGF2= -187.1042
##$SINO= 113.3802
##$SIOLD= 16384
##$SREGLST= <1H.CDCl3>
##$SSB= 0
##$STSI= 65536
##$STSR= 0
##$SW_p= 32467.5324675325
##$SYMM= 0
##$S_DEV= 0
##$TDeff= 32768
##$TDoff= 0
##$TI= <>
##$TILT= no
##$TM1= 0
##$TM2= 0
##$TOPLEV= 0
##$USERP1= <user>
##$USERP2= <user>
##$USERP3= <user>
##$USERP4= <user>
##$USERP5= <user>
##$WDW= 1
##$XDIM= 65536
##$YMAX_p= 283493600
##$YMIN_p= -294219859
$$ End of Bruker specific parameters
$$ ---------------------------------
##NTUPLES= NMR SPECTRUM
##VAR_NAME=  FREQUENCY,     SPECTRUM/REAL,   SPECTRUM/IMAG
##SYMBOL=    X,             R,               I
##VAR_TYPE=  INDEPENDENT,   DEPENDENT,       DEPENDENT
##VAR_FORM=  AFFN,          ASDF,            ASDF
##VAR_DIM=   65536,         65536,           65536
##UNITS=     HZ,            ARBITRARY UNITS, ARBITRARY UNITS
##FACTOR=    0.49542278885378, 1,            1
##FIRST=     16045.7642231865, 0,            0
##LAST=      -16421.768244346, 0,            0
##MIN=       -16421.768244346, -294219859,   0
##MAX=       16045.7642231865, 283493600,    0
$$ Real data points
##PAGE= N=1
##DATA TABLE= (X++(R..R)), XYDATA
$$ [...]
##PAGE= N=2
##DATA TABLE= (X++(I..I)), XYDATA
6395d0390584L707526o507598L535066N890534m426638n254989M885789L403581
$$ -40390584 -36683058 -43190656 -39655590 -33765056 -38191694 -43446683 -38560894 -35157313
6387c5157313j0020968r131386R999433J8651380N616620k675751J1098622K5065857
$$ -35157313 -45178281 -54309667 -44310234 -25658854 -20042234 -22717985 -11619363 13446494
6379A3446494J6914140J790732N034850J9616821J8312964m675257k7867534l2029776
$$ 13446494 30360634 32151366 37186216 56803037 75116001 70440744 42573210 10543434
6371A0543434j8801792l555051j0855q192792j3174025k375260J5415541J9872336
$$ 10543434 -8258358 -11813409 -11824264 -20017056 -33191081 -35566341 -20150800 -278464
6363b78464Q106925k150803q74186J237600n211496j1026412m053553J0712275
$$ -278464 7828461 5677658 4803472 6041072 829576 -10196836 -14250389 -3538114
6355c538114J7405269Q361058q621281j6352699k930167K0678312K4277314m615025
$$ -3538114 13867155 22228213 13606932 -2745767 -5675934 15002378 39279692 34664667
6347C4664667l5520537l0069555L586487K1582548Q272157o811934k579406K577661
$$ 34664667 -855870 -30925425 -27338938 -5756390 2515767 -4296167 -6875573 -4297912
6339d297912q863042j8849390o645570J2305568J1391527m408405j1661811q144044
$$ -4297912 -13160954 -32010344 -38655914 -26350346 -14958819 -19367224 -31029035 -39173079
6331c9173079q710951j3565343j0711943k225704l6267j065872O740948J7334967
$$ -39173079 -47884030 -61449373 -72161316 -74387020 -74423287 -75489159 -68748211 -51413244
6323e1413244J1909778q889301k2013519j3683309N636569J9566875K1465453
$$ -51413244 -39503466 -48392767 -70406286 -84089595 -78453026 -58886151 -37420698
6316c7420698J1302280n366032j4025627l550136J6178092K3939586J5228438
$$ -37420698 -26118418 -31484450 -45510077 -49060213 -32882121 -8942535 6285903
6309F285903N345014L768244K398342o409177j5248351j2647529Q15491J3582264
$$ 6285903 11630917 15399161 17797503 11388326 -3860025 -16507554 -15692063 -2109799
6301b109799J5432684O841679n99396M415524J7292284J9992416N380178j0462558
$$ -2109799 13322885 20164564 19565168 23980692 41272976 61265392 66645570 56183012
6293E6183012j0298572N25014O164560N314232O056036M845941o997167k0657578
$$ 56183012 45884440 46409454 52574014 57888246 63944282 68790223 61793056 41135478
6285D1135478j7470444J401814J5561808J6238495J3248070R512764m468941k3462651
$$ 41135478 23665034 25066848 40628656 56867151 70115221 79627985 75159044 51696393
6277E1696393k2569245N512105L1452028K6793662K623609j0396245o923296p816193
$$ 51696393 29127148 34639253 66091281 92884943 95508552 85112307 78189011 70372818
6269G0372818k2785913l6158323l1637246j2897558N745283J6237459J8352926
$$ 70372818 47586905 11428582 -20208664 -33106222 -27360939 -11123480 7229446
6262G229446J3651052M897144k958274o676602q122027j0644581j3088657j0701623
$$ 7229446 20880498 25777642 22819368 16142766 8020739 -2623842 -15712499 -26414122
6254b6414122l063776K277891r74855n985779J575833K2150477L5846259K6846802
$$ -26414122 -29477898 -27200007 -28174862 -34160641 -32584808 -10434331 25411928 52258730
6246E2258730O857433J57756R051216J1805686l046077j9168478j8306265q067081
$$ 52258730 59116163 59273919 68325135 80130821 77084744 57916266 39610001 31542920
6238C1542920r109447k3563255l2191783k0763700L792843K4503639L1380790
$$ 31542920 22433473 -1129782 -33321565 -54085265 -50292422 -25788783 5592007
6231E592007K4553867Q505865j0806378k5383918k7035837j3791437M220014R371283
$$ 5592007 30145874 38651739 27845361 2461443 -24574394 -38365831 -34145817 -24774534
6223b4774534n855932k5587761k3804736M007793L0249509K5624816l879017k2209622
$$ -24774534 -30630466 -56218227 -80022963 -76015170 -45765661 -20140845 -24019862 -46229484
6215d6229484o906853K3660656L3759526J3261238j4112842k3265345j4600287
$$ -46229484 -53136337 -29475681 4283845 17545083 3432241 -19833104 -34433391
6208c4433391k886571P661324K1981507L2980326K1891336j2913649m2448748
$$ -34433391 -37319962 -29658638 -7677131 25303195 47194531 34280882 -8167866
6201h167866l6333464O50884L3310322L4836410J1126311j1756457j4649998P60540
$$ -8167866 -44501330 -43850446 -10540124 24296286 35422597 23666140 9016142 9776682
6193I776682J7443736K0158436R690456j031944m908663p132885j0797003q052114
$$ 9776682 27220418 47378854 57069310 56037366 51128703 43995818 33198815 25146701
6185B5146701N068904J6387739J3838604M706372K551797L188469o710407k2682181
$$ 25146701 30215605 46603344 60441948 65148320 67700117 70888586 64178179 41495998
6177D1495998k6764929j7427533j2007722j6790216j7321006m097212J3027256
$$ 41495998 14731069 -2696464 -14704186 -31494402 -48815408 -52912620 -39885364
6170c9885364K2590258K3794299J5502202m762475k3731049j9341624M251263
$$ -39885364 -17295106 6499193 22001395 17238920 -6492129 -25833753 -21582490
6163b1582490J4791346k0227j0359064Q112940L1194587K1085291j5029003l5584430
$$ -21582490 -6791144 -6811371 -17170435 -9057495 22137092 43222383 28193380 -7391050
6155g391050k3078906R54896J3924172J4152159O354490o338104j3843954o352767
$$ -7391050 -30469956 -29515060 -15590888 -1438729 4915761 -1422343 -15266297 -21619064
6147b1619064Q484839J5586838J6360174K0598869K1099330M731377j5746597
$$ -21619064 -13134225 2452613 18812787 39411656 60510986 65242363 49495766
6140D9495766j4639511J643344n15977k5666994l6845795j3611249J5087144J7538678
$$ 49495766 34856255 36499599 35983622 10316628 -26529167 -40140416 -25053272 -7514594
6132g514594M913182L367474R915780P709913J671650M277037L505118j8445219
$$ -7514594 -2601412 766062 10681842 18391755 20063405 24340442 27845560 9400341
6124I400341m5376826m2598811q328118K3499178L1305188K5849027K0190931
$$ 9400341 -35976485 -78575296 -86903414 -63404236 -32099048 -6250021 13940910
6117A3940910J0715103l403767q164105M485426K1071135K2715040N506542k0101279
$$ 13940910 24656013 21252246 13088141 17573567 38644702 61359742 66866284 46765005
6109D6765005l8793582l7962098j9205261k710527n991700j9576009k0256011
$$ 46765005 7971423 -29990675 -49195936 -51906463 -57898163 -77474172 -97730183
6102i7730183n793542M694534M221013O567400J7032396K0574654R170940k248376
$$ -97730183 -103523725 -98829191 -94608178 -88040778 -71008382 -50433728 -41262788 -43511164
6094d3511164K92434J0363200J7878026K4698668K9666939J9368001q085826k8753539
$$ -43511164 -43218730 -32855530 -14977504 9721164 39388103 58756104 50670278 21916739
6086B1916739k2930018m306388J778182m507706m817823L894589Q079702M228649
$$ 21916739 -1013279 -5319667 -3541485 -8049191 -12867014 -8972425 -892723 3335926
6078C335926L235854Q696344J0133307j83754j6893600k8067945k3525278k129727
$$ 3335926 6571780 15268124 25401431 25217677 8324077 -19743868 -43269146 -45398873
6070d5398873K0522433K1700893J52298j7137905j0383150N922003R131450M260690
$$ -45398873 -24876440 -3175547 -3023249 -20161154 -30544304 -24622301 -15490851 -11230161
6062a1230161Q587887J5832997P584647q922758r217836N851091J1222367J819584
$$ -11230161 -2642274 13190723 20775370 11852612 2634776 8485867 19708234 21527818
6054B1527818n26528J0344001J2023757n280885j8715753j0094951O559562J2596561
$$ 21527818 21001290 31345291 43369048 38088163 19372410 9277459 15837021 28433582
6046B8433582J2576456J5065142J0865348p257152k3863719k2227810r798708
$$ 28433582 41010038 56075180 66940528 59683376 35819657 13591847 3793139
6039C793139k794479j669614k24171k011979q505087p579762O561406J8008859
$$ 3793139 998660 -670954 -895125 -2907104 -11412191 -18991953 -12430547 5578312
6031E578312J2976963K468238J598960M183388p89988o055538l049441k839161
$$ 5578312 18555275 21023513 22622473 26805861 26015873 19960335 16910894 14071733
6023A4071733j3805597j8111502r33055J5836379M790204j8169059j6503205O949867
$$ 14071733 266136 -17845366 -18778421 -2942042 1848162 -16320897 -32824102 -25874235
6015b5874235J6378632L461686m694707J428354q9075j5691653k1219550p796467
$$ -25874235 -9495603 -6033917 -10728624 -9300270 -9389345 -25080998 -46300548 -54097015
6007e4097015j89749j0494392j3564135P334762K6750021J7939767l109197o567359
$$ -54097015 -54286764 -64781156 -78345291 -71010529 -44260508 -26320741 -29429938 -35997297
5999c5997297L034387J426609j0696427j2085587L20958Q421162M203111j868860
$$ -35997297 -32962910 -31536301 -42232728 -54318315 -53997357 -45576195 -41373084 -43241944
5991d3241944j570372K545788P016700R520663N463796l514713n213612M968680
$$ -43241944 -44812316 -42266528 -35249828 -25729165 -20265369 -23780082 -28993694 -24025014
5983b4025014J2118183M160969o430202l463594K846219p882074k8121428k9409458
$$ -24025014 -11906831 -7745862 -14176064 -17639658 -14793439 -22675513 -50796941 -80206399
5975h0206399n485526J9592140K8850244L0637418L2758844K5108731K112414
$$ -80206399 -85691925 -66099785 -37249541 -6612123 26146721 51255452 53367866
5968E3367866j8349061j6661140J71263Q678326P28245r168738n862741Q184951
$$ 53367866 35018805 18357665 18528928 27207254 27935499 18766761 12904020 21088971
5960B1088971J7343026R487959j2025782l0179750k9363726j0534097J0464395
$$ 21088971 38431997 47919956 35894174 5714424 -23649302 -34183399 -23719004
5953b3719004K0004792J8038511J1217874Q22629j6180444l5381606m1443562
$$ -23719004 -3714212 14324299 25542173 26364802 10184358 -25197248 -66640810
5946f6640810k2501259J2101590L5268951K9651915Q505488R6857J1610654K0426336
$$ -66640810 -89142069 -77040479 -41771528 -12119613 -3614125 -3517268 8093386 28519722
5938B8519722O160347k0858437l4090315k5292177r980970j498282M513756J5883559
$$ 28519722 34680069 13821632 -20268683 -45560860 -55541830 -57040112 -52526356 -36642797
5930c6642797K7099030K6207673J2781431n01580l903059r17003L08328J04706
$$ -36642797 -9543767 16663906 29445337 28943757 25040698 24123695 24432023 24536729
5922B4536729N284213J6321482K5207409K7243129K5064594J7176498m482889
$$ 24536729 29820942 46142424 71349833 98592962 123657556 140834054 136351165
5915A36351165l5777351n2853095m0367265j6631314q885281j1953390R3435K4635813
$$ 136351165 100573814 47720719 7353454 -9277860 -18163141 -30116531 -30023096 -5387283
5907e387283K8733454M099642j3452727J507395K3618673J8337347l995441j0175376
$$ -5387283 23346171 27445813 13993086 15500481 39119154 57456501 53461060 43285684
5899D3285684J56303J9448j4523712j9392278o284486N091975K906382j012699
$$ 43285684 43441987 43461435 28937723 9545445 3260959 8352934 11259316 10246617
5891A0246617J149877j088732j2607183k0029284j5282164r827484j2507447j2934433
$$ 10246617 11396494 10307762 -2299421 -22328705 -37610869 -47438353 -59945800 -72880233
5883g2880233j354371J1525796J0281276j196910n539850N365371K3320817L3665137
$$ -72880233 -74234604 -62708808 -52427532 -53624442 -59164292 -53798921 -30478104 3187033
5875C187033K6643780O070516j0324731p989729N760882J0949692K254865p581538
$$ 3187033 29830813 35901329 25576598 17586869 23347751 34297443 36552308 28970770
5867B8970770j1296306j4585621j6812580o585608J4362968K4338467J2511964
$$ 28970770 17674464 3088843 -13723737 -20309345 -5946377 18392090 30904054
5860C0904054j554571M541760K3244559K8588987J0242135j8654576l8833928
$$ 30904054 29349483 33891243 57135802 85724789 95966924 77312348 38478420
5853C8478420l7883472j5764018J0601141J8202958M617414p249939j275337J0375877
$$ 38478420 594948 -15169070 -4567929 13635029 18252443 11002504 9727167 20103044
5845B0103044J1722990J0892899K1893008L2869116K0000625j3169032l7122489
$$ 20103044 31826034 42718933 64611941 97481057 117481682 104312650 67190161
5838F7190161l6632374k5814154k0586521j8106706r869909K275029J0991856
$$ 67190161 30557787 4743633 -15842888 -33949594 -43819503 -41544474 -30552618
5831c0552618J2745960P674320q38075n941679n545682p146489j3449341j0949508
$$ -30552618 -17806658 -10132338 -10970413 -16912092 -22457774 -29604263 -43053604 -54003112
5823e4003112R759454K9883499K2792276m639931j8882650r404008m06506n738051
$$ -54003112 -44243658 -14360159 8432117 3792186 -15090464 -24494472 -24900978 -30639029
5815c0639029o603282Q739724J6735235k380989k4835483j7937760N070355N413705
$$ -30639029 -37242311 -28502587 -11767352 -14148341 -38983824 -56921584 -51851229 -46437524
5807d6437524j6133361j8995201J0252689L4129114K2157131m064905p018879
$$ -46437524 -62570885 -81566086 -71313397 -37184283 -15027152 -19092057 -26110936
5800b6110936J2557658K4748483J6019696j278127j4635937k1734940j9968700
$$ -26110936 -13553278 11195205 27214901 25936774 11300837 -10434103 -30402803
5793c0402803p139530Q604782J5863377J4864982J1954702N420344p260391j5355194
$$ -30402803 -37542333 -28937551 -13074174 1790808 13745510 19165854 11905463 -3449731
5785c449731q063845L611451Q00132j0778543q030151R850735J7804233O403717
$$ -3449731 -11513576 -7902125 -7101993 -17880536 -25910687 -16059952 1744281 8147998
5777H147998l329144J857117M495885j0092741k4869685j9609158n148413j660265
$$ 8147998 4818854 6675971 11171856 1079115 -23790570 -43399728 -48548141 -50208406
5769e0208406k386086R783717K5025919K0636090K536229l762376J127004p313859
$$ -50208406 -52594492 -42810775 -17784856 2851234 5387463 1625087 2752091 -4561768
5761d561768k7609799k5298357J1569357M5887518M0663998O905474j9613098
$$ -4561768 -32171567 -57469924 -45900567 -13049 40650949 47556423 27943325
5754B7943325k6393744k4457094j8111976k110047J8554848K9699563K7819097
$$ 27943325 1549581 -22907513 -41019489 -43129536 -24574688 5124875 32943972
5747C2943972K2473406J9419528J4136026K257698j2990194k4585001k7939039
$$ 32943972 55417378 74836906 88972932 91230630 78240436 53655435 25716396
5740B5716396k3824846j6473743o918189P930620K2993806K0419333o023393k8527817
$$ 25716396 1891550 -14582193 -21500382 -13569762 9424044 29843377 23819984 -4707833
5732d707833j3384025K7232078M2239455J0554839k8319789l0852782o424086
$$ -4707833 -18091858 9140220 51379675 61934514 33614725 2761943 -3662143
5725c662143Q546087O162742J991955m649716k3086750l4430538q149530M2000971
$$ -3662143 4883944 11046686 13038641 8388925 -14697825 -49128363 -57277893 -15276922
5717a5276922O1314267K5971221k4401157m3307970l4369934k7947725k7719582
$$ -15276922 46037345 72008566 47607409 4299439 -30070495 -58018220 -85737802
5710h5737802j3419737J6245189L6736521L3991967K1655836J5939204J3671689
$$ -85737802 -99157539 -82912350 -46175829 -12183862 9471974 25411178 39082867
5703C9082867N932049j907984Q46740R107573P077916n921904j1617732j360678
$$ 39082867 45014916 43106932 43953672 53061245 60139161 54217257 42599525 41238847
5695D1238847O746229o959544l2161895m0894905k6209698p367938K832766J1598058
$$ 41238847 47985076 41025532 8863637 -32031268 -58240966 -65608904 -62776138 -51178080
5687e1178080K1425506J8017717k512534j6822381n222430J7198388K2279495
$$ -51178080 -29752574 -11734857 -14247391 -31069772 -36292202 -19093814 3185681
5680C185681Q560468l762242p152099j0695033j5795269j3531287n115368k041531
$$ 3185681 11746149 7983907 831808 -9863225 -25658494 -39189781 -44305149 -46346680
5672d6346680m859194k008624R208298J9329284K4615707K9258296K9698235J6948640
$$ -46346680 -51205874 -53214498 -44006200 -24676916 -61209 29197087 58895322 75843962
5664G5843962l694710j4969297j2316882p638936o689936k607469N380208P388786
$$ 75843962 72149252 57179955 44863073 37224137 30534201 27926732 33306940 40695726
5656D0695726J231526m160091p136794j4907972k3915911k1380661j0435883q582983
$$ 40695726 41927252 37767161 30630367 15722395 -8193516 -29574177 -40010060 -48593043
5648d8593043j4814891n876779K4081069M7932812M4329769K5699056J0792534
$$ -48593043 -63407934 -69284713 -45203644 2729168 47058937 72757993 83550527
5641H3550527l760592k3127742l1349927j5938595M794372P189341j814582k609945
$$ 83550527 79789935 56662193 25312266 9373671 14168043 21357384 19542802 16932857
5633A6932857m03378j1815881k5936933j5585557J5805950L3304861J9196242
$$ 16932857 16529479 4713598 -21223335 -36808892 -21002942 12301919 31498161
5626C1498161p586056k4930166l1569357l0716591j7510675N124509K0012118
$$ 31498161 23912105 -1018061 -32587418 -63304009 -80814684 -75690175 -55678057
5619e5678057J7477693O779858k140197r721481j2248398J305292K5506803L3529443
$$ -55678057 -38200364 -31420506 -33560703 -43282184 -55530582 -54225290 -28718487 4810956
5611D810956J3331606j0395225j1116077j84719n615648k3325452k1830614N547706
$$ 4810956 18142562 7747337 -3368740 -3553459 -9169107 -32494559 -54325173 -48777467
5603d8777467K5623943J3107812j2573594j6303044M154643J9843453J2280523
$$ -48777467 -23153524 -10045712 -22619306 -38922350 -34767707 -14924254 -2643731
5596b643731p418312j9680240j8660144r630479J756795J1095456J5091144J5213172
$$ -2643731 -10062043 -29742283 -48402427 -58032906 -56276111 -45180655 -30089511 -14876339
5588a4876339J5423098J4557957R096154L830492P396285J4665077R471607q363974
$$ -14876339 546759 15104716 24200870 28031362 35427647 50092724 59564331 51200357
5580E1200357j6876871n381289M506941r092621l1330659l1934170j2612149k087582
$$ 51200357 34323486 28942197 33449138 24356517 -6974142 -38908312 -51520461 -53608043
5572e3608043p983960p708147Q832166K1389511J5692296O658709Q594849R609488
$$ -53608043 -61592003 -69300150 -60467984 -39078473 -23386177 -16727468 -8132619 1476869
5564A476869l462534j8004352j6969534q226273q291022j2890271q751054o33547
$$ 1476869 -1985665 -19990017 -36959551 -45185824 -53476846 -66367117 -75118171 -75751718
5556g5751718J8178J729141J9412344M1305478L8811606P757197k5765355m0110783
$$ -75751718 -75733540 -74004399 -54592055 -13286577 25525029 33282226 7516871 -32593912
5548c2593912l5246451j7445903P066994K2232953J2461786j1947649k2814498
$$ -32593912 -67840363 -85286266 -78219272 -55986319 -43524533 -55472182 -78286680
5541g8286680j2429639r61535m12636L226282K1207173L8828590L6356098J6445616
$$ -78286680 -90716319 -91677854 -92090490 -88864208 -67657035 -28828445 7527653 23973269
5533B3973269l026983j0266815l461041J2445980K3136826J3685342j0354114
$$ 23973269 20946286 10679471 7218430 19664410 42801236 56486578 46132464
5526D6132464k5526341k2953337k0024478k8044761k9370159o052352K6278806
$$ 46132464 20606123 -2347214 -22371692 -50416453 -79786612 -85838964 -59560158
5519e9560158L7468816K4925456J2106021J1172263J1779728O045418J497279
$$ -59560158 -22091342 2834114 14940135 26112398 37892126 43937544 45434823
5512D5434823M535003Q721027N577420n304472k0093187l3176593l4556342j7917565
$$ 45434823 49969826 58690853 64268273 58963801 38870614 5694021 -28862321 -46779886
5504d6779886N981642J6723839Q795809k903170n256494j563302Q39774L429243
$$ -46779886 -40798244 -24074405 -15278596 -18181766 -23438260 -25001562 -24161788 -20732545
5496b0732545Q268132R093083J742309n654754m230303J690523L973827O111105
$$ -20732545 -12464413 -3371330 -1629021 -7283775 -11514078 -9823555 -5849728 261377
5488B61377J4384275J9402279N347579k1882790l4538420j7535209J1580728K5433887
$$ 261377 14645652 34047931 39395510 17512720 -17025700 -34560909 -22980181 2453706
5480B453706J7472817J239280r275483p975050M285018J7011571J5284468l48380
$$ 2453706 19926523 21165803 11890320 3915270 8200288 25211859 40496327 40147947
5472D0147947q987152J671477J3278411L632309j4950092j1565791J2766131K2454317
$$ 40147947 31160795 32832272 46110683 49742992 34792900 23227109 35993240 58447557
5464E8447557P58043k5493302k7924412j4614046o176749J172915K1567330M4634165
$$ 58447557 59205600 33712298 5787886 -8826160 -15002909 -13829994 7737336 52371501
5456E2371501M3871873J4504681j9348501l2723272j9630065Q376233K8236642
$$ 52371501 96243374 110748055 91399554 58676282 39046217 47422450 75659092
5449G5659092J9028207j3807868l7203184k9758370r956182o209668j4411984
$$ 75659092 94687299 80879431 43676247 13917877 3961695 -2247973 -16659957
5442a6659957j1560650J899464N799363j394905k050246N747775O626159P63414
$$ -16659957 -28220607 -26321143 -20521780 -21916685 -23966931 -18219156 -11592997 -10829583
5434a0829583L800967J2364071N893703j2522600j5056475K877381J2586465K014214
$$ -10829583 -7028616 5335455 11229158 -1293442 -16349917 -13472536 -886071 1128143
5426A128143n006592L631204L677694j8076034l2611094j6772684M110902r83812
$$ 1128143 -3878449 -247245 3430449 -14645585 -47256679 -64029363 -59918461 -60902273
5418f0902273j5435583o537036J6022914J9001341L240595m457883k664753j0481765
$$ -60902273 -76337856 -82874892 -66851978 -47850637 -44610042 -49067925 -51732678 -62214443
5410f2214443k0997103r515857J4904970J6628136m388284p603344K0324950M1197329
$$ -62214443 -83211546 -92727403 -77822433 -61194297 -65582581 -73185925 -52860975 -11663646
5402a1663646K7347483L945906L308978J4182870Q164044j1205537j9219938j1847891
$$ -11663646 15683837 19629743 22938721 37121591 45285635 34080098 14860160 3012269
5394C012269n870384p638585p720958r88868Q086930J5857346K0293016J6918763
$$ 3012269 -2858115 -10496700 -18217658 -19206526 -11119596 4737750 25030766 41949529
5386D1949529N782921m829494j1324530k0751423l3451198l3640953j2303952
$$ 41949529 47732450 42902956 31578426 10827003 -22624195 -56265148 -68569100
5379f8569100J2883170J8496310P259595K62264L531538K485260j0961039k3684133
$$ -68569100 -55685930 -37189620 -29930025 -29667761 -26136223 -23650963 -34612002 -58296135
5371e8296135j8398889N388018L1425533M2051817L2793477J5292766M177747
$$ -58296135 -76695024 -71307006 -39881473 2170344 34963821 50256587 54434334
5364E4434334L41657o099461j5881764j7142002p441066k644480j1462047j7263174
$$ 54434334 54775991 48676530 32794766 15652764 8211698 5567218 -5894829 -23158003
5356b3158003m044814J2854673P098731j4647493j8185234O590852K8162848J8780974
$$ -23158003 -27202817 -14348144 -7249413 -21896906 -40082140 -33491288 -5328440 13452534
5348A3452534o636617j5327246l571427M185790m330886j3741258r084391K96384
$$ 13452534 6815917 -8511329 -12082756 -7896966 -12227852 -25969110 -35053501 -34757117
5340c4757117l302213j7261107k1254137o631079J1162530J4759731Q057970O414810
$$ -34757117 -38059330 -55320437 -76574574 -83205653 -72043123 -57283392 -49225422 -42810612
5332d2810612J0679055O335783j1360674k7029517k6071387j2849569J238422
$$ -42810612 -32131557 -25795774 -37156448 -64185965 -90257352 -103106921 -101868499
5325a01868499J6016979L5161323M8631714L9885668J0387396j7415070k5093802
$$ -101868499 -85851520 -50690197 -2058483 37827185 48214581 30799511 5705709
5318E705709j6450641p858131q821537j5694386j8699985j2173048r43710M080413
$$ 5705709 -10744932 -18603063 -27424600 -43118986 -61818971 -73992019 -74935729 -70855316
5310g0855316Q3610k262297N656907J5347949J3189907K773836n64793M001099
$$ -70855316 -70771706 -73034003 -67377096 -52029147 -38839240 -36065404 -36630197 -32629098
5302c2629098J650050r065639p959464J3897197L2448605K1200112r272151k4467428
$$ -32629098 -30979048 -40044687 -48004151 -34106954 -1658349 19541763 10269612 -14197816
5294a4197816j2184204O538090J0777145J969496r644095j9405851k2241951j1839836
$$ -14197816 -26382020 -19843930 -9066785 -7097289 -16741384 -36147235 -58389186 -70229022
5286g0229022M110842N844951q327540j1339772J4691433M4478020L8524565p15016
$$ -70229022 -66118180 -60273229 -68600769 -79940541 -65249108 -20771088 17753477 17038461
5278A7038461k9098770j9241179P324306J6051928N019912k139471N736600J6126546
$$ 17038461 -12060309 -31301488 -23977182 -7925254 -2905342 -5044813 691787 16818333
5270A6818333J4450947R74254j3710448j9983215j6317679j1288646j5313459
$$ 16818333 31269280 32243534 18533086 -1450129 -17767808 -29056454 -44369913
5263d4369913k5103624k2989137K82959K9519540M2647955L7513105K8013229
$$ -44369913 -69473537 -92462674 -92179715 -62660175 -20012220 17500885 45514114
5256D5514114J9771481O934990r062240j6812733j4083405j2033052j4491855
$$ 45514114 65285595 72220585 63158345 46345612 32262207 20229155 5737300
5249E737300r800045P644380K2721361J8823933Q16520j3745699j7720448j6078731
$$ 5737300 -4062745 3581635 26302996 45126929 45943449 32197750 14477302 -1601429
5241a601429j1590583k701512P618092J3169608J3507139J2221064Q410044p51121
$$ -1601429 -13192012 -15893524 -8275432 4894176 18401315 30622379 39032423 38281302
5233C8281302j0871677j3204714n642593P027729K0960435L1842506K9353442
$$ 38281302 27409625 14204911 8562318 15590047 36550482 68392988 97746430
5226I7746430O855071k2710434l4981213k3486726q659643r773074j8483208j2329284
$$ 97746430 104601501 81891067 46909854 23423128 14763485 4990411 -13492797 -25822081
5218b5822081J1207892K8732417K1190522j477227j3854135p262785K199075j716545
$$ -25822081 -14614189 14118228 35308750 33831523 19977388 12714603 14913678 13197133
5210A3197133j3602126j6454190o132157N741985J0456480J0269842O659477m346020
$$ 13197133 -404993 -16859183 -22991340 -17249355 -6792875 3476967 10136444 5790424
5202E790424j8861178k1999378q927487M115428M195272M557562K2796154M4651018
$$ 5790424 -13070754 -35070132 -43997619 -39882191 -35686919 -31129357 -8333203 36317815
5194C6317815L6092198p036314m6793576m9596982k4477243k992251J585142k69101
$$ 36317815 72410013 65373699 18580123 -31016859 -55494102 -58486353 -56901211 -57170312
5186e7170312L264240J4094825K7753883L4350739K2882692k626644j9064038
$$ -57170312 -53906072 -39811247 -12057364 22293375 45176067 42549423 23485385
5179B3485385j0959139N681580L315661j8118514l1480797k0935034j17634J1845879
$$ 23485385 12526246 18207826 21523487 3404973 -28075824 -49010858 -49128492 -37282613
5171c7282613J3459208J2475602J1204687J0490421J4437170J9850143J3378207
$$ -37282613 -23823405 -11347803 -143116 10347305 24784475 44634618 58012825
5164E8012825q256553k6902649k6852493j9400912k4427372l4848029k3554583
$$ 58012825 49756272 22853623 -3998870 -23399782 -47827154 -82675183 -106229766
5157a06229766J3204206M3310680L9102315J1819910p261282o466702P62413J213989
$$ -106229766 -93025560 -49714880 -10612565 1207345 -6053937 -12520639 -11758226 -10544237
5149a0544237l682676o475868l638902L759398J0616193R401643j665928j3716947
$$ -10544237 -14226913 -20702781 -24341683 -20582285 -9966092 -564449 -2230377 -15947324
5141a5947324j7373562j4804185j3863233j4312700j0246192l012191O97359K118011
$$ -15947324 -33320886 -48125071 -61988304 -76301004 -86547196 -89559387 -88862028 -86744017
5133h6744017Q024556J5101838J2462098K698672L067083J7874324K6097326R110475
$$ -86744017 -78719461 -63617623 -51155525 -48456853 -45389770 -27515446 -1418120 7692355
5125G692355k1701862l9186540l3225352j5534722L49037Q830026P834579N82602
$$ 7692355 -14009507 -53196047 -86421399 -101956121 -101607084 -92777058 -84942479 -84359877
5117h4359877q51674J1855955K8846669L3460442K5251787J6804413J0279810
$$ -84359877 -85211551 -73355596 -44508927 -11048485 14203302 31007715 41287525
5110D1287525m305583k5891758l6962927k8083111j1209833K39042R439307K2967242
$$ 41287525 36981942 11090184 -25872743 -53955854 -65165687 -64926645 -55487338 -32520096
5102c2520096L2776672K6505761Q569255l783610l663925k400824j2659995l0132773
$$ -32520096 256576 26762337 35331592 31547982 27884057 25483233 12823238 -17309535
5094a7309535l4812256j1183485L0658782N7355163M4371428N042864k3450632
$$ -17309535 -52121791 -63305276 -32646494 24708669 69080097 74122961 50672329
5087E0672329k3536400j2256778j0086669j3906908j1560109n170100k728388
$$ 50672329 27135929 14879151 4792482 -9114426 -20674535 -25844635 -28573023
5080b8573023K59810J0670153J8071435O518454j7736381l0333254j9927561K186372
$$ -28573023 -28313213 -17643060 428375 6946829 -10789552 -41122806 -61050367 -58863995
5072e8863995K2287812L5404713L6095698J8736211p727725k3150682k1145296
$$ -58863995 -36576183 -1171470 34924228 53660439 45932714 22782032 1636736
5065A636736j5425199j5700570j4376463n320879K105860O05661J143160J5193387
$$ 1636736 -13788463 -29489033 -43865496 -49186375 -47080515 -46474854 -45331694 -30138307
5057c0138307L1570937K8771957N075972j9489853k8621977k3341775j1813249
$$ -30138307 1432630 30204587 35280559 15790706 -12831271 -36173046 -47986295
5050d7986295K19260O656028P18732j6387779l1948477l1576924j1881813J6316241
$$ -47986295 -47767035 -41111007 -40392275 -56780054 -88728531 -120305455 -132187268 -115871027
5042a15871027L5859945L6407975K2204762N395481p840126j9037293k5565004
$$ -115871027 -80011082 -43603107 -21398345 -16002864 -23842990 -42880283 -68445287
5035f8445287j7694262O315543L1108841L9303272L0149696J5519758L742806
$$ -68445287 -86139549 -79824006 -48715165 -9411893 20737803 36257561 40000367
5028D0000367l662945n855138m510256o906392j5654080j9997704j0211137L804312
$$ 40000367 36337422 30482284 25972028 19065636 3411556 -16586148 -26797285 -22992973
5020b2992973M210299o617001q412897M048236J0583723k656609j9058892j4661656
$$ -22992973 -18782674 -25399675 -33812572 -29764336 -19180613 -21837222 -40896114 -55557770
5012e5557770O452945J8187722Q932669n826766q365066m27470N851685O519696
$$ -55557770 -49104825 -30917103 -21984434 -27811200 -36176266 -36603736 -30752051 -24232355
5004b4232355N476631K938563l789716r882575n641306O768105J0061348n772600
$$ -24232355 -18755724 -15817161 -19606877 -29489452 -35130758 -28362653 -18301305 -24073905
4996b4073905k4883018k1716541N925945L2191914L3241309J1177084j4148770
$$ -24073905 -48956923 -70673464 -64747519 -32555605 685704 11862788 -2285982
4989b285982k4938232j3324895J5702742M0806634L8004950R835650j2149965
$$ -2285982 -27224214 -40549109 -24846367 15960267 53965217 63800867 51650902
4982E1650902p787219L213538p678460l2117213l7490463j7932621r04557j529914
$$ 51650902 43863683 47077221 39398761 7281548 -30208915 -48141536 -49046093 -50576007
4974e0576007l137970O773791J2393466K48373j1291957J379197K6612170L0021473
$$ -50576007 -53713977 -46940186 -34546720 -34298347 -45590304 -44211107 -17598937 12422536
4966A2422536J258521l3370626m2977815k0538848J7780574M6150374M3723552
$$ 12422536 13681057 -19689569 -62667384 -83206232 -65425658 -19275284 24448268
4959B4448268J1199771k5043119l5646962j6480638J1764297K8037828K6359134
$$ 24448268 35648039 10604920 -25042042 -41522680 -29758383 -1720555 24638579
4952B4638579J2289845l098276p163870L858426J6383052J1059683j4043287l8297553
$$ 24638579 36928424 33830148 26666278 30524704 46907756 57967439 43924152 5626599
4944E626599l9314767j5294764J4364063K8276641K2477821J1041434P099640
$$ 5626599 -33688168 -48982932 -34618869 -6342228 16135593 27177027 34276667
4937C4276667P468965J797768q613761j3465323j2110226j3486741j7536532j5709121
$$ 34276667 41745632 43543400 34929639 21464316 9354090 -4132651 -21669183 -37378304
4929c7378304j1836220j8840544k8598298j3569881K7461962N4603012L9647546
$$ -37378304 -49214524 -68055068 -96653366 -110223247 -82761285 -28158273 11489273
4922A1489273O629039p200130m267245o728313q748403P443292K5093683J2402132
$$ 11489273 18118312 10918182 6650937 -77376 -8825779 -1382487 23711196 36113328
4914C6113328j9127560k7067637q117440k283417k0024766k1741987J0520225
$$ 36113328 16985768 -10081869 -18199309 -20482726 -40507492 -62249479 -51729254
4907e1729254L4888200J5098879k0786992k5623467j711050J6818613K1622446
$$ -51729254 -16841054 -1742175 -22529167 -48152634 -49863684 -33045071 -11422625
4900a1422625K6250319K4963603J407609l0417445l5486152p907876K0828348
$$ -11422625 14827694 39791297 41198906 10781461 -24704691 -32612567 -11784219
4893a1784219K5061026J0107139n989360j2666005q252263L73813J143040o427092
$$ -11784219 13276807 23383946 17394586 4728581 -3523682 -3149869 -2006829 -8433921
4885h433921o167134Q455687J7453775L560282j8099401k4333496k0606188k3464538
$$ -8433921 -14601055 -6145368 11308407 14868689 -3230712 -27564208 -48170396 -71634934
4877g1634934k4097797o970257J1035534O787653N974160N4359044J29489058
$$ -71634934 -95732731 -102702988 -91667454 -84879801 -78905641 -24546597 104942461
4870A04942461J43151492N6971731n6358275j02200195p2540307k6543842l25911
$$ 104942461 248093953 305065684 248707409 146507214 73966907 47423065 47097154
4863D7097154J2824353J5299934l957784l2393924l5721940p647048J7707900
$$ 47097154 59921507 75221441 71263657 38869733 3147793 -4499255 13208645
4856A3208645J5384046J626713J180207Q720032M267057j0776486j7800147j3683450
$$ 13208645 28592691 30219404 31399611 40119643 44386700 33610214 15810067 2126617
4848B126617j5227863k8469714l3689750j2613273K1120724L4896485J8750655
$$ 2126617 -13101246 -41570960 -75260710 -87873983 -66753259 -31856774 -13106119
4841a3106119j587946R45544K0722716L1822306K4787163J3098095O068315l293183
$$ -13106119 -14694065 -13748521 6974195 38796501 63583664 76681759 82750074 79456891
4833G9456891j7307303k0655603l397295J6361788J2291909j2629788k7915854
$$ 79456891 62149588 41493985 38096690 54458478 66750387 54120599 26204745
4826B6204745j6929331J337497O48464j6137945k4342553j4678906m131419n960053
$$ 26204745 9275414 10612911 11261375 -4876570 -29219123 -43898029 -48029448 -53989501
4818e3989501p338693Q593584L0688947L2028292J1751641j50542J2646538K7006844
$$ -53989501 -61328194 -52734610 -22045663 9982629 21734270 21583728 34230266 61237110
4810F1237110J5311384j2943006k7566711k3103824k0571128k8165410k8328837
$$ 61237110 76548494 63605488 36038777 12934953 -7636175 -35801585 -64130422
4803f4130422q872032J5991282K5202455J5586563j056153j3086421j5303279
$$ -64130422 -73002454 -57011172 -31808717 -16222154 -17278307 -30364728 -45668007
4796d5668007j1182625j2467052k5292723l5629918k2876591R890759L4966443
$$ -45668007 -56850632 -69317684 -94610407 -130240325 -153116916 -143226157 -108259714
4789a08259714L3302522J4075890k061355l521774J0984245L3549991M5191956
$$ -108259714 -74957192 -60881302 -62942657 -66464431 -55480186 -21930195 23261761
4782B3261761L1682181N979298m693050K616860N192797l961060m706380Q981001
$$ 23261761 54943942 60923240 56230190 58847050 64039847 60078787 55372407 64353408
4774F4353408J1764279p668445j8716084K193023K5169288R926220k7105385l5593235
$$ 64353408 76117687 68449242 49733158 51926181 77095469 87021689 59916304 24323069
4766B4323069r018098J0168234J434558q026074J768908J0038063j999478j3915068
$$ 24323069 15304971 25473205 26907763 18881689 20650597 30688660 28689182 14774114
4758A4774114j090999K1124117K0670943j309525j5231898q451990L115823N952520
$$ 14774114 13683115 34807232 55478175 54168650 38936752 30484762 33600585 39553105
4750C9553105N096084N775545J174002j2109711k2180184j7624380n872702l010098
$$ 39553105 44649189 50424734 51598736 39489025 17308841 -315539 -6188241 -9198339
4742i198339r428802r216810M275265J5393252P960430q884047j1549642L663113
$$ -9198339 -18627141 -27843951 -23568686 -8175434 -215004 -9099051 -20648693 -16985580
4734a6985580J4663978P014737m178417J623256J8062853K1817194P648866o330566
$$ -16985580 -2321602 4693135 514718 2137974 20200827 42018021 49666887 43336321
4726D3336321p383151l020824l131564m370620j333265l00191r277772k0984750
$$ 43336321 35953170 32932346 29800782 25430162 24096897 23796706 14518934 -6465816
4718f465816j8916386o20676J5169860R903208j1157017k3729872j2712973J1767657
$$ -6465816 -25382202 -26002878 -10833018 -929810 -12086827 -35816699 -48529672 -36762015
4710c6762015K9460472L2487775K5135659J0415582q786743k1019093j7444327
$$ -36762015 -7301543 25186232 50321891 60737473 51950730 30931637 13487310
4703A3487310r800112j6059509k8201954k0859694L043522P944741j8111494l6800754
$$ 13487310 3687198 -12372311 -40574265 -61433959 -58390437 -50445696 -68557190 -105357944
4695a05357944j5441298K0374505K5472544L039131q059314J600583O114936k285606
$$ -105357944 -120799242 -100424737 -74952193 -71913062 -79972376 -78371793 -72256857 -74542463
4687g4542463j478637J4822965K3859224J6568871J3219735K2731638K4424016
$$ -74542463 -76021100 -61198135 -37338911 -20770040 -7550305 15181333 39605349
4680C9605349P294248q441347q754108r833340k1346237k0181844Q599361L4300304
$$ 39605349 46899597 38458250 29704142 19870802 -1475435 -21657279 -13057918 21242386
4672B1242386K0645566j7470565l4368753j6934154P986849K0233242K4845582
$$ 21242386 41887952 24417387 -9951366 -26885520 -18898671 1334571 26180153
4665B6180153K6709504J9324275K500270j3476945k4199250l1738783l0529562
$$ 26180153 52889657 72213932 74714202 61237257 37038007 5299224 -25230338
4658b5230338j4652348K413945J73575j4694297j1896203J7702796M4087071L6526969
$$ -25230338 -39882686 -37468741 -37295166 -51989463 -63885666 -46182870 -2095799 34431170
4650C4431170J748050k9517160l9681296l3053647j7614293L832522K4506013
$$ 34431170 36179220 6662060 -33019236 -66072883 -83687176 -79854654 -55348641
4643e5348641L0259777J4310873q708320j3553786O042732K6167212K1514666
$$ -55348641 -25088864 -10777991 -19486311 -33040097 -26997365 -830153 20684513
4636B0684513j18997r224675N99726L412093j4934694l0231205j7837196N914408
$$ 20684513 20565516 11340841 11940567 15352660 417966 -29813239 -47650435 -41736027
4628d1736027R662246k083239R6874J6753157J7174392o313830k1969300j0133198
$$ -41736027 -32073781 -34157020 -34060146 -17306989 -132597 -6446427 -28415727 -38548925
4620c8548925N140527k054230j6291380q277923J6643251K9945218K6065003K3125469
$$ -38548925 -33408398 -35462628 -51754008 -60031931 -43388680 -13443462 12621541 35747010
4612C5747010K3577016R248385k0308940l6682857k2834357N57381O234485j506157
$$ 35747010 59324026 68572411 48263471 11580614 -11253743 -10696362 -4461877 -5968034
4604e968034o33045J0273059J2131102r04879j1953530q930256j419341k267309
$$ -5968034 -6601079 3671980 15803082 14898203 2944673 -5985583 -7404924 -9672233
4596i672233q494831j0822173r310900p942154m383175K117872K329698q336077
$$ -9672233 -18167064 -28989237 -38300137 -46242291 -50625466 -48507594 -46177896 -54513973
4588e4513973j4615530R38592K8541692L8420236J8574241j1317405k5864788
$$ -54513973 -69129503 -68190911 -39649219 -1228983 17345258 6027853 -19836935
4581a9836935j8245257L189398K5113843L1965036J6203255p685261j5597120
$$ -19836935 -38082192 -34892794 -9778951 22186085 38389340 30704079 15106959
4574A5106959n841620q40130j0891115j8494293r834405J778178J196170j872570
$$ 15106959 9265339 8425209 -2465906 -20960199 -30794604 -29016426 -27820256 -29692826
4566b9692826N867817J1976800k286440k5621309k8634275o132490J8646842K8481855
$$ -29692826 -23825009 -11848209 -14134649 -39755958 -68390233 -74522723 -55875881 -27394026
4558b7394026K6621984J9727698J0448233N756073R752281R569933q233116k9320544
$$ -27394026 -772042 18955656 29403889 35159962 44912243 54482176 46249060 16928516
4550A6928516k6258198j951583J1035192j34212j0199672J708357J9623521J8538425
$$ 16928516 -9329682 -11281265 -246073 -380285 -10579957 -8871600 10751921 29290346
4542B9290346K145070p634831l159657N878750J0468777O809998p798630k8724572
$$ 29290346 31435416 23800585 20640928 26519678 36988455 43798453 35999823 7275251
4534G275251m1011573l5122024j9375959p357707j030638M630774R527258J1297045
$$ 7275251 -33736322 -68858346 -88234305 -95592012 -96622650 -91991876 -82464618 -71167573
4526g1167573J2416195J5005946J5816933J4034031J5185656J9312887J5349479
$$ -71167573 -58751378 -43745432 -27928499 -13894468 1291188 20604075 35953554
4519C5953554k743972k2885005k8100287j6334212O29158J0867463R220804j03297
$$ 35953554 33209582 10324577 -17775710 -34109922 -33480764 -22613301 -13392497 -13495794
4511a3495794k644450J2584413L3031241L1964197O227455j3657925m155298J9129819
$$ -13495794 -16140244 -3555831 29475410 61439607 67667062 54009137 49853839 68983658
4503F8983658K7536366J9682346J2657976P560931p889711k9586165l8119383
$$ 68983658 96520024 116202370 128860346 136421277 128531566 98945401 60826018
4496F0826018k8454232j4386451m438414K868805J261688j7849952l9088372l2027323
$$ 60826018 32371786 17985335 13546921 16415726 17677414 -172538 -39260910 -71288233
4488g1288233L643601K9732667K1387727J580476L253100J9863984K1501823M758238
$$ -71288233 -67644632 -37911965 -16524238 -14943762 -11690662 8173322 29675145 34433383
4480C4433383o393806m246870q029322k5392714l4144634j8113472K748581P78298
$$ 34433383 28039577 23792707 15763385 -9629329 -43773963 -61887435 -59138854 -58360556
4472e8360556j6166062j6375928O858773K5667517J9979138L714130j997664J018240
$$ -58360556 -74526618 -90902546 -84043773 -58376256 -38397118 -34682988 -36680652 -35662412
4464c5662412J632899M017988J5077002K0838006M276274j9083452j5029270J7090632
$$ -35662412 -34029513 -30011525 -14934523 5903483 10179757 -8903695 -23932965 -6842333
4456f842333L7228524J9956730j2166388k6305349k2611752j7097563o579163
$$ -6842333 30386191 50342921 38176533 11871184 -10740568 -27838131 -34417294
4449c4417294J7007049L3684354J5084285k6034852m1875304j2525734K6442885
$$ -34417294 -17410245 16274109 31358394 5323542 -36551762 -49077496 -22634611
4442b2634611L1739409M524854k1008658k4171712j4127267p620220p302249l785702
$$ -22634611 9104798 13629652 -7379006 -31550718 -45677985 -53298205 -60600454 -64386156
4434f4386156Q549386K1490045K0670361N107581o689669J543093K0575901K6372078
$$ -64386156 -55836770 -34346725 -13676364 -8568783 -15258452 -13715359 6860542 33232620
4426C3232620J1851738o321542j2967324j0398135n453877K859817J3910724J7001472
$$ 33232620 45084358 38762816 25795492 15397357 9943480 12803297 26714021 43715493
4418D3715493M323211j5243882k5252961k0039081p510506J258996J56731q403177
$$ 43715493 48038704 32794822 7541861 -12497220 -20007726 -18748730 -18591999 -26995176
4410b6995176j3477731n393258J0503575J7120330O818402q562962j3440702n587690
$$ -26995176 -40472907 -45866165 -35362590 -18242260 -11423858 -19986820 -33427522 -39015212
4402c9015212P872673K1905879L3001157L5196068K5933201J1009701l012474
$$ -39015212 -31142539 -9236660 23764497 58960565 84893766 95903467 92890993
4395I2890993j5739235k6566645k8918629j8596477j681579J2885203K1965029
$$ 92890993 77151758 50585113 21666484 3070007 1388428 14273631 36238660
4388C6238660K3294960J1669515j0084266k5341655k1550349p591285q52833k964183
$$ 36238660 59533620 71203135 61118869 35777214 14226865 6635580 5782747 2818564
4380B818564k341237L880021O418709R82759o325217j1280938j5165840j4942893
$$ 2818564 477327 4357348 10776057 11758816 5433599 -5847339 -21013179 -35956072
4372c5956072m180124J2852382K1083904J3334144j602551j2698680j7083679
$$ -35956072 -40136196 -27283814 -6199910 7134234 5531683 -7166997 -24250676
4365b4250676j3888579j366847J4153485J9368098J1158450Q35621n081626j3689031
$$ -24250676 -38139255 -39506102 -25352617 -5984519 5173931 6009552 927926 -12761105
4357a2761105k5960273k5143560j434229K5338151K9063684J4878883R248713
$$ -12761105 -38721378 -63864938 -65299167 -39961016 -10897332 3981551 13230264
4350A3230264J6251913J1669433j3820969l2911681j9067041J4279657L2692719
$$ 13230264 29482177 41151610 27330641 -5581040 -24648081 -10368424 22324295
4343B2324295K6242605J2964825L235215j2638917l6338166m5381041k2073208
$$ 22324295 48566900 61531725 64766940 52128023 15789857 -29591184 -51664392
4336e1664392J4405937K5615460K205606k3308792j8469228Q556709K3728887
$$ -51664392 -37258455 -11642995 -9437389 -32746181 -51215409 -42658700 -18929813
4329a8929813J5009081O223202J8490435L5716582K5598698j2535341m2536360
$$ -18929813 -3920732 2302470 20792905 56509487 82108185 69572844 27036484
4322B7036484l8239536j6102927q096356j6333013j5146715O625626K8400321
$$ 27036484 -11203052 -27305979 -35402335 -51735348 -66882063 -60256437 -31856116
4315c1856116K8641231J4062530N401131O661816M748643o230550j7175348k0479656
$$ -31856116 -3214885 10847645 16248776 22910592 27659235 21428685 4253337 -16226319
4307a6226319j9138329j5556585n091459J1361507J9846919J0274790o232611
$$ -16226319 -35364648 -50921233 -56012692 -44651185 -24804266 -14529476 -20762087
4300b0762087j0237239n63483O782086O124371J1262355K9945402M4920848L5169112
$$ -20762087 -30999326 -31562809 -24780723 -18656352 -7393997 22551405 67472253 102641365
4292A02641365P093669j2666030j2805152q571947j5199661k6620935k8586172
$$ 102641365 109735034 97069004 84263852 75691905 60492244 33871309 5285137
4285E285137k0242521j1494143o849309l239065Q61573M874434J1668578K2799090
$$ 5285137 -14957384 -26451527 -33300836 -36539901 -35678328 -30803894 -19135316 3663774
4277C663774K9026348J6889322j1843898l5854372l5778233j6563770k384409
$$ 3663774 32690122 49579444 37735546 1881174 -33897059 -50460829 -52845238
4270e2845238q502989k2667815k0148594K672137J9420463P464679j7547560j9000993
$$ -52845238 -61348227 -84016042 -104164636 -101492499 -82072036 -74607357 -92154917 -111155910
4262a11155910R432801L2747486K3831725N31604n072934N302634N731909q757634
$$ -111155910 -101723109 -68975623 -45143898 -44612294 -49685228 -44382594 -38650685 -47408319
4254d7408319j7910030j2934546n945707j463351R478337K0470867Q703909k2806827
$$ -47408319 -65318349 -78252895 -84198602 -85661953 -76183616 -55712749 -47008840 -69815667
4246f9815667l4009680j812912M0632388M6534524J7910062n400401n865440l196235
$$ -69815667 -103825347 -105638259 -65005871 -18471347 -561285 -5961686 -11827126 -15023361
4238a5023361j2485727k0235656r894543J1729036K4212333J6815829l543246
$$ -15023361 -27509088 -47744744 -57639287 -45910251 -21697918 -4882089 -8425335
4231h425335j8094404r631332J8720187L9190707K6581668j0634291l8997104
$$ -8425335 -26519739 -36151071 -17430884 21759823 48341491 37707200 -1289904
4224a289904l8724328k0063517k406949O329008P116933K691821q24978L364546
$$ -1289904 -40014232 -60077749 -62484698 -56155690 -49038757 -46346936 -47171914 -43807368
4216d3807368J3269040J9772201J9146342J4645065O963332m232472j0461377
$$ -43807368 -30538328 -10766127 8380215 23025280 29988612 25756140 15294763
4209A5294763k062259J3192098J6621724P122311L874348J3974959J8464666L539695
$$ 15294763 13232504 26424602 43046326 50168637 54042985 68017944 86482610 90022305
4201I0022305j3846169j1013997L947950M289929j3650363k5790404j8586236
$$ 90022305 76176136 65162139 69110089 73400018 59749655 33959251 15373015
4194A5373015q169128j1543283j8038571p306765J4677383K0165641J810153j1184717
$$ 15373015 7203887 -4339396 -22377967 -29684732 -15007349 5158292 6968445 -4216272
4186d216272P192428L8032358L7507490m101281m6647939n0651613k3161621R60211
$$ -4216272 2976156 41008514 78516004 74414723 27766784 -22884829 -46046450 -45086239
4178d5086239O644060O740302J2247678J7833600J6380787R123257o82268r425817
$$ -45086239 -38442179 -31701877 -19454199 -1620599 14760188 23883445 23201177 13775360
4170A3775360q140079Q944649K9778615L3764479J8200789J524087k148267J992342
$$ 13775360 5635281 14579930 44358545 78123024 96323813 97847900 95699633 97691975
4162I7691975K205385n459798j7785128k6830667k1512554k11618J9924076K2143637
$$ 97691975 99897360 94437562 76652434 49821767 28309213 28097595 48021671 70165308
4154G0165308J4762783J5852230J7853419k426834l6229353m1639327m912086
$$ 70165308 84928091 100780321 118633740 116206906 79977553 38338226 33426140
4147C3426140L0621137K1477600j6787766l6515219k3886369n315590m28505k563546
$$ 33426140 64047277 85524877 68737111 32221892 8335523 3019933 2591428 27882
4139B7882k867796l462735l526036L111262J0945748L760735j9880175l8012227
$$ 27882 -2839914 -6302649 -9828685 -6717423 4228325 7989060 -11891115 -49903342
4131d9903342l1047931n782002J4252375J6209580R012063Q686401J7219012K0244685
$$ -49903342 -80951273 -86733275 -72480900 -56271320 -47259257 -38572856 -21353844 -1109159
4123a109159P629502j0495834j7861673j6387472j9948294k6590961j9730264
$$ -1109159 6520343 -3975491 -21837164 -38224636 -58172930 -84763891 -104494155
4116a04494155k24919Q999879n22090j0150075j2495081k9251596o4300169p1543346
$$ -104494155 -104719074 -95719195 -96241285 -106391360 -118886441 -148138037 -212438206 -283981552
4108b83981552j2205520P4405071J05791267N9214091l457881j8547545J1381292
$$ -283981552 -296187072 -221782001 -115990734 -56776643 -60234524 -78782069 -67400777
4101f7400777M3279799N1092033L7646774J5110207l964755r537226l499451J966630
$$ -67400777 -24120978 26971055 64617829 79728036 75763281 66226055 62726604 64693234
4093F4693234J314700p66114m320215j4703438k4162641j4101481J4946196L5357510
$$ 64693234 66007934 65241820 60921605 46218167 22055526 7954045 22900241 58257751
4085E8257751K7190012M567251o346516j693936K869903j118792o906837o671042
$$ 58257751 85447763 90015014 83668498 81974562 84844465 83725673 76818836 70147794
4077G0147794j320413L272461L611394K713951P430779J7882614K2534904J2468202
$$ 70147794 68827381 72099842 75711236 78425187 85855966 103738580 126273484 138741686
4069A38741686k599551n378113L159520M475262r101293k2746722k1490537j0578346
$$ 138741686 136142135 130764022 133923542 138398804 129297511 106550789 85060252 74481906
4061G4481906o666902j8296905l8955191n1010538l7089072Q26219L5559030M2348880
$$ 74481906 67815004 49518099 10562908 -40447630 -77536702 -76710483 -41151453 1197427
4053A197427K9216902K1792719K2270013R513059j8659321l4025587j9863128
$$ 1197427 30414329 52207048 74477061 83990120 65330799 31305212 11442084
4046A1442084K964367P921027j826089p462698m244862J441370P976710J2921088
$$ 11442084 14406451 22327478 20501389 13038691 8793829 10235199 18211909 31132997
4038C1132997O033698j4255085l0263564k7289592j3594676l303088N313925J7485530
$$ 31132997 37166695 22911610 -7351954 -34641546 -48236222 -51539310 -46225385 -28739855
4030b8739855K3974492J5780879L071397j310149m014705j5050556k3062101j2407640
$$ -28739855 -4765363 11015516 14086913 12776764 8762059 -6288497 -29350598 -41758238
4022d1758238N538985O042990j0165133j9394601j3312727p141826q808726o471043
$$ -41758238 -36219253 -30176263 -40341396 -59735997 -73048724 -80190550 -88999276 -95470319
4014i5470319P793896K3933005L0174379K5982103J4623156o33282r950553l701137
$$ -95470319 -87676423 -63743418 -33569039 -7586936 7036220 6402938 -3547615 -7248752
4006g248752J0222381J1674704n136163k4258043k9313334j8273215K755655K3572544
$$ -7248752 2973629 14648333 9512170 -14745873 -44059207 -62332422 -59576767 -36004223
3998c6004223K7703329O576783k0411923k0918839P851728L1141785K1128681
$$ -36004223 -8300894 -1724111 -22136034 -43054873 -35203145 -4061360 17067321
3991A7067321q217663k3193538j2602748O263967J3959842P923871q050K477306
$$ 17067321 8849658 -14343880 -26946628 -20682661 -6722819 1201052 1193002 3670308
3983C670308J2488125R736382j8467724m9800760m4256693K948928M6557410M5066559
$$ 3670308 16158433 25894815 7427091 -42373669 -86630362 -83681434 -37124024 7942535
3975G942535J1801232q488770p6393J3333137J2375001O259109P803437R932978
$$ 7942535 19743767 11254997 11178604 24511741 36886742 43145851 50949288 60882266
3967F0882266J288997j1512071j3751893n449474R96998P72172o55985k762347
$$ 60882266 62171263 50659192 36907299 31457825 32454823 33226995 32571010 29808663
3959B9808663j1866302k4138523k1745305L333058L0811527L1232300J558148
$$ 29808663 17942361 -6196162 -27941467 -24608409 6203118 37435418 38993566
3952C8993566l0209430l7250085k0610239o81665Q100646P210190M825706M779197
$$ 38993566 8784136 -28465949 -49076188 -49757853 -41657207 -34447017 -29621311 -24842114
3944b4842114M150364j505256j0335738j2944253l498436R572158J2317692M840095
$$ -24842114 -20691750 -22197006 -32532744 -45476997 -48975433 -39403275 -27085583 -22245488
3936b2245488J180558O876976R761306N21456j0227783p296563N955506J3431961
$$ -22245488 -21064930 -14187954 -4426648 -3905192 -14132975 -21429538 -15474032 -2042071
3928b042071R347498K144562q84211k37599K219071M627356J806953q387703j6936296
$$ -2042071 7305427 9449989 8565778 8328179 10547250 15174606 16981559 8593856 -8342440
3919h342440j2866807M95099R261796Q010598L915614K093986j427778j0045026
$$ -8342440 -21209247 -20714148 -11452352 -3441754 473860 2567846 1140068 -8904958
3911h904958j9849969k5458010k5056096j8170217n543261P617712J4637624J4410463
$$ -8904958 -28754927 -54212937 -79269033 -97439250 -102982511 -95364799 -80727175 -66316712
3903f6316712J0856335P084952N004228O863380J0688487Q959616k27103o105545
$$ -66316712 -55460377 -48375425 -43371197 -36507817 -25819330 -16859714 -17086817 -23192362
3895b3192362P48006J2134741J1187068n474817k4612065l1812850k1023404M807116
$$ -23192362 -22444356 -10309615 877453 -4597364 -29209429 -61022279 -82045683 -77238567
3887g7238567L1045708L6706976J6949177n809110q168103L956518Q471773K309410
$$ -77238567 -46192859 -9485883 7463294 1654184 -6513919 -2557401 5914372 8223782
3879H223782J014558Q065330J0210255L760194P44963N601463Q806909P252498
$$ 8223782 9238340 17303670 27513925 31274119 32019082 37620545 46427454 53679952
3871E3679952P662360O351101q459265k8533651k8450279o686521N454204q570970
$$ 53679952 61342312 67693413 59234148 30700497 2250218 -4436303 1017901 -7553069
3863g553069k2463528p987457K0674478K9556155J3612131m344514j0501093r136517
$$ -7553069 -30016597 -38004054 -17329576 12226579 25838710 21494196 10993103 1856586
3855A856586l146267Q938351J9703401J8154561P187737j249397n923450j4987566
$$ 1856586 -1289681 7648670 27352071 45506632 52694369 51444972 45521522 30533956
3847C0533956k7274559l1133198k2131850q957593j301760j490668o382127r036223
$$ 30533956 3259397 -27873801 -50005651 -58963244 -60265004 -61755672 -68137799 -77174022
3839g7174022k047325J2374152K0334720J2781584j324234o991673k276682L864258
$$ -77174022 -79221347 -66847195 -46512475 -33730891 -35055125 -42046798 -44323480 -40459222
3831d0459222O809774R280261J2857045J4568953J0055843k154942j4537656j1499160
$$ -40459222 -33649448 -24369187 -11512142 3056811 13112654 10957712 -3579944 -15079104
3823a5079104J0810244K8813282J6943360j0711724j3090132J5651002L0883044
$$ -15079104 -4268860 24544422 41487782 30776058 17685926 33336928 64219972
3816F4219972L265919l4656701l7371701j1948669L418154K772579Q976490K0706499
$$ 64219972 67485891 32829190 -4542511 -16491180 -13073026 -10300447 -1323957 19382542
3808A9382542J1511618j9469918l9494468l0104668o756404J3127757K6170501
$$ 19382542 30894160 11424242 -28070226 -58174894 -64931298 -51803541 -25633040
3801b5633040K4013518k979685l5406781l6828550p311498J2843060N862215K074857
$$ -25633040 -1619522 -4599207 -40005988 -76834538 -84146036 -71302976 -65440761 -63365904
3793f3365904K2927666M0158671K2554867j1313071k3905467j5831511j2920673
$$ -63365904 -40438238 -279567 22275300 10962229 -12943238 -28774749 -41695422
3786d1695422j5648349l567016J9344510K4829232O336509r888252n633061N480603
$$ -41695422 -57343771 -60910787 -41566277 -16737045 -10400536 -20288788 -25921849 -20441246
3778b0441246L506813j0782482k3913277k8043681k2436188r075249N525222J2729979
$$ -20441246 -16934433 -27716915 -51630192 -79673873 -102110061 -111185310 -105660088 -92930109
3770i2930109J1322870Q978517J2469559K1425053L0577183L2318187J9999754
$$ -92930109 -81607239 -72628722 -60159163 -38734110 -8156927 24161260 44161014
3763D4161014l860250k5383833l2606292k7766529j9751015r910206N316176K2411958
$$ 44161014 40300764 14916931 -17689361 -45455890 -65206905 -75117111 -69800935 -47388977
3755d7388977L1958707K9389647J6853130q68395j4490637j2326567M097295J4425534
$$ -47388977 -15430270 13959377 30812507 29944112 15453475 3126908 7224203 21649737
3747B1649737M262694j1388234p756586J1334963J7168536p31909j8824907j4932973
$$ 21649737 25912431 14524197 6767611 18102574 35271110 34539201 15714294 781321
3739G81321J865450J0050194O876235L299754N78537o742666j0741548L208086
$$ 781321 2646771 12696965 19573200 22872954 23451491 16708825 5967277 9175363
3731I175363K6853815K8735484l782513l8465955l4455658K018658K1877131k304400
$$ 9175363 36029178 64764662 60982149 22516194 -11939464 -9920806 11956325 9651925
3723I651925l9243036m2770408j4932339J782290j1215514k4816491j1063871
$$ 9651925 -29591111 -72361519 -87293858 -85511568 -96727082 -121543573 -132607444
3716a32607444J4719166K1897780J2372673J1313810K1864817K1759643M764297
$$ -132607444 -117888278 -95990498 -83617825 -72304015 -50439198 -28679555 -23915258
3709b3915258n897706M505876J6430185N162777k1457381l3772544j9813855L599262
$$ -23915258 -29812964 -25307088 -8876903 -3714126 -25171507 -58944051 -78757906 -75158644
3701g5158644J5711017J2482953J870649q847235j5772461j4906481k514788J9312405
$$ -75158644 -59447627 -46964674 -45094025 -53941260 -69713721 -84620202 -87134990 -67822585
3693f7822585L8380351L8435840J5953686j0792110j9031736r119064k938929
$$ -67822585 -29442234 8993606 24947292 14155182 -4876554 -13995618 -16934547
3686a6934547j0343670j2898134N846294K7690717J9914542j6061805m1118963
$$ -16934547 -27278217 -40176351 -34330057 -6639340 13275202 -2786603 -43905566
3679d3905566k9447050o87961J2193883Q247353J0470635K3591198K6858523J0240856
$$ -43905566 -73352616 -74040577 -61846694 -53599341 -43128706 -19537508 7321015 17561871
3671A7561871p255200o856430J075538n176770k3190073k9119215j2911096Q980827
$$ 17561871 10306671 3450241 4525779 -650991 -23841064 -52960279 -65871375 -56890548
3663e6890548J9338090K0458966J9978479J2685646p508540k6990726k3883233
$$ -56890548 -37552458 -17093492 2884987 15570633 8062093 -18928633 -42811866
3656d2811866j61381J5235801J857641k6247502l8380101k1937920R533979L5077283
$$ -42811866 -42973247 -27737446 -25879805 -52127307 -90507408 -112445328 -102911349 -67834066
3648f7834066M1894858K7632877R50632j9905403k0686550o103796P031486J1996213
$$ -67834066 -25939208 1693669 2644301 -17261102 -37947652 -44051448 -37019962 -25023749
3640b5023749J6640806K4291563K4877925J2709645k50608q99331N475920O081419
$$ -25023749 -8382943 15908620 40786545 53496190 53245582 52346251 57822171 63903590
3632F3903590K275335L308783M678050o406662k4833828k9007587j3226537K221765
$$ 63903590 66178925 69487708 74165758 67759096 42925268 13917681 691144 2912909
3624B912909J820146m518791l957968l985056j4245687k1020190m553023K5709783
$$ 2912909 4733055 214264 -3743704 -7728760 -21974447 -42994637 -47547660 -21837877
3616b1837877L8364793K2241499p45005q482655m431722k802436m683595j353614
$$ -21837877 16526916 38768415 38023410 29540755 25109033 22306597 17623002 16269388
3608A6269388P657770J1812760L286698j2835814k3139803k0205780j1553449
$$ 16269388 23927158 35739918 39026616 26190802 3050999 -17154781 -28708230
3601b8708230r759043j3125405o811204J0917636J8400971J540412j8272045j0296908
$$ -28708230 -38467273 -51592678 -58403882 -47486246 -29085275 -27544863 -45816908 -56113816
3593e6113816J9235574L4771357K3674154R582795Q252738M122285j3221448k1342832
$$ -56113816 -36878242 -2106885 21567269 31150064 39402802 43525087 30303639 8960807
3585H960807m80238K7201598K6563959L159465o542305P929912J9310394J0070903
$$ 8960807 8480569 35682167 62246126 65405591 58863286 66793198 86103592 96174495
3577I6174495k464654j55371N939011j184863j2885804j0697996o64837n230495
$$ 96174495 93709841 93554470 99493481 98308618 85422814 74724818 74059981 68829486
3569F8829486k4394301l1102292j1356374J3210147J6020331K144694m399383
$$ 68829486 44435185 13332893 1976519 15186666 31206997 33351691 28952308
3562B8952308P89441N04353r495574j0337760O823733K1367447J4176124o71077
$$ 28952308 29741749 30246102 20750528 10412768 17236501 38603948 52780072 52108995
3554E2108995J514879J4459236J0009131j5654427l4011098k6101149o136526
$$ 52108995 53623874 68083110 78092241 62437814 28426716 2325567 -3810959
3547c810959N430986R114233J3871629J6487424R147335m662514j4792509j6252883
$$ -3810959 1620027 10734260 24605889 41093313 50240648 45578134 30785625 14532742
3539A4532742q726025M943814J3882547O271955j2188394k1131451j2555926J157902
$$ 14532742 5806717 10750531 24633078 30905033 18716639 -2414812 -14970738 -13812836
3531a3812836J0669428J9708102K4910965J2178085j3741304k3754478p224777
$$ -13812836 -3143408 16564694 41475659 53653744 39912440 16157962 8933185
3524H933185P148445l398192j7305741n724074J7550489K0253681N934439K850111
$$ 8933185 16081630 12683438 -4622303 -10346377 7204112 27457793 33392232 36242343
3516C6242343J2170418J0392950m211402j0851107q408751j4897980k5060749
$$ 36242343 48412761 58805711 54594309 43743202 35334451 20436471 -4624278
3509d624278j3863409J3050542J9114641k254591j3324720L922150J5467421o819137
$$ -4624278 -18487687 -5437145 13677496 11422905 -1901815 2020335 17487756 10668619
3501A0668619l6197676l4017422r332764J682568p076864j1800289j464988J2344151
$$ 10668619 -25529057 -59546479 -68879243 -67196675 -74273539 -86073828 -87538816 -75194665
3493g5194665J9168691J6721932K883476j6714663k3010661o472524J5097102
$$ -75194665 -56025974 -39304042 -36420566 -53135229 -76145890 -82618414 -67521312
3486f7521312K1096998J6262494J3128056M038405k1013340m3095629l4331318
$$ -67521312 -46424314 -30161820 -17033764 -12995359 -34008699 -77104328 -111435646
3479a11435646j700649K1904193K6123576K8852937L4248012K2158660j1182013
$$ -111435646 -113136295 -91232102 -65108526 -36255589 -2007577 20151083 8969070
3472H969070l5415433k6897925l122751L336385j1499007k4611562k0292635m601641
$$ 8969070 -26446363 -53344288 -56467039 -53130654 -64629661 -89241223 -109533858 -114135499
3464a14135499R435457J5662501J3888099O151509k662278n489567J666106J4501269
$$ -114135499 -104700042 -89037541 -75149442 -68997933 -71660211 -77149778 -75483672 -60982403
3456f0982403K1890666J6015431J978444p003338n683402j855078k427945l129530
$$ -60982403 -39091737 -23076306 -21097862 -28101200 -33784602 -35639680 -38067625 -41197155
3448d1197155J548373O942541O090715J724906r6884j975176r074415j5991255
$$ -41197155 -39648782 -32706241 -26615526 -24890620 -24987504 -26962680 -36037095 -52028350
3440e2028350j2216760J666483J3814546J5113363N349111r620019j8213053q105450
$$ -52028350 -64245110 -62578627 -48764081 -33650718 -28301607 -37921626 -56134679 -64240129
3432f4240129J7671676L7025792L4163156K0571463J5490786J4954478J571884
$$ -64240129 -46568453 -9542661 24620495 45191958 60682744 75637222 77209106
3425G7209106k0659861k6938304q682821J3734931K0805824J4928026M428650
$$ 77209106 56549245 29610941 20928120 34663051 55468875 70396901 74825551
3418G4825551j1544754k9844342l4058515j5642881P779879J2452957k4951p010672
$$ 74825551 63280797 33436455 -622060 -16264941 -8485062 3967895 3942944 -3067728
3410c067728K423143J4103379J0953669k602013o782864N811793J7616716P430474
$$ -3067728 -644585 13458794 24412463 21810450 15027586 20839379 38456095 45886569
3402D5886569j9908590l6646121k7115442o426833L734269M369337R875031K0174843
$$ 45886569 25977979 -10668142 -37783584 -44210417 -40476148 -36106811 -26231780 -6056937
3394f056937K1148193Q081016r312771k2380169k7280651j7864192N194137K1544642
$$ -6056937 15091256 23172272 13859501 -8520668 -35801319 -53665511 -48471374 -26926732
3386b6926732J0904861j3946766j8300136O735839L2008847L1819385J2927283
$$ -26926732 -16021871 -29968637 -48268773 -41532934 -9524087 22295298 35222581
3379C5222581o169514j9145589k2751755r194562J5201256K5157646Q656340j4405396
$$ 35222581 29053067 9907478 -12844277 -22038839 -6837583 18320063 26976403 12571007
3371A2571007k2407651k0351800j9172145r994457J4194290L0854884J5176742
$$ 12571007 -9836644 -30188444 -49360589 -59355046 -45160756 -14305872 870870
3364H70870j6387094k4140477k142442J5905773Q457925p979890j1146396k679333
$$ 870870 -15516224 -39656701 -41799143 -25893370 -17435445 -25415335 -36561731 -39241064
3356c9241064N803827J2963464K0198640K1218232J2772241L297741k54237l331297
$$ -39241064 -33437237 -20473773 -275133 20943099 33715340 37013081 36758844 33427547
3348C3427547j1656858j8530245j5002896n097779n47998n228041j3398996j9751202
$$ 33427547 21770689 3240444 -11762452 -16860231 -17408229 -22636270 -36035266 -55786468
3340e5786468k2894536j9836412m453074K3955711N1107133N2555876J7466626
$$ -55786468 -78681004 -98517416 -102970490 -79014779 -27907646 24648230 42114856
3333D2114856l0589503m8877387k1675853J8066505K6909701K858669j9068430
$$ 42114856 11525353 -37352034 -59027887 -40961382 -14051681 -11193012 -30261442
3326c0261442j7835695q142682p513744p745684N485619K3121624K3907194O931321
$$ -30261442 -48097137 -56239819 -63753563 -71499247 -66013628 -42892004 -18984810 -12053489
3318a2053489o585155l111380P184526P876366j006790m473276O762124K2564061
$$ -12053489 -18638644 -21750024 -14565498 -6689132 -7695922 -12169198 -5407074 17156987
3310A7156987K3165028L023918j9298816k0918209k136654J4533049J3073013
$$ 17156987 40322015 43345933 24047117 3128908 992254 15525303 28598316
3303B8598316O72459p971047j0661088j2696288j1781181j814483J2119174J6384797
$$ 28598316 29270775 21299728 10638640 -2057648 -13838829 -15653312 -3534138 12850659
3295A2850659P590438k252043k522292L173026N820400M973546O134112Q141371
$$ 12850659 20441097 18189054 15666762 18839788 24660188 29633734 35767846 43909217
3287D3909217K747036j1340821k1666638j5967876M6250P280281k488804j5019272
$$ 43909217 46656253 35315432 13648794 -2319082 -2272832 5007449 2518645 -12500627
3279a2500627j2593060J571572Q362746M04183q002190k824248R064940J1050111
$$ -12500627 -25093687 -23522115 -15159369 -14755186 -22757376 -25581624 -16516684 -5466573
3271e466573K245057p30435J2156947K9282505L1834473J6858257j589867j1667238
$$ -5466573 -3221516 -3951951 8204996 37487501 69321974 86180231 84590364 72923126
3263G2923126j5324753j8366946j7543815o713498P196793P039551j0469395k3667291
$$ 72923126 57598373 39231427 21687612 14974114 22170907 29210458 18741063 -4926228
3255d926228j0369136K0763437L6797670K0807078o783481j5088489j974208O789167
$$ -4926228 -15295364 5468073 42265743 63072821 56289340 41200851 39226643 46015810
3247D6015810m510704k0043035j7159401j145226K049624j3213616j9345982M012106
$$ 46015810 41505106 21462071 4302670 3157444 5207068 -8006548 -27352530 -23340424
3239b3340424L2997681K6701649j3955362m2513053k8426041M831904J8682391
$$ -23340424 9657257 36358906 22403544 -20109509 -48535550 -43703646 -25021255
3232b5021255J1614261O877747O845100n387841k5643355k7803761r029045p53758
$$ -25021255 -13406994 -6529247 315853 -5071988 -30715343 -58519104 -67548149 -68301907
3224f8301907j8913248l3015101r100391L6946538N7384100L4661639l15970j0509703
$$ -68301907 -87215155 -120230256 -129330647 -92384109 -35000009 -338370 -654340 -11164043
3216a1164043P184474K6704704K2947090o207812l8560843m7182783k7651167
$$ -11164043 -3979569 22725135 45672225 39464413 903570 -46279213 -73930380
3209g3930380k780901O024922M241096R757406K1756114K2817412R718532R83831
$$ -73930380 -76711281 -70686359 -66445263 -56687857 -34931743 -12114331 -2395799 -1411968
3201a411968P956133J6287459P481302j3435582k5050646j7675796j487148J0761267
$$ -1411968 6544165 22831624 30312926 16877344 -8173302 -25849098 -27336246 -16574979
3193a6574979J6544451J7130603J0069072l399900j0118223K616111K4900791
$$ -16574979 -30528 17100075 27169147 23769247 13651024 16267135 41167926
3186D1167926K7968086p8835l2092725l1423711J73465K3365417J2801033j2222181
$$ 41167926 69136012 69057177 36964452 5540741 5714206 29079623 41880656 29658475
3178B9658475j8541826k739589J1954585J0229270j447114r013919l996999J2401575
$$ 29658475 11116649 8377060 20331645 30560915 29113801 20099882 16102883 28504458
3170B8504458K6469157K0769211k273857j6578260p471183L161086j1034184l6055241
$$ 28504458 54973615 75742826 73468969 56890709 49419526 52580612 41546428 5491187
3162E491187l4661240k513454K5891551K8548317J9710799J5698327J0624814
$$ 5491187 -29170053 -31683507 -5791956 22756361 42467160 58165487 68790301
3155F8790301n08120n554827J5957n70140j4579371k1209288o505095P904409
$$ 68790301 68282181 62727354 62743311 62173171 47593800 26384512 19879417 27783826
3147B7783826j908488k1550516k1587342m370928N295543L744518Q241518K0526643
$$ 27783826 25875338 4324822 -17262520 -21633448 -16337905 -12593387 -4351869 16174774
3139A6174774K4623293J8219505J4232409J2172402n66010j8717998k2855256
$$ 16174774 40798067 59017572 73249981 85422383 84856373 66138375 43283119
3132D3283119j5122648j7400165k9173756k3996904J932693J6099128K399590
$$ 43283119 28160471 10760306 -18413450 -42410354 -40477661 -24378533 -21978943
3125b1978943r344694P690384L1612647K7998578O103673N23702J3042518J3582356
$$ -21978943 -31323637 -23633253 7979394 35977972 42081645 42605347 55647865 69230221
3117F9230221o467014k1060643j4056313l420562q773775j9881395j4227253Q298256
$$ 69230221 62763207 41702564 27646251 24225689 15451914 -4429481 -18656734 -10358478
3109a0358478K4083717J5047051r908836k3979837j2403857Q725233J1077745
$$ -10358478 13725239 28772290 18863454 -5116383 -17520240 -8795007 2282738
3102B282738p761412j9500978o143854J2846310J1524137j944671k133852Q047208
$$ 2282738 -5478674 -24979652 -31123506 -18277196 -6753059 -8697730 -10831582 -2784374
3094b784374K262101k0612104k8321107m648030K4579537L0674412K0804203J7345642
$$ -2784374 -522273 -21134377 -49455484 -54103514 -29523977 1150435 21954638 39300280
3086C9300280K0297146J5103850L522030j27162K588992n274965k5795224l7403137
$$ 39300280 59597426 74701276 78223306 78096144 80685136 75410171 49614947 12211810
3078A2211810k3639290K925114J4781337J678024j8315878j9435205L402324K9544513
$$ 12211810 -11427480 -8502366 6278971 7956995 -10358883 -29794088 -26391764 3152749
3070C152749L6576889K4046880P158203o502562j9185024k4230387p346367K4419044
$$ 3152749 39729638 63776518 70934721 64432159 45247135 21016748 13670381 38089425
3062C8089425L6198271O737542l7234428n0101276k3883331O504255J1958472
$$ 38089425 74287696 81025238 43790810 -6310466 -30193797 -23689542 -11731070
3055a1731070j24472p839123n624693j509099J602792O900149J1922237Q438897
$$ -11731070 -11855542 -19694665 -25319358 -26828457 -25225665 -18325516 -6403279 2035618
3047B035618n398065j9413170k0410602o206439R890253J1317372k785247j4924381
$$ 2035618 -3362447 -22775617 -43186219 -49392658 -39502405 -28185033 -30970280 -45894661
3039d5894661j0256151M674196J2087353P610627L482823Q268220J5997678J8285684
$$ -45894661 -56150812 -51476616 -39389263 -31778636 -28295813 -20027593 -4029915 14255769
3031A4255769J5672246J1273152K694950j1664595k3834092k2095586n292816
$$ 14255769 29928015 41201167 43896117 32231522 8397430 -13698156 -18990972
3024a8990972J2536273J3301559p235521l1112516l2810868p786028J9596721
$$ -18990972 -6454699 6846860 -388661 -31501177 -64312045 -72098073 -52501352
3017e2501352K5449260J6271698J4827350K2542851J8687197j879115j6316296
$$ -52501352 -27052092 -10780394 4046956 26589807 45277004 43397889 27081593
3010B7081593r565004J739838j836112j0961020p573178Q64246m761128j8555178
$$ 27081593 17516589 19256427 17420315 6459295 -1113883 -249637 -5010765 -23565943
3002b3565943j8575090p472767r687056k5145095k1805249J2182739M1651215
$$ -23565943 -42141033 -49613800 -59300856 -84445951 -106251200 -94068461 -52417246
2995e2417246L2534716J533867j0393134L437798J4815702R061456R30093J785327
$$ -52417246 -19882530 -18348663 -28741797 -25303999 -10488297 -1426841 -496748 1288579
2987A288579J401759r013334k0141133k2956845k4293706l0104328k9027973q828964
$$ 1288579 2690338 -6322996 -26464129 -49420974 -73714680 -103819008 -132846981 -141675945
2979a41675945K1481617M1428434M3393797L3488644J6461193l682937j4168936
$$ -141675945 -120194328 -78765894 -35372097 -1883453 14577740 10894803 -3274133
2972c274133m754633J1689584R984793j1214121k3330437q027501J3845209J0256841
$$ -3274133 -8028766 3660818 13645611 2431490 -20898947 -28926448 -15081239 -4824398
2964d824398j6226187l1543004j6369832J1252915K4130027J8715818Q942427
$$ -4824398 -21050585 -52593589 -68963421 -57710506 -33580479 -14864661 -5922234
2957e922234J479356n955651q621507K775305K1396081K4270935K386111k2801982
$$ -5922234 -4442878 -10398529 -19020036 -16244731 5151350 29422285 31808396 9006414
2949I006414k5892954j0559303N867j211371M96873J1646625J7585529P354122
$$ 9006414 -16886540 -27445843 -27439976 -28651347 -28154474 -16507849 1077680 8431802
2941H431802q120126j5262435j8126074k3328685k0664589n90819K0820066K0903816
$$ 8431802 311676 -14950759 -33076833 -56405518 -77070107 -77660926 -56840860 -35937044
2933c5937044Q125158J1304782L1537589L7319596J5572429n464045j821419P596984
$$ -35937044 -27811886 -16507104 15030485 52350081 67922510 62458465 60637046 68234030
2925F8234030n297926k8362650k7116932K42730K0749570J6798227N376248L031447
$$ 68234030 62936104 34573454 7456522 7699252 28448822 45247049 50623297 53654744
2917E3654744K269270n826443j1214158l877707N235381M38157j3252435j7580951
$$ 53654744 55924014 50097571 38883413 35005706 40241087 40679244 27426809 9845858
2909I845858o712540Q680825J7821702J7976196J0155070j710713r109594o166057
$$ 9845858 3133318 11814143 29635845 47612041 57767111 56056398 46946804 40780747
2901D0780747J927441M473256k269388j3715301k4571319l0847721k7546934j3076128
$$ 40780747 42708188 47181444 44912056 31196755 6625436 -24222285 -51769219 -64845347
2893f4845347M542141J3329936J0078026K248262k364436k128385K121926J0517448
$$ -64845347 -60303206 -46973270 -36895244 -34646982 -37011418 -39139803 -37017877 -26500429
2885b6500429K1040791K7222432K2924805R289702m278104p150995K370920J3339655
$$ -26500429 -5459638 21762794 44687599 53977301 49699197 42548202 44919122 58258777
2877E8258777J1746424l850513j9166333j9929633q249924J146384l63778n709151
$$ 58258777 70005201 66154688 46988355 27058722 18808798 19955182 19591404 13882253
2869A3882253k562294J0584042K2006569J9704499M502717j0661143j3343438
$$ 13882253 11319959 21904001 43910570 63615069 68117786 57456643 44113205
2862D4113205j879122J5640176K8348442K7601507J1393234j0548614k0678661
$$ 44113205 42234083 57874259 86222701 113824208 125217442 114668828 93990167
2855I3990167j0876812O235326J1706647M245643j063927K052828J573564j1285642
$$ 93990167 83113355 89348681 101055328 105300971 104237044 106289872 107863436 96577794
2847I6577794k4712721k2116386o595145L676447L40425p643979j0546437j0056629
$$ 96577794 71865073 49748687 43153542 46829989 47170414 39526435 28979998 18923369
2839A8923369j1952948j5058726j2666395j955929J0981417J5803642Q822503
$$ 18923369 6970421 -8088305 -20754700 -22710629 -11729212 4074430 12896933
2832A2896933j067268j895320N102857O311002l622160j2052885p775469k94506
$$ 12896933 11829665 9934345 15037202 21348204 17726044 5673159 -2102310 -2396816
2824b396816n517218j8406055j8062228j43069J4423342R426037l912447n110441
$$ -2396816 -7914034 -26320089 -44382317 -44525386 -30102044 -20676007 -24588454 -29698895
2816b9698895O338061J3463501P265386l897627q937128o851811l402162k706502
$$ -29698895 -23360834 -9897333 -2631947 -6529574 -15466702 -22318513 -25720675 -28427177
2808b8427177l912659j357602J0928589K8395506L1802099N365410l7696919n9738350
$$ -28427177 -32339836 -33697438 -22768849 5626657 37428756 42794166 5097247 -54641103
2800e4641103l8304691O388326L4826255L3560762K2841053K1263494K2262128
$$ -54641103 -92945794 -86557468 -51731213 -18170451 4670602 25934096 48196224
2793D8196224J3091667m17446l663420K711583O293964M897762O498383Q628497
$$ 48196224 61287891 60870445 57207025 59918608 66212572 71110334 77608717 86237214
2785H6237214k209652k5899636m1205327l1884843p126356J2887458J9807471
$$ 86237214 84027562 58127926 16922599 -14962244 -22088600 -9201142 10606329
2778A0606329J6154012L690633j4369402k7585910k7285937j6798729m316194
$$ 10606329 26760341 30450974 16081572 -11504338 -38790275 -55589004 -59905198
2771e9905198P207897J4378344Q072024j2281015k7193010j7021520R568108K3120451
$$ -59905198 -52697301 -38318957 -30246933 -42527948 -69720958 -86742478 -77174370 -54053919
2763e4053919R602191j4755730k6360171j9679133o660200n26099m299338j0096725
$$ -54053919 -44451728 -59207458 -85567629 -105246762 -111906962 -112433061 -116732399 -126829124
2755a26829124p864586L209258J4603389K0775938K3435400K0891565P133562
$$ -126829124 -134693710 -131484452 -116881063 -96105125 -72669725 -51778160 -44644598
2748d4644598j0484181r969698J3713699L2857912K3933042L958545K109563R505987
$$ -44644598 -55128779 -65098477 -51384778 -18526866 5406176 9364721 11474284 20980271
2740B0980271n138683l5873734l9343397j387795L7435616L9207457J6000298
$$ 20980271 15841588 -20032146 -59375543 -60763338 -23327722 15879735 31880033
2733C1880033j97564k493671J68397Q402876K0499143J8815937l461909k2775253
$$ 31880033 31682469 29188798 29357195 37760071 58259214 77075151 73613242 50837989
2725E0837989k0279248j4144077k4840486l1507884m501984L5530462L9904722
$$ 50837989 30558741 16414664 -8425822 -39933706 -44435690 -8905228 30999494
2718C0999494P101205j4422496j901835J3393760O499137j367075J1482523K2822913
$$ 30999494 38100699 23678203 21776368 35170128 41669265 40302190 51784713 74607626
2710G4607626K656575l4386059m8754591l0783523m115300J2452934J6836084
$$ 74607626 77264201 42878142 -5876449 -36659972 -40775272 -28322338 -11486254
2703a1486254Q201644j0175123j9234758m363067J6690908J4657682n222077r552514
$$ -11486254 -3284610 -13459733 -32694491 -37057558 -20366650 -5708968 -10931045 -20483559
2695b0483559Q707138J6660586n690377l1021558k4557923N467528K3115955J5258331
$$ -20483559 -11776421 4884165 -806212 -31827770 -56385693 -50918165 -27802210 -12543879
2687a2543879L40035m837141j300601O496419J7557134K4728099J8147894K035105
$$ -12543879 -12203844 -17040985 -18341586 -11845167 5711967 30440066 48587960 50623065
2679E0623065q885460j1959997j7202553k2908926j3719847Q783708J8314692
$$ 50623065 41737605 29777608 12575055 -10333871 -24053718 -15270010 3044682
2672C044682K686537j2156468L70726K4470170K5232047K590083j1412228m825640
$$ 3044682 5731219 -6425249 -6054523 18415647 43647694 46237777 34825549 29999909
2664B9999909Q19211n824389n054862J5048300K9300428R453502l1823108n5806406
$$ 29999909 30819120 24994731 19939869 34988169 64288597 73742099 41918991 -13887415
2656a3887415m5161935j5604053J0397353K1327030J5105163k73701p799724J022872
$$ -13887415 -59049350 -74653403 -64256050 -42929020 -27823857 -28097558 -35897282 -34874410
2648c4874410J3425461J3347790M905012K659031P038935Q052366N745702N591738
$$ -34874410 -21448949 -8101159 -3196147 -537116 6501819 14554185 20299887 25891625
2640B5891625J96752j9150645l6394011k5230824Q224861K7384568J7349053M766540
$$ 25891625 26088377 6937732 -29456279 -54687103 -46462242 -19077674 -1728621 3037919
2632C037919J1749052J9858973L342325k4612911k7976524J365920L5129507M5342339
$$ 3037919 14786971 34645944 37988269 13375358 -14601166 -13235246 21894261 67236600
2624F7236600K8288336k822877k8263125k8981341m672794J6946996R261917j6088130
$$ 67236600 95524936 92702059 64438934 35457593 30784799 47731795 56993712 40905582
2616D0905582k3330575m377591R925655j789587j9015699j3326232P041950J2186248
$$ 40905582 17575007 13197416 23123071 21333484 2317785 -11008447 -3966497 8219751
2608H219751k272799j1920423n495192j790556j5968298l1745262k3796009N239360
$$ 8219751 5946952 -5973471 -11468663 -13259219 -29227517 -60972779 -84768788 -79529428
2600g9529428K8184013K8391037J5191721M972303J395023j474115o926806j2562271
$$ -79529428 -51345415 -22954378 -7762657 -2790354 -1395331 -2869446 -9796252 -22358523
2592b2358523j3635287n933831R088604K0076179J4822111k170922j0173886J850066
$$ -22358523 -35993810 -41927641 -32839037 -12762858 2059253 -111669 -10285555 -8435489
2584h435489J7509124J2798225j0169113k3119561p677100K0641572L1941902
$$ -8435489 9073635 21871860 11702747 -11416814 -19093914 1547658 33489560
2577C3489560J7816104k440725r143851m512046l033337q311732j0865575p163588
$$ 33489560 51305664 48864939 39721088 35209042 32175705 23863973 12998398 5834810
2569E834810o701942j3856892j5798989k024683J3376106Q202564j2437637j9461746
$$ 5834810 -867132 -14724024 -30523013 -32547696 -19171590 -10969026 -23406663 -42868409
2561d2868409j688675J8693400K1276439J4501724J2496595P963722q303912j9261861
$$ -42868409 -44557084 -25863684 -4587245 9914479 22411074 30374796 22070884 2809023
2553B809023l572708K3933648K6544768o46812k2676982j5743289K434736M164755
$$ 2809023 -763685 23169963 49714731 49067919 26390937 10647648 13082384 17247139
2545A7247139j0997370k5430851l0481715k7876979j8217287l900015O139392
$$ 17247139 6249769 -19181082 -49662797 -77539776 -95757063 -99657078 -93517686
2538i3517686P600719Q430713J4538034J7243778P074279p698425r592991M673296
$$ -93517686 -85916967 -77486254 -62948220 -45704442 -38630163 -46328588 -55921579 -51248283
2530e1248283K0270458K2424672J0799837l492703r969958p574465k743065J023314
$$ -51248283 -30977825 -8553153 2246684 -1246019 -11215977 -18790442 -21533507 -20510193
2522b0510193O890390J3731442J0301169p380987k0458099p913913K0232056L2364317
$$ -20510193 -13619803 111639 10412808 3031821 -17426278 -25340191 -5108135 27256182
2514B7256182J9025983L370490K824115O153564k68685q431871p387381m427736
$$ 27256182 46282165 49652655 52476770 58630334 58361649 49929778 42542397 38114661
2506C8114661q493715j0785730k327926N181542k138999j4438188j3269605k067813
$$ 38114661 29620946 18835216 16507290 21688832 19549833 5111645 -8157960 -10225773
2498a0225773J021460p028348j2852670r611072k124905N521057J0456754N817054
$$ -10225773 -9204313 -16232661 -29085331 -38696403 -40821308 -35300251 -24843497 -19026443
2490a9026443q187682j5670778m347922J5153001K5594731K7079759K6105664
$$ -19026443 -27214125 -42884903 -47232825 -32079824 -6485093 20594666 46700330
2483D6700330J5443376j0093713l0550540k3205243o9742P245522n517241j4753831
$$ 46700330 62143706 52049993 21499453 -1705790 -1775532 5469990 -47251 -14801082
2475a4801082j1275772q801535j0185517j268102J5482110J5980340n409095k1626941
$$ -14801082 -26076854 -34878389 -45063906 -46332008 -30849898 -14869558 -20278653 -41905594
2467d1905594j2770627O381741J3021449O800682l97906l798983j564662R127893
$$ -41905594 -54676221 -48294480 -35273031 -28472349 -28870255 -32669238 -34233900 -25106007
2459b5106007K0146377J5474289l800821j6875893j3920225q384561j0995730
$$ -25106007 -4959630 10514659 6713838 -10162055 -24082280 -32466841 -43462571
2452d3462571j4516306j2243706p072519M326708K7166979M2023983K0031447
$$ -43462571 -57978877 -70222583 -77295102 -72968394 -45801415 -3777432 16254015
2445A6254015k3036553l1672326P631077L5811840P769211l4801530k6564921
$$ 16254015 -6782538 -38454864 -30823787 4988053 12757264 -22044266 -48609187
2438d8609187K0732867M1094379J6834641o567230k414573M079701o995187j6794561
$$ -48609187 -27876320 13218059 30052700 23485470 21070897 25150598 18155411 1360850
2430A360850r652471j170478k824476O96509J5555734J7837585m074930j9478772
$$ 1360850 -8291621 -9462099 -12286575 -11590066 3965668 21803253 17728323 -1750449
2422a750449J28148L3053690L8858947J7839158J733082k146925j6674396m5545960
$$ -1750449 -1622301 31431389 70290336 88129494 89862576 87715651 71041255 25495295
2414B5495295n7085778l0240751J1430500K9988921J9152094J150645r979078
$$ 25495295 -31590483 -61831234 -50400734 -20411813 -1259719 -109074 -10088152
2407a0088152j9217177k7384485k0659143O553838L3822276L6221087J7168648
$$ -10088152 -29305329 -56689814 -77348957 -70795119 -36972843 -751756 16416892
2400A6416892K602568L777551N213895m767159j1692941J489639K2505738K2445239
$$ 16416892 19019460 22797011 28010906 23243747 11550806 13040445 35546183 57991422
2392E7991422m142073l1253967l4832212j8364859j360309M510971J298354m266097
$$ 57991422 53849349 22595382 -12236830 -30601689 -31961998 -27451027 -26152673 -30418770
2384c0418770q131024r720467q860921l120606Q226930J6941347J1131356o574502
$$ -30418770 -38549794 -48270261 -57131182 -60251788 -52024858 -35083511 -23952155 -30526657
2376c0526657j5843289l417076J7720901K6367499K1821095J8368890J7432185
$$ -30526657 -46369946 -49787022 -32066121 -5698622 16122473 34491363 51923548
2369E1923548O014339j6369644k9249557j7445263P153939J8347745L775312k3679244
$$ 51923548 57937887 41568243 12318686 -5126577 2027362 20375107 24150419 471175
2361D71175l8346686k5592499K999268K1627806K0458068J4136205J4152808R454107
$$ 471175 -37875511 -63468010 -60468742 -38840936 -18382868 -4246663 9906145 19360252
2353A9360252r323119k3124463q653966K0148609K5865517J631314j9152448j1503374
$$ 19360252 10037133 -13087330 -21741296 -1592687 24272830 25904144 6751696 -4751678
2345d751678J1462389K5462821K4539425J2666012q595271k9562501l1330921
$$ -4751678 6710711 32173532 56712957 69378969 60783698 31221197 -109724
2338a09724j0924739R985740J4684756J1938059J4309792J5629592O324618o019995
$$ -109724 -11034463 -1048723 13636033 25574092 39883884 55513476 61838094 55818099
2330E5818099r193326n851382m539919l900616m83361L76908m432783o516175
$$ 55818099 46624773 40773391 36233472 32332856 31849495 32226403 27793620 21277445
2322B1277445n73630N397716O490497J0879901J9918274J7407735l804197k3593241
$$ 21277445 20703815 26101531 32592028 43471929 63390203 80797938 76993741 53400500
2314E3400500k3625354j6506658k2234406l2407680k5450184m712615P482126
$$ 53400500 29775146 13268488 -8965918 -41373598 -66823782 -71536397 -64054271
2307f4054271N348543J922232K866804M405923J0751534K6556767L7558650K6452610
$$ -64054271 -58705728 -56783496 -53916692 -49510769 -38759235 -12202468 25356182 51808792
2299E1808792L840886m726687R65682j782628j7487082k5290492j5336972j722729
$$ 51808792 55649678 50922991 51888673 50106045 32618963 7328471 -8008501 -9731230
2291i731230O134994J5655042K7165713K5987284Q605698p863322j2053406j1547794
$$ -9731230 -3596236 12058806 39224519 65211803 73817501 65954179 53900773 42352979
2283D2352979j2053964p319991J992945L960370j091830K384615J5329934J7680443
$$ 42352979 30299015 22979024 24971969 28932339 27840509 30225124 45555058 63235501
2275F3235501K671252j0106604q821856p432888j3719176j0152188J1727389K7314471
$$ 63235501 65906753 55800149 46978293 39545405 25826229 15674041 27401430 54715901
2267E4715901J6021048l466868m273142N553503K990764p559730p306141j972016
$$ 54715901 70736949 67270081 62996939 68550442 71541206 63981476 56675335 54703319
2259E4703319r564117k0867429j2033528R388445J1424999r420752k1571602r908440
$$ 54703319 45139202 24271773 12238245 21626690 33051689 23630937 2059335 -7849105
2251g849105L550592Q16402m830136J914424J1474279R807181J792596l299160
$$ -7849105 -4298513 -3482111 -8312247 -6397823 5076456 14883637 16676233 13377073
2243A3377073q524954j4144100o286875J9000378L7569171K5858908l671968j8075347
$$ 13377073 4852119 -9291981 -15578856 3421522 40990693 66849601 63177633 45102286
2235D5102286q045446M366175l62376j6250620k4883950j8202238m383422K190553
$$ 45102286 37056840 41423015 41060639 24810019 -73931 -18276169 -22659591 -20469038
2227b0469038m410374j4047429j0991542M977924J5177271N531043j4412433k3966810
$$ -20469038 -24879412 -38926841 -49918383 -44940459 -29763188 -24232145 -38644578 -62611388
2219f2611388j5520216K638636K0077094K9562012K5115331Q445972n568493l040447
$$ -62611388 -78131604 -75492968 -55415874 -25853862 -738531 7707441 2138948 -901499
2211i01499R962023J4544306M828151n863902o320129k156773m090276j1818506
$$ -901499 9060524 23604830 28432981 22569079 16248950 14092177 10001901 -1816605
2203a816605j6869366j5175472j0187315o705222n689300l167681O074751J9431467
$$ -1816605 -18685971 -33861443 -44048758 -50753980 -56443280 -59610961 -53536210 -34104743
2195c4104743K2828194N754730j8576405k0882748Q317397M1063541M2670037
$$ -34104743 -11276549 -5521819 -24098224 -44980972 -36663575 4399966 47070003
2188D7070003J3697428j3140660j5280630l275646J030918p044716j7255949k2331048
$$ 47070003 60767431 47626771 32346141 29070495 30101413 23056697 5800748 -16530300
2180a6530300k0771252r877565R125423K2374951J5210765n828696j6627069n292711
$$ -16530300 -37301552 -47179117 -38053694 -15678743 -467978 -6296674 -22923743 -28216454
2172b8216454J4089806K3282498K2281926J9770213J3470009l429627k2258343
$$ -28216454 -14126648 9155850 31437776 51207989 64677998 61248371 38990028
2165C8990028k4221094p232890Q988313R725944K543894j68737j866316j1488395
$$ 38990028 14768934 7536044 16524357 26250301 28794195 28625458 26759142 15270747
2157A5270747k2046780j7467898O64850J0169041k569844k2987097k6822059j0693935
$$ 15270747 -6776033 -24243931 -23579081 -13410040 -15979884 -38966981 -65789040 -76482975
2149g6482975O121158P982058R39787J549485J4081456K5480165K2971575J1110247
$$ -76482975 -70361817 -62379759 -61439972 -59890487 -45809031 -20328866 2642709 13752956
2141A3752956N876456J2623099J7572194O858631j1661809j6597534k910300R217758
$$ 13752956 19629412 32252511 49824705 56683336 45021527 28423993 25513693 34731451
2133C4731451J857975j5608867k1031701j1759252n826784j1593133j4076510
$$ 34731451 36589426 20980559 -51142 -11810394 -17637178 -29230311 -43306821
2126d3306821J042307K3817662L2634246K2290685O703294k484852p372917j3615726
$$ -43306821 -42264514 -18446852 14187394 36478079 43181373 40696521 33323604 19707878
2118A9707878j9134264j6747576l504896J4111634K2953939J4786556j941037
$$ 19707878 573614 -16173962 -19678858 -5567224 17386715 32173271 30232234
2111C0232234q499778O06973R908732P819338O568353J9866693L2038760J6823922
$$ 30232234 21732456 22339429 32248161 40067499 46635852 66502545 98541305 115365227
2103A15365227j6296796k7569790o076951J0714193n574505k9507058k3682217
$$ 115365227 99068431 71498641 65421690 76135883 70561378 41054320 17372103
2096A7372103Q81046N161464j2631921j7046985J840885J1163678q194187k8197551
$$ 17372103 18253149 23414613 10782692 -6264293 -4423408 6740270 -1453917 -29651468
2088b9651468j8253280Q299057J8945623J0439442L760734N676203M416466l279443
$$ -29651468 -47904748 -39605691 -20660068 -10220626 -6459892 -783689 3632777 353334
2080C53334o775198j874925L645366M503604K222232k383090o579797j418187
$$ 353334 -6421864 -8296789 -4651423 -147819 2074413 -308677 -6888474 -8306661
2072h306661J3066094J5845656r699401m3368650m7695108j9822450N085318P221448
$$ -8306661 4759433 20605089 10905688 -32462962 -80158070 -99980520 -94895202 -87673754
2064h7673754P055062K3405809L8254479K7829478M308200m204391N99544n379917
$$ -87673754 -80618692 -57212883 -18958404 8871074 13179274 8974883 9574427 4194510
2056D194510k3933709l1443203k0062062r209617r897772q033709N409771J5753033
$$ 4194510 -19739199 -51182402 -71244464 -80454081 -90351853 -98385562 -92975791 -77222758
2048g7222758J2629648J1375934K4524383L3110830J4133095j7375101k4545877
$$ -77222758 -64593110 -53217176 -28692793 4418037 18551132 1176031 -23369846
2041b3369846j240896K1919808K4544995J9349743K0542055J8006619m32495k2400188
$$ -23369846 -24610742 -2690934 21854061 41203804 61745859 79752478 79319983 56919795
2033E6919795k7483021j7294236q885967o528372k44607J1189151J5579455P755560
$$ 56919795 29436774 12142538 3256571 -3271801 -3516408 7672743 23252198 31007758
2025C1007758j262337m99002P376544J3945817J6853116J7537258J4330994M790334
$$ 31007758 29745421 29246419 36622963 50568780 67421896 84959154 99290148 104080482
2017A04080482q287505j7928250j8940055j1642273k153474R60086n798959j6323267
$$ 104080482 95792977 77864727 58924672 47282399 45128925 46089011 40290052 23966785
2009B3966785k1770746k1278119k0227150j8666783j0382803L732927J0965302
$$ 23966785 2196039 -19082080 -39309230 -57976013 -68358816 -64625889 -53660587
2002e3660587K943816r763908q760422Q827852K7186042L2022549K5128041J6437959
$$ -53660587 -50716771 -60480679 -69241101 -60413249 -33227207 -1204658 23923383 40361342
1994D0361342J0496115O953871P366510J1507907J0244490n408130k6281481k9381903
$$ 40361342 50857457 57811328 65177838 76685745 86930235 81522105 55240624 25858721
1986B5858721q162524J2825516O766086j9170747l2884839j9719332L088906J6104457
$$ 25858721 17696197 30521713 37287799 18117052 -14767787 -34487119 -31398213 -15293756
1978a5293756K0754185K3915831J9745629L297875j2287415j1493686l18334L657936
$$ -15293756 5460429 29376260 49121889 52419764 40132349 28638663 28320329 31978265
1970C1978265k717432j0747843k0241639l4315046l9288048j7269957K0045069
$$ 31978265 29260833 18512990 -1728649 -36043695 -75331743 -92601700 -72556631
1963g2556631L8206412K7113969J3654361J6446124J7193917k965439k4644890
$$ -72556631 -34350219 -7236250 6418111 22864235 40058152 37092713 12447823
1956A2447823j7498474R312922J7326560m364759k3562306j2331999J5017266
$$ 12447823 -5050651 4262271 21588831 17224072 -6338234 -18670233 -3652967
1949c652967K4503788P636820j1230321p527824J5053722L0227539J8111354j5005341
$$ -3652967 20850821 28487641 17257320 9729496 24783218 55010757 73122111 58116770
1941E8116770m5497130n6040525m5665657k1637745O591212K5671801K5619278
$$ 58116770 12619640 -43420885 -89086542 -110724287 -104133075 -78461274 -52841996
1934e2841996J4012125R536399J5829252J7462303R014380P195823J9465546K2562018
$$ -52841996 -38829871 -29293472 -13464220 3998083 13012463 20208286 39673832 62235850
1926F2235850l707720l8285653m4043438k0479218O99378O790537J5621751L4330270
$$ 62235850 58528130 20242477 -23800961 -44280179 -43580801 -36790264 -21168513 13161757
1918A3161757M2640764K7821087N367376r162331k1510806l6274700l9351568
$$ 13161757 55802521 83623608 88990984 79828653 58317847 22043147 -17308421
1911a7308421k2152519m87688J1175489K2250616L9646090M1170288O380445m1316064
$$ -17308421 -39460940 -39948628 -28773139 -6522523 33123567 74293855 80674300 39358236
1903C9358236n7944154l7304199j2685871l208498N802712K3305618K8766116
$$ 39358236 -18585918 -55890117 -68575988 -71784486 -65981774 -42676156 -13910040
1896a3910040N455868k7643099l8443877k1042787N765969K6712513L7606324
$$ -13910040 -8454172 -36097271 -74541148 -95583935 -89817966 -63105453 -25499129
1889b5499129L3519562J1455795j5123727k3217761q431692O225987j161346k1623831
$$ -25499129 8020433 19476228 4352501 -18865260 -27296952 -21070965 -22232311 -43856142
1881d3856142k5555353j858036K5039142K4558657r49838j9167659r366182J3750860
$$ -43856142 -69411495 -71269531 -46230389 -21671732 -22621570 -41789229 -51155411 -37404551
1873c7404551K4665264K1140856J8270589J7476052L479446k6134025m9134499
$$ -37404551 -12739287 8401569 26672158 44148210 47627656 21493631 -27640868
1866b7640868m6473670k7063654j2001429m971220O231717K4826251L8771718
$$ -27640868 -74114538 -101178192 -113179621 -118150841 -111919124 -87092873 -48321155
1859d8321155L9694146L3272103K6229983J4981792m799073k5002298l1002928
$$ -48321155 -8627009 24645094 50875077 65856869 61057796 36055498 5052570
1852E052570j8620199J418941J5219141J7332835J1731968N999297M980853P111636
$$ 5052570 -13567629 -12148688 3070453 20403288 32135256 38134553 43115406 50227042
1844E0227042O923443K818506q7913J787775L056944l130731j2302875j2697671
$$ 50227042 57150485 59968991 59881078 61668853 64725797 61595066 49292191 36594520
1836C6594520l011842M067746K40134o354915m644660K199673K589990o308837
$$ 36594520 33582678 37650424 37890558 31535643 26890983 29090656 31680646 25371809
1828B5371809j6872044k1834699j7730114l383976J4023705J7972027K343992
$$ 25371809 8499765 -13334934 -31065048 -34449024 -20425319 -2453292 -109300
1821a09300j3222552o170347J3815084J5520952n625759j6840305K986840K8776042
$$ -109300 -13331852 -19502199 -5687115 9833837 4208078 -12632227 -9645387 19130655
1813A9130655K4601762m734050k3106946j4067829L973987J0913400Q236992M906046
$$ 19130655 43732417 38998367 15891421 1823592 5797579 16710979 24947971 29854017
1805B9854017R06534n573155q556874k515294P203911J0346258M661909k211726
$$ 29854017 30760551 25187396 16630522 14115228 21319139 31665397 36327306 34115580
1797C4115580k522868K077202J608975r420745k1449018j9403179l946048P899790
$$ 34115580 31592712 33669914 35278889 25858144 4409126 -14994053 -18940101 -11040311
1789a1040311P774831P282951J4966197J8411129N714594r912913r167451O90953
$$ -11040311 -3265480 4017471 18983668 37394797 43109391 33196478 24029027 24719980
$$ [...]
##END NTUPLES=NMR SPECTRUM
##END=
