##TITLE=31Pdec_DE-44EA_W
 D2O
 24 sc
 5.4.2024
##JCAMPDX= 6.0         $$ Bruker NMR JCAMP-DX V2.0
##DATA TYPE= NMR SPECTRUM
##DATA CLASS= NTUPLES
##ORIGIN= UXNMR, Bruker Analytische Messtechnik GmbH
##OWNER= root
$$ XWIN-NMR		Version 3.5
$$ Fri Apr  5 13:45:53 2024 Russian Standard Time (UT+4h)  she@DPX200
##.OBSERVE FREQUENCY= 81.013821
##.OBSERVE NUCLEUS= ^31P
##.ACQUISITION MODE= SIMULTANEOUS
##.ACQUISITION SCHEME= undefined
##.AVERAGES= 24
##.DIGITISER RES= 16
##SPECTROMETER/DATA SYSTEM= spect
##.PULSE SEQUENCE= zgpg30
##.SOLVENT NAME= CDCl3
##.SHIFT REFERENCE= (INTERNAL, CDCl3, 0, 248.564)
##AUDIT TRAIL= $$ (NUMBER, WHEN, WHO, WHERE, WHAT)
$$ ##TITLE= Audit trail, XWIN-NMR		Version 3.5
$$ ##JCAMPDX= 5.01
$$ ##ORIGIN= Bruker BioSpin GmbH
$$ ##OWNER= she
$$ F:/spectra/data/she/nmr/P31/1/pdata/1/auditp.txt
$$ ##AUDIT TRAIL=  $$ (NUMBER, WHEN, WHO, WHERE, WHAT)
(   1,<2024-04-05 13:45:11.26 +0400>,<she>,<DPX200>,
      <created by zg, POWCHK disabled, PULCHK disabled
       configuration hash MD5:
       00 E9 B6 7A A2 85 ED C7 34 08 36 98 17 FE 4E 26
       data hash MD5: 32K
       41 EF F8 33 FC A8 14 0F 71 91 C0 3C E3 A9 BD C8>)
(   2,<2024-04-05 13:45:13.87 +0400>,<she>,<DPX200>,
      <Start of raw data processing
       efp BC_mod = 2 LB = 10 FT_mod = 6 PKNL = 1 PHC0 = -13232.09 PHC1 = 65.08333 SI = 64K 
       data hash MD5: 64K
       7F 6E E5 3D 53 D9 C7 C5 C7 12 23 D9 57 DA 7E C1>)
$$ ##END=
$$ 
$$ hash MD5
$$ 6C 5E EC C0 70 CC C6 FD 45 94 F8 72 6C 7A 79 70
##$RELAX= 
##$RELAX= 
##$RELAX= 
##$RELAX= 
##$RELAX= 
##$RELAX= 
##$RELAX= 
##$RELAX= 
##$RELAX= 
$$ Bruker specific parameters
$$ --------------------------
##$DU= <F:/spectra>
##$EXPNO= 1
##$NAME= <P31>
##$PROCNO= 1
##$TYPE= <nmr>
##$USER= <she>
##$AMP= (0..31)
100 100 100 100 100 100 100 100 100 100 100 100 100 100 100 100 100 100 
100 100 100 100 100 100 100 100 100 100 100 100 100 100 
##$AQSEQ= 0
##$AQ_mod= 1
##$AUNM= <au_zg>
##$AUTOPOS= <>
##$BF1= 81.014009
##$BF2= 200.13
##$BF3= 200.13
##$BF4= 200.13
##$BF5= 200.13
##$BF6= 200.13
##$BF7= 200.13
##$BF8= 200.13
##$BYTORDA= 1
##$CFDGTYP= 0
##$CFRGTYP= 5
##$CHEMSTR= <none>
##$CNST= (0..31)
1 1 145 1 1 1 1 1 1 1 1 1 1 1 1 1 1 1 1 1 1 1 1 1 1 1 1 1 1 1 1 1 
##$CPDPRG= <waltz16>
##$CPDPRG1= <>
##$CPDPRG2= <waltz16>
##$CPDPRG3= <>
##$CPDPRG4= <mlev>
##$CPDPRG5= <mlev>
##$CPDPRG6= <mlev>
##$CPDPRG7= <mlev>
##$CPDPRG8= <mlev>
##$CPDPRGB= <>
##$CPDPRGT= <>
##$D= (0..31)
0 1 0 0 0 0 0 0 0 0 0 0.03 2e-05 3e-06 0 0 0 0 0 0 0 0 0 0 0 0 0 0 0 0 
0 0 
##$DATE= 1712310310
##$DBL= (0..7)
120 120 120 11 120 120 24 19 
##$DBP= (0..7)
150 150 150 150 150 150 150 150 
##$DBP07= 0
##$DBPNAM0= <>
##$DBPNAM1= <>
##$DBPNAM2= <>
##$DBPNAM3= <>
##$DBPNAM4= <>
##$DBPNAM5= <>
##$DBPNAM6= <>
##$DBPNAM7= <>
##$DBPOAL= (0..7)
0.5 0.5 0.5 0.5 0.5 0.5 0.5 0.5 
##$DBPOFFS= (0..7)
0 0 0 0 0 0 0 0 
##$DE= 6
##$DECBNUC= <off>
##$DECIM= 3
##$DECNUC= <off>
##$DECSTAT= 4
##$DIGMOD= 1
##$DIGTYP= 9
##$DL= (0..7)
0 0 52 120 120 21 21 25 
##$DP= (0..7)
$$ [...]
##$SUBNAM2= <"">
##$SUBNAM3= <"">
##$SUBNAM4= <"">
##$SUBNAM5= <"">
##$SUBNAM6= <"">
##$SUBNAM7= <"">
##$SUBNAM8= <"">
##$SUBNAM9= <"">
##$SW= 501.771253377433
##$SWIBOX= (0..15)
0 1 3 0 0 0 0 0 0 0 0 0 0 0 0 0 
##$SW_h= 40650.406504065
##$TD= 32768
##$TD0= 1
##$TE= 0
##$TE2= 300
##$TE3= 300
##$TEG= 300
##$TL= (0..7)
0 120 53 12 22 120 120 120 
##$TP= (0..7)
150 150 150 150 150 150 150 150 
##$TP07= 0
##$TPNAME0= <>
##$TPNAME1= <>
##$TPNAME2= <>
##$TPNAME3= <>
##$TPNAME4= <>
##$TPNAME5= <>
##$TPNAME6= <>
##$TPNAME7= <>
##$TPOAL= (0..7)
0.5 0.5 0.5 0.5 0.5 0.5 0.5 0.5 
##$TPOFFS= (0..7)
0 0 0 0 0 0 0 0 
##$TUNHIN= 0
##$TUNHOUT= 0
##$TUNXOUT= 0
##$USERA1= <user>
##$USERA2= <user>
##$USERA3= <user>
##$USERA4= <user>
##$USERA5= <user>
##$V9= 5
##$VALIST= <valist>
##$VCLIST= <CCCCCCCCCCCCCCC>
##$VD= 0
##$VDLIST= <DDDDDDDDDDDDDDD>
##$VPLIST= <PPPPPPPPPPPPPPP>
##$VTLIST= <TTTTTTTTTTTTTTT>
##$WBST= 1024
##$WBSW= 4
##$XGAIN= (0..3)
0 0 0 0 
##$XL= 0
##$YL= 0
##$YMAX_a= 1157
##$YMIN_a= -1055
##$ZGOPTNS= <>
##$ZL1= 120
##$ZL2= 120
##$ZL3= 120
##$ZL4= 120
##$ABSF1= 0
##$ABSF2= 0
##$ABSG= 0
##$ABSL= 0
##$ALPHA= 0
##$AQORDER= 0
##$ASSFAC= 0
##$ASSFACI= 0
##$ASSFACX= 0
##$ASSWID= 0
##$AUNMP= <proc_1d>
##$AZFE= 0.1
##$AZFW= 0.5
##$BCFW= 0
##$BC_mod= 2
##$BYTORDP= 0
##$COROFFS= 0
##$CY= -3
##$DATMOD= 1
##$DC= 0
##$DFILT= <>
##$DTYPP= 0
##$F1P= 0
##$F2P= 0
##$FCOR= 1
##$FTSIZE= 65536
##$FT_mod= 6
##$GAMMA= 0
##$GB= 0
##$INTBC= 1
##$INTSCL= 6.047779e-11
##$ISEN= 30
##$LB= 10
##$LEV0= 0
##$LPBIN= 0
##$MAXI= 10000
##$MC2= 0
##$MEAN= 0
##$ME_mod= 0
##$MI= 50
##$NCOEF= 0
##$NC_proc= -12
##$NLEV= 6
##$NOISF1= 182.463
##$NOISF2= 159.3651
##$NSP= 0
##$NTH_PI= 0
##$NZP= 0
##$OFFSET= 248.5645
##$PC= 4
##$PHC0= -13232.09
##$PHC1= 65.08333
##$PH_mod= 1
##$PKNL= yes
##$PPARMOD= 0
##$PSCAL= 0
##$PSIGN= 0
##$REVERSE= no
##$SF= 81.0140089999694
##$SI= 65536
##$SIGF1= 159.3651
##$SIGF2= -187.1042
##$SINO= 113.3802
##$SIOLD= 16384
##$SREGLST= <1H.CDCl3>
##$SSB= 0
##$STSI= 65536
##$STSR= 0
##$SW_p= 40650.406504065
##$SYMM= 0
##$S_DEV= 0
##$TDeff= 32768
##$TDoff= 0
##$TI= <>
##$TILT= no
##$TM1= 0
##$TM2= 0
##$TOPLEV= 0
##$USERP1= <user>
##$USERP2= <user>
##$USERP3= <user>
##$USERP4= <user>
##$USERP5= <user>
##$WDW= 1
##$XDIM= 65536
##$YMAX_p= 299987165
##$YMIN_p= -391892013
$$ End of Bruker specific parameters
$$ ---------------------------------
##NTUPLES= NMR SPECTRUM
##VAR_NAME=  FREQUENCY,     SPECTRUM/REAL,   SPECTRUM/IMAG
##SYMBOL=    X,             R,               I
##VAR_TYPE=  INDEPENDENT,   DEPENDENT,       DEPENDENT
##VAR_FORM=  AFFN,          ASDF,            ASDF
##VAR_DIM=   65536,         65536,           65536
##UNITS=     HZ,            ARBITRARY UNITS, ARBITRARY UNITS
##FACTOR=    0.620285442955139, 1,           1
##FIRST=     20137.2065510682, 0,            0
##LAST=      -20513.1999529968, 0,           0
##MIN=       -20513.1999529968, -391892013,  0
##MAX=       20137.2065510682, 299987165,    0
$$ Real data points
##PAGE= N=1
##DATA TABLE= (X++(R..R)), XYDATA
$$ [...]
12899a769984n76855R89485K763190M445397N737824O424524O424975N801421
12891C0239977M726470L427671K124733R74045L8683p00996j300966j801231k202722
12882C5525664k483969k635203k676350k644288k563339k425568k196880j844437
12874A6055630j367732q15590k78859J41342L77627M29837L67215K97229L20882
12865A5527581M99488Q44443J325306J885436K456138K965043L341434L526383
12857C2371252L490229L246572K847409K357886J827225J274821O96712Q2913
12849D8195019n68484j248834j944795k640322l307434l895361m336516m574161
12841B5679112m594591m441370m202364l974116l815401l710016l564061l248391
$$ plain form
12899 -1769984 -2346839 -1357354 1405836 5851233 11589057 18013581 24438556 30239977
12891 30239977 34966447 38394118 40518851 41492896 41531579 40830583 39529617 37728386 35525664
12882 35525664 33041695 30406492 27730142 25085854 22522515 20096947 17900067 16055630
12874 16055630 14687898 13872308 13593449 13734791 14112418 14542255 14909470 15206699 15527581
12865 15527581 16027069 16871512 18196818 20082254 22538392 25503435 28844869 32371252
12857 32371252 35861481 39108053 41955462 44313348 46140573 47415394 48112106 48195019
12849 48195019 47626535 46377701 44432906 41792584 38485150 34589789 30253273 25679112
12841 25679112 21084521 16643151 12440787 8466671 4651270 941254 -2622807 -5871198
12833e871198k665343j800215p31391L98461J431194K241971K770746L024932
12825a200843L056364K930747K707938K436922K156415J891768J647295J401533
12817A7028139J115190P53580L11168j80210o65955j093327j427249j650350j754965
12808A2436021j738346j606427j383737j121088q90680p63519p75815r02077j053650
12799B200682j109634r67552n87310n647O82451J361722J937402K366010K663097
12790H541221K877724L042198L130097L056734K726136K094312J210026K11060
12782B6889508p22757j439485j875311k074049k156485k259478k478524k838366
12774A1045053l297542l778868m209074m546095m778682m902749m897628m724159
$$ plain form
12833 -5871198 -8536541 -10336756 -11068147 -10669686 -9238492 -6996521 -4225775 -1200843
12825 -1200843 1855521 4786268 7494206 9931128 12087543 13979311 15626606 17028139
12817 17028139 18143329 18896909 19208077 19027867 18361912 17268585 15841336 14190986 12436021
12808 12436021 10697675 9091248 7707511 6586423 5695743 4932224 4156409 3254332 2200682
12799 2200682 1091048 123496 -463814 -469461 212990 1574712 3512114 5878124 8541221
12790 8541221 11418945 14461143 17591240 20647974 23374110 25468422 26678448 26889508
12782 26889508 26166751 24727266 22851955 20777906 18621421 16361943 13883419 11045053
12774 11045053 7747511 3968643 -240431 -4786526 -9565208 -14467957 -19365585 -24089744
12766b4089744m345721l754336k983909k106099j214768m06508K37329O63085
12758c8000671Q50953Q17693O16990L32273N6701j33730j97752j26077P5016L96048
12748c5312556Q21589J318092J827982K279983K609757K774631K753895K544343
12740a8382284K166528J679838J183633P86474N55713M83149M93605M91249M13170
12731a0128925K59746R0826l192O0341L19444P39978J210251J570725J674676
12722d206130J451959R42785K87010l22754p04641p44586m24581J87680R74724
12713b558534J806816K569856L187592L635930L933931M106681M145476M001242
12705B4828990L619963K993011K185803J326592N62218M340l06783m06303l83670
$$ plain form
12766 -24089744 -28435465 -32189801 -35173710 -37279809 -38494577 -38901085 -38663756 -38000671
12758 -38000671 -37149718 -36332025 -35715035 -35382762 -35326061 -35459791 -35657543 -35783620 -35708604 -35312556
12748 -35312556 -34490967 -33172875 -31344893 -29064910 -26455153 -23680522 -20926627 -18382284
12740 -18382284 -16215756 -14535918 -13352285 -12565811 -12010098 -11526949 -11033344 -10542095 -10128925
12731 -10128925 -9869179 -9778353 -9781545 -9721204 -9401760 -8661782 -7451531 -5880806 -4206130
12722 -4206130 -2754171 -1811386 -1524376 -1847130 -2551771 -3296357 -3720938 -3533258 -2558534
12713 -2558534 -751718 1818138 5005730 8641660 12575591 16682272 20827748 24828990
12705 24828990 28448953 31441964 33627767 34954359 35516577 35520917 35214134 34807831 34424161
12696C4424161l54677m36467p23074j261646k038755k982464l973033m855072
12688A7798973n458302n637080n318893m533622l405200k115433q64048J61671
12680i371934Q10548R90569O89168j9119r87428k034192k990061l733289m201203
12671b0846941m381544m294763l975108l457164k777358j992671j199007n23120
12663d3447676q1515P0768k9940k63239m65057m84354k32678K93124J016543J801367
12653d1822657K479017K891722K950349K674573K177966J602460J051714N68060
12645b5426796J52203k07131n18629p88954j026331j239642j434769j613766j777750
12636c3881565j927007k053598k133692k131798k015947j768783j386198q73218
$$ plain form
12696 34424161 34069484 33633017 32909943 31648297 29609542 26627078 22654045 17798973
12688 17798973 12340671 6703591 1384698 -3148924 -6554124 -8669557 -9533605 -9371934
12680 -9371934 -8561386 -7570817 -6881649 -6900768 -7888196 -9922388 -12912449 -16645738 -20846941
12671 -20846941 -25228485 -29523248 -33498356 -36955520 -39732878 -41725549 -42924556 -43447676
12663 -43447676 -43529191 -43458423 -43488363 -43751602 -44216659 -44701013 -44933691 -44640567 -43624024 -41822657
12653 -41822657 -39343640 -36451918 -33501569 -30826996 -28649030 -27046570 -25994856 -25426796
12645 -25426796 -25274593 -25481724 -26000353 -26789307 -27815638 -29055280 -30490049 -32103815 -33881565
12636 -33881565 -35808572 -37862170 -39995862 -42127660 -44143607 -45912390 -47298588 -48171806
12628d8171806k48590M46163J144938J764508K216399K425244K357355K046801
12620c6018988J593545J124105P37374M70699L02624J82919P1342k8831n3960
12611c1619171J06425N59231J338809K362247L445748M377032M997411N246368
12603i185900N156463M816329M323199L741278L084427K335847J490824N85682
12595A6348149l10804j129761j827070k387481k817786l139531l380403l562246
12587b206933l690045l744784l677256l404743k824865j858042n04955J116751
12579b0794872K784515M228298N206133N570297N306906M536243L466736K317214
12571A2621470J248974L48524l38453p66110q86367o87077k28468L62690R41354
$$ plain form
12628 -48171806 -48420396 -47974233 -46829295 -45064787 -42848388 -40423144 -38065789 -36018988
12620 -36018988 -34425443 -33301338 -32563964 -32093265 -31790641 -31607722 -31536380 -31565211 -31619171
12611 -31619171 -31512746 -30953515 -29614706 -27252459 -23806711 -19429679 -14432268 -9185900
12603 -9185900 -4029437 786892 5110091 8851369 11935796 14271643 15762467 16348149
12595 16348149 16037345 14907584 13080514 10693033 7875247 4735716 1355313 -2206933
12587 -2206933 -5896978 -9641762 -13319018 -16723761 -19548626 -21406668 -21911623 -20794872
12579 -20794872 -18010357 -13782059 -8575926 -3005629 2301277 6837520 10304256 12621470
12571 12621470 13870444 14218968 13880515 13114405 12228038 11540961 11312493 11675183 12616537
12562A2616537J399508J691982J822471J807297J647485J333112Q79308L63570
12554B3561270p5314k89655j96107J79714P14247J240113J609183J734306J595471
12545C0073228J214466O19296j74432j152976k277310l462976m580850n478256
12537A4780190o013344o093134n701545m904353l827898k620834j414631k98286
12529a6093835O83509J512668K176702K658310K934665K978354K761632K273163
12521A885168J545026O71298j97809q84948j227012j121007n64244L31360J368544
12512A806376K330449L049933L448688L534503L368779L027144K573842K059135
12504B5198849J532982J057004O99923N17063N28279P08486R92873J288713J488007
$$ plain form
12562 12616537 14016045 15708027 17530498 19337795 20985280 22318392 23197700 23561270
12554 23561270 23485956 23196301 23000194 23179908 23894155 25134268 26743451 28477757 30073228
12545 30073228 31287694 31906990 31732558 30579582 28302272 24839296 20258446 14780190
12537 14780190 8766846 2673712 -3027833 -7932186 -11760084 -14380918 -15795549 -16093835
12529 -16093835 -15410326 -13897658 -11720956 -9062646 -6127981 -3149627 -387995 1885168
12521 1885168 3430194 4101492 3903683 3018735 1791723 670716 106472 437832 1806376
12512 1806376 4136825 7186758 10635446 14169949 17538728 20565872 23139714 25198849
12504 25198849 26731831 27788835 28488758 29005821 29534100 30242586 31235459 32524172 34012179
12495C4012179J485242J206517O42957j34099r95681j809620k493648l030649
12487B8883198l436681l709502l801511l641040l186219k470131j604803p43449
12479F289862k7030M54613O72416O44848M19508O2205l48265p29348j011390j155174
12469E272245j162598j078069r79734r57520j078717j352518j712587k032890
12461e082388k177058k060945j693245j166083n99831q0909L64910P51970J091821
12452a0651758J364671J525354J536075J399695J170573R40470Q13373Q79119
12444a022428J184014J701696K324911K898350L282558L410434L302044L033783
12436B0115362K685194K296109J858945J346749P48241P5612o56943j449435k299230
$$ plain form
12495 34012179 35497421 36703938 37346895 37212796 36217115 34407495 31913847 28883198
12487 28883198 25446517 21737015 17935504 14294464 11108245 8638114 7033311 6289862
12479 6289862 6262832 6717445 7389861 8034709 8454217 8516422 8168157 7438809 6427419 5272245
12469 5272245 4109647 3031578 2051844 1094324 15607 -1336911 -3049498 -5082388
12461 -5082388 -7259446 -9320391 -11013636 -12179719 -12779550 -12860459 -12495549 -11743579 -10651758
12452 -10651758 -9287087 -7761733 -6225658 -4825963 -3655390 -2714920 -1901547 -1022428
12444 -1022428 161586 1863282 4188193 7086543 10369101 13779535 17081579 20115362
12436 20115362 22800556 25096665 26955610 28302359 29050600 29126212 28469269 27019834 24720604
12427B4720604l168128l976761m642676n130555n469543n724544n947116o140872
12419a5479591o256692o210831n913228n299720m364158l178133j880770o34734
12411d9217857M29371J245660J805861K128350K235642K157732J948703J689538
12403c5577000J465060J329336J283257J273841J209901R90052N43552j27943
12395b7609944r36816j743472k418976k891373l147500l202037l066375k739184
12387d7755677k219436j528541p22630J19586R28105J664708K313833K850561
12379d4349491L222831L371626L271602K952376K481256J925369J326014P01805
12371b5096612P1957n22044j014295j334371j434202j300429r44065l81325L72876
$$ plain form
12427 24720604 21552476 17575715 12933039 7802484 2332941 -3391603 -9338719 -15479591
12419 -15479591 -21736283 -27947114 -33860342 -39160062 -43524220 -46702353 -48583123 -49217857
12411 -49217857 -48788486 -47542826 -45736965 -43608615 -41372973 -39215241 -37266538 -35577000
12403 -35577000 -34111940 -32782604 -31499347 -30225506 -29015605 -28025553 -27482001 -27609944
12395 -27609944 -28546760 -30290232 -32709208 -35600581 -38748081 -41950118 -45016493 -47755677
12387 -47755677 -49975113 -51503654 -52226284 -52106698 -51178593 -49513885 -47200052 -44349491
12379 -44349491 -41126660 -37755034 -34483432 -31531056 -29049800 -27124431 -25798417 -25096612
12371 -25096612 -25024655 -25546699 -26560994 -27895365 -29329567 -30629996 -31574061 -31955386 -31582510
12362c1582510J292966K327236L396589M410087N285263N960056O392409O553631
12354D035727O426286O012145N342993M478858L487359K418190J296361J43548
12346C3641467r88140j998841k760114l167304l197955k938533k555334k219665
12338A3815581k030050j978209j975635j916805j734922j419635r98959n11503
12330A249863P543N24087R99790J394129J671732J807535J787045J603596J253712
12321A2299032P31951L1634q41428j847254k902200l897974m739251n368483n758124
12312a2292097n886030n727461n274987m563660l675167k720254j814563j052274
12304d3006493m73674m0815L47376P93004J331866J916481K459088K888938L174799
$$ plain form
12362 -31582510 -30289544 -27962308 -24565719 -20155632 -14870369 -8910313 -2517904 4035727
12354 4035727 10462013 16474158 21817151 26296009 29783368 32201558 33497919 33641467
12346 33641467 32653327 30654486 27894372 24727068 21529113 18590580 16035246 13815581
12338 13815581 11785531 9807322 7831687 5914882 4179960 2760325 1761366 1249863
12330 1249863 1257406 1781493 2781283 4175412 5847144 7654679 9441724 11045320 12299032
12321 12299032 13030983 13062617 12221189 10373935 7471735 3573761 -1165490 -6533973 -12292097
12312 -12292097 -18178127 -23905588 -29180575 -33744235 -37419402 -40139656 -41954219 -43006493
12304 -43006493 -43480167 -43520982 -43173606 -42380602 -41048736 -39132255 -36673167 -33784229 -30609430
12295c0609430L308398L281085L079106K693373K125821J386268M90173n31136
12287a4776342j610489k632592l447890l915498l956705l589371k922880k117801
12279c8969568j335270p00505k85938j05153j15092k36156l91306n40249o79198
12270d3358435q08103r02448r21556q45083p00863n57479m84909n07509n78981
12261d9665366o00240m75383j69220K75731P70401J226444J586026J830779J983869
12252d3236959K106445K277018K554976K950743L424882L915813M374892M784454
12244a6847736N148256N464427N705090N820413N762313N507849N070153M500336
12236B6131101L884566L330181K935504K753766K772028K917790L089189L193688
$$ plain form
12295 -30609430 -27301032 -24019947 -20940841 -18247468 -16121647 -14735379 -14245206 -14776342
12287 -14776342 -16386831 -19019423 -22467313 -26382811 -30339516 -33928887 -36851767 -38969568
12279 -38969568 -40304838 -41005343 -41291281 -41396434 -41511526 -41747682 -42138988 -42679237 -43358435
12270 -43358435 -44166538 -45068986 -45990542 -46835625 -47536488 -48093967 -48578876 -49086385 -49665366
12261 -49665366 -50265606 -50740989 -50910209 -50634478 -49864077 -48637633 -47051607 -45220828 -43236959
12252 -43236959 -41130514 -38853496 -36298520 -33347777 -29922895 -26007082 -21632190 -16847736
12244 -16847736 -11699480 -6235053 -529963 5290450 11052763 16560612 21630765 26131101
12236 26131101 30015667 33345848 36281352 39035118 41807146 44724936 47814125 51007813
12228E1007813L177105L028853K762489K388168J899291J282398N40474k87421
12220F5799170j122427j862415k414649k730014k819014k739485k565988k362977
12212D7182201k176506k040729j982847k014444k113799k217934k240322k110111
12204C0285509j808737j378906r01126m56635j02344J31439K31466J99060O0208
12195B6259934j25915k77506l19812k14732K8697L65093P33308J077222J364512
12186B8890801J598987J813892K038677K256980K393494K350475K068384J560006
12178D4971696Q95798J67854n29568j101328j462044j567045j440075j170425
12170C8764863q80038o82454o51889q08787j122237j525451j935871k273430k476968
$$ plain form
12228 51007813 54184918 57213771 59976260 62364428 64263719 65546117 66086591 65799170
12220 65799170 64676743 62814328 60399679 57669665 54850651 52111166 49545178 47182201
12212 47182201 45005695 42964966 40982119 38967675 36853876 34635942 32395620 30285509
12204 30285509 28476772 27097866 26196740 25740105 25637761 25769200 26000666 26199726 26259934
12195 26259934 26134019 25856513 25536701 25321969 25350666 25715759 26449067 27526289 28890801
12186 28890801 30489788 32303680 34342357 36599337 38992831 41343306 43411690 44971696
12178 44971696 45867494 46035348 45505780 44404452 42942408 41375363 39935288 38764863
12170 38764863 37884825 37202371 36550482 35741695 34619458 33094007 31158136 28884706 26407738
12161B6407738k517507k400214k150385j793825j347858q26859k52739L38019
12153A5456370Q91945J340916J610486J631822J354042P59532j15612j168512
12145B1760989k245122l187325l883393m287218m399895m239056l825386l192380
12137g498786k401490j541923p12156J705N36470Q52827R37243Q07144N11355
12128h507611J20103k92618o69567r89025j271077j559160j881242k215930k487255
12119a9753382k589528k427832j961165j236472l95020L64337Q55861R76303P35318
12110b5431580K31971m06699j085537j758547k393467k919744l213979l143886
12102d0121468k639366j738953n83551O34042J734452K600483L188972L507140
$$ plain form
12161 26407738 23890231 21490017 19339632 17545807 16197949 15371090 15118351 15456370
12153 15456370 16348315 17689231 19299717 20931539 22285581 23045113 22929501 21760989
12145 21760989 19515867 16328542 12445149 8157931 3758036 -481020 -4306406 -7498786
12137 -7498786 -9900276 -11442199 -12154355 -12152650 -11616180 -10763353 -9826110 -9018966 -8507611
12128 -8507611 -8387508 -8680126 -9349693 -10338718 -11609795 -13168955 -15050197 -17266127 -19753382
12119 -19753382 -22342910 -24770742 -26731907 -27968379 -28363399 -27999062 -27143201 -26166898 -25431580
12110 -25431580 -25199609 -25606308 -26691845 -28450392 -30843859 -33763603 -36977582 -40121468
12102 -40121468 -42760834 -44499787 -45083338 -44449296 -42714844 -40114361 -36925389 -33418249
12094c3418249L577729L422953L078512K621205K180213J912786J951360K350463
12086a2323028L061219L940931M786608N380563N543008N181660M316521L062893
12078B2950375J582698L5724j445072k755099l811600m549796m924812m920450
12070B161968m562614l927088l129413k296900j537442r19726m66406j54395P6853
12061a4755163L01434N68542Q67926J122790J218147J050597N74985j71782j076717
12052a0299241j981175k722421l171808l259104k978553k378351j541270n66917
12044b8898840M39107J373983K152741K728845L107449L337268L479693L569980
12036h709774L593539L493532L206203K700040J992935J142357K26903o61951
$$ plain form
12094 -33418249 -29840520 -26417567 -23339055 -20717850 -18537637 -16624851 -14673491 -12323028
12086 -12323028 -9261809 -5320878 -534270 4846293 10389301 15570961 19887482 22950375
12078 22950375 24533073 24568797 23123725 20368626 16557026 12007230 7082418 2161968
12070 2161968 -2400646 -6327734 -9457147 -11754047 -13291489 -14211215 -14677621 -14832016 -14755163
12061 -14755163 -14453729 -13885187 -13017261 -11894471 -10676324 -9625727 -9050742 -9222524 -10299241
12052 -10299241 -12280416 -15002837 -18174645 -21433749 -24412302 -26790653 -28331923 -28898840
12044 -28898840 -28459733 -27085750 -24933009 -22204164 -19096715 -15759447 -12279754 -8709774
12036 -8709774 -5116235 -1622703 1583500 4283540 6276475 7418832 7645735 6983784
12028F983784j421318j951453k190854k150698j916402j608079j327189j125948
12020f708157j010369r58711r36468r08258q52615p70561o72697n51141l66209
12011a3735186o7816L63799Q92270J431413J872854K116272K095082J799149J290565
12002a941598O98231J79082j46055k49443k09722j71353k76311o07865j169450
11993c894484j896058k683141l418854m009719m394156m544283m460969m167171
11985c3468835l702427l119222k478574j839883j245136p07971k19722K28928
11977d6552842O27283R41117J128627J166688J076075R34994Q70565J023435J494031
11968c7290027K292007L313594M362617N213664N694857N751916N458202M964037
$$ plain form
12028 6983784 5562466 3611013 1420159 -730539 -2646941 -4255020 -5582209 -6708157
12020 -6708157 -7718526 -8677237 -9613705 -10521963 -11374578 -12145139 -12817836 -13368977 -13735186
12011 -13735186 -13803002 -13439203 -12546933 -11115520 -9242666 -7126394 -5031312 -3232163 -1941598
12002 -1941598 -1243367 -1064285 -1210340 -1459783 -1669505 -1840858 -2117169 -2725034 -3894484
11993 -3894484 -5790542 -8473683 -11892537 -15902256 -20296412 -24840695 -29301664 -33468835
11985 -33468835 -37171262 -40290484 -42769058 -44608941 -45854077 -46562048 -46781770 -46552842
11977 -46552842 -45925559 -44984442 -43855815 -42689127 -41613052 -40678058 -39807493 -38784058 -37290027
11968 -37290027 -34998020 -31684426 -27321809 -22108145 -16413288 -10661372 -5203170 -239133
11960b39133M418049L911198L471819L095628K771497K482506K196604J870925
11952B3979093J471856R91424M44850j46500p72008j437569k156409k927643l714493
11943A5732601m439952n008436n340915n399983n192871m760650m167071l487737
11935b2065014k790657k108755j423691o82568J53885J060408J927688K588572
11927b3340132K878963K706690K097381J193157K01344o79714j315673j646171
11919a7904155j659293j363207p80985L2279R73307J898793K660596L148614L318366
11910i675685L194661K856623K411403J962643J583700J306470J125194J002836
11902E767845Q73657O52520K62956l24340j068284j867070k593676l134791l415621
$$ plain form
11960 -239133 4178916 8090114 11561933 14657561 17429058 19911564 22108168 23979093
11952 23979093 25450949 26442373 26887223 26740723 25968715 24531146 22374737 19447094 15732601
11943 15732601 11292649 6284213 943298 -4456685 -9649556 -14410206 -18577277 -22065014
11935 -22065014 -24855671 -26964426 -28388117 -29070685 -28916800 -27856392 -25928704 -23340132
11927 -23340132 -20461169 -17754479 -15657098 -14463941 -14262597 -14942311 -16257984 -17904155
11919 -17904155 -19563448 -20926655 -21707640 -21675361 -20702054 -18803261 -16142665 -12994051 -9675685
11910 -9675685 -6481024 -3624401 -1212998 749645 2333345 3639815 4765009 5767845
11902 5767845 6641502 7294022 7556978 7232638 6164354 4297284 1703608 -1431183 -4846804
11893d846804l408038l129906k643233k050970j485076j079119r28213j050628
11885b0621987j370742j737272j974522j945736j599654r80744k03092N95554
11877b9838195J295952J815797K100753K107050J802193J189422L32003o49351
11869a9844376j605729k394333k903730l072752k904352k463590j851997j169098
11861c8209957m81246J91372Q69779J595111K395189L253666M103307M850696
11853b1432083N413917N744862N826228N659640N265992M697011M035982L373161
11845A8584710K770789K247227J790432J381362J003574O38315K62976j35925
11837B8543460n43931r11353j166041j239218j088658p07761j22571O12431J415674
$$ plain form
11893 -4846804 -8254842 -11384748 -14027981 -16078951 -17564027 -18643146 -19571359 -20621987
11885 -20621987 -21992729 -23730001 -25704523 -27650259 -29249913 -30230657 -30433749 -29838195
11877 -29838195 -28542243 -26726446 -24625693 -22518643 -20716450 -19527028 -19195025 -19844376
11869 -19844376 -21450105 -23844438 -26748168 -29820920 -32725272 -35188862 -37040859 -38209957
11861 -38209957 -38691203 -38499831 -37630052 -36034941 -33639752 -30386086 -26282779 -21432083
11853 -21432083 -16018166 -10273304 -4447076 1212564 6478556 11175567 15211549 18584710
11845 18584710 21355499 23602726 25393158 26774520 27778094 28416409 28679385 28543460
11837 28543460 27999529 27088176 25922135 24682917 23594259 22886498 22763927 23376358 24792032
11828B4792032K185729K821573L246493L418135L321495K959169K350432J534995
11820D6630053N73230m54983j447636k281137k829254l003859k799493k314709
11812C2072212j733498j271001j106609j333054j937565k811475l777192m629140
11804A3472678n187657n350371n113913m554461l786830k932797k108350j415350
11796a6977051r22840o41560n08753l99107j65488L04434J043870J999529L060803
11787a3206163M100350N001326N667936O031352O058254N758080N182908M418752
11779B9012795L570513K744082K029923J489817J143565R55595Q33473O53467
11771D2433230L09515k41450r64856j768063k538401l183388l661320l988639
$$ plain form
11828 24792032 26977761 29799334 33045827 36463962 39785457 42744626 45095058 46630053
11820 46630053 47203283 46748300 45300664 43019527 40190273 37186414 34386921 32072212
11812 32072212 30338714 29067713 27961104 26628050 24690485 21879010 18101818 13472678
11804 13472678 8285021 2934650 -2179263 -6733724 -10520554 -13453351 -15561701 -16977051
11796 -16977051 -17899891 -18541451 -19050204 -19449311 -19614799 -19310365 -18266495 -16266966 -13206163
11787 -13206163 -9105813 -4104487 1563449 7594801 13653055 19411135 24594043 29012795
11779 29012795 32583308 35327390 37357313 38847130 39990695 40946290 41779763 42433230
11771 42433230 42742745 42501295 41536439 39768376 37229975 34046587 30385267 26396628
11763B6396628m215124m380253m484559m499733m405373m216014l973904l716643
11755g494975l451233l159246k829743k490623k208073k050226k041820k143635
11747b7869574k271092k341375k324047k266087k270487k434078k783425l253275
11739d7813440l717717m043497m129908l925447l429453k682608j746198o80713
11731g2168981M58827J608605K682567L580747M218845M557870M611933M429574
11723d6020013M064261L556987K941448K260762J574513R45414M14476j5436l73139
11714c0650727o92976r90275j260082j496294j702056j870327j953728j866143
11706d2482608j529150r25590j11633Q19243J781452K711594L550037M223468
$$ plain form
11763 26396628 22181504 17801251 13316692 8816959 4411586 195572 -3778332 -7494975
11755 -7494975 -10946208 -14105454 -16935197 -19425820 -21633893 -23684119 -25725939 -27869574
11747 -27869574 -30140666 -32482041 -34806088 -37072175 -39342662 -41776740 -44560165 -47813440
11739 -47813440 -51531157 -55574654 -59704562 -63630009 -67059462 -69742070 -71488268 -72168981
11731 -72168981 -71710154 -70101549 -67418982 -63838235 -59619390 -55061520 -50449587 -46020013
11723 -46020013 -41955752 -38398765 -35457317 -33196555 -31622042 -30676628 -30262152 -30277588 -30650727
11714 -30650727 -31343703 -32333978 -33594060 -35090354 -36792410 -38662737 -40616465 -42482608
11706 -42482608 -44011758 -44937348 -45048981 -44229738 -42448286 -39736692 -36186655 -31963187
11698c1963187M661234M842107M830041M757094M755119M883197N099010N282800
11690G147415N288633M996322M351129L383670K203404R67912j59599j051652
11682B7127234j647426j962672k069821k054766j974799j842290j639992j354830
11674A2580638j009494o73728m46558m16120o17640j012567j501608j967687k326742
11665B608494k554190k667821k684130k592343k374015k046699j681708j371500
11657a5363912j174285j086440j065500j079227j135213j267232j494742j792657
11649b5459208k093978k317481k396865k295547k006850j546757r45738k43668
11641c9306092N10968J260111J937023K469799K785810K817536K513568J857820
$$ plain form
11698 -31963187 -27301953 -22459846 -17629805 -12872711 -8117592 -3234395 1864615 7147415
11690 7147415 12436048 17432370 21783499 25167169 27370573 28338485 28178886 27127234
11682 27127234 25479808 23517136 21447315 19392549 17417750 15575460 13935468 12580638
11674 12580638 11571144 10897416 10450858 10034738 9417098 8404531 6902923 4935236 2608494
11665 2608494 54304 -2613517 -5297647 -7889990 -10264005 -12310704 -13992412 -15363912
11657 -15363912 -16538197 -17624637 -18690137 -19769364 -20904577 -22171809 -23666551 -25459208
11649 -25459208 -27553186 -29870667 -32267532 -34563079 -36569929 -38116686 -39062424 -39306092
11641 -39306092 -38795124 -37535013 -35597990 -33128191 -30342381 -27524845 -25011277 -23153457
11633b3153457Q94242k54003j388744k278568k731463k664120k126326j266315
11625c4968754k63994P24098J584792K243715K661182K841146K844363K787155
11617a9546297K814835L054765L565857M303691N116612N781591O076684N865991
11609A7033729N154279M074832K815146J532138L15317p89759j739742k481467
11601B5914473k973667l207259l198738k970262k545881j969738j322344p10806
11593G015778k33903N4804J60753J29511P667j89420m80492q92527j428373k050491
11583B093307k685501l240238l621316l757480l622690l249754k722942k150138
11575b2956752j630403j234930j004144r47518j035562j193178j314533j303001
$$ plain form
11633 -23153457 -22259215 -22513218 -23901962 -26180530 -28911993 -31576113 -33702439 -34968754
11625 -34968754 -35232748 -34508650 -32923858 -30680143 -28018961 -25177815 -22333452 -19546297
11617 -19546297 -16731462 -13676697 -10110840 -5807149 -690537 5091054 11167738 17033729
11609 17033729 22188008 26262840 29077986 30610124 30925441 30135682 28395940 25914473
11601 25914473 22940806 19733547 16534809 13564547 11018666 9048928 7726584 7015778
11593 7015778 6781875 6836679 6997432 7126943 7134610 6945190 6464698 5572171 4143798 2093307
11583 2093307 -592194 -3832432 -7453748 -11211228 -14833918 -18083672 -20806614 -22956752
11575 -22956752 -24587155 -25822085 -26826229 -27773747 -28809309 -30002487 -31317020 -32620021
11567c2620021j110999p48163k53145L42621J025368J775198K530209L171808
11559b5887124L551300L551554L153018K464890J697302J082835P85026Q38567
11551h762632J147154J535079J825477J910812J788767J553220J348205J305349
11543C651431J489056J869838K337268K748401K987599L003144K801129K411859
11535B3299725J865858J200161M76933k19911q18545j294138j669796j981903
11527B0858384k243167k436211k537468k541432k459200k296922k043294j683569
11519B617121j223784o94269j25914M73156J111776J786116K457980L061141L524703
11510A2988026L790701L818327L583884L084827K346615J427894M22695n41121
$$ plain form
11567 -32620021 -33731020 -34479183 -34732328 -34389707 -33364339 -31589141 -29058932 -25887124
11559 -25887124 -22335824 -18784270 -15631252 -13166362 -11469060 -10386225 -9601199 -8762632
11551 -8762632 -7615478 -6080399 -4254922 -2344110 -555343 997877 2346082 3651431
11543 3651431 5140487 7010325 9347593 12095994 15083593 18086737 20887866 23299725
11535 23299725 25165583 26365744 26842677 26622766 25804221 24510083 22840287 20858384
11527 20858384 18615217 16179006 13641538 11100106 8640906 6343984 4300690 2617121
11519 2617121 1393337 699068 573154 1046310 2158086 3944202 6402182 9463323 12988026
11510 12988026 16778727 20597054 24180938 27265765 29612380 31040274 31462969 30921848
11502C0921848j311392j734886j695206j156905j97357R94590K162460L054951
11494C1038103L496681L427832K902027K051422J038105J1464r14173j657982
11486D1393479k157000k355317k213270j734998r94074j32995O70927J257038
11478C3733790J525114J457931J123528O59135K33475q438N360K60492O87606
11469C9677993J213156J791028K396296K995919L528079L910558M073396L994726
11461F3581151L719508L350417L009589K782666K672853K596361K426123K054064
11453H6192732J432220N80355m23655j458476k386838l099212l550088l758550
11445G3528488l778016l668764l491714l307418l161195l065271l002889k955068
$$ plain form
11502 30921848 29610456 27875570 26180364 25023459 24826102 25820692 27983152 31038103
11494 31038103 34534784 37962616 40864643 42916065 43954170 43965634 43051461 41393479
11486 41393479 39236479 36881162 34667892 32932894 31938820 31805825 32476752 33733790
11478 33733790 35258904 36716835 37840363 38499498 38732973 38724535 38729895 38990387 39677993
11469 39677993 40891149 42682177 45078473 48074392 51602471 55513029 59586425 63581151
11461 63581151 67300659 70651076 73660665 76443331 79116184 81712545 84138668 86192732
11453 86192732 87624952 88205307 87781652 86323176 83936338 80837126 77287038 73528488
11445 73528488 69750472 66081708 62589994 59282576 56121381 53056110 50053221 47098153
11437D7098153k922780k923301k967215l036269l074922k999723k727561k215393
11429B4230989j491283o57054J39146P45330J046909R95918O19084k88p57435
11420B4871316j556164k316799k964306l413022l564805l329746k666219j620270
11412C439985l34372R90551K162855L058492L640835L941805M023752L943655
11404B4867558L735692L419190L022666K599468K215763J918451J711308J558296
11396D5048392J405575J201155R03985M91302k8627o06384j158784j597087j860763
11387D3798764j935093j843346j625570j326084r99992p25859o01226p12083j092387
11378C2937124j700494k427219l129267l669532l947477l912630l564635k948438
$$ plain form
11437 47098153 44175373 41252072 38284857 35248588 32173666 29173943 26446382 24230989
11429 24230989 22739706 22082652 22221798 22967128 24014037 25009955 25629039 25628751 24871316
11420 24871316 23315152 20998353 18034047 14621025 11056220 7726474 5060255 3439985
11412 3439985 3105613 4096164 6259019 9317511 12958346 16900151 20923903 24867558
11404 24867558 28603250 32022440 35045106 37644574 39860337 41778788 43490096 45048392
11396 45048392 46453967 47655122 48559107 49050409 49021782 48415398 47256614 45659527 43798764
11387 43798764 41863671 40020325 38394755 37068671 36068679 35342820 34741594 34029511 32937124
11378 32937124 31236630 28809411 25680144 22010612 18063135 14150505 10585870 7637432
11370G637432k150016j289589n04992P5839L63457L24181j6355n75808j219769
11361B644380j777483k079753k011102j546468p47035K78669J415030K553528
11353a270234L584092M389006M858558M923862M584748L913143L030494K074599
11345C0088268J171680M16500j43812n18143p60151r36827j096267j254787j402173
11336B5564288j508879j528066j402093j083248n64398R6528P76185J320357J605762
11327B3276436J597488J364306J040360P59212N98620N56347N56839M84378K37380
11318C0471366k14821q05684j399898j865783k147066k287425k394685k572515
11310A6783489k862541l223562l550127l719700l651258l349124k904231k446784
$$ plain form
11370 7637432 5487416 4197827 3692835 3768674 4132131 4456312 4439957 3864149 2644380
11361 2644380 866897 -1212856 -3223958 -4770426 -5517461 -5238792 -3823762 -1270234
11353 -1270234 2313858 6702864 11561422 16485284 21070032 24983175 28013669 30088268
11345 30088268 31259948 31676448 31532636 31014493 30254342 29317515 28221248 26966461 25564288
11336 25564288 24055409 22527343 21125250 20042002 19477604 19574132 20350317 21670674 23276436
11327 23276436 24873924 26238230 27278590 28037802 28636422 29192769 29749608 30233986 30471366
11318 30471366 30256545 29450861 28050963 26185180 24038114 21750689 19356004 16783489
11310 16783489 13920948 10697386 7147259 3427559 -223699 -3572823 -6477054 -8923838
11302h923838k078053j823973j634989j424068j114078o67048q5711O01120J350318
11293a5800320K106315K801368L361528L713707L788572L525928K891812J902194
11285H291104O37314p62042k113367l222870l925663m126076l820886l095736
11277a2138222k099794j009586R428Q34631J401868J702662J770179J661798J443153
11268f423883J180642R47922Q35957R42173J329306J979967K786835L591540M246118
11259A1416577M657740M795379M665180M280757L654895K818302J843954Q48792
11251C8981576l3963o93329j068740j161667j033079p85607n29773l45514k59509
11242C3070395k50056k71030k75024k23293q6835J49429M76203Q53737J222041
$$ plain form
11302 -8923838 -11001891 -12825864 -14460853 -15884921 -16998999 -17666047 -17751758 -17150638 -15800320
11293 -15800320 -13694005 -10892637 -7531109 -3817402 -28830 3497098 6388910 8291104
11285 8291104 8928418 8166376 6053009 2830139 -1095524 -5221600 -9042486 -12138222
11277 -12138222 -14238016 -15247602 -15238174 -14403543 -13001675 -11299013 -9528834 -7867036 -6423883
11268 -6423883 -5243241 -4295319 -3459362 -2517189 -1187883 792084 3578919 7170459 11416577
11259 11416577 16074317 20869696 25534876 29815633 33470528 36288830 38132784 38981576
11251 38981576 38947613 38254284 37185544 36023877 34990798 34205191 33675418 33329904 33070395
11242 33070395 32820339 32549309 32274285 32050992 31964157 32113586 32589789 33443526 34665567
11233C4665567J524944J731365J839511J865760J831607J757647J661626J553793
11225D8431820J430739J276450J074934Q26351N52421K84518M1769j85165m31608
11216E3302229p36584j114294j539715j958315k308711k536923k595044k439433
11208C8073210k046001j438644p07003N707N41810P76076O52164J99424m74266
11199C5582477j215669j878138k369205k665664k788818k765799k613365k353811
11191A6932008k037605j743764j556259j536833j708755k049507k487517k907985
11183I03783l176783l181931k877409k305294j578407q28939j54477M04087Q46049
11174a1949321J180158J406361J514093J485446J298694R38484M13440k32244
$$ plain form
11233 34665567 36190511 37921876 39761387 41627147 43458754 45216401 46878027 48431820
11225 48431820 49862559 51139009 52213943 53040294 53592715 53877233 53919002 53733837 53302229
11216 53302229 52565645 51451351 49911636 47953321 45644610 43107687 40512643 38073210
11208 38073210 36027209 34588565 33881562 33887269 34429079 35205155 35857319 36056743 35582477
11199 35582477 34366808 32488670 30119465 27453801 24664983 21899184 19285819 16932008
11191 16932008 14894403 13150639 11594380 10057547 8348792 6299285 3811768 903783
11183 903783 -2273000 -5454931 -8332340 -10637634 -12216041 -13044980 -13199457 -12795370 -11949321
11174 -11949321 -10769163 -9362802 -7848709 -6363263 -5064569 -4126085 -3712645 -3944889
11166c944889r26337j590902k161112k588171k831164k851487k617744k119502
11158b1631308j384561m92269M28863J229184J784678K035995J995090J720801
11150a4313527J287748P69994K41105k20895n34718o29559m70994q5901M36087
11141a3520660R75536J433040J762859J972317K096770K170923K208636K195150
11133A294571K096228J885069J571911J210171Q67787N84806L53478J35697j02694
11124I897024l71360o56756r29869j148677j261920j223774j013306o44031j60759
11115B486572L66193Q45082J174728J272106J106116P18273K18808k41085n14623
11106G432170n11391k36186K05983O43490Q94679Q26405M00130l06896j120099
$$ plain form
11166 -3944889 -4871226 -6462128 -8623240 -11211411 -14042575 -16894062 -19511806 -21631308
11158 -21631308 -23015869 -23508138 -23079275 -21850091 -20065413 -18029418 -16034328 -14313527
11150 -14313527 -13025779 -12255785 -12014680 -12235575 -12770293 -13399852 -13870846 -13956747 -13520660
11141 -13520660 -12545124 -11112084 -9349225 -7376908 -5280138 -3109215 -900579 1294571
11133 1294571 3390799 5275868 6847779 8057950 8925737 9510543 9864021 9999718 9897024
11124 9897024 9525664 8868908 7939039 6790362 5528442 4304668 3291362 2647331 2486572
11115 2486572 2852765 3697847 4872575 6144681 7250797 7969070 8187878 7946793 7432170
11106 7432170 6920779 6684593 6890576 7534066 8428745 9255150 9655280 9348384 8228285
11097H228285j828855k266092k365278k169459j800015j410624j145605j107996
11089e865639j337209j797772k383756k944038l327419l432678l238752k799417
11081b7126680k210430j571734r60768m19282M7014M53235Q07502J087658J243816
11072b8649669J230564J046175P46419M20396J49168j7671n3019O9348L79046
11063b4679243Q88909J570491K347309L109702L741721M150603M291909M180831
11055c97768L881094L473937L024352K565854K113404J693647J367214J220927
11047A8942661J327360J691900K219237K725661L001543K896911K382009J546484
11039C6733766N42654m84309j436138k259047k916673l365286l551066l433989
$$ plain form
11097 8228285 6399430 4133338 1768060 -401399 -2201414 -3612038 -4757643 -5865639
11089 -5865639 -7202848 -9000620 -11384376 -14328414 -17655833 -21088511 -24327263 -27126680
11081 -27126680 -29337110 -30908844 -31869612 -32288894 -32241880 -31788645 -30981143 -29893485 -28649669
11072 -28649669 -27419105 -26372930 -25626511 -25206115 -25056947 -25074618 -25127637 -25058289 -24679243
11063 -24679243 -23790334 -22219843 -19872534 -16762832 -13021111 -8870508 -4578599 -397768
11055 -397768 3483326 6957263 9981615 12547469 14660873 16354520 17721734 18942661
11047 18942661 20270021 21961921 24181158 26906819 29908362 32805273 35187282 36733766
11039 36733766 37276420 36792111 35355973 33096926 30180253 26814967 23263901 19829912
11031A9829912l023069k395132j678984j013406n04998k05762j12998j83525l52478
11022A0359560n48417p01931p53109o64603m36969j13884K30591N17870O92045
11013H581153P38266O85316N89619N06681M65464M60192M61601M36298L60206
11004A3284796K20824J4611k50616n47649q27234j030127j107082j029648p85715
10995G942160l73903J86244Q31836J446550J884031K018931J794470J237367M39435
10986A7407121m69964j342914k032955k433350k522514k377900k134975j915248
10978B177301j773235j691737j615724j495516j314339j088835q46654n99820
10970h248559l34230j9678L72827Q59879J442194K104762K819274L546901M235246
$$ plain form
11031 19829912 16806843 14411711 12732727 11719321 11214323 11008561 10895563 10712038 10359560
11022 10359560 9811143 9109212 8356103 7691500 7254531 7140647 7371238 7889108 8581153
11013 8581153 9319419 10004735 10594354 11101035 11566499 12026691 12488292 12924590 13284796
11004 13284796 13505620 13520231 13269615 12721966 11894732 10864605 9757523 8727875 7942160
10995 7942160 7568257 7754501 8586337 10032887 11916918 13935849 15730319 16967686 17407121
10986 17407121 16937157 15594243 13561288 11127938 8605424 6227524 4092549 2177301
10978 2177301 404066 -1287671 -2903395 -4398911 -5713250 -6802085 -7648739 -8248559
10970 -8248559 -8582789 -8602467 -8229640 -7369761 -5927567 -3822805 -1003531 2543370 6778616
10961F778616M808082N160179N174008M760653L906463K698422J309470n5775
10953C4540118j231686k141635k800025l270126l609235l834481l922223l832850
10945I897857l542589l063472k440760j733133r94025k68352L98046R49637J321798
10936E25007J451673J298135Q66376K23144n13328j208300j749825k071005k150382
10927c328505j997998j635450j079050l38650N62900J563489K550951L377273
10919c25040L891730L984796L633688K927911K048538J202295N49194J64890M2605
10910A8120607J12152K63398L80048L82444K58507O3787j06405j56198k5196K91103
10900A9584247P47944J281685J838854K379849K861367L222870L392178L304053
$$ plain form
10961 6778616 11586698 16746877 21920885 26681538 30588001 33286423 34595893 34540118
10953 34540118 33308432 31166797 28366772 25096646 21487411 17652930 13730707 9897857
10945 9897857 6355268 3291796 851036 -882097 -1876122 -2144474 -1746428 -796791 525007
10936 525007 1976680 3274815 4141191 4364335 3851007 2642707 892882 -1178123 -3328505
10927 -3328505 -5326503 -6961953 -8041003 -8379653 -7816753 -6253264 -3702313 -325040
10919 -325040 3566690 7551486 11185174 14113085 16161623 17363918 17913112 18078002 18120607
10910 18120607 18232759 18496157 18876205 19258649 19517156 19580943 19474538 19318340 19293144 19584247
10900 19584247 20332191 21613876 23452730 25832579 28693946 31916816 35308994 38613047
10892C8613047K921140K252824J364294L62989o36481j544441k300627k854569
10884C8178176l148526l122504k737388j999084r69642K39439J487783K631699
10876C0559953L548516M159352M447160M457858M276082L988636L661131L336431
10868F2435119L037903K761750K466765K081577J534408P91843j11182j066002
10860G3932181j922381k553256k916090l065737l109488l142160l206178l287594
10852E0729297l331259l262437l014279k555180j899857j097400k10690O93571
10844C6051766J542681K258036K766976L018886K992319K692402K152018J445605
10836E4920689P01688Q6408k51632k47372M9257M99448R42872J269676J466326
$$ plain form
10892 38613047 41534187 43787011 45151305 45514294 44877813 43333372 41032745 38178176
10884 38178176 35029650 31907146 29169758 27170674 26201032 26440471 27928254 30559953
10876 30559953 34108469 38267821 42714981 47172839 51448921 55437557 59098688 62435119
10868 62435119 65473022 68234772 70701537 72783114 74317522 75109365 74998183 73932181
10860 73932181 72009800 69456544 66540454 63474717 60365229 57223069 54016891 50729297
10852 50729297 47398038 44135601 41121322 38566142 36666285 35568885 35358195 36051766
10844 36051766 37594447 39852483 42619459 45638345 48630664 51323066 53475084 54920689
10836 54920689 55622377 55708785 55457153 55209781 55259038 55758486 56701358 57971034 59437360
10827E9437360J618099J863686K316835K993619L788787M516774M991024N094024
10819H6620208M803591M172754L285848K219067J022262k76846j654062l065261
10811I7127561m428031n619964o502187o965069o978306o619688o060692n504313
10803D8449311n097956m866946m709671m458611l969896l192018k185850j097491
10795A8870872j02681O51990J086009J187357R90746N55864l9817o99198j307899
10786B1193243j746618j912126j743078j241781m77611M34144J364405K192407
10778A8062985K815063L160745L215761L042199K756794K471240K233805K015699
10770C9774291J749223J385857R35021M65709P8015j36915j30899Q4556M42344
$$ plain form
10827 59437360 61055459 62919145 65235980 68229599 72018386 76535160 81526184 86620208
10819 86620208 91423799 95596553 98882401 101101468 102123730 101846884 100192822 97127561
10811 97127561 92699530 87079566 80577379 73612310 66634004 60014316 53953624 48449311
10803 48449311 43351355 38484409 33774738 29316127 25346231 22154213 19968363 18870872
10795 18870872 18768191 19420181 20506190 21693547 22684293 23240157 23200340 22501142 21193243
10786 21193243 19446625 17534499 15791421 14549640 14072029 14506173 15870578 18062985
10778 18062985 20878048 24038793 27254554 30296753 33053547 35524787 37758592 39774291
10770 39774291 41523514 42909371 43844392 44310101 44388116 44251201 44120302 44204858 44647202
10761D4647202Q41373J177902J375158J397519J241245R10560M02191k85801j131304
10752E0576045k077707l047340l963414m759304n374662n755287n865693n703317
10744A4029321n299193m706134l987813l213690k449000j732647j059375l93136
10736h811667K87463R49305J509641J880810K011142J891037J537523R88591L13762
10727B557607l80690r70210j349517j470093j356564j087213p42793l56532R4055
10718e061950O46133J298452J990025K620674L092452L348264L392719L284156
10710A4610925L098161K886794K666036K436720K210331K013202J875164J824869
10702C3622202J895517K123061K525505L075399L687978M236298M587293M641437
$$ plain form
10761 44647202 45488575 46666477 48041635 49439154 50680399 51590959 51993150 51707349 50576045
10752 50576045 48498338 45450998 41487584 36728280 31353618 25598331 19732638 14029321
10744 14029321 8730128 4023994 36181 -3177509 -5626509 -7359156 -8418531 -8811667
10736 -8811667 -8524204 -7574899 -6065258 -4184448 -2173306 -282269 1255254 2243845 2557607
10727 2557607 2176917 1206707 -142810 -1612903 -2969467 -4056680 -4799473 -5156005 -5061950
10718 -5061950 -4415817 -3117365 -1127340 1493334 4585786 7934050 11326769 14610925
10710 14610925 17709086 20595880 23261916 25698636 27908967 29922169 31797333 33622202
10702 33622202 35517719 37640780 40166285 43241684 46929662 51165960 55753253 60394690
10694F0394690M357134L750503K878007J819122O67712m75654j521291k414060
10686F9456163l145882l744833m246990m670191n005184n224855n300297n212150
10678C2905781m953621m527786l941858l201264k309641j280389j55120R85601
10670A3521703K029207K851288L339603L420102L084665K407333J529550O13741
10662C2797192k08593q65553j344375j673943j899734k054614k135777k105495
10654B0509108j921502j578805j134297o97762l92981l05747m41544p15768r87312
10645A2333390j120514j039034p40404k71151L09136R46416J589293K180801K660026
10636A6847959K974135L091779L010553K757534K385567J966957J582331J301354
$$ plain form
10694 60394690 64751824 68502327 71380334 73199456 73867168 73391514 71870223 69456163
10686 69456163 66310281 62565448 58318458 53648267 48643083 43418228 38117931 32905781
10678 32905781 27952160 23424374 19482516 16281252 13971611 12691222 12536102 13521703
10670 13521703 15550910 18402198 21741801 25161903 28246568 30653901 32183451 32797192
10662 32797192 32588599 31723046 30378671 28704728 26804994 24750380 22614603 20509108
10654 20509108 18587606 17008801 15874504 15176742 14783761 14478014 14036470 13320702 12333390
10645 12333390 11212876 10173842 9433438 9162287 9471423 10417839 12007132 14187933 16847959
10636 16847959 19822094 22913873 25924426 28681960 31067527 33034484 34616815 35918169
10628C5918169J160006J150328J234918J374714J539844J688530J736898J559266
10620D7362673J032486R8647j191717k676635m120049n278649n977936o167143
10612B3081677n925622n416445m811755m227252l693436l169169k583883j887201
10604h633086j087310k64199M51023R27231J090167R48626N72261M3860n68757
10595f520184j200088j759195k129813k208949j950686j377387n57185M22435
10587a7281052J465140K470802L352762M061943M594897M976335N232937N381247
10579A4255011N433717N408038N325024N194978N005130M720705M301132L721782
10571E3365517K990413K153186J287559M78042k21822q20278j382836j986095
$$ plain form
10628 35918169 37078175 38228503 39463421 40838135 42377979 44066509 45803407 47362673
10620 47362673 48395159 48493806 47302089 44625454 40505405 35226756 29248820 23081677
10612 23081677 17156055 11739610 6927855 2700603 -992833 -4162002 -6745885 -8633086
10604 -8633086 -9720396 -9984595 -9533572 -8606341 -7516174 -6567548 -5995287 -5951427 -6520184
10595 -6520184 -7720272 -9479467 -11609280 -13818229 -15768915 -17146302 -17703487 -17281052
10587 -17281052 -15815912 -13345110 -9992348 -5930405 -1335508 3640827 8873764 14255011
10579 14255011 19688728 25096766 30421790 35616768 40621898 45342603 49643735 53365517
10571 53365517 56355930 58509116 59796675 60274717 60052895 59232617 57849781 55863686
10563E5863686k659136l355159l972578m407539m601240m556359m322063l964643
10555B4024969l541415l085921k605865k093823j547555r89424m72717p1440J40557
10546I757366J15308j42243n55750r85074j269004j287755j011626n08425R2905
10537D205702O61344J116323J451898J725223K016226K377753K802680L227488
10529A9584637L567981L760005L779422L637809L366140K995698K540534J990526
10521D5222752J324796N40210l25224j191256j959274k551455k944739l174038
10513C4941772l297485l352788l344232l264535l119299k932999k748770k634732
10505A0246932k683196k987571l609844m563238n816362p311548q993374j0839451
$$ plain form
10563 55863686 53204550 49849391 45876813 41469274 36868034 32311675 27989612 24024969
10555 24024969 20483554 17397633 14791768 12697945 11150390 10160966 9688249 9616809 9757366
10546 9757366 9872674 9730431 9174681 8189607 6920603 5632848 4621222 4112797 4205702
10537 4205702 4867046 5983369 7435267 9160490 11176716 13554469 16357149 19584637
10529 19584637 23152618 26912623 30692045 34329854 37695994 40691692 43232226 45222752
10521 45222752 46547548 47087758 46762534 45571278 43612004 41060549 38115810 34941772
10513 34941772 31644287 28291499 24947267 21682732 18563433 15630434 12881664 10246932
10505 10246932 7563736 4576165 966321 -3596917 -9413279 -16724827 -25718201 -36557652
10497c6557652j2874467j5159151j7770612k0787138k4261624k8160049l2263544
10490a87834237l6054910l8646674l8875472l5684715k8711872j8705458p378675
10483c91892013L291745J1851796J7739061K1137126K2599925K2747300K2114228
10476b70410832K1090571J9900757J8620253J7228211J5680836J3981748J2216638
10469a51691818J0526616R037263P800395O790729N946977N218500M590743M082321
10461i7698274L718144L496373L374963L288248L179419L030141K878546K816701
10453g1915739K954262L353440L972056M655697N187108N365382N077347M333886
10445c7016561L261306K056982R30613M9610n01027p34375p43881o59560o02382
$$ plain form
10497 -36557652 -49432119 -64591270 -82361882 -103149020 -127410644 -155570693 -187834237
10490 -187834237 -223889147 -262535821 -301411293 -337096008 -365807880 -384513338 -391892013
10483 -391892013 -388600268 -376748472 -359009411 -337872285 -315272360 -292525060 -270410832
10476 -270410832 -249320261 -229419504 -210799251 -193571040 -177890204 -163908456 -151691818
10469 -151691818 -141165202 -132127939 -124327544 -117536815 -111589838 -106371338 -101780595 -97698274
10461 -97698274 -93980130 -90483757 -87108794 -83820546 -80641127 -77610986 -74732440 -71915739
10453 -71915739 -68961477 -65608037 -61635981 -56980284 -51793176 -46427794 -41350447 -37016561
10445 -37016561 -33755255 -31698273 -30767660 -30718050 -31219077 -31953452 -32697333 -33356893 -33959275
10436c3959275o54511q42361j127120j412888j582230j543784j261234p51467
10428d3134870o8075P09846J482818K142777K597095K793318K726540K424485
10420b8326066J926797J279385N44531j92648q34979j294042j507606j451113
10412b9855741j144365o47168m0175N97536J200026J718335K128029K435025K661239
10403b0947259K811073K849511K719652K390448J896302J337111Q37405M88747
10395e617010L06673K24126J24179j04220n14167j077430j701494k276444k721253
10386a3357040k999737l102237l018633k733180k247327j607563r08579k62693
10378c0236989K44687N82755P71119Q54910Q81847Q94553R35113J049661J280221
$$ plain form
10436 -33959275 -34613786 -35456147 -36583267 -37996155 -39578385 -41122169 -42383403 -43134870
10428 -43134870 -43202945 -42493099 -41010281 -38867504 -36270409 -33477091 -30750551 -28326066
10420 -28326066 -26399269 -25119884 -24575353 -24768001 -25602980 -26897022 -28404628 -29855741
10412 -29855741 -31000106 -31647274 -31687449 -31089913 -29889887 -28171552 -26043523 -23608498 -20947259
10403 -20947259 -18136186 -15286675 -12567023 -10176575 -8280273 -6943162 -6105757 -5617010
10395 -5617010 -5310337 -5086211 -4962032 -5066252 -5580419 -6657849 -8359343 -10635787 -13357040
10386 -13357040 -16356777 -19459014 -22477647 -25210827 -27458154 -29065717 -29974296 -30236989
10378 -30236989 -29992302 -29409547 -28638428 -27783518 -26901671 -26007118 -25072005 -24022344 -22742123
10369b2742123J639169K080013K494195K753228K777655K585019K283145K018415
10361d111284J916628K045448K404208K934657L544686M134502M612502M896183
10353B2377530M908661M587550L910674K922413J736826N08544o13481j524823
10345C8813894k184790k618849k906848l151993l432677l760178m072305m269440
10337A2416814m266972m030712l583587k994292k360004j784049j346578j075495
10329i024875r32801q27517o53917l41161J07663O08765J031212J254789J219466
10320g558376R41297M96186p639m52839p34679p90015o27653l37623o0650P5671
10310i056320K1175j70195l68486m34469k86381O8679N48605J037920J430414
$$ plain form
10369 -22742123 -21102954 -19022941 -16528746 -13775518 -10997863 -8412844 -6129699 -4111284
10361 -4111284 -2194656 -149208 2255000 5189657 8734343 12868845 17481347 22377530
10353 22377530 27286191 31873741 35784415 38706828 40443654 40952198 40338717 38813894
10345 38813894 36629104 34010255 31103407 27951414 24518737 20758559 16686254 12416814
10337 12416814 8149842 4119130 535543 -2458749 -4818753 -6602802 -7949380 -9024875
10329 -9024875 -9957676 -10785193 -11439110 -11780271 -11672608 -11063843 -10032631 -8777842 -7558376
10320 -7558376 -6617079 -6120893 -6128532 -6581371 -7316050 -8106065 -8733718 -9071341 -9131991 -9056320
10310 -9056320 -9035145 -9205340 -9573826 -10008295 -10294676 -10225997 -9677392 -8639472 -7209058
10301g209058J656793J695985J572167J335680J030381O65485K16463l40129r85302
10292c61535j646720k227849k650932k880464k918931k790808k530745k177784
10284b0185768j772019j355180r76574o96921n79463o68249r65674j420546j929313
10275c0549707k349704k528169k339732j730187p45290M66776J688655K701296
10267c5386062L362499L655391L678397L589559L545884L662900L988100M480237
10259e423095N011167N410803N541376N354680M895941M257965L519689K706683
10251C1275209J795452P55994m01298j612445k786000l836495m695172n303673
10243A5191572n614796n603468n269558m628255l709146k576068j343774j58359
$$ plain form
10301 -7209058 -5552265 -3856280 -2284113 -948433 81948 747433 963896 623767 -361535
10292 -361535 -2008255 -4236104 -6887036 -9767500 -12686431 -15477239 -18007984 -20185768
10284 -20185768 -21957787 -23312967 -24289541 -24986462 -25565925 -26234174 -27199848 -28620394 -30549707
10275 -30549707 -32899411 -35427580 -37767312 -39497499 -40242789 -39776013 -38087358 -35386062
10267 -35386062 -32023563 -28368172 -24689775 -21100216 -17554332 -13891432 -9903332 -5423095
10259 -5423095 -411928 4998875 10540251 15894931 20790872 25048837 28568526 31275209
10251 31275209 33070661 33826655 33425357 31812912 29026912 25190417 20495245 15191572
10243 15191572 9576776 3973308 -1296250 -5924505 -9633651 -12209719 -13553493 -13711852
10235a3711852Q55284J639017K207737K621137K946045L225607L460533L609860
10227F853368L617411L451538L127976K696012K201282J660490J071772M52054
10219B5131903j30917n61490p18930n36113l6907O71390J443383K148144K700289
10210C0110752L061138L220862L179102K937381K505064J906867J177358L46045
10202D8444569n62424j499064k360555l007792l341000l371577l219065l029312
10194B8053780k884905k780937k673743k550255k460367k491545k707707l098465
10186F405856l577132m026877m354880m513968m489474m279290l886724l322148
10178b6044637k606054j776634r01667q0489N75192R71345J052594Q09446K82201
$$ plain form
10235 -13711852 -12856568 -11217551 -9009814 -6388677 -3442632 -217025 3243508 6853368
10227 6853368 10470779 13922317 17050293 19746305 21947587 23608077 24679849 25131903
10219 25131903 25000986 24439496 23720566 23184453 23147546 23818936 25262319 27410463 30110752
10210 30110752 33171890 36392752 39571854 42509235 45014299 46921166 48098524 48444569
10202 48444569 47882145 46383081 44022526 41014734 37673734 34302157 31083092 28053780
10194 28053780 25168875 22387938 19714195 17163940 14703573 12212028 9504321 6405856
10186 6405856 2828724 -1198153 -5553033 -10067001 -14556475 -18835765 -22722489 -26044637
10178 -26044637 -28650691 -30427325 -31328992 -31409481 -30834289 -29862944 -28810350 -28000904 -27718703
10169b7718703m35000j202010j862532k287136k407177k223358j790292j191012
10161d1117220n14105J63856P92743J356654J866933K341509K785789L188649
10153b9135192L529508L782569L913487L875990L614892L075766K222862J067257
10145d052861l05645j734367l022118m006034m615267m880582m887421m702332
10137c2206627m325215l704634k804324j666236m21405P53161J696154K309829
10129d0369297K583833K593551K469863K345559K300207K329193K349826K243424
10121b1153841J922003J393277P84062K95636J09377L00577Q11943J493025K171325
10112a1872616K714942L065064L235483L286834L289206L289297L295163L283470
$$ plain form
10169 -27718703 -28153703 -29355713 -31218245 -33505381 -35912558 -38135916 -39926208 -41117220
10161 -41117220 -41631325 -41467469 -40674726 -39318072 -37451139 -35109630 -32323841 -29135192
10153 -29135192 -25605684 -21823115 -17909628 -14033638 -10418746 -7342980 -5120118 -4052861
10145 -4052861 -4358506 -6092873 -9114991 -13121025 -17736292 -22616874 -27504295 -32206627
10137 -32206627 -36531842 -40236476 -43040800 -44707036 -45128441 -44375280 -42679126 -40369297
10129 -40369297 -37785464 -35191913 -32722050 -30376491 -28076284 -25747091 -23397265 -21153841
10121 -21153841 -19231838 -17838561 -17054499 -16758863 -16649486 -16348909 -15536966 -14043941 -11872616
10112 -11872616 -9157674 -6092610 -2857127 429707 3718913 7008210 10303373 13586843
10104A3586843L224070L106069K945006K762032K550863K263843J834226J219185
10096C3492137M31659m56522j333807k077588k587184k816021k786992k574417
10088A9291265k258090j880945j442586r32499l75268J47044N10833N93929L20628
10079A3974311l11980j233501k320249l424377m400994n127460n516429n527428
10071a3888107n176616m537096l724428k873202k115431j561117j272496j236220
10063c6384713j359917j513654j595651j570557j451984j256792r81668o19130
10055d6734066j85763K68926O77174R76256J127778J125403R85407P26133L58501
10046d0674251r7254n86203j019932j312093j414239j317215j026751n52652P0707
$$ plain form
10104 13586843 16810913 19916982 22861988 25624020 28174883 30438726 32272952 33492137
10096 33492137 33923796 33467274 32133467 30055879 27468695 24652674 21865682 19291265
10088 19291265 17033175 15152230 13709644 12777145 12401877 12548921 13059754 13653683 13974311
10079 13974311 13662331 12428830 10108581 6684204 2283210 -2844250 -8360679 -13888107
10071 -13888107 -19064723 -23601819 -27326247 -30199449 -32314880 -33875997 -35148493 -36384713
10063 -36384713 -37744630 -39258284 -40853935 -42424492 -43876476 -45133268 -46114936 -46734066
10055 -46734066 -46919829 -46650903 -45973729 -44997473 -43869695 -42744292 -41758885 -41032752 -40674251
10046 -40674251 -40771505 -41357708 -42377640 -43689733 -45103972 -46421187 -47447938 -48000590 -47929883
10037d7929883P60105J394192J862775K118799K194131K170007K124257K088825
10029c3216792K042515J941843J767209J549216J355240J249720J261813J382050
10021b0667186J580439J823450K076207K293941K416292K376662K129785J686019
10013d284391J128247N91005K05861M3315Q5906K46127M15887N20130N48253N47926
10003D8266N84760O92177Q43612R62239R55343P47994L02567l73770j229788k179899
9993A353501l119808l940225m538822m840861m828211m553721m119715l632814
9985c2220676l170065k772242k448722k179930j927939j666144j408281j204012
9977d8998011j099691j100694j167788j243477j281939j266072j212078j164524
$$ plain form
10037 -47929883 -47169778 -45775586 -43912811 -41794012 -39599881 -37429874 -35305617 -33216792
10029 -33216792 -31174277 -29232434 -27465225 -25916009 -24560769 -23311049 -22049236 -20667186
10021 -20667186 -19086747 -17263297 -15187090 -12893149 -10476857 -8100195 -5970410 -4284391
10013 -4284391 -3156144 -2565139 -2359278 -2315963 -2230057 -1983930 -1568043 -1047913 -499660 48266
10003 48266 633026 1325203 2168815 3131054 4086397 4834391 5136958 4763188 3533400 1353501
9993 1353501 -1766307 -5706532 -10245354 -15086215 -19914426 -24468147 -28587862 -32220676
9985 -32220676 -35390741 -38162983 -40611705 -42791635 -44719574 -46385718 -47793999 -48998011
9977 -48998011 -50097702 -51198396 -52366184 -53609661 -54891600 -56157672 -57369750 -58534274
9969e8534274j180963j309484j569661j944580k382590k805228l123817l267481
9961g6118078l213755l003151k726024k488141k371793k405394k548662k700650
9953i7575648k735433k556251k142423j561524r36678l85077L6741L47408O09972
9944a06898913Q85596J208019J585098K004237K426003K780323K987323K998801
9936i0023513K831738K570229K335302K238898K343140K642793L076753L557155
9928f8427505L997335M329095M512224M540022M437285M244537L989311L658179
9920c4719517L192099K518650J606026M99721o86553j816627k781434l529753
9912c5717388m077111m492955m863340n239174n598824n851521n881062n602301
$$ plain form
9969 -58534274 -59715237 -61024721 -62594382 -64538962 -66921552 -69726780 -72850597 -76118078
9961 -76118078 -79331833 -82334984 -85061008 -87549149 -89920942 -92326336 -94874998 -97575648
9953 -97575648 -100311081 -102867332 -105009755 -106571279 -107507957 -107893034 -107856293 -107508885 -106898913
9944 -106898913 -106013317 -104805298 -103220200 -101215963 -98789960 -96009637 -93022314 -90023513
9936 -90023513 -87191775 -84621546 -82286244 -80047346 -77704206 -75061413 -71984660 -68427505
9928 -68427505 -64430170 -60101075 -55588851 -51048829 -46611544 -42367007 -38377696 -34719517
9920 -34719517 -31527418 -29008768 -27402742 -26903021 -27589574 -29406201 -32187635 -35717388
9912 -35717388 -39794499 -44287454 -49150794 -54389968 -59988792 -65840313 -71721375 -77323676
9904g7323676m997558m116971l052421j910653q05392J34058P58084R15444M98790
9895h9900295n00598j961880l655892n317173o732489p805359q574728r183254
9887a33631668r802182j0541133j1389348j2214177j2791890j2825900j1943673
9880b15139971r709360n700706L18437Q147232J6938725K5244677L1445206L4403914
9872a14051846L3941072L0807341K6220230K1320426J6857344J3155697J0238759
9865C8489023P983740O245594M919056L935706L232017K734994K375333K100923
9857G2016386J869792J633812J339697R57086N13348R8792j76162k48134j42041
9848G7862576M4355J96282K34344J32165r8956m32560q32022j237954j564705
$$ plain form
9904 -77323676 -82321234 -86438205 -89490626 -91401279 -92206671 -92072613 -91314529 -90399085 -89900295
9895 -89900295 -90400893 -92362773 -96018665 -101335838 -108068327 -115873686 -124448414 -133631668
9887 -133631668 -143433850 -153974983 -165364331 -177578508 -190370398 -203196298 -215139971
9880 -215139971 -224849331 -230550037 -230231600 -222084368 -205145643 -179900966 -148455760 -114051846
9872 -114051846 -80110774 -49303433 -23083203 -1762777 15094567 28250264 38489023
9865 38489023 46472763 52718357 57637413 61573119 64805136 67540130 69915463 72016386
9857 72016386 73886178 75519990 76859687 77816773 78330121 78428913 78252751 78004617 77862576
9848 77862576 77906931 78103213 78337557 78469722 78370766 77938206 77106184 75868230 74303525
9839G4303525j729726j703692j539905j354546j269449j353471j593755j910739
9831F1848242k209291k432916k579479k668275k696721k634541k459246k190547
9823D1977226j885294j598595j349703j123134r00523o91786n37659m83715n49752
9814C2857065p16018r27792j108455j176531j068062p60029k82463K90749Q69542
9805B7978006J378566J773419K035961K159867K142563J985846J694097J267148
9797D2415473P01127N631p78595j584583k344916l012104l556083l950603m171552
9788B3723795m212886m103900l908146l698853l524078l384714l242004l050543
9780e401329k791899k481998k147003j791111j389246r15954l85857J34250N58265
$$ plain form
9839 74303525 72573799 70870107 69330202 67975656 66706207 65352736 63758981 61848242
9831 61848242 59638951 57206035 54626556 51958281 49261560 46627019 44167773 41977226
9823 41977226 40091932 38493337 37143634 36020500 35119977 34428191 33890532 33406817 32857065
9814 32857065 32141047 31213255 30104800 28928269 27860207 27100178 26817715 27108464 27978006
9805 27978006 29356572 31129991 33165952 35325819 37468382 39454228 41148325 42415473
9797 42415473 43116600 43122231 42343636 40759053 38414137 35402033 31845950 27895347 23723795
9788 23723795 19510909 15407009 11498863 7800010 4275932 891218 -2350786 -5401329
9780 -5401329 -8193228 -10675226 -12822229 -14613340 -16002586 -16918540 -17304397 -17170147 -16611882
9771a6611882Q34881R81788J077843J222287J485560J873697K320973K716387
9763d098466K954027K981079K816038K528856K199794J884125J599921J336763
9755A4202137J071365P78935M39628M4916l95599q52912j287359j662681j953677
9746A0384753k140795k198871k095867j809079j348044p64699j42680M23958Q47236
9737A155912J053020R88477O35617K4292p71022j658454k566143l460605m327611
9728h926517n129688n777697o142915o101994n584570m598969l230504j618667
9720d7111521P8269J720891L214887M513566N595014O428474O956044P109769
9712a1494607O858493O251476N423329M553046L803599L277316L002488K941917
$$ plain form
9771 -16611882 -15777001 -14795213 -13717370 -12495083 -11009523 -9135826 -6814853 -4098466
9763 -4098466 -1144439 1836640 4652678 7181534 9381328 11265453 12865374 14202137
9755 14202137 15273502 16052437 16492065 16536981 16141382 15288470 14001111 12338430 10384753
9746 10384753 8243958 6045087 3949220 2140141 792097 27398 -115282 308676 1155912
9737 1155912 2208932 3197409 3833026 3857318 3086296 1427842 -1138301 -4598906 -8926517
9728 -8926517 -14056205 -19833902 -25976817 -32078811 -37663381 -42262350 -45492854 -47111521
9720 -47111521 -47033252 -45312361 -42097474 -37583908 -31988894 -25560420 -18604376 -11494607
9712 -11494607 -4636114 1615362 7038691 11591737 15395336 18672652 21675140 24617057
9704B4617057L007123L073071L000185K668838K018773J075731m9800j194572
9696C8216406k194504k936366l386755l584712l603680l506410l318849l034289
9688A2650841k639328k140723j573567r86229m17787J09577N77583R57077J212708
9679G750152J324600J304321J190357J031478Q73847P54530O94141O90256P24031
9670A6337713P83103Q81714J054192J322020J662156K003964K256052K342438
9662B8643352K228594J931147J512603J062978O72243M01899K66136K31435K37943
9653C7188330K33149J94348J19934k908k20330n96972j172781j926250k771788
9644C1044732l592263m286375m804516n154466n376646n507894n557337n504409
$$ plain form
9704 24617057 27624180 30697251 33697436 36366274 38385047 39460778 39410978 38216406
9696 38216406 36021902 33085536 29698781 26114069 22510389 19003979 15685130 12650841
9688 12650841 10011513 7870790 6297223 5310994 4893207 5002784 5580367 6537444 7750152
9679 7750152 9074752 10379073 11569430 12600908 13474755 14229285 14923426 15613682 16337713
9670 16337713 17120816 18002530 19056722 20378742 22040898 24044862 26300914 28643352
9662 28643352 30871946 32803093 34315696 35378674 36050917 36452816 36718952 36950387 37188330
9653 37188330 37421479 37615827 37735761 37732853 37512523 36915551 35742770 33816520 31044732
9644 31044732 27452469 23166094 18361578 13207112 7830466 2322572 -3234765 -8739174
9636h739174n312851m950361m407058l707892k914028k111584j391170q24387
9628c4358505m44607k39426j57424j23211n1819J39056N13728J099514J873401
9619c1749293K764585L672938M493562N136604N537171N656569N478701N004881
9611E995718M250037L245519K052044P75009m37513j427465k078387k355484k311866
9602G707612k062043j737991j443017j217230j028526p94807m26303J33054Q80480
9593A1229J748986K620016L351123L810998L908469L605494K917058J909437P01189
9584B4583999n44419j650023k474168k954492l115964l038423k803636k452366
9576E550508j975249j343708n62767K92130J086166J680126J989831K010166J796471
$$ plain form
9636 -8739174 -14052025 -19002386 -23409444 -27117336 -30031364 -32142948 -33534118 -34358505
9628 -34358505 -34803112 -35042538 -35199962 -35323173 -35374992 -35235936 -34722208 -33622694 -31749293
9619 -31749293 -28984708 -25311770 -20818208 -15681604 -10144433 -4487864 990837 5995718
9611 5995718 10245755 13491274 15543318 16318327 15880814 14453349 12374962 10019478 7707612
9602 7707612 5645569 3907578 2464561 1247331 218805 -576002 -1002305 -869251 11229
9593 11229 1760215 4380231 7731354 11542352 15450821 19056315 21973373 23882810 24583999
9584 24583999 24039580 22389557 19915389 16960897 13844933 10806510 8002874 5550508
9576 5550508 3575259 2231551 1668784 1960914 3047080 4727206 6717037 8727203 10523674
9567A0523674J425570R61538M38094j39681p74748j445961k082717k567950k777227
9558C560592k636005k158994j443645o22300J93362R42392J610943K207419K731353
9549D385117L148013L383190L348777K989007K316633J413695L99458o11341j539283
9540A9233266k351618l052059l653168m148482m507552m698369m711531m555840
9532a2445353m227997l694619k918688j916630p95957K63278J071604J493784
9524b3170578J480757J071381L80520m22400j152511j662750j885449j834952
9516b7195982j571045j152798o15666J9211P21382J437235K094215K613241K918520
9507b0731687K948068K674357K129433J412243O65827M1041l27222l29553J01156
$$ plain form
9567 10523674 11949244 12910782 13348876 13209195 12434447 10988486 8905769 6337819 3560592
9558 3560592 924587 -1234407 -2678052 -3300352 -3106990 -2164598 -553655 1653764 4385117
9549 4385117 7533130 10916320 14265097 17254104 19570737 20984432 21383890 20772549 19233266
9540 19233266 16881648 13829589 10176421 6027939 1520387 -3177982 -7889513 -12445353
9532 -12445353 -16673350 -20367969 -23286657 -25203287 -25999244 -25735966 -24664362 -23170578
9524 -23170578 -21689821 -20618440 -20237920 -20660320 -21812831 -23475581 -25361030 -27195982
9516 -27195982 -28767027 -29919825 -30535491 -30516280 -29794898 -28357663 -26263448 -23650207 -20731687
9507 -20731687 -17783619 -15109262 -12979829 -11567586 -10901759 -10860718 -11187940 -11517493 -11416337
9498a1416337R57493K134096L442830M665525N612961O160413O254110N901306
9490B3712397N156563M105958K844664J451568k0749j525821k988567m296654
9482B8439359n338453o057097o468949o631060o591521o363171n929401n267097
9474b0207390m374477l298188k146618j070016k03859L96548P84359J085256J416010
9465b7618375J811162K203174K459733K447672K090695J402868M90449m77263
9457a5189885j314788j865408k034156j808827j263744n35570K23832Q90665J386547
9448b1511334J675445J758464J670614J470761J223331R81011P74554O09601M73032
9439a0874521L51295K50473J98578K23587L25096M66094N95447O85466P52031
$$ plain form
9498 -11416337 -10458844 -8324748 -4881918 -216393 5396568 11556981 17811091 23712397
9490 23712397 28868960 32974918 35819582 37271150 37250401 35724580 32736013 28439359
9482 28439359 23100906 17043809 10574860 3943800 -2647721 -9010892 -14940293 -20207390
9474 -20207390 -24581867 -27880055 -30026673 -31096689 -31300548 -30904000 -30119641 -29034385 -27618375
9465 -27618375 -25807213 -23604039 -21144306 -18696634 -16605939 -15203071 -14712622 -15189885
9457 -15189885 -16504673 -18370081 -20404237 -22213064 -23476808 -24012378 -23788546 -22897881 -21511334
9448 -21511334 -19835889 -18077425 -16406811 -14936050 -13712719 -12731708 -11957154 -11347553 -10874521
9439 -10874521 -10523226 -10272753 -10074175 -9850588 -9525492 -9059398 -8463951 -7778485 -7026454
9430g026454Q32792R33843R91119Q89428N34200p5285q21092j500864j898922
9421g141235j864176j366310n04802N36831J566955K448614L121030L584092L868447
9412D249446M009373M031007L941653L739527L424385L005782K500570J922885
9404C0824628J279112N75784j67716r18014j642670k325695k964195l544711m019573
9395A7096950m307713m327157m041693l491661k789575k086439j530457j233583
9387f711328j246934j545377k031213k565043l012602l282079l335531l179416
9379b6909523k849382k397938j884334j364685q84547m77555j69075K2872R6520
9370c6817647Q0118L3755K8087J10568K83242N05152P11568Q36735Q35873P04796
$$ plain form
9430 -7026454 -6193662 -5259819 -4268700 -3379272 -2845072 -2920357 -3741449 -5242313 -7141235
9421 -7141235 -9005411 -10371721 -10876523 -10339692 -8772737 -6324123 -3203093 380999 4249446
9412 4249446 8258819 12289826 16231479 19971006 23395391 26401173 28901743 30824628
9404 30824628 32103740 32679524 32511808 31593794 29951124 27625429 24661234 21116523 17096950
9395 17096950 12789237 8462080 4420387 928726 -1860849 -3947288 -5477745 -6711328
9387 -6711328 -7958262 -9503639 -11534852 -14099895 -17112497 -20394576 -23730107 -26909523
9379 -26909523 -29758905 -32156843 -34041177 -35405862 -36290409 -36767964 -36937039 -36914167 -36817647
9370 -36817647 -36737529 -36703774 -36675687 -36565119 -36281877 -35776725 -35065157 -34228422 -33392549 -32687753
9360c2687753M85881K46751L6950j47920l63581o72946j092283j569367k008785
9351c7773053k318638k437541k328079j961919j326911m53127N73154J626824
9343d6399290K579449L327910L807387L995898L914812L620908L187133K678663
9335a9287130K136001J573784R95252M11875j46718o39017j026327j284682j412516
9326a8679478j438135j422389j444702j571743j826253k175407k541389k823743
9318c3923239k924492k771817k335647j627020o82209M54628J735529L097668
9310c8976599M449022N665927O609835P159350P246146O882060O165972N261457
9302A0463170M345504L548659K922456K456201K124061J915882J825819J820897
$$ plain form
9360 -32687753 -32201872 -31955121 -31918171 -32066091 -32429672 -33102618 -34194901 -35764268 -37773053
9351 -37773053 -40091691 -42529232 -44857311 -46819230 -48146141 -48599268 -48026114 -46399290
9343 -46399290 -43819841 -40491931 -36684544 -32688646 -28773834 -25152926 -21965793 -19287130
9335 -19287130 -17151129 -15577345 -14582093 -14170218 -14316936 -14955953 -15982280 -17266962 -18679478
9326 -18679478 -20117613 -21540002 -22984704 -24556447 -26382700 -28558107 -31099496 -33923239
9318 -33923239 -36847731 -39619548 -41955195 -43582215 -44264424 -43809796 -42074267 -38976599
9310 -38976599 -34527577 -28861650 -22251815 -15092465 -7846319 -964259 5201713 10463170
9302 10463170 14808674 18357333 21279789 23735990 25860051 27775933 29601752 31422649
9294C1422649J830591J769754J571588J207338O91907Q1890n38546j087420j515020
9285C5434731j813200k004214k128547k240627k399979k648061k983063l353028
9277A5864012l671907l847318l808507l527643l027680k372848j646841r28493
9269f967225k70415L15668Q58889J409639K010384K674340L377997M060937M632083
9260A2102297M991702N069915M862040M437352L916881L434237L095867K951328
9252D4861619K980935L104678L209571L186392K963760K526037J906285J160948
9244F5900225L47158m82369j274306j977284k555194k996476l308635l505402
9236E0147717l600217l607685l542628l409925l192641k854866k368049j748466
$$ plain form
9294 31422649 33253240 35022994 36594582 37801920 38493827 38575717 38037171 36949751 35434731
9285 35434731 33621531 31617317 29488770 27248143 24848164 22200103 19217040 15864012
9277 15864012 12192105 8344787 4536280 1008637 -2019043 -4391891 -6038732 -6967225
9269 -6967225 -7237640 -6921972 -6063083 -4653444 -2643060 31280 3409277 7470214 12102297
9260 12102297 17093999 22163914 27025954 31463306 35380187 38814424 41910291 44861619
9252 44861619 47842554 50947232 54156803 57343195 60306955 62832992 64739277 65900225
9244 65900225 66247383 65765014 64490708 62513424 59958230 56961754 53653119 50147717
9236 50147717 46547500 42939815 39397187 35987262 32794621 29939755 27571706 25823240
9228B5823240j076600m76470o3241J06132M7512j74880m91887q66454j306458
9219B1520894j846482k507262l258474m012306m652830n078405n230445n101853
9211a0167163m733718m203540l600632k994822k419575j882549j389728r57587
9203c2349314o05458l42197j61498m6599K1097N3514N3324K4449q766O030J28653
9192c3226765L87872P57166J167799J548490J855401K064838K138694K003438
9184b1303067J574131Q11908k29780j405699k525243l417198l982644m215666
9176c4693258m187164m007239l792023l646139l648041l825987m138278m483815
9168f6421944m746471m846228m766444m547047m252813l934884l606219l245017
$$ plain form
9228 25823240 24746640 24270170 24206929 24313061 24360573 24185693 23693806 22827352 21520894
9219 21520894 19674412 17167150 13908676 9896370 5243540 165135 -5065310 -10167163
9211 -10167163 -14900881 -19104421 -22705053 -25699875 -28119450 -30001999 -31391727 -32349314
9203 -32349314 -32954772 -33296969 -33458467 -33505066 -33483969 -33430455 -33377131 -33352682 -33361448 -33355418 -33226765
9192 -33226765 -32838893 -32081727 -30913928 -29365438 -27510037 -25445199 -23306505 -21303067
9184 -21303067 -19728936 -18917028 -19146808 -20552507 -23077750 -26494948 -30477592 -34693258
9176 -34693258 -38880422 -42887661 -46679684 -50325823 -53973864 -57799851 -61938129 -66421944
9168 -66421944 -71168415 -76014643 -80781087 -85328134 -89580947 -93515831 -97122050 -100367067
9160a00367067k821526k326878j784430j239576p36482k94094J05584N08099R59283
9151a07997087J475141K024024K528145K885591L009577K871597K525721K096519
9143h8580772J732529J545562J562767J713661J859942J855552J609714J127552
9135g5573493N15515n0561l87790l76366k026O53611J464710K317392L138324
9126f8300684L891851M563290N145688N634433O024119O302075O440294O394000
9118b3904934O114020N570598M776284L793617K722617J676344P57949M4854m24593
9109A126756o64384p43917p68042q38091j016201j312183j692478k098580k466750
9100a0473870k746441k911576k957031k883639k687677k366711j934444j426162
$$ plain form
9160 -100367067 -103188593 -105515471 -107299901 -108539477 -109275959 -109570053 -109464469 -108956370 -107997087
9151 -107997087 -106521946 -104497922 -101969777 -99084186 -96074609 -93203012 -90677291 -88580772
9143 -88580772 -86848243 -85302681 -83739914 -82026253 -80166311 -78310759 -76701045 -75573493
9135 -75573493 -75057978 -75108539 -75496329 -75872695 -75874721 -75221110 -73756400 -71439008 -68300684
9126 -68300684 -64408833 -59845543 -54699855 -49065422 -43041303 -36739228 -30298934 -23904934
9118 -23904934 -17790914 -12220316 -7444032 -3650415 -927798 748546 1506495 1551349 1126756
9109 1126756 462372 -281545 -1049587 -1887678 -2903879 -4216062 -5908540 -8007120 -10473870
9100 -10473870 -13220311 -16131887 -19088918 -21972557 -24660234 -27026945 -28961389 -30387551
9092c0387551q87646l59816J26498N48901R00023J202986J512748J884047K322860
9083b3136950K765678L111882L285250L274253L123122K889587K607078K275944
9075A95844J880736J413985Q89421L40099j92902o73196j077625j398282j639809
9066b61729j817491j959686k109937k318914k622944l019750l459329l860789
9058b1430569m148335m283792m273464m148107l938594l668811l361119l032820
9050e2285611k679302k267066j755717j134660m41188K54673Q83151J402324J809378
9041e6214018K135180K424303K705655K965054L134629L110352K797724K167751
9033c4773370J291508L28370n28771j121525j374477j307541j012835o07824j85248
$$ plain form
9092 -30387551 -31275197 -31635013 -31508515 -30959614 -30059591 -28856605 -27343857 -25459810 -23136950
9083 -23136950 -20371272 -17259390 -13974140 -10699887 -7576765 -4687178 -2080100 195844
9075 195844 2076580 3490565 4379986 4720085 4527183 3853987 2776362 1378080 -261729
9066 -261729 -2079220 -4038906 -6148843 -8467757 -11090701 -14110451 -17569780 -21430569
9058 -21430569 -25578904 -29862696 -34136160 -38284267 -42222861 -45891672 -49252791 -52285611
9050 -52285611 -54964913 -57231979 -58987696 -60122356 -60563544 -60308871 -59425720 -58023396 -56214018
9041 -56214018 -54078838 -51654535 -48948880 -45983826 -42849197 -39738845 -36941121 -34773370
9033 -34773370 -33481862 -33153492 -33682263 -34803788 -36178265 -37485806 -38498641 -39106465 -39291713
9024c9291713K16332O07674J016295J448200J865998K193261K340017K235599
9016b7368337J856491J243144N01181k19885p71291j055834j056172q24416m43976
9007b8139095R695M88874R69241J430363J838112K145011K309955K320666K200619
8998a4426559J998934J775128J585937J471966J446160J495549J601177J760478
8990a291230J988748K295394K655845L003915L250821L317602L161897K786235
8982B1169227K226345J530322P45362q0033q87736j611125k188474k576921k759290
8973A5567677k750425k609234k443447k384237k529698k890934l382103l863876
8965g286277m209853m355414m310980m147026l964186l855969l872681m002628
$$ plain form
9024 -39291713 -39075381 -38467707 -37451412 -36003212 -34137214 -31943953 -29603936 -27368337
9016 -27368337 -25511846 -24268702 -23767521 -23987406 -24758697 -25814531 -26870703 -27695119 -28139095
9007 -28139095 -28129400 -27640526 -26671285 -25240922 -23402810 -21257799 -18947844 -16627178 -14426559
8998 -14426559 -12427625 -10652497 -9066560 -7594594 -6148434 -4652885 -3051708 -1291230
8990 -1291230 697518 2992912 5648757 8652672 11903493 15221095 18382992 21169227
8982 21169227 23395572 24925894 25671256 25591223 24703487 23092362 20903888 18326967 15567677
8973 15567677 12817252 10208018 7764571 5380334 2850636 -40298 -3422401 -7286277
8965 -7286277 -11496130 -15851544 -20162524 -24309550 -28273736 -32129705 -36002386 -40005014
8957d0005014m183526m337614m406494m364588m208560l936135l532002k972968
8949g1946901k250888j393796m60217M96479J462799K461197L505241M554519
8941f3571567N512695O271301O760824O968527O915774O621202O082001N284867
8933a3154376M233007K967384J570989J58616j142913k223310l022064l550062
8925a4162729l880882m111881m319362m533697m737986m876894m870874m644878
8917e0139183m169644l486883k688692j860352j032451j79095P44272J757794
8909f1054234K833959L896904M837505N537944N898161N855359N393026M542680
8901b2258696L382605K035219O61286n55988j445783j899452j909593j569319
$$ plain form
8957 -40005014 -44188540 -48526154 -52932648 -57297236 -61505796 -65441931 -68973933 -71946901
8949 -71946901 -74197789 -75591585 -76051802 -75555323 -74092524 -71631327 -68126086 -63571567
8941 -63571567 -58058872 -51787571 -45026747 -38058220 -31142446 -24521244 -18439243 -13154376
8933 -13154376 -8921369 -5953985 -4382996 -4224380 -5367293 -7590603 -10612667 -14162729
8925 -14162729 -18043611 -22155492 -26474854 -31008551 -35746537 -40623431 -45494305 -50139183
8917 -50139183 -54308827 -57795710 -60484402 -62344754 -63377205 -63556300 -62812028 -61054234
8909 -61054234 -58220275 -54323371 -49485866 -43947922 -38049761 -32194402 -26801376 -22258696
8901 -22258696 -18876091 -16840872 -16179586 -16735574 -18181357 -20080809 -21990402 -23559721
8893b3559721j030081m47480N5967M07749N93075O52892O60232O75184P03567
8884b1288616O90372N55719K48435k20439p83836j352265j846100k209240k408661
8875b8614631k431574k282611j976819j529475r50696k50532N46937J386636K171827
8866c3930938K771264L050577K919410K373064J509393N13007l92086j012685
8858b2198994j256011j162067q73078n53132l06577j41245J4333K64586O99724
8849b5512461J358588K202417L107863L894592M389290M499672M255855L792238
8841A988054L280846K856115K570697K396782K260331K082925J810108J419711
8833B0665569R18005L35848k71260q25442j238254j432628j370886j081840o72061
$$ plain form
8893 -23559721 -24589802 -25037282 -24981315 -24573566 -23980491 -23327599 -22667367 -21992183 -21288616
8884 -21288616 -20598244 -20042525 -19794090 -20014529 -20798365 -22150630 -23996730 -26205970 -28614631
8875 -28614631 -31046205 -33328816 -35305635 -36835110 -37785806 -38036338 -37489401 -36102765 -33930938
8866 -33930938 -31159674 -28109097 -25189687 -22816623 -21307230 -20794223 -21186309 -22198994
8858 -22198994 -23455005 -24617072 -25490150 -26043282 -26349859 -26491104 -26476771 -26212185 -25512461
8849 -25512461 -24153873 -21951456 -18843593 -14949001 -10559711 -6060039 -1804184 1988054
8841 1988054 5268900 8125015 10695712 13092494 15352825 17435750 19245858 20665569
8833 20665569 21583574 21919422 21648162 20822720 19584466 18151838 16780952 15699112 15027051
8824A5027051l01820j23758k16515n58738j058078j605128k112119k523802k813624
8815C713469k976926l021514k955276k776332k471022k021567j423240p05020
8807a4637428O1918P80779J363291J757845J957049J991000J918075J813988J754332
8798a239151J792630J941383K160062K351698K374720K078090J355536J96667
8790A3011635j293367k919211m452795n692442o498503o801804o596570n928314
8782b7171371m880750l564983k112692o67450O33899J685892K431087K863485
8774c0782883L027531L016148K955303K966454L121911L418865L781747M084816
8766d410108M186772L972322L388618K461213J287463J8150j167419k097395k651255
$$ plain form
8824 15027051 14725231 14601473 14384958 13826220 12768142 11163014 9050895 6527093 3713469
8815 3713469 736543 -2284971 -5240247 -8016579 -10487601 -12509168 -13932408 -14637428
8807 -14637428 -14575510 -13794731 -12431440 -10673595 -8716546 -6725546 -4807471 -2993483 -1239151
8798 -1239151 553479 2494862 4654924 7006622 9381342 11459432 12814968 13011635
8790 13011635 11718268 8799057 4346262 -1346180 -7844683 -14646487 -21243057 -27171371
8782 -27171371 -32052121 -35617104 -37729796 -38397246 -37763347 -36077455 -33646368 -30782883
8774 -30782883 -27755352 -24739204 -21783901 -18817447 -15695536 -12276671 -8494924 -4410108
8766 -4410108 -223336 3748986 7137604 9598817 10886280 10904430 9737011 7639616 4988361
8757D988361k792979k576873k127112j602407j154532q88558q38203r67978j200030
8748i160311j450532j657900j791334j839568j793038j636591j356511r49252
8740b1635037m22099K07399R03178J600868K214534K663660K902698K934483K805191
8731e825125K589463K371467K223294K184162K248458K370692K489368K559876
8723A3211655K574716K551808K495376K361910K065292J522953P08232l30366
8715B7161576j491390k659385l731705m625919n278739n645408n698027n420915
8707g389912m808302l869960k641628j193071L69383J907813L271991M335904
8699a0017782N034716N372615N390558N120519M567876L736411K669085J464561
$$ plain form
8757 4988361 2195382 -381491 -2508603 -4111010 -5265542 -6154100 -6992303 -7960281 -9160311
8748 -9160311 -10610843 -12268743 -14060077 -15899645 -17692683 -19329274 -20685785 -21635037
8740 -21635037 -22057136 -21849737 -20946559 -19345691 -17131157 -14467497 -11564799 -8630316 -5825125
8731 -5825125 -3235662 -864195 1359099 3543261 5791719 8162411 10651779 13211655
8723 13211655 15786371 18338179 20833555 23195465 25260757 26783710 27491942 27161576
8715 27161576 25670186 23010801 19279096 14653177 9374438 3729030 -1968997 -7389912
8707 -7389912 -12198214 -16068174 -18709802 -19902873 -19533490 -17625677 -14353686 -10017782
8699 -10017782 -4983066 389549 5780107 10900626 15468502 19204913 21873998 23338559
8691B3338559K54626q37478j725799k362347k719835k777693k524744j976926
8683H668363j197751l05734N43275J197326J552755J574076J279194P08400r3435
8674A3926469j070185k138257l182914m075111m699888m982583m903836m500511
8666a5626816l853674l068584k254517j510680r18133n33084l80534m54919p32500
8657b9333441j185880j782344k463034l127073l648719l924661l915721l651122
8649e3031995l198514k628351j993751j325569o34940P7654Q05095J515388K147831
8640e8267152K633343K930841L055161L071656L053390L026499K943127K704269
8632c4848866K219379J465252N10102n08387j437477k166379k653356k908208
$$ plain form
8691 23338559 23593185 22755707 21029908 18667561 15947726 13170033 10645289 8668363
8683 8668363 7470612 7164878 7708153 8905479 10458234 12032310 13311504 14019904 13926469
8674 13926469 12856284 10718027 7535113 3460002 -1239886 -6222469 -11126305 -15626816
8666 -15626816 -19480490 -22549074 -24803591 -26314271 -27232404 -27765488 -28146022 -28600941 -29333441
8657 -29333441 -30519321 -32301665 -34764699 -37891772 -41540491 -45465152 -49380873 -53031995
8649 -53031995 -56230509 -58858860 -60852611 -62178180 -62813120 -62735466 -61930371 -60414983 -58267152
8640 -58267152 -55633809 -52702968 -49647807 -46576151 -43522761 -40496262 -37553135 -34848866
8632 -34848866 -32629487 -31164235 -30654133 -31162520 -32599997 -34766376 -37419732 -40327940
8624d0327940k948409k769109k353396j709705q99082k9945P70760J389788J754565
8615d7122473J853497J740474J511841J262873J052014Q96281P91919P32513P04508
8606c6576553O67811N48002K59256k49941r57931j764438k521740l085096l361242
8597d7041872l338337l083998k707015k300703j903831j503323j068044n81998
8589f3529121n7622M66675R35172J289692J492210J545569J496386J414788J363457
8580e3582794J376283J458282J600181J788177J994480K156855K175191J946935
8572c9086410J429998O90048j08345p67662j138937j170347r05411m47810Q2540
8563d1422336N88713J022282J381552J677330J887544J938963J736815J224810
$$ plain form
8624 -40327940 -43276349 -46045458 -48398854 -50108559 -51007641 -51037586 -50266826 -48877038 -47122473
8615 -47122473 -45268976 -43528502 -42016661 -40753788 -39701774 -38805493 -38013574 -37281061 -36576553
8606 -36576553 -35908742 -35360740 -35101484 -35351425 -36309356 -38073794 -40595534 -43680630 -47041872
8597 -47041872 -50380209 -53464207 -56171222 -58471925 -60375756 -61879079 -62947123 -63529121
8589 -63529121 -63586743 -63120068 -62184896 -60895204 -59402994 -57857425 -56361039 -54946251 -53582794
8580 -53582794 -52206511 -50748229 -49148048 -47359871 -45365391 -43208536 -41033345 -39086410
8572 -39086410 -37656412 -36966364 -37074709 -37842371 -38981308 -40151655 -41057066 -41504876 -41422336
8563 -41422336 -40833623 -39811341 -38429789 -36752459 -34864915 -32925952 -31189137 -29964327
8555b9964327M34107n11809j439285k187329k655492k817720k709906k408876
8547d4260637k007905j583748j162912p12167j68339N09819J302930K126595K857482
8538d3098882L373953L594849L501522L134858K574373J917264J267913P30681
8530b3003469L92834K97513M23442O90325R91981J237436J373849J382709J265349
8521a4948031J038723P42747M42539K15295J31418K43606N81357J138074J851914
8512h562358K602278L240309L642868L757250L612460L299015K932621K612457
8504A7136900K382227K210966K011061J687720J187535N17088k66953j074304
8496B5792240j793349k309441k538590k464900k156978j749171j395707j219044
$$ plain form
8555 -29964327 -29530220 -30042029 -31481314 -33668643 -36324135 -39141855 -41851761 -44260637
8547 -44260637 -46268542 -47852290 -49015202 -49727369 -49895708 -49385889 -48082959 -45956364 -43098882
8538 -43098882 -39724929 -36130080 -32628558 -29493700 -26919327 -25002063 -23734150 -23003469
8530 -23003469 -22610635 -22313122 -21889680 -21199355 -20207374 -18969938 -17596089 -16213380 -14948031
8521 -14948031 -13909308 -13166561 -12724022 -12508727 -12377309 -12133703 -11552346 -10414272 -8562358
8512 -8562358 -5960080 -2719771 923097 4680347 8292807 11591822 14524443 17136900
8504 17136900 19519127 21730093 23741154 25428874 26616409 27133497 26866544 25792240
8496 25792240 23998891 21689450 19150860 16685960 14528982 12779811 11384104 10165060
8488A0165060j271740j521688j863427k154012k264729k128656j760029j235413
8480d034634o51601q8059M07803Q13326J112061J275286J255300J001389M97005
8471A587876k04398r75851j656338k109347k261490k103346j669252j023560k59030
8462a0674736N09975J171241J643636J891831J923836J782430J534815J254049
8454A037077R92946P67914N69623L94349K69144K47692L78597O71006J083988
8445F412336J545163J980088K330124K553819K622508K517578K226388J735995
8437B3923999J034581J28239r36726k065973l131888l999866m551270m699227
8429E701869m402103l675789k598412j300971N4818J304031K305716K968605L271903
$$ plain form
8488 10165060 8893320 7371632 5508205 3354193 1089464 -1039192 -2799221 -4034634
8480 -4034634 -4686235 -4774294 -4366491 -3553165 -2441104 -1165818 89482 1090871 1587876
8471 1587876 1383478 407627 -1248711 -3358058 -5619548 -7722894 -9392146 -10415706 -10674736
8462 -10674736 -10164761 -8993520 -7349884 -5458053 -3534217 -1751787 -216972 1037077
8454 1037077 2030023 2797937 3367560 3761909 4031053 4278745 4657342 5328348 6412336
8445 6412336 7957499 9937587 12267711 14821530 17444038 19961616 22188004 23923999
8437 23923999 24958580 25086819 24150093 22084120 18952232 14952366 10401096 5701869
8429 5701869 1299766 -2376023 -4974435 -6275406 -6220588 -4916557 -2610841 357764 3629667
8420C629667L269477L066589K774843K468908K166355J832771J401304Q00015
8412B1409929j3461j018366k119047l171030m037273m644812n010189n219762
8404c824011n374820n529073n650956n632171n340258m687996l682975k434405
8396d2156665j120242O6007R71251J529826J785393J868039J926212K049288K231532
8387c0849359K398390K467662K397744K196697J901159J551507J182847Q31819
8379a5921534N42122L51080K59795K12627J11033j40882n87300j195255j860843
8370a8229157k441196k801701k861443k614697k117506j453424p05430N2845P56210
8361c2415499J352072J810785K131747K337899K461725K530770K557552K534824
$$ plain form
8420 3629667 6899144 9965733 12740576 15209484 17375839 19208610 20609914 21409929
8412 21409929 21396468 20378102 18259055 15088025 11050752 6405940 1395751 -3824011
8404 -3824011 -9198831 -14727904 -20378860 -26011031 -31351289 -36039285 -39722260 -42156665
8396 -42156665 -43276907 -43210900 -42239649 -40709823 -38924430 -37056391 -35130179 -33080891 -30849359
8387 -30849359 -28450969 -25983307 -23585563 -21388866 -19487707 -17936200 -16753353 -15921534
8379 -15921534 -15379412 -15028332 -14768537 -14555910 -14444877 -14585759 -15173059 -16368314 -18229157
8370 -18229157 -20670353 -23472054 -26333497 -28948194 -31065700 -32519124 -33224554 -33171709 -32415499
8361 -32415499 -31063427 -29252642 -27120895 -24782996 -22321271 -19790501 -17232949 -14698125
8353a4698125K437946K238733J930339J549751J177260R05656P97153Q56449J032359
8344a772479J238713J380948J383342J213542Q94687M97340J16474j53881k42092
8335D556594j17123K00299O43004J122030J558256J902138K131624K234526K192596
8326A6423944J982437J594582J056590M42010j43194n91152q25841q26154o30687
8317A8482535l26733l2168J25776L9013l45636r99379j814732k643836l352603
8308I132237l863281m167527m307577m338419m294587m180035l978626l668331
8300b3666146l230990k663636j991417j267261n50944J13973P02377J193265J562826
8291b9797953J792687J876668J815264J611185J280142Q65588M33709M5972k66449
$$ plain form
8353 -14698125 -12260179 -10021446 -8091107 -6541356 -5364096 -4458440 -3661287 -2804838 -1772479
8344 -1772479 -533766 847182 2230524 3444066 4338753 4836093 4952567 4798686 4556594
8335 4556594 4439471 4639770 5282774 6404804 7963060 9865198 11996822 14231348 16423944
8326 16423944 18406381 20000963 21057553 21499563 21356369 20765217 19939376 19113222 18482535
8317 18482535 18155802 18123634 18249410 18288423 17942787 16943408 15128676 12484840 9132237
8308 9132237 5268956 1101429 -3206148 -7544567 -11839154 -16019189 -19997815 -23666146
8300 -23666146 -26897136 -29560772 -31552189 -32819450 -33370394 -33256421 -32554044 -31360779 -29797953
8291 -29797953 -28005266 -26128598 -24313334 -22702149 -21422007 -20556419 -20122710 -20076738 -20343187
8282b0343187n03289o73378p72639p79952o70211m30763p0674L75778Q46412J254523
8272b1767380J510597J560476J414022J136265Q03549M59387J03477k84998p15781
8263a5780386j171702j612077j985042k240153k339121k263646k018163j629165
8255c1039455j147794o57221k72429j16041k72421p46180j451737k236790k923287
8246d0863355l352251l425483l129863k525079j697824p17657L72173J534936
8238e3804403K724058L882898M942226N804746O340952O425772O004389N139103
8230a2540259M001969K820762J810028J112525P64942O99191P83698Q89165R46128
8221A288149R65048J012240J159522J438289J822378K242591K614830K861960
$$ plain form
8282 -20343187 -20846476 -21519854 -22292493 -23072445 -23742656 -24173419 -24244093 -23868315 -23021903 -21767380
8272 -21767380 -20256783 -18696307 -17282285 -16146020 -15342471 -14883084 -14779607 -15064605 -15780386
8263 -15780386 -16952088 -18564165 -20549207 -22789360 -25128481 -27392127 -29410290 -31039455
8255 -31039455 -32187249 -32844470 -33116899 -33232940 -33505361 -34251541 -35703278 -37940068 -40863355
8246 -40863355 -44215606 -47641089 -50770952 -53296031 -54993855 -55711512 -55339339 -53804403
8238 -53804403 -51080345 -47197447 -42255221 -36450475 -30109523 -23683751 -17679362 -12540259
8230 -12540259 -8538290 -5717528 -3907500 -2794975 -2030033 -1330842 -547144 342021 1288149
8221 1288149 2253197 3265437 4424959 5863248 7685626 9928217 12543047 15405007
8213A5405007K925442K775355K422091J920762J358158Q23568L75873K3358k69865
8204B7759749n49131q25944j059245j178153j126547q91824n01865q360N20129
8195B2138809R96134J320291J404534J199227P09375l686q32228j642954k307221
8186B2982281k732412k882258k778299k482744k069635j595956j084976n28137
8178F827864R7692Q06677J583571K374391L093124L642298L937676L927166L600885
8169B9891344K994378K186117J288544M32418k54661o73437p75910n76706j47609
8160C4364478M01072R44212J364824J571877J508731J153429N20079l33407j301703
8151D0193592k249092l047724l616740l939547m051408m006470l844733l582111
$$ plain form
8213 15405007 18330449 21105804 23527895 25448657 26806815 27630383 28006256 28029614 27759749
8204 27759749 27210618 26384674 25325429 24147276 23020729 22128905 21627040 21618680 22138809
8195 22138809 23134943 24455234 25859768 27058995 27768370 27764684 26932456 25289502 22982281
8186 22982281 20249869 17367611 14589312 12106568 10036933 8440977 7356001 6827864
8178 6827864 6925556 7732233 9315804 11690195 14783319 18425617 22363293 26290459 29891344
8169 29891344 32885722 35071839 36360383 36792801 36538140 35864703 35088793 34512087 34364478
8160 34364478 34765550 35709762 37074586 38646463 40155194 41308623 41828702 41495295 40193592
8151 40193592 37944500 34896776 31280036 27340489 23289081 19282611 15437878 11855767
8143A1855767l231478k832772k456229k168569j992418j895896j814699j679666
8135f215960j432376j038577n11143P1439N80615Q95151R67141Q46296O41604
8126e195810M51420L18659K41979K22577K98118N31813R64736J568096K231353
8117A632941K796693L120258L127340K838882K364353J864665J492305J327631
8109B0565068J343149J419129J402888J176886P00641J2369p99747j632154k384334
8100B1803895k960259l274069l276623k989181k510084j977729j510615j163501
8092B141834r23623p39745n56071l27467j8353L91148Q79469J360305J697057
8083C904554J759334J484764R05860J33615o82582j395884j889738k088601j960090
$$ plain form
8143 11855767 8624289 5791517 3335288 1166719 -825699 -2721595 -4536294 -6215960
8135 -6215960 -7648336 -8686913 -9198056 -9126617 -8546002 -7650851 -6683710 -5837414 -5195810
8126 -5195810 -4744390 -4425731 -4183752 -3961175 -3663057 -3131244 -2166508 -598412 1632941
8117 1632941 4429634 7549892 10677232 13516114 15880467 17745132 19237437 20565068
8109 20565068 21908217 23327346 24730234 25907120 26607761 26620130 25820383 24188229 21803895
8100 21803895 18843636 15569567 12292944 9303763 6793679 4815950 3305335 2141834
8092 2141834 1218211 478466 -77605 -405072 -423425 -32277 847192 2207497 3904554
8083 3904554 5663888 7148652 8054512 8188127 7505545 6109661 4219923 2131322 171232
8074A71232j522783q59227j11925N55089J013323J208263J160356R43133O60476
8065C217937M25609L31333M12542O21049Q34780R04568P18348K51683m19098j146952
8055F151799j773869k192095k374479k357107k189713j893312j454748q53879
8047h937403r6623P66538J640865K405738K949579L209606L194327K974639K652120
8038A0759386K326782K080562J977273K067893K387341K937358L666883M470792
$$ plain form
8074 171232 -1351551 -2210778 -2322703 -1767614 -754291 453972 1614328 2557461 3217937
8065 3217937 3643546 3974879 4387421 5008470 5843250 6747818 7466166 7717849 7298751 6151799
8055 6151799 4377930 2185835 -188644 -2545751 -4735464 -6628776 -8083524 -8937403
8047 -8937403 -9034026 -8267488 -6626623 -4220885 -1271306 1938300 5132627 8107266 10759386
8038 10759386 13086168 15166730 17144003 19211896 21599237 24536595 28203478 32674270
$$ [...]
##END NTUPLES=NMR SPECTRUM
##END=
