##TITLE=31Pdec_DE_43H_D2O
 D2O, 64 sc
 6.8.2024
##JCAMPDX= 6.0         $$ Bruker NMR JCAMP-DX V2.0
##DATA TYPE= NMR SPECTRUM
##DATA CLASS= NTUPLES
##ORIGIN= UXNMR, Bruker Analytische Messtechnik GmbH
##OWNER= root
$$ XWIN-NMR		Version 3.5
$$ Tue Aug  6 14:42:17 2024 Russian Standard Time (UT+4h)  she@DPX200
##.OBSERVE FREQUENCY= 81.013821
##.OBSERVE NUCLEUS= ^31P
##.ACQUISITION MODE= SIMULTANEOUS
##.ACQUISITION SCHEME= undefined
##.AVERAGES= 64
##.DIGITISER RES= 17
##SPECTROMETER/DATA SYSTEM= spect
##.PULSE SEQUENCE= zgpg30
##.SOLVENT NAME= D2O
##.SHIFT REFERENCE= (INTERNAL, D2O, 0, 198.062)
##AUDIT TRAIL= $$ (NUMBER, WHEN, WHO, WHERE, WHAT)
$$ ##TITLE= Audit trail, XWIN-NMR		Version 3.5
$$ ##JCAMPDX= 5.01
$$ ##ORIGIN= Bruker BioSpin GmbH
$$ ##OWNER= she
$$ F:/spectra/data/she/nmr/P31/2/pdata/1/auditp.txt
$$ ##AUDIT TRAIL=  $$ (NUMBER, WHEN, WHO, WHERE, WHAT)
(   1,<2024-08-06 14:41:23.15 +0400>,<she>,<DPX200>,
      <created by zg, POWCHK disabled, PULCHK disabled
       configuration hash MD5:
       00 E9 B6 7A A2 85 ED C7 34 08 36 98 17 FE 4E 26
       data hash MD5: 32K
       C8 3F 8D D5 F0 4C 4B C3 7E 85 28 C1 4A 5A 49 F0>)
(   2,<2024-08-06 14:41:25.48 +0400>,<she>,<DPX200>,
      <Start of raw data processing
       efp BC_mod = 2 LB = 1.5 FT_mod = 6 PKNL = 1 PHC0 = 2628.369 PHC1 = 185.2869 SI = 64K 
       data hash MD5: 64K
       36 FD 9C A6 16 22 D0 8E DF 38 88 B7 4F D1 75 B1>)
(   3,<2024-08-06 14:41:40.92 +0400>,<she>,<DPX200>,
      <pk PHC0 = -6.280251 PHC1 = 0 
       data hash MD5: 64K
       65 C4 5B 85 F1 E2 C8 91 ED 53 25 7B 56 1B F0 7A>)
(   4,<2024-08-06 14:41:45.78 +0400>,<she>,<DPX200>,
      <abs ABSG = 5 
       data hash MD5: 64K
       86 0D AF 03 78 49 E9 E9 76 69 C1 F9 36 A7 40 5B>)
$$ ##END=
$$ 
$$ hash MD5
$$ D8 FC AF 03 94 92 2D 04 7F 7B BC C8 C7 1E 00 9F
##$RELAX= 
##$RELAX= 
##$RELAX= 
##$RELAX= 
##$RELAX= 
##$RELAX= 
##$RELAX= 
##$RELAX= 
$$ Bruker specific parameters
$$ --------------------------
##$DU= <F:/spectra>
##$EXPNO= 2
##$NAME= <P31>
##$PROCNO= 1
##$TYPE= <nmr>
##$USER= <she>
##$AMP= (0..31)
100 100 100 100 100 100 100 100 100 100 100 100 100 100 100 100 100 100 
100 100 100 100 100 100 100 100 100 100 100 100 100 100 
##$AQSEQ= 0
##$AQ_mod= 1
##$AUNM= <au_zg>
##$AUTOPOS= <>
##$BF1= 81.014009
##$BF2= 200.13
##$BF3= 200.13
##$BF4= 200.13
##$BF5= 200.13
##$BF6= 200.13
##$BF7= 200.13
##$BF8= 200.13
##$BYTORDA= 1
##$CFDGTYP= 0
##$CFRGTYP= 5
##$CHEMSTR= <none>
##$CNST= (0..31)
1 1 145 1 1 1 1 1 1 1 1 1 1 1 1 1 1 1 1 1 1 1 1 1 1 1 1 1 1 1 1 1 
##$CPDPRG= <waltz16>
##$CPDPRG1= <>
##$CPDPRG2= <waltz16>
##$CPDPRG3= <>
##$CPDPRG4= <mlev>
##$CPDPRG5= <mlev>
##$CPDPRG6= <mlev>
##$CPDPRG7= <mlev>
##$CPDPRG8= <mlev>
##$CPDPRGB= <>
##$CPDPRGT= <>
##$D= (0..31)
0 1 0 0 0 0 0 0 0 0.06 0 0.03 2e-05 3e-06 0 0 0.0002 0 0 0 0 0 0 0 0 0 
0 0 0 0 0 0 
##$DATE= 1722940882
##$DBL= (0..7)
120 120 120 11 120 120 24 19 
##$DBP= (0..7)
150 150 150 150 150 150 150 150 
##$DBP07= 0
##$DBPNAM0= <>
##$DBPNAM1= <>
##$DBPNAM2= <>
$$ [...]
##$SUBNAM3= <"">
##$SUBNAM4= <"">
##$SUBNAM5= <"">
##$SUBNAM6= <"">
##$SUBNAM7= <"">
##$SUBNAM8= <"">
##$SUBNAM9= <"">
##$SW= 400.765351723535
##$SWIBOX= (0..15)
0 1 3 0 0 0 0 0 0 0 0 0 0 0 0 0 
##$SW_h= 32467.5324675325
##$TD= 32768
##$TD0= 1
##$TE= 0
##$TE2= 300
##$TE3= 300
##$TEG= 300
##$TL= (0..7)
0 120 53 12 22 120 120 120 
##$TP= (0..7)
150 150 150 150 150 150 150 150 
##$TP07= 0
##$TPNAME0= <>
##$TPNAME1= <>
##$TPNAME2= <>
##$TPNAME3= <>
##$TPNAME4= <>
##$TPNAME5= <>
##$TPNAME6= <>
##$TPNAME7= <>
##$TPOAL= (0..7)
0.5 0.5 0.5 0.5 0.5 0.5 0.5 0.5 
##$TPOFFS= (0..7)
0 0 0 0 0 0 0 0 
##$TUNHIN= 0
##$TUNHOUT= 0
##$TUNXOUT= 0
##$USERA1= <user>
##$USERA2= <user>
##$USERA3= <user>
##$USERA4= <user>
##$USERA5= <user>
##$V9= 5
##$VALIST= <valist>
##$VCLIST= <CCCCCCCCCCCCCCC>
##$VD= 0
##$VDLIST= <DDDDDDDDDDDDDDD>
##$VPLIST= <PPPPPPPPPPPPPPP>
##$VTLIST= <TTTTTTTTTTTTTTT>
##$WBST= 1024
##$WBSW= 4
##$XGAIN= (0..3)
0 0 0 0 
##$XL= 0
##$YL= 0
##$YMAX_a= 3598
##$YMIN_a= -7396
##$ZGOPTNS= <>
##$ZL1= 120
##$ZL2= 120
##$ZL3= 120
##$ZL4= 120
##$ABSF1= 198.0616
##$ABSF2= -202.7028
##$ABSG= 5
##$ABSL= 3
##$ALPHA= 0
##$AQORDER= 0
##$ASSFAC= 0
##$ASSFACI= 0
##$ASSFACX= 0
##$ASSWID= 0
##$AUNMP= <proc_1d>
##$AZFE= 0.1
##$AZFW= 0.5
##$BCFW= 0
##$BC_mod= 2
##$BYTORDP= 0
##$COROFFS= 0
##$CY= -3
##$DATMOD= 1
##$DC= 0
##$DFILT= <>
##$DTYPP= 0
##$F1P= 0
##$F2P= 0
##$FCOR= 1
##$FTSIZE= 65536
##$FT_mod= 6
##$GAMMA= 0
##$GB= 0
##$INTBC= 1
##$INTSCL= 9.790993e-09
##$ISEN= 30
##$LB= 1.5
##$LEV0= 0
##$LPBIN= 0
##$MAXI= 10000
##$MC2= 0
##$MEAN= 0
##$ME_mod= 0
##$MI= 50
##$NCOEF= 0
##$NC_proc= -10
##$NLEV= 6
##$NOISF1= 182.463
##$NOISF2= 159.3651
##$NSP= 0
##$NTH_PI= 0
##$NZP= 0
##$OFFSET= 198.0616
##$PC= 4
##$PHC0= 2622.089
##$PHC1= 185.2869
##$PH_mod= 1
##$PKNL= yes
##$PPARMOD= 0
##$PSCAL= 0
##$PSIGN= 0
##$REVERSE= no
##$SF= 81.0140089999434
##$SI= 65536
##$SIGF1= 159.3651
##$SIGF2= -187.1042
##$SINO= 113.3802
##$SIOLD= 16384
##$SREGLST= <1H.CDCl3>
##$SSB= 0
##$STSI= 65536
##$STSR= 0
##$SW_p= 32467.5324675325
##$SYMM= 0
##$S_DEV= 0
##$TDeff= 32768
##$TDoff= 0
##$TI= <>
##$TILT= no
##$TM1= 0
##$TM2= 0
##$TOPLEV= 0
##$USERP1= <user>
##$USERP2= <user>
##$USERP3= <user>
##$USERP4= <user>
##$USERP5= <user>
##$WDW= 1
##$XDIM= 65536
##$YMAX_p= 480907070
##$YMIN_p= -130601202
$$ End of Bruker specific parameters
$$ ---------------------------------
##NTUPLES= NMR SPECTRUM
##VAR_NAME=  FREQUENCY,     SPECTRUM/REAL,   SPECTRUM/IMAG
##SYMBOL=    X,             R,               I
##VAR_TYPE=  INDEPENDENT,   DEPENDENT,       DEPENDENT
##VAR_FORM=  AFFN,          ASDF,            ASDF
##VAR_DIM=   65536,         65536,           65536
##UNITS=     HZ,            ARBITRARY UNITS, ARBITRARY UNITS
##FACTOR=    0.49542278885378, 1,            1
##FIRST=     16045.7642231865, 0,            0
##LAST=      -16421.768244346, 0,            0
##MIN=       -16421.768244346, -130601202,   0
##MAX=       16045.7642231865, 480907070,    0
$$ Real data points
##PAGE= N=1
##DATA TABLE= (X++(R..R)), XYDATA
$$ [...]
42059A6353722Q504835J233549r072311j2779072o878775K804409P763029N183694
42051A3113080K45891p68544J227589m5189n764672q691280l976120J918515J17500
42042b623230o117800n139609N007955J2463693Q329225j932916q376824q662845
42034g052351m434419M746172J5349252J6580590M143011r323196r250748R21456
42026A1679767P113893O320127O178556O973834J613359p045846p293098J84326
42018B5724918L34287j1224116j8861996j1477906p7608R12820m036329j883751
42010b0589681P019196J2079126J0328829P165256M152000j138672o385093o876684
42002E754277m242825l365364l320880j59650M259952M685522J024443k896079
$$ plain form
42059 16353722 24858557 26092106 17019795 4240723 -2638052 166357 7929386 13113080
42051 13113080 13358971 12590427 13818016 13772827 8008155 -683125 -4659245 -2740730 -2623230
42042 -2623230 -8741030 -13880639 -8872684 3591009 11920234 9987318 1610494 -7052351
42034 -7052351 -11486770 -6740598 8608654 25189244 29332255 20009059 10758311 11679767
42026 11679767 18793660 25113787 31292343 38266177 39879536 32833690 25540592 25724918
42018 25724918 26059205 14835089 -4026907 -15504813 -15582421 -14669601 -18705930 -20589681
42010 -20589681 -13570485 -1491359 8837470 16002726 20154726 19016054 12630961 5754277
42002 5754277 1511452 -1853912 -5174792 -5334442 -1074490 3611032 4635475 1739396
41994A739396n727989p049750m249250J757337L466872k217722o203262j30226
41986a8614594R091417Q891246q0899o806422p300032o242349m348175K255032
41978b3154776J1034037J4177044J0868261P272124M719285q89471q323156j1080044
41970D623304q347925n144948j906668M887840J2196870J2547372O943298L600373
41962B9399516L419078m48484p391719p550246J320261Q039319M095694n104099
41954B5779320r872181q047976l403317l08715k081120o898624n973233M558394
41946f247452J2639348N040081q860649o211350J4484719K7684100J6565206m750510
41938E0343493j4874659j3249948j1153340r969562n069495q56669m912242j2721213
$$ plain form
41994 1739396 -3988593 -11038343 -15287593 -13530256 -10063384 -12281106 -18484368 -18614594
41986 -18614594 -9523177 -631931 -712830 -7519252 -14819284 -21061633 -25409808 -23154776
41978 -23154776 -12120739 2056305 12924566 20196690 24915975 24026504 15703348 4623304
41970 4623304 -3724621 -8869569 -10776237 -5888397 6308473 18855845 25799143 29399516
41962 29399516 32818594 32370110 24978391 17428145 18748406 26787725 30883419 25779320
41954 25779320 15907139 7859163 4455846 4147131 2066011 -4832613 -10805846 -6247452
41946 -6247452 6391896 11431977 2571328 -3640022 10844697 38528797 55094003 50343493
41938 50343493 35468834 22218886 11065546 1095984 -3973511 -4830180 -9742422 -22463635
41930b2463635j2747040l712328M770105O620146M899558M464673O052215O806002
41922e310304L333897l397262o281140j172472L965760n30404q187070m365548
41914b1944543P566239Q208133m880503r627829L924349J3753813J025283j6837160
41906a8812218j2934857O244221J3362800M479524J40198O988571Q772634k483581
41898E757292j3488231j3689440r560112q092343n728300n86719K087626L026609
41890d0273618J0196416K0754594J9809285N156306m812977J574400J1022668
41883B3427074P399635k992705m209860K852720M490191k242980p564616p840687
41875A3318772j0023736j6024235j6946487p795901K782081M448371j31968o30710
$$ plain form
41930 -22463635 -35210675 -38923003 -34152898 -27532752 -22633194 -18168521 -12116306 -5310304
41922 -5310304 -1976407 -5373669 -11654809 -12827281 -8861521 -9391925 -17578995 -21944543
41914 -21944543 -14378304 -6170171 -11050674 -20678503 -16754154 -3000341 -1975058 -18812218
41906 -18812218 -31747075 -25502854 -12140054 -7660530 -7520332 -531761 8240873 5757292
41898 5757292 -7730939 -21420379 -30980491 -39072834 -44801134 -45387853 -43300227 -40273618
41890 -40273618 -30077202 -9322608 10486677 15642983 10830006 12404406 23427074
41883 23427074 30826709 27834004 23624144 26476864 30967055 28724075 21159459 13318772
41875 13318772 3295036 -12729199 -29675686 -37471587 -34689506 -30241135 -30373103 -31003813
41867c1003813M398783N521377j865461q609846m847469M170072N379659j361957
41859b8218655k645238O135113J1806721M382116o006686n258707K125302K065847
41851a5614187m856577o044411l39171J73346p110479r047911J538894J3306619
41843b7993877J3059901L197657m780893m734763K360763J2465358J8460449J3770005
41835B5804600J256823p976271q055576l685622k92860K038529K333137l066053
41827H356707j1649312j3801897n761352M866656J0220836R696302L714758q134565
41819b491867j8136481j2800388P960175K5419782K4440005J0904882j461703
41812C3834405r780266j6426449j6112656l605203J2120505J5983776O355138
$$ plain form
41867 -31003813 -26605030 -21083653 -22949114 -31558960 -36406429 -32236357 -26856698 -28218655
41859 -28218655 -30863893 -24728780 -12922059 -8539943 -14546629 -19805336 -17680034 -15614187
41851 -15614187 -20470764 -26515175 -26854346 -26681000 -33791479 -42839390 -41300496 -27993877
41843 -27993877 -14933976 -11736319 -16517212 -21251975 -18891212 -6425854 12034595 25804600
41835 25804600 27061423 19085152 11029576 7343954 7051094 9089623 11422760 8356707
41827 8356707 -3292605 -17094502 -22855854 -17989198 -7768362 1927940 5642698 -2491867
41819 -2491867 -20628348 -33428736 -25468561 -48779 24391226 35296108 33834405
41812 33834405 24054139 7627690 -8484966 -12090169 30336 16014112 22369250
41805B2369250m754128q256257m726203K122192Q375725Q615675J242071o515283
41797A8473042p110103l800795m956346r856581r381774O6729J1537106J6466089
41789A1437367J2521440L258700m920651o937648m259935l240486n259480m278925
41781a679618J417313L170410m545195j2208149p406613O501061J5110431J2733921
41773A3093561O406103K603460P09476j450221m884151j0889293j7115716j5289544
41765b6816325j931255J2434111J5119038Q509520M057151L322129j007561q114508
41757E572300r281327m951768m816515q797391n228412P320990J3949972P143364
41749I11213m3857M210481J0486407M784220o601131o997410K407626L746643
$$ plain form
41805 22369250 17615122 9358865 4632662 6754854 15130579 23746254 24988325 18473042
41797 18473042 11362939 7562144 2605798 -7250783 -16632557 -16565828 -5028722 11437367
41789 11437367 23958807 27217507 22296856 15359208 11099273 7858787 2599307 -1679618
41781 -1679618 -262305 2908105 -1637090 -13845239 -21251852 -14750791 359640 13093561
41773 13093561 19499664 22103124 22812600 21362379 16478228 5588935 -11526781 -26816325
41765 -26816325 -28747580 -16313469 -1194431 7315089 11372240 14694369 13686808 5572300
41757 5572300 -3709027 -8660795 -13477310 -22274701 -27503113 -20182123 -6232151 911213
41749 911213 867356 5077837 15564244 20348464 13747333 6749923 9157549 12904192
41741A2904192q240410j6227843n790955J2710853J7918043N671640p711424q474725
41733B759371j248976J625560j335560j103677N572660R974290M576948n248327
41725A5572289q728001l976373J848819L409866J563327p85301r41969L110307
41717A1072964Q460658O941029l626571j1971404o831146N526148Q990696Q82246
41709A9444620o019171m892301l345622p199925j0764342r402486p900714q540247
41701c8620188m227426O884807J2963457O735292J35598N932379J4957547R598319
41693A4359785o819003j4352747p951860l516956r280690j1647519Q59744J6188616
41685b2160630J5647271J862997n972235m71802N788081J880101n096414k311130
$$ plain form
41741 12904192 4663782 -11564061 -17355016 -4644163 13273880 18945520 11234096 2759371
41733 2759371 1510395 3135955 1800395 696718 6269378 16243668 20820616 15572289
41725 15572289 6844288 2867915 4716734 8126600 9689927 8904626 7962657 11072964
41717 11072964 19533622 26474651 22848080 10876676 4045530 9571678 18562374 19444620
41709 19444620 13425449 8533148 5187526 -2012399 -12776741 -22179227 -30079941 -38620188
41701 -38620188 -42847614 -35962807 -22999350 -16264058 -16128460 -10196081 4761466 14359785
41693 14359785 7540782 -6811965 -14763825 -18280781 -27561471 -39208990 -38349246 -22160630
41685 -22160630 -6513359 -4650362 -10622597 -11094399 -5306318 -3426217 -8522631 -10833761
41677a0833761Q391022J2474052L377672q240381r481618k721137r74172q346981
41669a6355304j3779093o528191R054610J9162130J6714170O655688k182683n047825
41661G693502k343591K112544L689773J216794j668935k096399k944844p915628
41653b256784j3180514j0058096K953255J6116229J9007100J1579166K118734
41646B6279090k989709m222472m941105n815363m558561m35340K650389n09587
41638E457342r576716j7187417j5959415n669510P709328J7710334K0032583J2983948
41630A5500477J49772r064926p408674J375202O960347O264459O334835J0902385
41622C1013877J1717461M87033j5308370j8715578n890798P257914N699268n098392
$$ plain form
41677 -10833761 -2442739 10031313 13408985 5168604 -4313014 -7034151 -8008323 -16355304
41669 -16355304 -30134397 -36662588 -27607978 -8445848 8268322 14924010 12741327 7693502
41661 7693502 5349911 7462455 11152228 12369022 10700087 8603688 5658844 -2256784
41653 -2256784 -15437298 -25495394 -22542139 -6425910 12581190 24160356 26279090
41646 26279090 23289381 19066909 14125804 8310441 3751880 3316540 5966929 5457342
41638 5457342 -4119374 -21306791 -37266206 -42935716 -35226388 -17516054 2516529 15500477
41630 15500477 15650249 6585323 -823351 551851 7512198 13776657 20111492 31013877
41622 31013877 42731338 43218371 27910001 9194423 3303625 10561539 16260807 11162415
41614A1162415q377655n06706M997799j044748r359699o812893K825955M041493
41606c074039o835627j5175882q226616P892897J7337640J3833340L706884n443608
41598D014989j0627073j0178138l365147N618305R857752P749569L860828Q79748
41590G810833l278701q398785q929715k771034K604923j81017n967736k776476
41582b1887708R965841J7558306Q625094q410787j4228504k032906J4554483J8197095
41574B2340914P046573o217499j0908526q288621n233026l808353j123825L148204
41566c044159M549127K65708o052880q647666o576476l011325R11812O856045
41558a4749814J3185473J3181912L188270j0263939j6101350j0742021o86100
$$ plain form
41614 11162415 2784760 2278054 7275853 6231105 -3128594 -9941487 -7115532 -3074039
41606 -3074039 -9909666 -25085548 -33312164 -25419267 -8081627 5751713 9458597 4014989
41598 4014989 -6612084 -16790222 -20155369 -14537064 -4679312 3070257 6931085 7810833
41590 7810833 4532132 -3866653 -12796368 -15567402 -12962479 -13143496 -19111232 -21887708
41582 -21887708 -11921867 5636439 14261533 5850746 -8377758 -10410664 4143819 22340914
41574 22340914 29387487 23169988 12261462 3972841 -1260185 -5068538 -6192363 -3044159
41566 -3044159 1504968 1770676 -4282204 -12929870 -19506346 -22517671 -21605859 -14749814
41558 -14749814 -1564341 11617571 14805841 4541902 -11559448 -22301469 -22987569
41551b2987569O119789O950426K631730m632970r527560n733037N356919J2197052
41543i625220N491688r014420j6341665j0207260J215243Q139436J0621205J3279611
41535f441382J4452718Q177108m062921j1235562o271076K886626K234554q865208
41527i125143j4667544l529973J4633985J9567576O983686o368014n735278L557386
41519E316681O764384J71209p700051j0114512p879056l451847J870775N412189
41511i610228M992735K828343J455148j873928q930494j1673452r88051J5970322
41503g829605K0109519N835219r833411j0167580l11950L158634l596113r063243
41495a1698530m404043O160731J3076684J2315998P242530L865472M947610O883470
$$ plain form
41551 -22987569 -16867780 -9917354 -7285624 -11918594 -21446154 -27179191 -21822272 -9625220
41543 -9625220 -4133532 -13147952 -29489617 -39696877 -38481634 -30342198 -19720993 -6441382
41535 -6441382 8011336 16188444 12125523 889961 -5381115 -2494489 -259935 -9125143
41527 -9125143 -23792687 -27322660 -12688675 6878901 13862587 7494573 1759295 5316681
41519 5316681 12081065 12252274 4552223 -5562289 -13441345 -16893192 -15022417 -9610228
41511 -9610228 -4617493 -1789150 -334002 -2207930 -11138424 -22811876 -23799927 -7829605
41503 -7829605 12279914 18115133 8281722 -1885858 -2197808 960826 -2635287 -11698530
41495 -11698530 -16102573 -9941842 3134842 15450840 22693370 26558842 31506452 38389922
41487C8389922L641272m853342j1520051j1645465r344670j0414061j2600305
41480a8346700q827878J562714J0495921J0562490L042405m343644n600874j517347
41472a2972913K958247N731720R823714J6802943K1091579J5895532L245481p979098
41464E4597205j3320587j5284938j5263146j1384409n262759j934566j348906
41457i202106J019747L944357K122087k31403P736307K1927495K1614026j84959
41449D8745551k0898117j7998440l95601Q129335M986986N605266J1490138P389772
41441D7054890r282423k0470995j5009208m161904j488210m025787k985840J052106
41433i317371L995868P676223J2893111J2440077J783681j0176147j1175118k039338
$$ plain form
41487 38389922 42031194 37177852 25657801 14012336 4667666 -5746395 -18346700
41480 -18346700 -27174578 -25611864 -15115943 -4553453 -1511048 -5854692 -11455566 -12972913
41472 -12972913 -10014666 -4282946 5540768 22343711 43435290 59330822 62576303 54597205
41464 54597205 41276618 25991680 10728534 -655875 -5918634 -7853200 -9202106
41457 -9202106 -8182359 -4238002 -2115915 -2347318 5388989 27316484 48930510 48745551
41449 48745551 27847434 9848994 9453393 17582728 22569714 28174980 39665118 47054890
41441 47054890 37772467 17301472 2292264 -1869640 -3357850 -7383637 -10369477 -9317371
41433 -9317371 -5321503 2354720 15247831 27687908 29471589 19295442 8120324 6080986
41425F080986N384870L775685l065109p232882n065568P61000M702040M302886
41417I643908K245302Q70451j724343n489472l829837N794167J1730074J675019
41409B0915269j6253566k1451032r857898J897730L723174M398984J0327329J1648744
41401E348734J239649r395690p689179K43147K300964M94956K443806M028296
41393i85317j838342q243490m593580L222723J840808o190473p651834k777199
41385b7216704k975526o798928j140689J2187893J4681085J859647o722539J584812
41377a4540949J1686216M999062j1551323j7611218r525087j000058N19159J836153
41369c5188045R105991J7494059J8064917Q195434n879176j3530932q858400J566499
$$ plain form
41425 6080986 11465856 15241541 12176432 4943550 -122018 638982 5341022 9643908
41417 9643908 11889210 12759661 11035318 5545846 1716009 7510176 19240250 20915269
41409 20915269 4661703 -16789329 -26647227 -24749497 -21026323 -16627339 -6300010 5348734
41401 5348734 6588383 -2807307 -10496486 -10253339 -7952375 -7457419 -5013613 -985317
41393 -985317 -2823659 -11067149 -15660729 -12438006 -10597198 -16787671 -24439505 -27216704
41385 -27216704 -30192230 -36991158 -38131847 -25943954 -11262869 -9403222 -16125761 -14540949
41377 -14540949 -2854733 2144329 -9406994 -27018212 -36543299 -37543357 -37024198 -35188045
41369 -35188045 -26082054 -8587995 9476922 17672356 11793180 -1737752 -10596152 -9029653
41361i029653M112553n094361j4141249j1054931M02343P517850O022034K266895
41353a8998519J268379J448937N16969q97672j883676k103518l01520L435895
41345a7514725N206460J999678k653299k920137J171030N316563Q367366J1211794
41337A0184730J0244557J096615j0678830j2454748j654054Q270978M411925r249242
41329A71931j7957884j3886476j660518R890892J4624331J0034094j269802j0705642
41321a0759074j0204803j057027P491953Q981018N308564J486506l86510m71848
41313C88779J036552K947190L132743J921932K495171N611331P106216L621995
41305B8261909j956417m179380j828668K368140O297139Q547213O357181r10024
$$ plain form
41361 -9029653 -4917100 -10011461 -24152710 -35207641 -34805298 -27287448 -21265414 -18998519
41353 -18998519 -17730140 -16281203 -15764234 -16661906 -18545582 -20649100 -20950620 -17514725
41345 -17514725 -12308265 -10308587 -12961886 -15882023 -14710993 -9394430 -1027064 10184730
41337 10184730 20429287 21525902 10847072 -1607676 -3261730 5009248 9421173 171931
41329 171931 -17785953 -31672429 -33332947 -23442055 -8817724 1216370 -53432 -10759074
41321 -10759074 -20963877 -22020904 -14528951 -5547933 -239369 1247137 860627 388779
41313 388779 1425331 4372521 7505264 9427196 11922367 17533698 24639914 28261909
41305 28261909 26305492 22126112 20297444 22665584 28962723 37509936 43867117 42957093
41297D2957093p230347n065413L980141R056504K802815r754231j7150978j3438140
41289F157444k902186M351431R84053j0151643j7150088j1621151N43285O860637
41281b2928218O162735R647699K1313060K7916596J6353239o611564k1897072
41274B9956475k0803398j0416261k9915O607440O903432n01917r035929q105232
41266e425305K379166J0276070Q169291L014082L119645M667761K88500n842296
41258B0646914l343037O457540J0028059Q81434j0787060j2167285l726913M978014
41250A2967666R387307J1832810J2357091O868946m125949j2511281j2384568
41243B4392022p928159o771151r257584r999135p587692n795283n451696k447595
$$ plain form
41297 42957093 35726746 30661333 34641474 43697978 46500793 36746562 19595584 6157444
41289 6157444 3255258 7606689 8590742 -1560901 -18710989 -30332140 -29788855 -22928218
41281 -22928218 -16765483 -7117784 14195276 42111872 58465111 51853547 29956475
41274 29956475 9153077 -1263184 -1293099 5314341 12217773 11715856 2679927 -5425305
41266 -5425305 -3046139 7229931 15399222 18413304 21532949 26200710 26489210 20646914
41258 20646914 17303877 23761417 33789476 34670910 23883850 11716565 7989652 12967666
41250 12967666 22354973 34187783 46544874 53413820 49287871 36776590 24392022
41243 24392022 16463863 9692712 435128 -9564007 -17151699 -22946982 -28398678 -30846273
41235c0846273M273166R457031R608299P993492O942325J797476r643779j6737538
41227a7155801o571892J4993810K4730724J0146336j2532582j7506883j905952
41220e802240J1885185O911244o771804q415265L412137R867173L77818j1693829
41212b29581r227654L538088Q905231L119701j84905N496481Q501208j96530r716821
41203A0005218n660982N954504O914634n100186j2884976n836624M573715K172487
41195A37790j0534796j5519367k756513J6840249K3939217J3149327j320848m289914
41187A9645145O70221j781500j3435358j7580265n253273P569404K351449j2806136
41179b0620313j4386370J262972J3869726J0483181P17548l762607n843447j0165490
$$ plain form
41235 -30846273 -26573107 -17116076 -7507777 485715 7428040 9225516 -418263 -17155801
41227 -17155801 -23727693 -8733883 15996841 26143177 13610595 -3896288 -5802240
41220 -5802240 6082945 12994189 6222385 -2192880 1219257 11086430 11464248 -229581
41212 -229581 -9457235 -5919147 2986084 6105785 5920880 11417361 19918569 19722039 10005218
41203 10005218 4344236 10298740 17213374 12113188 -771788 -6608412 -2034697 137790
41195 137790 -10397006 -25916373 -28672886 -11832637 12106580 25255907 23935059 19645145
41187 19645145 20315366 18533866 5098508 -12481757 -17735030 -10165626 -7814177 -20620313
41179 -20620313 -35006683 -33743711 -19873985 -9390804 -8673256 -12435863 -18279310 -28444800
41171b8444800j0356490j317722Q231124Q382849L732535L977221O843524L399248
41163e552511n381092j0174914p935603l630246o8157L592995N462879L010226
41155b0676423j20279J363313M573479K122394n565440j0242150p248158R47471
41147c4845793J0931449J9502039K0377084R722156m838609j0042369l034208
41140G771749O243114R017696N846714P72400l361926k745466M432812J0638889
41132C8615982M655494j1660629k2016230j6410514m281644j44793m088343n424459
41124b0755136k40844M722668L855099n29824l962838n777431p202549p667574
41116c7558429n313004O02297Q742064J5935605J8306608J3677585L619363p081737
$$ plain form
41171 -28444800 -38801290 -40119012 -31887888 -23505039 -19772504 -15795283 -8951759 -5552511
41163 -5552511 -10933603 -21108517 -29044120 -32674366 -32742523 -29149528 -23686649 -20676423
41155 -20676423 -20796702 -19433389 -14859910 -12737516 -18302956 -28545106 -35793264 -34845793
41147 -34845793 -23914344 -4412305 15964779 25686935 20848326 10805957 7771749
41140 7771749 14014863 23032559 28879273 29651673 26289747 23544281 27977093 38615982
41132 38615982 43271476 31610847 9594617 -6815897 -11097541 -11242334 -15330677 -20755136
41124 -20755136 -20995980 -16273312 -12418213 -12948037 -16910875 -22688306 -29890855 -37558429
41116 -37558429 -42871433 -42269136 -33527072 -17591467 715141 14392726 18012089 10930352
41108A0930352j3115823j1516089l441204O140632J1414912R541990K377367m907552
41100G424585p489758n132643k929253n287878q981135o500224K058402O428308
41092b0409596L09980p410845l523173J0390633J9044449J3683418K064874m305797
41084I843943m670976n805191j0122524j3045768r781511l05875J1071194J8116929
41076d699779J6071374N738793n855354j0853787p493830j499774M5422l177641
41068a1724576m036647K307478J0018810R713294L203665J868882P801748Q433940
41060B7586594k452891j0747899k613089J0841025Q001305r281805j7323706o472510
41052b462976O154745M993462l141800n551396k761533O23146Q166332K0730802
$$ plain form
41108 10930352 -2185471 -13701560 -17142764 -11002132 412780 9954770 12332137 7424585
41100 7424585 -65173 -5197816 -8127069 -13414947 -22396082 -28896306 -26837904 -20409596
41092 -20409596 -20099616 -27510461 -31033634 -20643001 -1598552 12084866 14149740 9843943
41084 9843943 5172967 -632224 -10754748 -23800516 -33582027 -33887902 -22816708 -4699779
41076 -4699779 11371595 17110388 11255034 401247 -7092583 -8592357 -8546935 -11724576
41068 -11724576 -15761223 -13453745 -3434935 6278359 9482024 11350906 19152654 27586594
41060 27586594 25133703 14385804 11772715 22613740 30615045 21333240 4009534 -2462976
41052 -2462976 3691769 8685231 5543431 -7965 -2769498 -2146352 6019980 26750782
41044B6750782K6657298J7783212M451306j54283l39099o835190j5209977j3613604
41036C9490445n110087k927489p317615o353436J528833M462293k095585q355865
41028A3321494o653694n60386M442066O101111Q97509j1078869j7067288m430570
41020a5028627J6430002K0845950M943101q199054l566402N824034M198782k384174
41012B3063612j460020L394048K703229m67549Q7408j903950j2919322k2350355
41004i852899j7141320n053597k664872p070204j964290J1970979J6408067N471148
40996i896988o011308p666923n941067o000804j624219Q593104J3113728N747896
40988i686581l195067m099009k129166l658237k678643O600530J5556561J3268870
$$ plain form
41044 26750782 53408080 71191292 75642598 75488315 75149216 68314026 53104049 39490445
41036 39490445 34380358 31452869 24135254 17781818 19310651 23772944 21677359 13321494
41028 13321494 6667800 6107414 10549480 16650591 17548100 6469231 -10598057 -15028627
41020 -15028627 1401375 22247325 27190426 18991372 15424970 21249004 25447786 23063612
41012 23063612 21603592 24997640 27700869 27233320 27320728 25416778 12497456 -9852899
41004 -9852899 -26994219 -32047816 -34712688 -41782892 -43747182 -31776203 -15368136 -9896988
40996 -9896988 -15908296 -23575219 -29516286 -35517090 -37141309 -28548205 -15434477 -9686581
40988 -9686581 -12881648 -16980657 -19109823 -22768060 -25446703 -18846173 -3289612 9979258
40980I979258L628035k354535k854476j710099K269942Q826216P802064o941051
40972A8645354k1751359j8311316k80829J2295261J2204504J0139182J1093051
40965B4033848O029851p913914j7181556j1039447K244118P939921L535949l414095
40957D234675p209044n670746K346661J3022079J7214181J1059186J790627k253952
40949C4533667j440384j11421M30916j119627p756136j6203264j6107302n335202
40941a3108753K965136j051721o972380P07648J6657635K0040690M370496j3340268
40933A0268483j5799864n115524N067760P048559L416021P25308L080204P807971
40925A6498918O520620m569087j6321461j5808299l178853Q892284J2236277R862794
$$ plain form
40980 9979258 13607293 11252758 8398282 6688183 8958125 17784341 25586405 18645354
40972 18645354 -3106005 -21417321 -21698150 -9402889 2801615 12940797 24033848
40965 24033848 30063699 22149785 4968229 -6071218 -3827100 4112821 7648770 4234675
40957 4234675 -2974369 -8645115 -6298454 6723625 23937806 34996992 36787619 34533667
40949 34533667 33093283 32981862 33412778 32293151 24537015 8333751 -7773551 -13108753
40941 -13108753 -10143617 -11195338 -18167718 -17460070 -802435 19238255 23608751 10268483
40933 10268483 -5531381 -10646905 -5579145 1469414 4885435 5610743 8690947 16498918
40925 16498918 23019538 18450451 2128990 -13679309 -16858162 -7965878 4270399 14133193
40917A4133193N249380k866227j1333472j0561555R55384R808648M193943r752046
40909a72752j6635860j1248275j210984N013031M657061q91482o284064m086517
40901c0859842N994206J2878783P043166n009338q038648J299506J0183558P124891
40893F16282m041746j0466302n291121O428484J3808589J0753270K210462q89018
40885A3128900N262068J2083877R814213K47224p292602r450738j0732154j3247918
40877a87130j2955081p474838q27269J943433m049m761403r709654j1231680o903197
40868e2110868J423677J0408358J9318825K5811183K1195261N22004k3058849
40861C509591k7414782r727629O701303K439499j2003827j2271847N134073J9606853
$$ plain form
40917 14133193 19382573 16516346 5182874 -5378681 -4423297 5385351 9579294 -172752
40909 -172752 -16808612 -28056887 -29267871 -24254840 -19597779 -20489261 -26773325 -30859842
40901 -30859842 -24865636 -11986853 -4943687 -9953025 -17991673 -16692167 -6508609 616282
40893 616282 -3425464 -13891766 -19182887 -12754403 1054186 11807456 14017918 13128900
40885 13128900 18390968 30474845 40289058 40536282 33243680 23792942 13060788 -187130
40877 -187130 -13142211 -20617049 -21444318 -19500885 -19504934 -24266337 -33975991 -45207671 -52110868
40868 -52110868 -50687191 -40278833 -20960008 4851175 26046436 26568440 3509591
40861 3509591 -23905191 -33632820 -26931517 -24492018 -36495845 -48767692 -43633619 -24026766
40853b4026766J6301574L965225j397113J552635K581781k040430m931372m13266
40845h407732O225304N998576j085547n534451o63881Q805415J3233808J0242027
40837B8813519N404131J723966m510973j4396287j9588859j1890923L352863J1619585
40829E27022P533282J250488L046860P965345L053759j2493080k3329948j7357942
40821b9804214k223638M923040O56682k063403M338968R655044L147072o760783
40813a8131232l643866J1000354J9137426J3467533O042279M999619Q09897j3308676
40805B0373334k3434874j4350128M135280R949255J762736j645262O620894J1910103
40797A5321338M194334o134546o795807j184809K436509M571640O172518L56795
$$ plain form
40853 -24026766 -7725192 -3759967 -5157080 -3604445 -1022664 -3063094 -7994466 -8407732
40845 -8407732 -2182428 3816148 2730601 -2803850 -3467731 5337684 18571492 28813519
40837 28813519 34217650 35941616 31430643 17034356 -2554503 -14445426 -11092563 527022
40829 527022 8060304 9310792 12357652 20322997 23376756 10883676 -12446272 -29804214
40821 -29804214 -32027852 -27104812 -26448130 -28511533 -24172565 -14517521 -11370449 -18131232
40813 -18131232 -21775098 -10774744 8362682 21830215 27872494 32872113 33682010 20373334
40805 20373334 -3061540 -17411668 -13276388 -3327133 -1564397 -3209659 3411235 15321338
40797 15321338 19515672 13381126 6585319 5400510 7837019 12408659 18581177 18937972
40789A8937972j4153482k2956685j4504092O15439N067249J495306N485673J7258258
40781b754362K1336548J3754554Q114095J0376505Q215835n568426j7204200j2659890
40773B3610659l15810K321488n072890q729754m478707j905892n921505r059105
40765i551516n081398J138421J978142k450455o460965o089968j153782N655168
40757b2016353R601742P807701L640715K906146M667598J350737r411961j8206162
40749a9659837j3679007L470105K0094900K3235720J1172938o401924j6864104
40742A368791j4386427l585971N994504Q921551O650009K623712j718965n108768
40734G58436m646004O24006O109781N407736k195919j0493385j3100752r377104
$$ plain form
40789 18937972 4784490 -18172195 -32676287 -32060848 -26993599 -25498293 -20012620 -2754362
40781 -2754362 18582186 32336740 40450835 50827340 59043175 53474749 36270549 23610659
40773 23610659 23294849 25616337 20543447 11813693 7334986 5429094 -492411 -9551516
40765 -9551516 -14632914 -13494493 -11516351 -13966806 -20427771 -26517739 -27671521 -22016353
40757 -22016353 -12414611 -4606910 -966195 1939951 6607549 7958286 -1453675 -19659837
40749 -19659837 -33338844 -29868739 -9773839 13461881 24634819 18232895 1368791
40742 1368791 -13017636 -16603607 -10609103 -1687552 4962457 7586169 5867204 758436
40734 758436 -3887568 -3263562 2846219 8253955 6058036 -4435349 -17536101 -26913205
40726b6913205l064761K348467M807706K533860l873896q142614k809491R570188
40718b5543746J4910882M115674j2068385j4184594K7286J2018436Q465783j018557
40710a3277221r78005N518780L484142q599508j5900618r510977L166620J3020105
40702b3076682K0192413K4860578K0129238L439637j4308197k1099894j8729508
40695h592415j6103181j3840141o535792L514653P039720K419630q22402M081273
40687b8838655J1507358J1647106L422503m786866n241745R20882N369637K072676
40679c927104n508384q765459n276087j386801j876023k817507Q06186N539422
40671b3211757M218246k627661p101459m588932J870805P278190R394984Q030831
$$ plain form
40726 -26913205 -29977966 -27629499 -22821793 -20287933 -24161829 -32304443 -35113934 -25543746
40718 -25543746 -10632864 -6517190 -18585575 -32770169 -32742883 -20724447 -12258664 -13277221
40710 -13277221 -14255226 -8736446 -5252304 -13851812 -29752430 -39263407 -36096787 -23076682
40702 -23076682 -2884269 21976309 42105547 45545184 31236987 10137093 -8592415
40695 -8592415 -24695596 -38535737 -45071529 -41556876 -34517156 -32097526 -32919928 -28838655
40687 -28838655 -17331297 -5684191 -2261688 -7048554 -12290299 -11369417 -5999780 -3927104
40679 -3927104 -9435488 -18200947 -23477034 -24863835 -26739858 -29557365 -28751179 -23211757
40671 -23211757 -18993511 -21621172 -28722631 -33311563 -31440758 -24162568 -14767584 -6736753
40663f736753M384625J339615J094597K925743N286692P667626Q229710M047032
40655B8238887k849949n245189j280955J395636j737602l494434J629550M290051
40647B0945995n514803j7748003j3718251L975616J2122554K13754j5047548j4711881
40639b9482567j145270J1350198J5674352J2872180N736436p1466J058098M193367
40631B0185328j583819j2497781j0403925P086660J6195873K290449j3269171
40624H003614m226406J7601361J9244249j293809j2090010J823914J6136458O986544
40616E2185915j3178870j7531038m711463M044756j463808r326093o765085K758712
40608F013026P681918M804030J542717L558910N224141k783691j6915472k0509938
$$ plain form
40663 -6736753 -2352128 -1012513 82084 3007827 8294519 15962145 24191855 28238887
40655 28238887 25388938 20143749 18862794 20258430 18520828 15026394 16655944 20945995
40647 20945995 15431192 -2316811 -16035062 -12059446 63108 276862 -14770686 -29482567
40639 -29482567 -30627837 -19277639 -3603287 9268893 15005329 14933863 15991961 20185328
40631 20185328 18601509 6103728 -4300197 2786463 18982336 21272785 8003614
40624 8003614 3777208 21378569 40622818 39329009 27238999 29062913 45199371 52185915
40616 52185915 39007045 21476007 16764544 20809300 19345492 10019399 3254314 6013026
40608 6013026 13694944 18498974 20041691 23600601 28824742 26041051 9125579 -11384359
40600a1384359o143390J0447127J0282406j624787m640737N405850J1736667N526184
40592A9604961j443974K34252J869591m654292r894120l218297P866750J0624854
40584B0989725P624499P738524O984237l038497j5125068j4399398j967198P729857
40576A6536681R732622J0113840P837233l734779j7068393j4595460K786364J2519298
40568B4127406L303031q757624p352279l61747k524076r467224p139393K838534
40560e333372N605168l676538j4555399j7543500j3049031m911436M375765J1804603
40552c7283740J4948421J4513291J1047216L022659o589996q616591n26385O249538
40544c235587K242904l874205J646738J3910600J5011546J690770r583718p354616
$$ plain form
40600 -11384359 -17527749 -7080622 3201784 1576997 -3063740 2342110 14078777 19604961
40592 19604961 18160987 18395239 20264830 15610538 5716418 2498121 10364871 20989725
40584 20989725 28614224 36352748 43336985 40298488 25173420 10774022 8806824 16536681
40576 16536681 26269303 36383143 44220376 40485597 23417204 8821744 11608108 24127406
40568 24127406 27430437 18672813 11320534 10958787 8434711 -1032513 -8171906 -5333372
40560 -5333372 271796 -3404742 -17960141 -35503641 -48552672 -53464108 -49088343 -37283740
40552 -37283740 -22335319 -7822028 3225188 6247847 -342149 -8958740 -9485125 -3235587
40544 -3235587 -992683 -4866888 -3220150 10690450 25701996 27392766 17809048 10454432
40536A0454432Q09638L974054L323464M580420O314116M307797l72379m701629
40528B8689913q448987j0385631p148912j045319q85156q886232j4717145r819316
40520c2646785k98803K792623j34078K18016O991572J3554801J3299093O612107
40512A0388546o30924j641996N078121J1065931M947323j1694042k2279620j4852479
40504a9619140L084072J5914174J8550853J5427745Q647320j575895r755378j0002102
40496B0671649n216604j827917P94845N922617R332998M944085l696577r174580
40488B1750516j2422884j6302222j3558162J744772J6067394J0949903n824429
40481B404888p389970J0873416K2296778R775938q797213j0248676P0909K819228
$$ plain form
40536 10454432 11264070 15238124 18561588 23142008 29456124 33763921 33391542 28689913
40528 28689913 20240926 9855295 2706383 1661064 775908 -8110324 -22827469 -32646785
40520 -32646785 -32945588 -30152965 -30287043 -30069027 -23077455 -9522654 3776439 10388546
40512 10388546 9757622 8115626 13193747 24259678 29207001 17512959 -4766661 -19619140
40504 -19619140 -16535068 -620894 17929959 33357704 42005024 40429129 30673751 20671649
40496 20671649 15455045 13627128 14421973 20344590 29677588 34621673 30925096 21750516
40488 21750516 9327632 -6974590 -20532752 -18787980 -2720586 8229317 2404888
40481 2404888 -4985082 5888334 28185112 37961050 29163837 18915161 18986070 21805298
40473B1805298l554677o304563k513056J87055k92340r15919l328426p373986
40465b290614k661079J5882038L1216158K2720569k860053j9027276j5662218
40458B7317525p079277m551940k836286J943455J994181n934889j0773091l725120
40450c645442P663966J1052009N153764l078168q205764p449237o86471O132003
40442F936660O220315L234601O467091J2656987P257033j0798477k1815252j2752456
40434b593498K730299M716196m605321q299076j545249N311325N842486M291396
40426E848558M725285O042906P321331Q015723M099640o569375j6720180j6738847
40418c974959p645264J510680O506946R005630Q247809K942681q83210L607628
$$ plain form
40473 21805298 18250621 11946058 9433002 9620057 9327717 8411798 5083372 -2290614
40465 -2290614 -4951693 10930345 42146503 64867072 62007019 42979743 27317525
40458 27317525 20238248 15686308 12850022 14793477 16787658 10852769 79678 -3645442
40450 -3645442 4018524 15070533 20224297 17146129 8940365 1491128 804657 6936660
40442 6936660 13156975 16391576 22858667 35515654 42772687 31974210 10158958 -2593498
40434 -2593498 136801 4852997 247676 -8051400 -9596649 -4285324 1557162 5848558
40426 5848558 10573843 16616749 23938080 31953803 36053443 29484068 12763888 -3974959
40418 -3974959 -11620223 -10109543 -3602597 5403033 13650842 16593523 15710313 19317941
40410A9317941J0407049O566767p245655j5598827j0839191l309309l404110o278717
40402a0384052l245520K174117J017082m817790m840521L756793J1885990J0705684
40394F251783R84937r832996j4271824q599225M453782J5752719J6991690R331912
40386B1062778J764547J97190J621259M22504l146710m033860k92845L809787
40378B1404650L466596l39668k349759j81098K317934k67221q112833j5170333
40370G68268j4835298o345632M211678R495078P884845M015570J914382K89478
40362G398369k836036m263952j82283N358450M540299j299725k156941M469682
40354A1027863Q337881L451998l98973O650208J6207324J2960978r09809q474563
$$ plain form
40410 19317941 29724990 36291757 29046102 13447275 2608084 -701225 -4105335 -10384052
40402 -10384052 -13629572 -11455455 -10438373 -15256163 -20096684 -16339891 -4453901 6251783
40394 6251783 7236720 -2596276 -16868100 -25467325 -21013543 -5260824 11730866 21062778
40386 21062778 22827325 23024515 24645774 25068278 21921568 17887708 17594863 21404650
40378 21404650 24871246 24531578 22181819 22000721 24318655 24051434 15938601 768268
40370 768268 -14067030 -20412662 -16200984 -6705906 1178939 5194509 7108891 7398369
40362 7398369 4562333 298381 116098 5474548 10014847 8715122 6558181 11027863
40354 11027863 19365744 22817742 22418769 29068977 45276301 58237279 57327470 48852907
40346D8852907l923747M60190m334395j1122311j0728811n592435j368818L228510
40338A5471090Q813781P990075k891338j2504776p875818N661045J0405200L45651
40330B5414910j2288202j4825608q402129k372082k293322o157876p604977j786531
40322c0315817Q217502J2219555N035028m873248n739261J173737M730400J973484
40314g578620J567509P419246J0723516L911287p153678j2103386r672116m979951
40306a7866193Q1211N286061O273813j53741p996264q361209j952408L162244
40298b1526486M352065N515507O320206J460175p316642r468083j128330O925008
40290a4866580M007232m733559n766210L876582J3502495J2828834K223896j0033608
$$ plain form
40346 48852907 44929160 45389350 41054955 29932644 19203833 13611398 12242580 15471090
40338 15471090 24284871 32274946 29383608 16878832 9003014 14664059 25069259 25414910
40330 25414910 13126708 -1698900 -10101029 -12473111 -14766433 -20924309 -28529286 -30315817
40322 -30315817 -22098315 -9878760 -4843732 -9716980 -15456241 -14282504 -9552104 -7578620
40314 -7578620 -6011111 1408135 12131651 16042938 8889260 -3214126 -12886242 -17866193
40306 -17866193 -17784982 -12498921 -6225108 -6378849 -14375113 -22736322 -24688730 -21526486
40298 -21526486 -17174421 -11658914 -5338708 -3878533 -11195175 -20663258 -21791588 -14866580
40290 -14866580 -10859348 -15592907 -21359117 -17482535 -3980040 8848794 11072690 1039082
40282A039082j4793902p650384O219598J3599522O140185q172611j2845216k841388
40274a9305114R861808J2237437M855870k707353m968289l981223l482418m538482
40266a2027764n411663k922687M032007J0600245R156190j014818j0871817j1623092
40258b0083399m100237M881945J1009914J2931205R041363M71854n687968l364210
40250E100467L671070O685216M610014M267230P833972Q359070P28673r552898
40242C1702814j3021264p697393j14433K359379k627986j1769506j8435153j6995976
40234c6599518p147710N590014J3243605R708390m160825j6820749j2699904J0170629
40226c8716068L2671779L4333191J8895935Q445033J1593914J2481273k427518
$$ plain form
40282 1039082 -13754820 -21405204 -15185606 -1586084 4554101 -3618510 -16463726 -19305114
40274 -19305114 -9443306 2794131 7650001 4942648 -25641 -4006864 -7489282 -12027764
40266 -12027764 -17439427 -20362114 -16330107 -5729862 3426328 2411510 -8460307 -20083399
40258 -20083399 -24183636 -19301691 -8291777 4639428 13680791 14152645 8464677 5100467
40250 5100467 8771537 15456753 20066767 24333997 32167969 40527039 41255712 31702814
40242 31702814 18681550 10984157 10869724 13229103 10601117 -1168389 -19603542 -36599518
40234 -36599518 -43747228 -38157214 -24913609 -15205219 -19366044 -36186793 -48886697 -38716068
40226 -38716068 -6044289 28288902 47184837 55629870 67223784 79705057 77277539
40219G7277539k1492102k4316463j0783708J096510N79937p191517j4526006j8084453
40211a7440263j3536513J062171J4677279J1411586o199921j6556924q341354
40204c4923939L927779L398847m096261k985336N027475N489442k395843l635431
40196c0193267P390873J7653952J6382182R632327O219267K707589o834671j6507524
40188F450728j6475792q606931k191325J348849P403853J4808714J6146404J0923905
40180B9808405O516700N059476J221065m590516l170063P861621J6099154R705210
40172F8511052o868975j9436857j9760991q847434P513102J9227233J6150865
40165E6487995J192574q112394j474343Q179285L434362j0059664j2093363n73970
$$ plain form
40219 77277539 55785437 31468974 20685266 21781776 22361713 15170196 644190 -17440263
40211 -17440263 -30976776 -29914605 -15237326 -3825740 -10025661 -26582585 -34923939
40204 -34923939 -30996160 -27597313 -31693574 -34678910 -29651435 -24161993 -26557836 -30193267
40196 -30193267 -22802394 -5148442 11233740 20866067 27085334 29792923 22958252 6450728
40188 6450728 -10025064 -18631995 -20823320 -19474471 -12070618 2738096 18884500 29808405
40180 29808405 36325105 41384581 42605646 38015130 34845067 42706688 58805842 68511052
40172 68511052 61642077 42205220 22444229 13596795 21109897 40337130 56487995
40165 56487995 57680569 49568175 48093832 56273117 59707479 49647815 37554452 36980482
40157C6980482M793412n592375j5907050j0484958K453285N887633o8993k939598
40149A5121838l61463j249920p574985j0094610l357862O608890J1791922J0520027
40141B1403837M703812l057946p672939m539424K880319N026286j234670p994192
40133I515083p641801l285611l106103q220709j1767579q805243k293077J672559
40125c3932481J494696Q17393K611567N182567N676593N667855R279416J5265924
40117A2063530J5690161N783604q113211j4818435j0955607l288682P01743M97794
40109b439103M78870L312617O674132N892626J09217m901523l127714K391862
40101H390984K115602n840823j0693499l514814R152198J3940538Q606885K238752
$$ plain form
40157 36980482 41773894 36181519 20274469 9789511 12242796 18130429 18061436 15121838
40149 15121838 14760375 13510455 5935470 -4159140 -7517002 -908112 10883810 21403837
40141 21403837 26107649 23049703 15376764 10837340 13717659 18743945 17509275 9515083
40133 9515083 1873282 -1412329 -4518432 -12739141 -24506720 -33311963 -35605040 -33932481
40125 -33932481 -32437785 -31620392 -29008825 -23826258 -18149665 -12481810 -3202394 12063530
40117 12063530 27753691 33537295 25424084 10605649 -349958 -3638640 -2936897 -2439103
40109 -2439103 -1960233 1352384 8026516 13919142 14028359 9126836 5999122 8390984
40101 8390984 10506586 4665763 -6027736 -9542550 -390352 13550186 22157071 24395823
40093B4395823K32274o96124k994866m234115m250022o644439j0144085p510466
40085a1846020K612205J0810784R150275J626749l034949l032994k062741j374017
40077B849292K28395J711613Q83992j736257l849352l912818p73250M893835O835983
40068G131433k156642j7574157k2911995r562801R360742J4454166M784400l356913
40060a9831767p7194P469549R290729O628228O898168J1429920J4000777R261194
40052D5069604l31112n580944L37088J1994142J4585961J620700j4264013j6105721
40044C7325705n294021J331233l350987p560684r50350Q420766O674118m954743
40036C1641037j2911708j0715608m961834l213631n023649n932533l577832J711307
$$ plain form
40093 24395823 24628097 23931973 20937107 16702992 12452970 5808531 -4335554 -11846020
40085 -11846020 -9233815 1576969 10727244 12353993 9319044 6286050 4223309 2849292
40077 2849292 3077687 4789300 5673292 3937035 87683 -3825135 -4598385 295450 7131433
40068 7131433 4974791 -12599366 -35511361 -45074162 -35713420 -21259254 -16474854 -19831767
40060 -19831767 -19908961 -12439412 -3148683 3479545 10377713 21807633 35808410 45069604
40052 45069604 44738492 39157548 39494636 51488778 66074739 67695439 53431426 37325705
40044 37325705 32031684 33362917 30011930 22451246 21500896 29921662 36595780 31641037
40036 31641037 18729329 8013721 3051887 -161744 -5185393 -11117926 -14695758 -12984451
40028a2984451P633541J0304055P642935K477457r70576k631989m743186o051796
40020F75990l085719L439101Q805413J0717083J0366733P683695J866954l353102
40012C7116148k642998J225998r75087j0089740j4274207n927014N122288M770189
40004A4325577m589893p919059q042P995422O067552j776505o359710n675306
39996B060036k133090M535669J3350948J6761681R018934k777572n885734j0459
39988C4920413J576575q524648k0381449k0151603q053859M387929J0670752J4258551
39980H702661J8231083J8539408J0548647k929889j3690319j5696442q974787
39973A4730362R10486N729595R98703p618124q295104K416276J2700679R107491
$$ plain form
40028 -12984451 -5350910 4953145 12596080 15073537 14102961 11470972 6727786 675990
40020 675990 -2409729 1029372 9834785 20551868 30918601 38602296 40469250 37116148
40012 37116148 34473150 35699148 34724061 24634321 10360114 4433100 9555388 14325577
40004 14325577 9735684 1816625 1808583 9804005 15871557 14095052 7735342 2060036
39996 2060036 -73054 4462615 17813563 34575244 43594178 40816606 34930872 34920413
39988 34920413 36496988 27972340 7590891 -12560712 -20614571 -16226642 -5555890 8702661
39980 8702661 26933744 45473152 56021799 53091910 39401591 23705149 14730362
39973 14730362 15640848 21370443 22369146 14751022 6455918 8872194 21572873 30680364
39965C0680364n224809j3545618o946537N089499Q611371K587786l155705k427199
39957A5669152J807940M189850K699014k064440p777421r924535n185042L301965
39949B716483P770227M625336j179160j922363M525337J2734259J4651845O939031
39941E0860995m788103j0324433o191030o53030l108431j0359196j0288771L61764
39933E509765R810402O705652m582953j0305583n367482J907480K723082n70222
39925E830141J004020R426228J5258680R493524k712002o629151J828058Q376325
39917D1875823m2588j4630654j5561418m54052J2429556J0798686K901074K1919
39909C7338346o21559n755686j1482187j1142081p895553o691614k801203P313190
$$ plain form
39965 30680364 25455555 11909937 4963400 10052899 18664270 21252056 18096351 15669152
39957 15669152 17477092 21666942 24365956 22301516 14524095 4599560 -585482 2716483
39949 2716483 10486710 15112046 13932886 12010523 16535860 29270119 43921964 50860995
39941 50860995 46072892 35748459 29557429 28904399 25795968 15436772 5148001 5509765
39933 5509765 15320167 22025819 17442866 7137283 1769801 3677281 6400363 5830141
39925 5830141 6834161 16260389 31519069 41012593 38300591 31671440 33499498 41875823
39917 41875823 41833235 27202581 11641163 11187111 23616667 34415353 37316427 37338346
39909 37338346 36716787 30961101 19478914 8336833 441280 -6250334 -9051537 -1738347
39901a738347J2326426Q90691j5589281j4862685L150291J5398221R555252j116877
39893H013691k042299K640140L431722K427007N248356Q631975P713665N654117
39885D1718374N556815K579499n388127r220583k721410M050922o34123j0111268
39877B5830099r304469O84926M785082j309910n509610j37423O948209O723238
39869B8710142J846233j070412j974346l249354k864340J091591M525856L010787
39861C0026157l09867P89635N080128M430012m326146j3400220j3372895n887589
39853C029215j898049o246149r558921r62710J4647407K0815106J1253962k287126
39845B8792735p282966n629099m911531l878006K730397J1002364J1926823O310812
$$ plain form
39901 -1738347 10588079 11478770 -4110511 -18973196 -15822905 -424684 9130568 8013691
39893 8013691 5971392 8611532 12043254 14470261 19718617 28350592 36064257 41718374
39885 41718374 47275189 49854688 44466561 35245978 32524568 36575490 35941367 25830099
39877 25830099 16525630 17210556 21995638 20685728 15176118 15038695 21986904 28710142
39869 28710142 30556375 29485963 27511617 24262263 21397923 22489514 27015370 30026157
39861 30026157 29716290 30505925 35586053 40016065 35689919 22289699 8916804 3029215
39853 3029215 1131166 -5114983 -14673904 -15636614 -989207 19825899 31079861 28792735
39845 28792735 21509769 15880670 10969139 7091133 9821530 20823894 32750717 39061529
39837C9061529L895223P536036Q934191J876158r391117j7398040j9279358j5141915
39829I2707o077704L314945O833547M064792Q43015P49926J692749K108230L993833
39820A7616040P539096R014834O809017L972097K212105p77346m929253m736100
39812C6720490K870954J1882368J3185109M953298n948941j0998637o731845L025248
39804D8958044R985956Q523497Q60043o295980r093192p900161l902420Q60261
39796D1996048K288583r63867l389549r8258L812828j59938r594962j3555105
39788B0335780r011023l569209q87826L777267J0212628R324033n05608n755705
39780B3920337L712693J8215124K0921595R755054l419430r532648q538591l687732
$$ plain form
39837 39061529 42956752 50492788 59426979 61303137 51912020 34513980 15234622 92707
39829 92707 -5984997 -2670052 4163495 8228287 9071302 9821228 11513977 13622207 17616040
39820 17616040 25155136 34169970 40978987 44951084 47163189 46385843 41456590 36720490
39812 36720490 39591444 51473812 64658921 69612219 63663278 52664641 45932796 48958044
39804 48958044 58944000 67467497 68327540 62031560 52938368 45038207 41135787 41996048
39796 41996048 44284631 43320764 39931215 39832957 43645785 43485847 33890885 20335780
39788 20335780 11324757 7755548 6867722 10644989 20857617 30181650 29676042 23920337
39780 23920337 27633030 45848154 66769749 76524803 73105373 63572725 55034134 51346402
39772E1346402J351891L092660K766242N849097J1847836J2076621M229458n46424
39764I2013783N206459J1219674N645695m033746k781819N986234N440921o114792
39756A12582409j1800306l267131P460359Q640447M978657N600247R236316R670960
39748A43101958N736501p80058p997489j0182736j992028R115321P774172n638089
39740A39137552j0781611L543488K0545511J9217199M348190m005913j348371
39733A70656045M50941k385611j258362N013895O227894M92174k11650Q958584
39725A87943910J5253760Q647192r18755J118916J1290945J4482654P102979K48704
39717B45170305J697495O786570Q213278N666791L762449O965513J7284702L0767005
$$ plain form
39772 51346402 52698293 55790953 58557195 64406292 76254128 88330749 92560207 92013783
39764 92013783 97220242 108439916 114085611 110051865 107270046 113256280 118697201 112582409
39756 112582409 100782103 97514972 104975331 113615778 118594435 124194682 133430998 143101958
39748 143101958 148838459 148058401 140060912 129878176 127886148 137001469 144775641 139137552
39740 139137552 128355941 131899429 152444940 171662139 176010329 172004416 170656045
39733 170656045 171106986 168721375 167463013 172476908 178704802 179196976 178985326 187943910
39725 187943910 203197670 211844862 210926107 212045023 223335968 237818622 244921601 245170305
39717 245170305 246867800 253654370 261867648 267534439 271296888 278262401 295547103 326314108
39709C26314108L6437154K6375367Q037143j422891M097108J2131748R045126
39702D21014863k247112q234474l111458O478152J2259898J2545572J0173004
39695D48878445Q210003Q282247R068866O467509j353004r986736j3556493j2078063
39687D43932774r876674q478712o582618n769043r437661j5840975j8974530j7452840
39679C51519721j5611085j4290896q653046J122647N136645l358051j5859932
39672C00006003j7426334n557477O294328L978661j2663336k9997975l3039166
39665B11594704j9149094j241348M828913k897047j1975393j2394761o964296
39658A61801678k094521K613456Q182047P758224m323837j9160071k1199285q943512
$$ plain form
39709 326314108 362751262 389126629 397163772 395740881 399837989 411969737 421014863
39702 421014863 418767751 410533277 407421819 413899971 426159869 438705441 448878445
39695 448878445 457088448 465370695 474439561 480907070 479554066 469567330 456010837 443932774
39687 443932774 434056100 425577388 418994770 413225727 403788066 387947091 368972561 351519721
39679 351519721 335908636 321617740 312964694 314087341 319223986 315865935 300006003
39672 300006003 282579669 277022192 283316520 287295181 274631845 244633870 211594704
39665 211594704 192445610 191204262 196033175 193136128 181160735 168765974 161801678
39658 161801678 159707157 162320613 170502660 178260884 173937047 154776976 133577691 124634179
39650A24634179L153994M079417k940924j0464720j6244004j8308772j1477496
39643G2431674L270645J3208243O731719j1296936k4108522k1121089o244593
39636C2871141R321240J6346628J1064659l256375j6165053j6604628l472204
39629C0105408J2147009J7790993J1736482K639124j379819l7716K540680M014511
39621G9556672L594972r25729j0485077j9840733k0966623j2649101k291552L136716
39613A9129545L662417K876085L135068N664003R793061J0549879L700990n170159
39605E3340889n420501J906617L282572n603447j0452484j168130Q863244K266357
39597D7015117j3293889j5438303j483797R010249O027884J483554M567751N264099
$$ plain form
39650 124634179 127788173 131867590 128926666 118461946 102217942 83909170 72431674
39643 72431674 75702319 88910562 95642281 84345345 60236823 39115734 32871141
39636 32871141 42192381 58539009 69603668 66347293 50182240 33577612 30105408
39629 30105408 42252417 60043410 71779892 74419016 73039197 73001481 75542161 79556672
39621 79556672 83151644 82225915 71740838 51900105 30933482 18284381 15992829 19129545
39613 19129545 22791962 25668047 28803115 34467118 44260179 54810058 58511048 53340889
39605 53340889 47920388 49827005 53109577 47506130 37053646 35885516 44748760 47015117
39597 47015117 33721228 18282925 16799128 25809377 31837261 33320815 37888566 43152665
39589D3152665o387789j9878841j7023784K833002K1762629K3797533R787414
39582E8042829n653236r075873k445371m53019q848825j2859174O93445J7974755
39574C7375531J5371510j975992n572602R870971J5665934l646881k2590745j4536999
39566B9960727O909842J2692752L722859J005020N270086N1446j2455390j2269921
39558C4887421K217863R677759J089310p890211n790476j497888l556849n857454
39550B3279475l300740j668180k473211K923294J4059427J5029315n68960j5390009
39542C1890411j2598866K89825N841935K136545q73511P5473J248288K289154
39534C0299254L924157K051217m574300p767456j630824O717673Q666183P857421
$$ plain form
39589 43152665 36764876 16886035 -137749 2695253 24457882 48255415 58042829
39582 58042829 52389593 43313720 40868349 40415330 31566505 18707331 19400776 37375531
39574 37375531 52747041 50771049 45198447 55069418 70735352 67088471 44497726 29960727
39566 29960727 36870569 49563321 53286180 54291200 59561286 59612732 47157342 34887421
39558 34887421 37105284 46783043 47872353 39982142 34191666 32693778 29136929 23279475
39550 23279475 19978735 18310555 15837344 18760638 32820065 47849380 47280420 31890411
39542 31890411 19291545 19581370 25423305 27559850 26686339 26761812 28010100 30299254
39534 30299254 34223411 36274628 31700328 23932872 22302048 29019721 37685904 45543325
39526D5543325J0667086J1807818L653910p153132p959076k82168L600017Q25453
39518F0703233j068949j308651p003458j5861252j4513001P04197J5154403J5114248
39510E1920770M771467l155909m537446l366214j334435K557916N085248J23579
39502E2064976j2241653k2893176k2026985r224122N287816R821966K743986n697250
39494b164442m652953N083399J2595618R980799P07528n705502m412415J145722
39486A2577754M888495M988461L945387K826850r89183p867102j1265455m958728
39478D146479O356120J1012515N823432j28401N72398M309252N042898L565517
39470D0700210K028263k304645r586098j1311017k044085Q655807P589533k855233
$$ plain form
39526 45543325 56210411 68018229 71672139 64519007 56559931 56277763 59877780 60703233
39518 60703233 59634284 58325633 51322175 35460923 20947922 21652119 36806522 51920770
39510 51920770 56692237 53536328 48998882 45632668 44298233 46856149 51941397 52064976
39502 52064976 39823323 16930147 -5096838 -14320960 -9033144 788822 3532808 -2164442
39494 -2164442 -6817395 -1733996 10861622 20842421 21549949 15844447 11432032 12577754
39486 12577754 17466249 22454710 26400097 29226947 28237764 20370662 9105207 4146479
39478 4146479 10502599 21515114 27338546 27210145 27782543 32091795 37134693 40700210
39470 40700210 42728473 40423828 30837730 19526713 17482628 26138435 33727968 30872735
39462C0872735q990750o618838m139498n323824l412901M112024Q026241J582147
39454A6107336p500411p490235J109879P623746O132059J541354J413436O263245
39446B5200409R324481N180909k644237n771717l450743m717791j3011599j6061279
39438e951567k147363J7889591J9795642j629749k3722480k4852852r242684M753351
39430b5108111R298248Q907797O388734N38089n451219n474418o35250J302894
39422a0233236k291357n109553j768362M400882O235770J999761k711624j241654
39414a0719373O708765J3843516J2481913L165025o043183q994004o869012l640198
39406f6551p57998J661402K849921L134155L549996J958178m760463j2310124
$$ plain form
39462 30872735 21881985 15263147 11123649 5799825 2386924 6498948 14525189 16107336
39454 16107336 8606925 1116690 2226569 9850315 15982374 17523728 18937164 25200409
39446 25200409 34524890 39705799 37061562 31289845 27839102 23121311 10109712 -5951567
39438 -5951567 -8098930 9790661 29586303 27956554 4234074 -20618778 -29861462 -25108111
39430 -25108111 -15809863 -6902066 -513332 24757 -5426462 -10900880 -11536130 -10233236
39422 -10233236 -12524593 -17634146 -19402508 -15001626 -8765856 -6766095 -9477719 -10719373
39414 -10719373 -4010608 9832908 22314821 25479846 19436663 10442659 3573647 -66551
39406 -66551 -824549 836853 3686774 6820929 10370925 12329103 7568640 -4741484
39398d741484j0561396J462448J0310863N777053l315034j755715Q452646J0116277
39390A5745658m118051k0932506k3218800q577396J1625578K3546732J9190065
39383A3261280K216650j1611860q439110N819211J0765685j200827j3799646j0335663
39375a3324280K983297Q953410N566218M494403P997543N590768m701872r375698
39367H183789o86939R719012Q508858K94186k696874j301115m857767j1491832
39359E671318r549274J923480R912634P435075K475963K007696P77331o205528
39351A4448695j2236899j0294401n941558p121935r061000k586268Q258813J1410042
39343a3124511O543189M652288Q233337P162632k578500j0249337o653834K359187
$$ plain form
39398 -4741484 -15302880 -13840432 -3529569 2247484 -1067550 -2823265 5629381 15745658
39390 15745658 11627607 -9304899 -32523699 -41101095 -29475517 -5928785 13261280
39383 13261280 15477930 3866070 -4573040 1246171 12011856 10811029 -2988617 -13324280
39375 -13324280 -10340983 -1387573 4178645 8673048 16670591 22261359 17559487 8183789
39367 8183789 7496850 17215862 25724720 26018906 23322032 22020917 17163150 5671318
39359 5671318 -3877956 -1954476 7958158 15393233 17869196 19876892 20654223 14448695
39351 14448695 2211796 -8082605 -14024163 -21146098 -30207098 -32793366 -24534553 -13124511
39343 -13124511 -6581322 -1929034 6304303 13466935 10888435 639098 -6014736 -3655549
39335c655549O363913N405049O128934R002702P795675q45875j2928763k0589045
39327c322959j7617141m860370Q156622J1347991N221637r15520k138172k255294
39319f383206m224751n162000l603396k747432k951849j47777M650678M621662
39311a5948071K39828R38080P437698O361752p619529j8370645j1052227M004036
39303c4009078P428519R67450J327583J0129976J2401206M021453j415940L117421
39295C968590O777771P48952p395426p931803l688122j134149J701640Q453460
39287A500913J4183073J1359748O07580j0914581j6792736j3506783k607802N973055
39279a0197533J971113r422373j0044483O652421K3837518K2761284O959291n307980
$$ plain form
39335 -3655549 2708364 8113413 14242347 23245049 31040724 30194849 17266086 -3322959
39327 -3322959 -20940100 -25800470 -17643848 -6295857 -1074220 -1989740 -4127912 -6383206
39319 -6383206 -10607957 -15769957 -19373353 -22120785 -25072634 -25220411 -20569733 -15948071
39311 -15948071 -15708243 -14770163 -7332465 -970713 -8590242 -26960887 -38013114 -34009078
39303 -34009078 -26580559 -25613109 -24285526 -14155550 -1754344 2267109 851169 3968590
39295 3968590 10746361 11495313 4099887 -3831916 -7520038 -8654187 -6952547 1500913
39287 1500913 15683986 27043734 27651314 16736733 -56003 -13562786 -16170588 -10197533
39279 -10197533 -8226420 -17648793 -27693276 -21040855 2796663 25557947 32517238 27209258
39271B7209258n795783j928373j583552l442784k564502J954186N938864L733990
39263B3521304n403434j3223741j0213769L55175M210519l392298q519218J471355
39255a1194107J7258939J8871046K921369j3966037j7407748r353264O22071P354271
39247d893460J0079985Q436914L479534r60683j203327L047366Q525373J0224370
39239C6736072N073255l949844r227048o429294O13963M315066R3829j1304508
39231A5921491k3210848k4296433q113892J5728032K7886462K0945691O751263
39224C1611766j957202o656708j2896961j6773346j2852468o365420m687623m093121
39216c4671083J687860O735908J883949p145442p087671Q15284L260944k184663
$$ plain form
39271 27209258 21413475 19485102 17901550 14458766 11894264 13848450 19787314 23521304
39263 23521304 18117870 4894129 -5319640 -4964465 -753946 -4146244 -12665462 -11194107
39255 -11194107 6064832 24935878 27857247 13891210 -3516538 -12869802 -12247731 -4893460
39247 -4893460 5186525 13623439 17102973 16142290 14938963 17986329 26511702 36736072
39239 36736072 41809327 37859483 28632435 22203141 22817104 27132170 27225999 15921491
39231 15921491 -7289357 -31585790 -39699682 -23971650 3914812 24860503 31611766
39224 31611766 29654564 22997856 10100895 -6672451 -19524919 -25890339 -30577962 -34671083
39216 -34671083 -32983223 -26247315 -24363366 -31508808 -38596479 -37781195 -34520251 -36704914
39208c6704914m179962J852735P608075Q525377R804695J2600578J0760450N451764
39200A5718798O191833J1904172Q395685p578394j8857111j2637069Q78630O071363
39192A0087907L630951J767925p89310p913848j3078371r013629k055954j774750
39184a9139079l686280K327493J2710334J5382167R649019N054516L552737j123723
39176B4727184p932213q474754k892406n51933l101263j543793O480593J0621173
39168A7332588M529927l517117l622012J700824L556920o41459p078938j2452765
39160a92032j5122094j3392086p341487M8143N635375P336611L139230n980722
39152b5869062j2820479j0658353l491631j588022n676135m826675O694313J9857178
$$ plain form
39208 -36704914 -40884876 -39032141 -31424066 -22898689 -13093994 -493416 10267034 15718798
39200 15718798 21910631 33814803 42210488 34632094 15774983 3137914 4016544 10087907
39192 10087907 13718858 15486783 14697473 6783625 -6294746 -15308375 -17364329 -19139079
39184 -19139079 -22825359 -20497866 -7787532 7594635 17243654 22298170 25850907 24727184
39176 24727184 16794971 8320217 5427811 4875878 1774615 230822 6711415 17332588
39168 17332588 21862515 18345398 14723386 16424210 19981130 19339671 12260733 -192032
39160 -192032 -15314126 -28706212 -36047699 -35999556 -30364181 -23027570 -19888340 -25869062
39152 -25869062 -38689541 -49347894 -52839525 -54427547 -60103682 -64930357 -58236044 -38378866
39144c8378866K3697256J9548326J5367578J2560418P158016K8327l330803k397146
39136C4253106l196398q789233j3936267j2293812n716221k363784n373363p121604
39128b4537576J103199J4844841J9036315Q247498l432647j176221Q241596O140519
39120B8467524q301072j4692831k156452J3010468J0978723l269025r868397l920267
39112A0248671J478743j250150m964809m042732l983839q352612q907023J555909
39104a8217842J4981882J7358063P668362k353733m953615l058094p93947K447388
39096A3078464N839140M355986k292234n398618N91536P306984L283406p764050
39088A9000614j0881927k134339N484335K577010k265957K590132J1870491J0676876
$$ plain form
39144 -38378866 -14681610 4866716 20234294 32794712 39952728 39981055 36650252 34253106
39136 34253106 31056708 22267475 8331208 -3962604 -9678825 -12042609 -17415972 -24537576
39128 -24537576 -23434377 -8589536 10446779 18694277 15261630 14085409 22327005 28467524
39120 28467524 20166452 5473621 3317169 16327637 27306360 24037335 14168938 10248671
39112 10248671 11727414 10477264 5512455 1469723 -2514116 -10866728 -19773751 -18217842
39104 -18217842 -3235960 14122103 21790465 19436732 14483117 11425023 10631076 13078464
39096 13078464 18917604 23273590 20981356 15582738 16174274 23481258 26764664 19000614
39088 19000614 8118687 5984348 11468683 14045693 11779736 14369868 26240359 36917235
39080C6917235k959044j5358391j5923036p444762K459376R286189R415300Q91571
39072A7284438r738983j0994749j719551N673003K284922n404770o974437l030318
39064a2620445m77543L99516M263795J0088125J1733005P430526Q56108n629642
39056A6043445j1383752j2843696o756475K007447L597323m378285j3407091j4293682
39048d1414766o034631N859028J4865071J6780975J2346051P151533N066698K669280
39040A7289239m809474j3551818j4414077o318042J526188K927290K597492O693418
39032h059784J1983728J0261781j40412j2419396j8915858j7111566r927577k950146
39024d7279230J80900J274612M313889Q123073O727449r75819p106065m381436
$$ plain form
39080 36917235 33958191 18599800 2676764 -4767998 -2308622 6977567 16392867 17284438
39072 17284438 7545455 -3449294 -5168845 504158 2789080 -2615690 -9590127 -12620445
39064 -12620445 -13097988 -12698472 -8434677 1653448 13386453 20816979 21673087 16043445
39056 16043445 4659693 -8184003 -14940478 -12933031 -9335708 -13713993 -27121084 -41414766
39048 -41414766 -47449397 -41590369 -26725298 -9944323 2401728 9553261 14619959 17289239
39040 17289239 12479765 -1072053 -15486130 -21804172 -20277984 -17350694 -14753202 -8059784
39032 -8059784 3923944 14185725 14045313 1625917 -17289941 -34401507 -44329084 -47279230
39024 -47279230 -47098330 -45823718 -41509829 -33386756 -26659307 -27635126 -34741191 -39122627
39016c9122627M352678J0833764J2105524J1346394J0867510J0054409Q488378
39009B8926030N648136p21013j0042812j4737452q467207J817576J413115j1745228
39001g908855k1173776j2277357Q149476K0579487J6377337M051725n734116j1390271
38993i326350j5110433j5344085r821013j173756N516488Q324571Q346914O766708
38985b1820956N348156O829521J0701618J1147645M011170o001089j0339000p561381
38977g684316l301199J2899N649891J2863373J2921958P86888j4447138j7977257
38969a1174901o316042R715003J7657394J3870945K745493q112090j1423493n150241
38961A812068L848219N664021q46383o342574l689222K177059J428452o739977
$$ plain form
39016 -39122627 -34769949 -23936185 -11830661 -484267 10383243 20437652 28926030
39009 28926030 34574166 33853153 23810341 9072889 605682 2423258 3836373 -7908855
39001 -7908855 -29082631 -41359988 -33210512 -12631025 3746312 7798037 2063921 -9326350
38993 -9326350 -24436783 -39780868 -49601881 -50775637 -45259149 -36934578 -28587664 -21820956
38985 -21820956 -16472800 -9643279 1058339 12205984 16217154 10216065 -122935 -7684316
38977 -7684316 -10985515 -10972616 -5322725 7540648 20462606 21249494 6802356 -11174901
38969 -11174901 -17490943 -7775940 9881454 23752399 26497892 18385802 6962309 1812068
38961 1812068 5660287 11324308 10477925 4135351 446129 2623188 4051640 -2688337
38953b688337j2791470q853830K210030J0332331Q400269j088263p878874l740770
38945a6098914P594176J2784669M772441o744805p042085L323997Q963596J638311
38937I191386q583882r536148m424016l456367n552323j682598O765591P809706
38929i468651j350534q318150m260352L695767N962396M933278O314366O200265
38921C708385o51426p170727l151872O194833O351298k898404n961529L570071
38913i371J1502651L677641j3569283k2478681j5830909j763951Q067017Q203501
38905b2201385J053589n673395n973180k797016l931086q975992p862336L750791
38897e2610010J5647110J5999500O639505j548512k986092n0164L757911N877651
$$ plain form
38953 -2688337 -15479807 -24333637 -22123607 -11791276 -3391007 -4479270 -12358144 -16098914
38945 -16098914 -8504738 4279931 9052372 2307567 -4734518 -1410521 7553075 9191386
38937 9191386 607504 -8928644 -13352660 -16809027 -22361350 -24043948 -17278357 -9468651
38929 -9468651 -10819185 -19137335 -23397687 -19701920 -13739524 -8806246 -2491880 3708385
38921 3708385 3056959 -4113768 -7265640 -1070807 5280491 2382087 -3579442 -9371
38913 -9371 11493280 15170921 1601638 -20877043 -36707952 -38471903 -30404886 -22201385
38905 -22201385 -21147796 -26821191 -32794371 -35591387 -39522473 -48498465 -56360801 -52610010
38897 -52610010 -36962900 -20963400 -14323895 -15872407 -18858499 -18908663 -15150752 -9273101
38889i273101L702040j745153m648084k637671j440171n082569p449068j927245
38881c0501022O054317O354171J58898k338786J642817M566811K206071k59175
38873a2115898K152449O918937R100709P728325M948617K718678Q71879l702690
38865A8621006j3084679k0986530j6037417J758345J5717128J2705002R35608
38858c71537l883713j958454l610714p246844l157591L766716j972741j7280035
38850c5714913j8366945L981800K7467282K8202151J0647872n024929j0486700
38843G05618r868120n368694J935015N186778j34223p044036p196813l513615
38835b5298090k274162m48178P411175J6488068J7594428J0140605l86878j0615564
$$ plain form
38889 -9273101 -5571061 -7316214 -11964298 -14601969 -16042140 -21124709 -28573777 -30501022
38881 -30501022 -24446705 -18092534 -17933636 -20272422 -18629605 -14062794 -11856723 -12115898
38873 -12115898 -9963449 -3044512 6056197 13784522 18733139 21451817 22323696 18621006
38865 18621006 5536327 -15450203 -31487620 -29729275 -14012147 -1307145 -371537
38858 -371537 -4255250 -6213704 -9824418 -17071262 -20228853 -16462137 -18434878 -35714913
38850 -35714913 -54081858 -50100058 -22632776 5569375 16217247 11192318 705618
38843 705618 -9162502 -14531196 -12596181 -7409403 -7543626 -14587662 -21784475 -25298090
38835 -25298090 -27572252 -28020430 -20609255 -4121187 13473241 23613846 23226968 12611404
38827A2611404j5778029q343840P870985J3426008j743594j9517799j7256397
38820b8731262k17639J0151927J0887370J5001135K0125358R941337j1112055
38813B6046171j5343165N988896K4968468J6543983o498869j5872593p291761
38806B8541130J956432K018554k705885p508131j0315657o221137N490756J3636845
38798B4892907Q504227k088697m119358O51030k14200p024189q377887l339422
38790H884411l938475j2210330j3537972r29523J0564518N912428n985520n744640
38782a6985103O423401J0862154k071222j7931201j8501138n108559O458636P808153
38774b9044879N077135N810400Q002151N661248o27890m400718k550741J202036
$$ plain form
38827 12611404 -3166625 -11510465 -3639480 9786528 8042934 -11474865 -28731262
38820 -28731262 -28948901 -18796974 -7909604 7091531 27216889 37158226 26046171
38813 26046171 10703006 16691902 41660370 58204353 51705484 35832891 28541130
38806 28541130 30497562 32516116 29810231 22302100 11986443 5765306 11256062 24892907
38798 24892907 33397134 31308437 27189079 27840109 27625909 20601720 12223833 8884411
38790 8884411 4945936 -7264394 -20802366 -21731889 -11167371 -5254943 -11240463 -16985103
38782 -16985103 -10561702 300452 -1770770 -19701971 -38203109 -43311668 -36853032 -29044879
38774 -29044879 -23967744 -18157344 -10155193 -4493945 -5121835 -9522553 -12073294 -10871258
38766a0871258K112063l32695l725042n804835m859929k85414N086806N738273
38758a2942031o22091r094293j2049243p296553q5617L110888J667494J064340
38750c6247106O015853J3974832J7303478J2561869M768994k4343l008849q456505
38742F888223j3825361j1622887j429762Q027735J1242617J2105142J3361765
38735B4747472Q982025m376389j5449393j0466836N065414J0241089k609852j5494420
38727F39110q878455J0591249J8192131M057551j4351372j6054425k930468O028087
38719b706592J631663n635157l980101K295208J496501o005853q372889j393096
38711b2670316M634627J042316n980840n520202J936992P581214Q589512Q821434
$$ plain form
38766 -10871258 -8759195 -9091890 -12816932 -18621767 -23481696 -23767110 -18680304 -12942031
38758 -12942031 -13564122 -22658415 -34707658 -42004211 -42089828 -38978940 -37311446 -36247106
38750 -36247106 -30231253 -16256421 1047057 13608926 18377920 18353577 15344728 6888223
38742 6888223 -6937138 -18560025 -19989787 -11962052 -719435 11385707 24747472
38735 24747472 33729497 29353108 13903715 3436879 8502293 18743382 16133530 639110
38727 639110 -8239345 2351904 20544035 24601586 10250214 -5804211 -8734679 -2706592
38719 -2706592 -1074929 -6710086 -10690187 -8394979 -6898478 -12904331 -21277220 -22670316
38711 -22670316 -18035689 -16993373 -22974213 -28494415 -26557423 -18976209 -10386697 -1565263
38703a565263P632813p0031j1345167j4444852n268577N160087O115010J485006
38695a2300974M29129J412503l074336j0448775r941392l52339O717078M436745
38687b3122361M56838L783698J1231592J3636118Q378617p91923r789287j3561936
38679i778644o831389O434956J1707484K222654q324612l998894Q622655J0058428
38671A0112638j021703n660578M605644J4784698J1508732K860300J682742M331830
38663D3204303L32323q342149j2757159j3155209j4745961j4385005o523291L053433
38655b3318715M658561J700706M953700J2926236J3583806M088740o341442j2207268
38647D4324j5210580j3280181k944592P291049M162246p514174p993220P037284
$$ plain form
38703 -1565263 6067550 5997519 -5347648 -19792500 -25061077 -19900990 -13785980 -12300974
38695 -12300974 -11871845 -10459342 -13533678 -23982453 -33923845 -34276184 -27559106 -23122361
38687 -23122361 -22665523 -18881825 -7650233 5985885 14364502 13572579 3783292 -9778644
38679 -9778644 -16610033 -10175077 1532407 3755061 -4569551 -8568445 54210 10112638
38671 10112638 9090935 3430357 8036001 22820699 34329431 37189731 38872473 43204303
38663 43204303 43536626 35194477 22437318 9282109 -5463852 -19848857 -26372148 -23318715
38655 -23318715 -18660154 -16959448 -12005748 920488 14504294 18593034 12251592 44324
38647 44324 -15166256 -28446437 -31391029 -24099980 -19937734 -27451908 -35445128 -28407844
38639b8407844J8583978J3928510M676722M646122P776761K259940p892744j1051711
38631D519734p033814l362758j181955J787416K276909k002745m817443k278946
38623a2093602k154893r343314j2077655J263522J9839337K3052820J0351050
38616A8837265j10467M05167L099540J202914q00413l84980l207248j1165288
38608G876490j7036026j5576894r421211j064322J0200569K0362419K0447989
38601A5789014Q580696n674984j1903177p584934L056094J1086728O233087j1164733
38593H417791k3876950j6123932L564446J2565325O366903K708473J1016235J7433918
38585B2072209Q607132o965032j3185051q667417k471413J906498N858165O918457
$$ plain form
38639 -28407844 -9823866 4104644 8781366 13427488 21204249 23464189 15571445 4519734
38631 4519734 -2514080 -5876838 -7058793 -5271377 -2994468 -4997213 -9814656 -12093602
38623 -12093602 -14248495 -23591809 -35669464 -34405942 -14566605 8486215 18837265
38616 18837265 18726798 19131965 22231505 23434419 22634006 22249026 19041778 7876490
38608 7876490 -9159536 -24736430 -34157641 -35221963 -25021394 -4658975 15789014
38601 15789014 24369710 18694726 6791549 -793385 2262709 13349437 19582524 8417791
38593 8417791 -15459159 -31583091 -28018645 -15453320 -9086417 -6377944 4638291 22072209
38585 22072209 30679341 23714309 10529258 1861841 -609572 1296926 7155091 14073548
38577A4073548K360397l794730o250661n637594l706370J218775P198693O135292
38569A1597350l291954r245953l035950O923029Q198021K856807O70746J657911
38561A6330007m84878l558201q16741L892584O07404q378022r893303n97548P968633
38552E069935P583636L271435R70255k307697r762464j6262914j5753350j0098799
38544c7289963m057706K808691J2748798K2362993K4771766J7868483O540118
38537D5753180k548999o270046o004088m564908k263373K597126Q577016J0193431
38529D5469339N488348M25651L09437P06433n461114j4566496j5646901o847938
38521I876759J372594J406320k205940j782538L390270R703795J4334549J3668373
$$ plain form
38577 14073548 16433945 12639215 6388554 750960 -2955410 -1736635 5462058 11597350
38569 11597350 8305396 -940557 -3976507 2946522 11144543 14001350 14672096 16330007
38561 16330007 15845129 12286928 11470187 15362771 15970175 7592153 -2301150 -2898698 5069935
38552 5069935 12653571 15925006 16895261 14587564 4825100 -11437814 -27191164 -37289963
38544 -37289963 -41347669 -38538978 -25790180 -3427187 21344579 39213062 45753180
38537 45753180 43204181 36934135 30930047 26365139 24101766 26698892 35275908 45469339
38529 45469339 50957687 51383338 51692775 52399208 46938094 32371598 16724697 9876759
38521 9876759 11249353 12655673 10449733 8667195 12057465 21761260 36095809 49764182
38513D9764182M427279q535458j3135554n084556M704061M573188k720956p427615
38505B6564571q552441j1107718j2413944m889983Q053594J2812497N511495j467172
38497A4510899J385549O849890N081939J106918N269306J2752397Q282800r552997
38489D5686701k3771558k2273731j2447612o323199l174346L571550J1583888
38482g148307J3816719J1626250J1416845J1536632M800279p345732j5298716
38475B3403970j5932786j4837805j3266742n856338N952340J1635976P763568
38468a137817L830613N854346O981948K048328j963681r9317o34110r218538j4784653
38459i122881p434900J471574k870639j0464271n72759K0847536K5532523O736362
$$ plain form
38513 49764182 54191461 45656003 32520449 27435893 32139954 36713142 33992186 26564571
38505 26564571 18012130 6904412 -5509532 -10399515 -2345921 10466576 15978071 14510899
38497 14510899 15896448 22746338 27828277 28935195 34204501 46956898 55239698 45686701
38489 45686701 21915143 -358588 -12806200 -19129399 -22303745 -18732195 -7148307
38482 -7148307 6668412 18294662 29711507 41248139 46048418 38702686 23403970
38475 23403970 7471184 -7366621 -20633363 -26489701 -20537361 -8901385 -1137817
38468 -1137817 2692796 8547142 15529090 17577418 15613737 15514420 14880310 5661772 -9122881
38459 -9122881 -16557781 -15086207 -17956846 -28421117 -28993876 -8146340 17386183 24122545
38451B4122545r302857m290560O114882J930408q723059p444596J491390J27064
38443D025217j1278596j5562577p917199j302858j972642k1728J0580627J9172478
38435d277278J3592826k893614j6777540j8665882q254283P216256J5854289J0329235
38427c875991k164848o508518J115752R198805Q973771N651249N797781M855807
38419B3043808k740368r839828n647526O241261J1437607M470593o599071j4439029
38411E927447j9416620k1046039j4491766k70883J1941933J4700754J0818924
38404a1836250N741436l9788n510481m700867L944685J0385161M874378p163444
38396d305170j1771561n268537K970022M810672J164289l607871o054453k987224
$$ plain form
38451 24122545 14819688 10529128 16644010 18574418 9851359 2406763 3898153 4025217
38443 4025217 -7253379 -22815956 -30733155 -32036013 -34008655 -34030383 -23449756 -4277278
38435 -4277278 9315548 6421934 -10355606 -29021488 -37275771 -30059515 -14205226 -3875991
38427 -3875991 -6040839 -12549357 -11433605 -2234800 6738971 12390220 18188001 23043808
38419 23043808 20303440 10463612 4816086 11057347 22494954 26965547 20366476 5927447
38411 5927447 -13489173 -34535212 -49026978 -49297861 -37355928 -22655174 -11836250
38404 -11836250 -6094814 -6134602 -11645083 -16345950 -12401265 -2016104 2858274 -4305170
38396 -4305170 -16076731 -21345268 -18375246 -13564574 -12400285 -16008156 -22062609 -25049833
38388b5049833M483880P158281j831789j3548776j2353377J046914R888822P207013
38380b2998865M605895Q559956O445041j0265768k4801101j6316018P630663K0437847
38372b6702350J2966145O7009o882483j1762425j5571041q764635R349467K1664462
38364b5635851J5995816L572722K137392J0633275J3900190N714953n786617j1921428
38356H610452j1164716m716750N561808J4287825J4919177O237467p083526j8923817
38348G727920k3726720j8139124n873915K609280J248893l600540k027827N852714
38340c5929319J2018333J3273602J3356171J3258900Q615948j068424q053262
38333A5471949n455475L531131R220046O086873k433979q340755o905446j044921
$$ plain form
38388 -25049833 -20565953 -13407672 -15239461 -28788237 -41141614 -40094700 -30205878 -22998865
38380 -22998865 -18392970 -9833014 -3387973 -13653741 -38454842 -54770860 -47140197 -26702350
38372 -26702350 -13736205 -13669196 -20551679 -32314104 -47885145 -56649780 -47300313 -25635851
38364 -25635851 -9640035 -6067313 -3929921 6703354 20603544 26318497 20531880 8610452
38356 8610452 -2554264 -7271014 -1709206 12578619 27497796 33735263 26651737 7727920
38348 7727920 -15998800 -34137924 -40011839 -37402559 -36153666 -39754206 -41782033 -35929319
38340 -35929319 -23910986 -10637384 2718787 15977687 24593635 23525211 15471949
38333 15471949 10016474 13547605 22767651 28854524 26420545 18079790 11174344 10129423
38325A0129423J871544j624236o845945o581088K86961Q049377J1101369R025694
38317B5413099N085747J877055j200482o803872j5195305k0997853j7331625m663684
38309c3816920P593442J0788516N761271k69904k140960P99515O614699J0708106
38301F037765P289599l561356j2707884j1715326m131272o94724m090585n574990
38293b9148773J794535J2790289J6318063Q784507j845107m546719K847308J0094070
38285A7088173N154982j0098355j9239017j1135810L942695O214139p826198k1579797
38277c7479188k0998757j0148851k13641O135073J1435113J3329489Q990308M672793
38269b4277661Q474191J5028445J0250168o553071j7915219j1577005K377367
$$ plain form
38325 10129423 12000967 10376731 3530786 -3050302 -2763341 5286036 16387405 25413099
38317 25413099 30498846 32375901 31175419 24371547 9176242 -11821611 -29153236 -33816920
38309 -33816920 -26223478 -15434962 -9673691 -9943595 -12084555 -11285040 -4670341 6037765
38301 6037765 13327364 9766008 -2941876 -14657202 -18788474 -19483198 -23573783 -29148773
38293 -29148773 -27354238 -14563949 1754114 10538621 8693514 4146795 6994103 17088173
38285 17088173 22243155 12144800 -7094217 -18230027 -14287332 -8073193 -15899391 -37479188
38277 -37479188 -58477945 -68626796 -68840437 -62705364 -51270251 -37940762 -28950454 -24277661
38269 -24277661 -15803470 -775025 9475143 2922072 -14993147 -26570152 -24192785
38262b4192785P055254K476209J072784N248360N298731q14583k423377M358334
38254a921073P936714J153121m414657K598099J1991812P032587p061380r865754
38246G449469K027849J0610723N697569k277721l787708m179618p564564o155791
38238A820208K457164N264092m553864j2581959o596174Q58796n966638j5787300
38230c5085675p030045J4178252K0853943O946729n902158n185104l132349q437130
38222b2793537q983873M073680J6736111J2848903j662027j0835716j1792676
38215b2409135j0510737o032804M382476J2239151O622524p553758j4029099o395709
38207d3687091O034642J2147103R589179K461684l848442n714317l822171j507750
$$ plain form
38262 -24192785 -17137531 -14661322 -13588538 -8340178 -3041447 -3856030 -6279407 -1921073
38254 -1921073 6015641 7168762 2754105 5352204 17344016 24376603 17315223 7449469
38246 7449469 9477318 20088041 25785610 23507889 19720181 15540563 7975999 1820208
38238 1820208 4277372 9541464 4987600 -7594359 -14190533 -13331737 -19298375 -35085675
38230 -35085675 -42115720 -27937468 -7083525 -136796 -6038954 -11224058 -14356407 -22793537
38222 -22793537 -31777410 -27703730 -10967619 1881284 219257 -10616459 -22409135
38215 -22409135 -32919872 -38952676 -34570200 -22331049 -15708525 -23262283 -37291382 -43687091
38207 -43687091 -37652449 -25505346 -15916167 -13454483 -17302925 -23017242 -26839413 -28347163
38199b8347163J060726O296183J1514026R957189K526263j190365J890916L108964
38191F816739j905989m441332J211453N761298Q89214m944664j264604M697171
38183F819286L73972q474582o045047O168953J0182840j010127j4568903j7522527
38175b4076135r937635K386718J3545140J5255664M024353q311508o126126O777492
38167f462037J0990730k9227j2064891j3506994q857549l897824M500337J5726485
38159a3600970J9229669J0911101J491516j094959l605328j1463877j5219358
38152a3352206o068242P158230J0546248N021320L51287j789177m784044m887019
38144g803603L002982J2398863J1859577J389673r186394j4444330j5426666j2309383
$$ plain form
38199 -28347163 -27286437 -20990254 -9476228 480961 3007224 1816859 3707775 6816739
38191 6816739 4910750 469418 1680871 7442169 8331383 3386719 2122115 6819286
38183 6819286 7193258 -1281324 -7326371 -1157418 9025422 8015295 -6553608 -24076135
38175 -24076135 -34013770 -31627052 -18081912 -2826248 1198105 -7113403 -13239529 -6462037
38167 -6462037 4528693 4499466 -7565425 -21072419 -29929968 -33827792 -29327455 -13600970
38159 -13600970 5628699 16539800 18031316 16936357 13331029 1867152 -13352206
38152 -13352206 -19420448 -12262218 -1715970 3305350 3656637 1867460 -2916584 -7803603
38144 -7803603 -4800621 7598242 19457819 20847492 11661098 -2783232 -18209898 -30519281
38136c0519281o123509l115413o101304o267450M581717J8355741K0051314Q987435
38128a50750k164931o149585n901839l910248n03831N1788m332227m564688P205261
38119b0421050J9501167J4097132m528948j2712429k596096P939171O163428L183467
38111A0625842J0406935J7120858Q104526j0169345j8473989j1677986j172700
38104D764141M044130N007078M817775M377810M101129K118392n388850j5611115
38096H230490j7551740p218633L118152J176778o783336n995204L522480P670721
38088a3830292K42339r064517r222319J64863J2027446J7841419J1143487n314474
38080C987952j6625829j0292662O263785J3337162M553350o512744p011285J07336
$$ plain form
38136 -30519281 -36642790 -39758203 -45859507 -52126957 -47545240 -29189499 -9138185 -150750
38128 -150750 -2315681 -8465266 -14367105 -18277353 -18781184 -18729396 -23061623 -27626311 -20421050
38119 -20421050 -919883 13177249 8648301 -4064128 -6660224 1278947 7442375 10625842
38111 10625842 21032777 38153635 46258161 36088816 17614827 5936841 4764141
38104 4764141 8808271 13815349 18633124 23010934 27112063 29230455 23841605 8230490
38096 8230490 -9321250 -16539883 -13421731 -12244953 -19028289 -25023493 -21501013 -13830292
38088 -13830292 -13587953 -22652470 -31874789 -31709926 -19682480 -1841061 9302426 3987952
38080 3987952 -12637877 -22930539 -16666754 -3329592 1223758 -5288986 -12300271 -12192935
38072a2192935N891463Q593134J0048356P990123L74225q208172j1478762q985578
38064g968146l796131K681587Q607226R182321K191223o846758j0039649n652079
38056a1640406J769054O639819N080179k989398j0785889q706078L474718J2931410
38048d226591Q480127m540343j0857839m325367O839507J2598788J0984959M693795
38040A9647036m294507j2898128j5383747r127231K49454M089212P04402l326360
38032b0339869k351121J206427J224115k742117m615995q75266L800562L018255
38024b1675009k305305o034383o219279o630271q684358q013989j684795O065723
38016e5181666R070819P081440M944405O231148J0451286J4279963J3069039M078100
$$ plain form
38072 -12192935 -6301472 2291662 12340018 20330141 20704366 12496194 1017432 -7968146
38064 -7968146 -11764277 -9082690 -475464 8706857 10898080 4051322 -5988327 -11640406
38056 -11640406 -9871352 -3231533 1848646 -1140752 -11926641 -20632719 -17158001 -4226591
38048 -4226591 4253536 -286807 -11144646 -15470013 -8630506 3968282 14953241 19647036
38040 19647036 15352529 2454401 -12929346 -22056577 -21807123 -17717911 -17013509 -20339869
38032 -20339869 -22690990 -21484563 -20260448 -23002565 -27618560 -28493826 -24693264 -21675009
38024 -21675009 -23980314 -30014697 -36233976 -42864247 -51548605 -59562594 -61247389 -55181666
38016 -55181666 -46110847 -39029407 -34085002 -27853854 -17402568 -3122605 9946434 14024534
38008A4024534q488199j4447543q039088M041909R271955L616637m485584m825011
38000i330390L018462J0185670R049162J620693l137560j17886N844045O629274
37992B3761470J371657l903487n811686o533337o762037l282115L305849N723336
37984G869650J35014o836548p235426k664053M49582J246861K332920J990624
37976b711376k295421o048621l617415P46872j179434n862446r92706J4277622
37968g682925K4947390K0358560P373944k012516n306617n196167j632140K852459
37960C3701988j80058j2179388j9752884j2129392N28986P31475r446822j2004880
37952c0730975k164702M718920p71913p144915k181969P028541P191501Q48664
$$ plain form
38008 14024534 5536335 -8911208 -16950296 -12908387 -3636432 -19795 -4505379 -9330390
38000 -9330390 -6311928 3873742 12922904 14543597 11406037 11288151 17132196 23761470
37992 23761470 25133127 21229640 15417954 8884617 2122580 -1159535 2146314 7869650
37984 7869650 8004664 1168116 -6067310 -8731363 -8281781 -7034920 -4702000 -2711376
37976 -2711376 -5006797 -11055418 -14672833 -13925961 -15105395 -20967841 -21960547 -7682925
37968 -7682925 17264465 37623025 44996969 42984453 37677836 32481669 30849529 33701988
37960 33701988 33521930 21342542 1589658 -10539734 -10010748 -9279273 -18726095 -30730975
37952 -30730975 -32895677 -28176757 -28948670 -36093585 -38275554 -31247013 -24055512 -23206848
37944b3206848J89083N708375P151101K949204K500049P798364Q081381k214717
37936H955992j3359302j5691071j3848113j5805297j6804368o991156R757146
37929f3786169J8270913J3165006N517015N861242J0675939J0671083M639504
37922E014533j353403l673096l663031k973586j727333o15108r67351k563435
37914a2521810l459854k088641J230502M474536N738078N498298N517492M136757
37906H525358l489420j5959913k0812720p976175J3494443K2823551J3197613
37899I802737q13877m802800j639668r71363l594413n600169p512994q260383
37891b3392930k10530J6252157K2896539N953811j8403372k1339504j677055J2793478
$$ plain form
37944 -23206848 -23017765 -17309390 -10158289 -7209085 -4709036 3089328 11170709 8955992
37936 8955992 -4403310 -20094381 -33942494 -49747791 -66552159 -73543315 -63786169
37929 -63786169 -45515256 -32350250 -26833235 -20971993 -10296054 375029 5014533
37922 5014533 3661130 -11966 -3674997 -6648583 -8375916 -8991024 -9958375 -12521810
37914 -12521810 -15981664 -18070305 -16839803 -12365267 -6627189 -1128891 4388601 8525358
37906 8525358 5035938 -10923975 -31736695 -39712870 -26218427 -3394876 9802737
37899 9802737 8988860 4186060 2546392 1575029 -2019384 -7619553 -15132547 -23392930
37891 -23392930 -23603460 -7351303 15545236 21499047 3095675 -18243829 -19920884 -7127406
37883g127406O004158o993659q136533k015402r95550k858769O14547N904364
37875a5604250N240703K312476M555476P534939K982220m215675l923586l86296
37867a503993n356014j4338039j0239117P456613J7837204R730934j153397K290397
37859D724588J1606077P076000j0900237k2154443j5281460n42537O793538L828719
37851a4849755k434641n442023k432320N798142J3731862J4161649O085883l995520
37843A0623277j0910672j5652475j8048904j1799437N187672K0467697J8538030
37836a594812K438138p850157k041338O948469L424869p711681r971574q25331
37828a7183417O528663N046046K358386M863739P090860K984446l261968n054892
$$ plain form
37883 -7127406 -1123248 -8116907 -16253440 -18268842 -19264392 -22123161 -21508614 -15604250
37875 -15604250 -10363547 -8051071 -3495595 4039344 7021564 2805889 -1117697 -1503993
37867 -1503993 -6860007 -21198046 -31437163 -23980550 -6143346 3587588 2434191 4724588
37859 4724588 16330665 23406665 12506428 -9648015 -24929475 -25472012 -18678474 -14849755
37851 -14849755 -17284396 -22726419 -25158739 -19360597 -5628735 8532914 14618797 10623277
37843 10623277 -287395 -15939870 -33988774 -45788211 -40600539 -20132842 -1594812
37836 -1594812 843326 -7006831 -9048169 -2099700 1325169 -6386512 -16358086 -17183417
37828 -17183417 -10654754 -5608708 -3250322 1613417 8704277 11688723 8426755 3371863
37820C371863l399979j978045l95700M97855m437194j3290855j2123459N842207
37812b5913307K3391118J8051736n146109j7428179n265659J1595722R122062
37805H407384q258691j6923709p680128N171290P237564K515777K922402Q545075
37797A936964Q213796k081348j0933829o272324P154561J2527215K246704j2811052
37789a9313j7312302q573912L845137J0458451R061623L319579j014778n59549
37781g95064J895671P03818l744040m523188O27887M383618J062306m147005l740592
37772h276589J080853N489822R746933J3497619R388664n068976j6332597j1091820
37764a566091J418605J506429r409351j0668284K676036J0442246R85903q680924
$$ plain form
37820 3371863 -28116 -2006161 -2401861 -1904006 -6341200 -19632055 -31755514 -25913307
37812 -25913307 -2522189 15529547 10383438 -7044741 -12310400 -714678 8407384
37805 8407384 148693 -16775016 -24455144 -19283854 -12046290 -9530513 -6608111 1936964
37797 1936964 10150760 8069412 -2864417 -9136741 -1982180 10545035 12791739 -19313
37789 -19313 -17331615 -25905527 -22060390 -11601939 -2540316 779263 -235515 -795064
37781 -795064 1100607 1804425 -1939615 -6462803 -5834916 -1451298 -388992 -4535997 -8276589
37772 -8276589 -7195736 -1705914 8041019 21538638 30927302 25858326 9525729 -1566091
37764 -1566091 -147486 1358943 -8050408 -18718692 -16042656 -5600410 -4614507 -13295431
37756a3295431j350248J0968868O464447j0399577j5093439m7116J6091432J6709837
37748A0048773O372955k316431n800859o486210l507871M657734J3485872J5115544
37740C1569507O640054o838558j6336360j6020817q147337o57802J549520R17860
37732g323933J220654J577424K71490j89703K401323M489733K630276R32707M444171
37723A0454142Q490569M726357l944986o015047M85903M574866J55907m838789
37715A4088922l105691l95695m163787r014293n141981M614317Q873155O071534
37707A1826481N632348J0482529J1514203L504605n030750m869115K03870J352370
37699C4616541q09538j4408K197680j216665q492383r316671j318414M995612
$$ plain form
37756 -13295431 -14645679 -3676811 2787636 -7611941 -22705380 -22752496 -6661064 10048773
37748 10048773 16421728 14105297 8304438 1818228 -1689643 2968091 16453963 31569507
37740 31569507 38209561 31371003 15034643 -986174 -9133511 -9791313 -8241793 -7323933
37732 -7323933 -6103279 -4525855 -4254365 -4444068 -2042745 2446988 5077264 6009971 10454142
37723 10454142 18944711 23671068 19726082 13711035 14196938 18771804 18927711 14088922
37715 14088922 10983231 10587536 6423749 -2590544 -7732525 -3118208 5754947 11826481
37707 11826481 17458829 27941358 39455561 42960166 37929416 33060301 33264171 34616541
37699 34616541 33807003 33792595 35990275 34773610 26281227 16964556 15646142 20641754
37691B0641754K146782l591702l770222j280673l845672j0430987j3518030j1009481
37683b4658231p048576l567437P86449N185555P553509Q943595R926669N831368
37675B952901n763934j5913549j3307311j025614O733395M407007J81142Q51515
37667b0884448L784630O011021Q918482J0491301N195779m070241o399245l57608
37659B689671K205317l603656o026421L186471J2866971R613223q37245m297730
37651A5796601r69650j588750p271931r336015n202971M20078O732638J4431427
37643A3011427J5597289K466046j4982506j7227392k450948J0379444Q488397
37636A5281757k10167m044793l746217m563894n449141m761599o107204r824290
$$ plain form
37691 20641754 22788536 19196834 15426612 14145939 10300267 -130720 -13648750 -24658231
37683 -24658231 -31706807 -35274244 -34487795 -29302240 -21748731 -12805136 -2878467 2952901
37675 2952901 -2811033 -18724582 -32031893 -33057507 -26324112 -21917105 -21735963 -20884448
37667 -20884448 -17099818 -11088797 -2170315 8320986 13516765 9446524 3047279 2689671
37659 2689671 4894988 1291332 -4735089 -1548618 11318353 20931576 20094331 15796601
37651 15796601 14826951 13238201 5966270 -3369745 -8572716 -8152638 -1420000 13011427
37643 13011427 28608716 31074762 16092256 -1135136 -3586084 6793360 15281757
37636 15281757 15071590 11026797 7280580 2716686 -2732455 -7494054 -13601258 -23425548
37628b3425548q015253K754729J1841785P769773m435992r224478r57953J0341417
37620a3351520J2624972M245854p151590j2754938q860027J254621J0145068J1862346
37612a985214N777422l508839q636694m453163N752976J1157760N514260l810725
37604E807783n465684q05031j770720j1663799j8611785j2638114m23024L875728
37596d1694646k862938j0035840o427076Q622127K5082640L0310205J9818885
37589B2813357K549992o903035k909672O648994J0414829M261582p749288j7566770
37581A1559989j7413352n757688Q854756J4747717R576708J677916j060246J882355
37573B4068155P359556J1615552R063471l359482j8404573k3346835j5379410
$$ plain form
37628 -23425548 -31440801 -28686072 -16844287 -9074514 -13510506 -22734984 -23692937 -13351520
37620 -13351520 -726548 3519306 -3632284 -16387222 -25247249 -23992628 -13847560 -1985214
37612 -1985214 3792208 283369 -8353325 -12806488 -7053512 4104248 9618508 5807783
37604 5807783 342099 -462932 -2233652 -13897451 -32509236 -45147350 -45570374 -41694646
37596 -41694646 -44557584 -54593424 -61020500 -52398373 -27315733 2994472 22813357
37589 22813357 25363349 18460314 15550642 22199636 32614465 36876047 29126759 11559989
37581 11559989 -5853363 -11611051 -2756295 11991422 21568130 23246046 22185800 24068155
37573 24068155 31427711 43043263 52106734 48747252 30342679 6995844 -8383566
37566h383566m425304J255594K889375K520188j563065n939549j447090J0484137
37558d609280J3312851j403368j6933719j1991541Q690993K0307765J1480273
37551A8853974l795904q557150l232648R32349j403980n830810n908957k24227
37543i167353O381189P610008L225563j32728J562654L026200k402229j1456781
37535a353477j4697100j0081801n358661o393261r497386p297122J912033J2288028
37527d0478747J5748781R295344j200227n984555j995179L986840M363137j127729
37519a7392335q431441j4525501j5774889p610126P757808J9119565J9206775
37512a7650144J4454824J3618672J2674358K256826j4084947k2430485j8435407
$$ plain form
37566 -8383566 -12808870 -11553276 -8663901 -6143713 -7706778 -13646327 -15093417 -4609280
37558 -4609280 8703571 7300203 -9633516 -21625057 -12934064 7373701 18853974
37551 18853974 15058070 6500920 3268272 4200621 2796641 -3034169 -8943126 -9167353
37543 -9167353 -2786164 4823844 8049407 7916679 9479333 12505533 10103304 -1353477
37535 -1353477 -16050577 -26132378 -31491039 -37884300 -47381686 -54678808 -52766775 -40478747
37527 -40478747 -24729966 -15434622 -16634849 -22619404 -24614583 -20627743 -16264606 -17392335
37519 -17392335 -25823776 -40349277 -56124166 -63734292 -55976484 -36856919 -17650144
37512 -17650144 -3195320 10423352 23097710 25354536 11269589 -11160896 -29596303
37505b9596303j1535626p699694j150505J1820855K2078226J8646074M007775
37498F570802q535212r387387l16222R277092J0720206L282295n421887q306311
37490b116624o730730n425085k702378N868529J5369405J4371281K539721n603271
37482A5570848m20991Q584404O215371p540394j8855816j7982644p478302M681393
37474a7226131J2119371J1417040M033421k507203j033577O753115J2238261J0100009
37466C5894306K175785p989456j8176868k4042227j9691720o266248M813452L410196
37458b9872780o352273j0678331l444189P274013J1574039R908389Q269795O983431
37450f337906K389709k686236J76462J1530970J9674370J4751699J862051n773741
$$ plain form
37505 -29596303 -41131929 -48831623 -49982128 -38161273 -16083047 2563027 6570802
37498 6570802 -1964410 -11351797 -11668019 -2390927 8329279 11611574 6189687 -2116624
37490 -2116624 -8847354 -14272439 -16974817 -11106288 4263117 18634398 21174119 15570848
37482 15570848 15149857 23734261 29949632 22409238 3553422 -14429222 -21907524 -17226131
37474 -17226131 -5106760 6310280 10343701 7836498 6802921 13556036 25794297 35894306
37466 35894306 38070091 30080635 11903767 -12138460 -31830180 -38096428 -33282976 -29872780
37458 -29872780 -36225053 -46903384 -50347573 -43073560 -31499521 -21591132 -13321337 -6337906
37450 -6337906 -3948197 -6634433 -6457971 5072999 24747369 39499068 41361119 35587378
37442C5587378l638460J62757k660751r333675r736465q8153J0046644P777382
37434B8116657o038000j5609642j0198805J287006L854034j760413l738827j273635
37426e361625m205962j0556314n726347R703114J3966410j363038j2689796L99115
37418a5834443K0240251J6828440n427742j6311850p535742L4269m010742n216930
37410a7234489M119766Q966763m89891j0359665p736419k327615o585554j2808877
37402d4455981q664592l28955l09730l715929L025588J7173410K2560441J3696487
37394a019261P21807p278510r913701q449790l577699J014985K475647L502706
37386b2523816N476976L127715m567384o605819M042535J4828132J0173667k768232
$$ plain form
37442 35587378 31948918 32111675 29450924 20117249 10380784 10292631 20339275 28116657
37434 28116657 22078657 6469015 -3729790 -2442784 1411250 -349163 -4087990 -5361625
37426 -5361625 -9567587 -20123901 -25850248 -16147134 -2180724 -3543762 -16233558 -15834443
37418 -15834443 4405808 21234248 15806506 -505344 -8041086 -8006817 -12017559 -17234489
37410 -17234489 -13114723 -4147960 -4637851 -14997516 -22733935 -25061550 -31647104 -44455981
37402 -44455981 -53120573 -53449528 -53759258 -57475187 -54449599 -37276189 -14715748 -1019261
37394 -1019261 -297454 -7575964 -17489665 -25939455 -29517154 -28502169 -26026522 -22523816
37386 -22523816 -17046840 -13919125 -18486509 -25092328 -21049793 -6221661 3952006 1183774
37378A183774l996415O954268R982326k294302j1790361l588344J0676473J0465410
37370A7592829m654699j6730938j3705861r84576Q559431Q416873K946793J578303
37362C018155P414356J1985637N794955p291623j4237698j1455494q642943j1187365
37354b4602020j0768036o73341J0298422J0235320L143738K829118J1025510J4741845
37346A6230556O543038m049029m346617M155753Q695462J694103j1376564j9373439
$$ plain form
37378 1183774 -2812641 4141627 14123953 11829651 39290 -3549054 7127419 17592829
37370 17592829 12938130 -3792808 -17498669 -18483245 -9923814 -1506941 1439852 3018155
37362 3018155 10432511 22418148 28213103 20921480 6683782 -4771712 -13414655 -24602020
37354 -24602020 -35370056 -36043397 -25744975 -15509655 -12365917 -9536799 1488711 16230556
37346 16230556 22773594 18724565 14377948 18533701 27229163 28923266 17546702 -1826737
$$ [...]
##END NTUPLES=NMR SPECTRUM
##END=
