##TITLE=31Pdec_DEPH-Gly_sum
 D2O, 24 sc
 19.2.2026
##JCAMPDX= 6.0         $$ Bruker NMR JCAMP-DX V2.0
##DATA TYPE= NMR SPECTRUM
##DATA CLASS= NTUPLES
##ORIGIN= UXNMR, Bruker Analytische Messtechnik GmbH
##OWNER= root
$$ XWIN-NMR		Version 3.5
$$ Thu Feb 19 16:03:12 2026 Russian Standard Time (UT+4h)  she@DPX200
##.OBSERVE FREQUENCY= 81.013821
##.OBSERVE NUCLEUS= ^31P
##.ACQUISITION MODE= SIMULTANEOUS
##.ACQUISITION SCHEME= undefined
##.AVERAGES= 24
##.DIGITISER RES= 17
##SPECTROMETER/DATA SYSTEM= spect
##.PULSE SEQUENCE= zgpg30
##.SOLVENT NAME= CDCl3
##.SHIFT REFERENCE= (INTERNAL, CDCl3, 0, 198.062)
##AUDIT TRAIL= $$ (NUMBER, WHEN, WHO, WHERE, WHAT)
$$ ##TITLE= Audit trail, XWIN-NMR		Version 3.5
$$ ##JCAMPDX= 5.01
$$ ##ORIGIN= Bruker BioSpin GmbH
$$ ##OWNER= she
$$ F:/spectra/data/she/nmr/P31/2/pdata/1/auditp.txt
$$ ##AUDIT TRAIL=  $$ (NUMBER, WHEN, WHO, WHERE, WHAT)
(   1,<2026-02-19 16:01:47.39 +0400>,<she>,<DPX200>,
      <created by zg, POWCHK disabled, PULCHK disabled
       configuration hash MD5:
       00 E9 B6 7A A2 85 ED C7 34 08 36 98 17 FE 4E 26
       data hash MD5: 32K
       C1 DF 89 7E EF 36 48 8A 50 81 13 62 F6 E6 06 7D>)
(   2,<2026-02-19 16:01:56.57 +0400>,<she>,<DPX200>,
      <Start of raw data processing
       efp BC_mod = 2 LB = 1.5 FT_mod = 6 PKNL = 1 PHC0 = 1451.794 PHC1 = -10.89932 SI = 64K 
       data hash MD5: 64K
       C4 E0 33 78 0D 76 3D C0 7C 9A E0 07 5C 61 E3 6F>)
(   3,<2026-02-19 16:02:13.92 +0400>,<she>,<DPX200>,
      <pk PHC0 = -38.92309 PHC1 = 0 
       data hash MD5: 64K
       0C E0 32 03 16 B1 BA 66 C8 8C EC F9 FA 25 4F C9>)
(   4,<2026-02-19 16:02:19.45 +0400>,<she>,<DPX200>,
      <abs ABSG = 5 
       data hash MD5: 64K
       83 86 24 3A E2 C2 76 8E 59 ED E3 B2 E7 62 97 C9>)
$$ ##END=
$$ 
$$ hash MD5
$$ C9 E8 F6 41 CB 7D 80 73 50 F4 01 E7 E5 CE 4F 8B
##$RELAX= 
##$RELAX= 
##$RELAX= 
##$RELAX= 
##$RELAX= 
##$RELAX= 
##$RELAX= 
##$RELAX= 
$$ Bruker specific parameters
$$ --------------------------
##$DU= <F:/spectra>
##$EXPNO= 2
##$NAME= <P31>
##$PROCNO= 1
##$TYPE= <nmr>
##$USER= <she>
##$AMP= (0..31)
100 100 100 100 100 100 100 100 100 100 100 100 100 100 100 100 100 100 
100 100 100 100 100 100 100 100 100 100 100 100 100 100 
##$AQSEQ= 0
##$AQ_mod= 1
##$AUNM= <au_zg>
##$AUTOPOS= <>
##$BF1= 81.014009
##$BF2= 200.13
##$BF3= 200.13
##$BF4= 200.13
##$BF5= 200.13
##$BF6= 200.13
##$BF7= 200.13
##$BF8= 200.13
##$BYTORDA= 1
##$CFDGTYP= 0
##$CFRGTYP= 5
##$CHEMSTR= <none>
##$CNST= (0..31)
1 1 145 1 1 1 1 1 1 1 1 1 1 1 1 1 1 1 1 1 1 1 1 1 1 1 1 1 1 1 1 1 
##$CPDPRG= <waltz16>
##$CPDPRG1= <>
##$CPDPRG2= <waltz16>
##$CPDPRG3= <>
##$CPDPRG4= <mlev>
##$CPDPRG5= <mlev>
##$CPDPRG6= <mlev>
##$CPDPRG7= <mlev>
##$CPDPRG8= <mlev>
##$CPDPRGB= <>
##$CPDPRGT= <>
##$D= (0..31)
0 1 0 0 0 0 0 0 0 0.06 0 0.03 2e-05 3e-06 0 0 0.0002 0 0 0 0 0 0 0 0 0 
0 0 0 0 0 0 
##$DATE= 1771502506
##$DBL= (0..7)
120 120 120 11 120 120 24 19 
##$DBP= (0..7)
150 150 150 150 150 150 150 150 
##$DBP07= 0
##$DBPNAM0= <>
##$DBPNAM1= <>
$$ [...]
##$SUBNAM3= <"">
##$SUBNAM4= <"">
##$SUBNAM5= <"">
##$SUBNAM6= <"">
##$SUBNAM7= <"">
##$SUBNAM8= <"">
##$SUBNAM9= <"">
##$SW= 400.765351723535
##$SWIBOX= (0..15)
0 1 3 0 0 0 0 0 0 0 0 0 0 0 0 0 
##$SW_h= 32467.5324675325
##$TD= 32768
##$TD0= 1
##$TE= 0
##$TE2= 300
##$TE3= 300
##$TEG= 300
##$TL= (0..7)
0 120 53 12 22 120 120 120 
##$TP= (0..7)
150 150 150 150 150 150 150 150 
##$TP07= 0
##$TPNAME0= <>
##$TPNAME1= <>
##$TPNAME2= <>
##$TPNAME3= <>
##$TPNAME4= <>
##$TPNAME5= <>
##$TPNAME6= <>
##$TPNAME7= <>
##$TPOAL= (0..7)
0.5 0.5 0.5 0.5 0.5 0.5 0.5 0.5 
##$TPOFFS= (0..7)
0 0 0 0 0 0 0 0 
##$TUNHIN= 0
##$TUNHOUT= 0
##$TUNXOUT= 0
##$USERA1= <user>
##$USERA2= <user>
##$USERA3= <user>
##$USERA4= <user>
##$USERA5= <user>
##$V9= 5
##$VALIST= <valist>
##$VCLIST= <CCCCCCCCCCCCCCC>
##$VD= 0
##$VDLIST= <DDDDDDDDDDDDDDD>
##$VPLIST= <PPPPPPPPPPPPPPP>
##$VTLIST= <TTTTTTTTTTTTTTT>
##$WBST= 1024
##$WBSW= 4
##$XGAIN= (0..3)
0 0 0 0 
##$XL= 0
##$YL= 0
##$YMAX_a= 11001
##$YMIN_a= -11711
##$ZGOPTNS= <>
##$ZL1= 120
##$ZL2= 120
##$ZL3= 120
##$ZL4= 120
##$ABSF1= 198.0616
##$ABSF2= -202.7028
##$ABSG= 5
##$ABSL= 3
##$ALPHA= 0
##$AQORDER= 0
##$ASSFAC= 0
##$ASSFACI= 0
##$ASSFACX= 0
##$ASSWID= 0
##$AUNMP= <proc_1d>
##$AZFE= 0.1
##$AZFW= 0.5
##$BCFW= 0
##$BC_mod= 2
##$BYTORDP= 0
##$COROFFS= 0
##$CY= -3
##$DATMOD= 1
##$DC= 0
##$DFILT= <>
##$DTYPP= 0
##$F1P= 0
##$F2P= 0
##$FCOR= 1
##$FTSIZE= 65536
##$FT_mod= 6
##$GAMMA= 0
##$GB= 0
##$INTBC= 1
##$INTSCL= 9.790993e-09
##$ISEN= 30
##$LB= 1.5
##$LEV0= 0
##$LPBIN= 0
##$MAXI= 10000
##$MC2= 0
##$MEAN= 0
##$ME_mod= 0
##$MI= 50
##$NCOEF= 0
##$NC_proc= -6
##$NLEV= 6
##$NOISF1= 182.463
##$NOISF2= 159.3651
##$NSP= 0
##$NTH_PI= 0
##$NZP= 0
##$OFFSET= 198.0616
##$PC= 4
##$PHC0= 1412.871
##$PHC1= -10.89932
##$PH_mod= 1
##$PKNL= yes
##$PPARMOD= 0
##$PSCAL= 0
##$PSIGN= 0
##$REVERSE= no
##$SF= 81.0140089999434
##$SI= 65536
##$SIGF1= 159.3651
##$SIGF2= -187.1042
##$SINO= 113.3802
##$SIOLD= 16384
##$SREGLST= <1H.CDCl3>
##$SSB= 0
##$STSI= 65536
##$STSR= 0
##$SW_p= 32467.5324675325
##$SYMM= 0
##$S_DEV= 0
##$TDeff= 32768
##$TDoff= 0
##$TI= <>
##$TILT= no
##$TM1= 0
##$TM2= 0
##$TOPLEV= 0
##$USERP1= <user>
##$USERP2= <user>
##$USERP3= <user>
##$USERP4= <user>
##$USERP5= <user>
##$WDW= 1
##$XDIM= 65536
##$YMAX_p= 344497454
##$YMIN_p= -15006505
$$ End of Bruker specific parameters
$$ ---------------------------------
##NTUPLES= NMR SPECTRUM
##VAR_NAME=  FREQUENCY,     SPECTRUM/REAL,   SPECTRUM/IMAG
##SYMBOL=    X,             R,               I
##VAR_TYPE=  INDEPENDENT,   DEPENDENT,       DEPENDENT
##VAR_FORM=  AFFN,          ASDF,            ASDF
##VAR_DIM=   65536,         65536,           65536
##UNITS=     HZ,            ARBITRARY UNITS, ARBITRARY UNITS
##FACTOR=    0.49542278885378, 1,            1
##FIRST=     16045.7642231865, 0,            0
##LAST=      -16421.768244346, 0,            0
##MIN=       -16421.768244346, -15006505,    0
##MAX=       16045.7642231865, 344497454,    0
$$ Real data points
##PAGE= N=1
##DATA TABLE= (X++(R..R)), XYDATA
$$ [...]
$$ plain form
41859 -239064 -493889 -1095006 -1290768 -861569 -168656 396958 665981 578859 196922 -233658
41849 -233658 -525421 -821088 -1358645 -1995853 -2252210 -1872995 -1127684 -477414 -123209 40626
41839 40626 176473 319656 387810 317328 199977 242262 526890 873749 1029262 925268
41829 925268 642067 223714 -276749 -641357 -632453 -314480 -8940 112715 178902 316853
41819 316853 448819 494802 544536 668713 753787 705894 653891 749565 897521 888725 699725
41808 699725 466813 270179 145119 179979 339344 288190 -276826 -1121367 -1618623 -1475347
41798 -1475347 -1046048 -830880 -907512 -982231 -792027 -326457 176177 362761 91752 -296332
41788 -296332 -278525 180046 545748 444848 106567 -165874 -532722 -1155530 -1548582 -1089914
$$ packed form
41859b39064k54825o01117j95762M29199O92913N65614K69023q7122l81937m30580
41849b33658k91763k95667n37557o37208k56357L79215P45311O50270L54205J63835
41839D0626J35847J43183O8154p0482j17351M2285K84628L46859J55513j03994
41829I25268k83201m18353n00463l64608Q904L17973L05540J21655O6187J37951
41819C16853J31966M5983M9734J24177Q5074m7893n2003R5674J47956q796j89000
41808F99725k32912j96634j25060L4860J59365n1154n65016q44541m97256J43276
41798a475347M29299K15168p6632p4719J90204M65570N02634J86584k71009l88084
41788b96332J7807M58571L65702j00900l38281k72441l66848o22808l93052M58668
$$ plain form
41778 -1089914 -101734 307333 -345505 -1282680 -1545358 -1157659 -769986 -590732 -297939
41769 -297939 174620 404907 111665 -456729 -919751 -1196206 -1347833 -1278280 -855728 -206161
41759 -206161 344411 594545 598372 497654 343116 98800 -252231 -648338 -979681 -1149855
41749 -1149855 -1091038 -749612 -143852 529527 949355 943041 662094 385412 204919 41037
41739 41037 -95855 -92691 -18583 -162745 -604722 -915477 -557057 423384 1311689 1418633
41729 1418633 738010 -140690 -650686 -679864 -498930 -447302 -695100 -1140225 -1442349 -1272695
41719 -1272695 -668635 -84472 60511 -132510 -171695 190673 643462 727170 376656 -102308
41709 -102308 -435067 -522494 -301345 205039 675268 682710 277480 89064 552453 1209458
$$ packed form
41778a089914R88180M09067o52838r37175k62678L87699L87673J79254K92793
41769b97939M72559K30287k93242n68394m63022k76455j51627O9553M22552O49567
41759b06161N50572K50134L827j00718j54538k44316l51031l96107l31343j70174
41749a149855N8817L41426O05760O73379M19828o314k80947k76682j80493j63882
41739D1037j36892L164P4108j44162m41977l10755L58420R80441Q88305J06944
41729A418633o80623q78700n09996k9178J80934N1628k47798m45125l02124J69654
41719a272695O04060N84163J44983j93021l9185L62368M52789Q3708l50514m78964
41709a02308l32759q7427K21149N06384M70229P442m05230j88416M63389O57005
$$ plain form
41699 1209458 1161382 199758 -900484 -1346063 -1231011 -1196132 -1449610 -1576458 -1277187 -807371
41689 -807371 -489519 -186405 371876 973624 1092980 620714 -6885 -470795 -931602 -1542587
41679 -1542587 -2001394 -1935737 -1483901 -1103083 -939679 -782915 -577813 -551129 -750251 -840669
41669 -840669 -557886 -101660 132240 44557 -135305 -196563 -158716 -197757 -465546 -909667
41659 -909667 -1208479 -1017974 -394092 158953 208359 -135005 -413809 -405225 -318803 -450245
41649 -450245 -829394 -1243930 -1464063 -1382116 -1038935 -604776 -296255 -232184 -337534 -396083
41639 -396083 -229955 134525 485340 647150 664580 694368 742097 642634 342900 62393
41629 62393 60891 327524 609001 689798 538859 224192 -186509 -610795 -907524 -908364 -540638
$$ packed form
41699A209458m8076r61624j100242m45579J15052L4879k53478j26848K99271M69816
41689h07371L17852L03114N58281O01748J19356m72266o27599m63910m60807o10985
41679a542587m58807O5657M51836L80818J63404J56764K05102K6684j99122r0418
41669h40669K82783M56226K33900q7683j79862o1258L7847l9041k67789m44121
41659i09667k98812J90505O23882N53045M9406l43364k78804Q584Q6422j31442
41649d50245l79149m14536k20133Q1947L43181M34159L08521O4071j05350n8549
41639c96083J66128L64480L50815J61810J7430K9788M7729r9463k99734k80507
41629F2393j502K66633K81477Q0797j50939l14667m10701m24286k96729q40L67726
$$ plain form
41618 -540638 40911 501120 630848 601965 756937 1113065 1276375 950022 328928 -169286
41608 -169286 -378033 -379300 -213918 102741 377316 390840 247324 250840 400261 340496 -73257
41597 -73257 -488216 -532522 -316359 -190069 -186425 -13685 458380 977417 1189230 951208
41587 951208 364446 -319918 -794966 -867168 -606778 -240700 119513 529135 984008 1305583
41577 1305583 1328186 1078403 688784 258491 -94587 -178912 87066 493765 732701 757375
41567 757375 759747 769340 510960 -208396 -1146751 -1841221 -2071126 -1937999 -1584759 -1065427
41557 -1065427 -476296 8308 293718 422369 460350 477453 633192 1068534 1651893 2027836
41547 2027836 1995934 1662392 1176947 595836 122665 135614 664243 1080116 714227 -292257
$$ packed form
41618e40638N81549M60209J29728k8883J54972L56128J63310l26353o21094m98214
41608a69286k08747j267J65382L16659K74575J3524j43516L516J49421n9765m13753
41597g3257m14959m4306K16163J26290L644J72740M72065N19037K11813k38022
41587I51208n86762o84364m75048p2202K60390L66078L60213M09622M54873L21575
41577A305583K2603k49783l89619m30293l53078q4325K65978M06699K38936K4674
41567G57375K372R593k58380p19356r38355o94470k29905J33127L53240N19332
41557a065427N89131M84604K85410J28651L7981J7103J55739M35342N83359L75943
41547B027836l1902l33542m85445n81111m73171J2949N28629M15873l65889j006484
$$ plain form
41537 -292257 -1110425 -1181562 -728178 -298256 -145644 -172457 -202093 -136618 -1835 59706
41527 59706 -33923 -122757 -4840 176392 43721 -420784 -730690 -570029 -333069 -656025
41517 -656025 -1553468 -2361614 -2515914 -2102250 -1608102 -1372430 -1374472 -1397185 -1271729 -1013940
41507 -1013940 -784114 -705403 -742618 -799526 -874366 -1006015 -1081719 -844562 -183325 640193
41497 640193 1163999 1179376 969086 999356 1358370 1629869 1426208 913375 595118 645975
41487 645975 749544 634793 453472 463225 613085 694874 698855 711107 590098 108818 -580581
41476 -580581 -958612 -731488 -185515 186461 250871 275542 502747 844675 1016672 875368
41466 875368 552073 260108 60229 -100024 -190854 -130107 -10919 -63649 -300009 -443568
$$ packed form
41537b92257q18168p1137M53384M29922J52612k6813k9636O5475J34783O1541
41527E9706r3629q8834J17917J81232j32671m64505l09906J60661K36960l22956
41517f56025q97443q08146j54300M13664M94148K35672k042k2713J25456K57789
41507a013940K29826P8711l7215n6908p4840j31649p5704K37157O61237Q23518
41497F40193N23806J5377k10290L0270L59014K71499k03661n12833l18257N0857
41487F45975J03569j14751j81321R753J49860Q1789L981J2252j21009m81280o89399
41476e80581l78031K27124N45973L71976O4410K4671K27205L41928J71997j41304
41466H75368l23295k91965j99879j60253r0830O0747J19188n2730k36360j43559
$$ plain form
41456 -443568 -373072 -354697 -560567 -638928 -211234 366901 318309 -427886 -986877 -643428
41446 -643428 241710 819586 883816 920448 1202344 1375842 1038772 336596 -234675 -424103
41436 -424103 -418177 -498859 -669461 -682442 -400067 -22863 146296 119005 203354 504738 664498
41425 664498 288645 -508207 -1226634 -1570334 -1646161 -1595058 -1328117 -758400 -86730 333131
41415 333131 350230 136573 9549 192416 658216 1118454 1227190 887502 337820 -90738
41405 -90738 -237094 -121963 144771 353650 239076 -244312 -725457 -729827 -243120 234728
41395 234728 297544 109114 104509 368463 572333 489302 276241 141963 -11768 -389763
41385 -389763 -871934 -1056971 -760485 -256074 73162 166488 234022 384930 506097 512951
$$ packed form
41456d43568P0496J8375k05870p8361M27694N78135m8592p46195n58991L43449
41446f43428Q85138N77876O4230L6632K81896J73498l37070p02176n71271j89428
41436d24103N926q0682j70602j2981K82375L77204J69159k7291Q4349L01384J59760
41425F64498l75853p96852p18427l43700p5827N1103K66941N69717O71670M19861
41415C33131J7099k13657j27024J82867M65800M60238J08736l39688n49682m28558
41405i0738j46356J15131K66734K08879j14574m83388m81145m370M86707M77848
41395B34728O2816j88430m605K63954K03870q3031k13061j34278j53731l77995
41385c89763m82171j85037K96486N04411L29236R3326O7534J50908J21167O854
$$ plain form
41375 512951 526597 679566 850443 763705 354457 -117826 -380488 -447227 -507720 -632457
41365 -632457 -746253 -821422 -888028 -861966 -597691 -174273 103226 109814 87218 250773 424234
41354 424234 312826 -40907 -385123 -700699 -1119551 -1453167 -1272860 -580037 23992 63364
41344 63364 -255471 -464428 -479212 -476640 -405971 -87913 320491 433781 224010 86558
41334 86558 255032 539358 755066 1000250 1281993 1255977 717390 108021 92820 706756
41324 706756 1323862 1476340 1297620 1049316 642406 -48568 -682239 -732710 -261529 2120
41314 2120 -478294 -1371931 -1888308 -1688618 -1133464 -719521 -587459 -632208 -784688 -964396
41304 -964396 -931645 -482533 198874 598846 386127 -221695 -668181 -587855 -108013 307337
$$ packed form
41375E12951J3646J52969J70877q6738m09248m72283k62662o6739o0493j24737
41365f32457j13796p5169o6606K6062K64275M23418K77499O588k2596J63555J73461
41354D24234j11408l53733l44216l15576m18852l33616J80307O92823O04029L9372
41344F3364l18835k08957j4784K572P0669L18058M08404J13290k09771j37452
41334H6558J68474K84326K15708K45184K81743k6016n38587o09369j5201O13936
41324G06756O17106J52478j78720k48304m06910o90974o33671n0471M71181K63649
41314B120m80414q93637n16377J99690N55154M13943J32062m4749j52480j79708
41304i64396L2751M49112O81407L99972k12719o07822m46486Q0326M79842M15350
$$ plain form
41294 307337 279221 -155786 -582939 -611771 -279750 -23548 -215450 -758959 -1176079 -1064902
41284 -1064902 -444907 295759 728370 695392 399408 211320 320976 536152 479832 30934
41274 30934 -487575 -628062 -278759 280218 721434 910447 815133 424832 -87614 -320471
41264 -320471 -35917 457366 589866 230209 -153266 -102577 321308 781831 1143823 1433269
41254 1433269 1512735 1178003 566851 126847 69180 113785 -78919 -444824 -686930 -742822
41244 -742822 -797643 -856405 -594745 207663 1234123 1851313 1783087 1407111 1285778 1512694
41234 1512694 1687787 1497373 1093483 814539 730637 651775 470877 278153 165394 111110
41224 111110 66338 -5467 -167684 -422227 -599553 -542185 -391108 -425166 -571323 -402743
$$ packed form
41294C07337k8116m35007m27153k8832L32021K56202j91902n43509m17120J11177
41284a064902O19995P40666M32611l2978k95984j88088J09656K15176n6320m48898
41274C0934n18509j40487L49303N58977M41216J89013r5314l90301n12446k32857
41264c20471K84554M93283J32500l59657l83475N0689M23885M60523L61992K89446
41254A433269P9466l34732o11152m40004n7667M4605j92704l65905k42106n5892
41244g42822n4821n8762K61660Q02408J026460O17190o8226l75976j21333K26916
41234A512694J75093j90414m03890k78944q3902p8862j80898j92724j12759n4284
41224A11110m4772p1805j62217k54543j77326N7368J51077l4058j46157J68580
$$ plain form
41214 -402743 206169 733415 607176 -66837 -703897 -997625 -1077134 -990444 -532269 267632
41204 267632 899324 912228 468539 84995 -5937 50133 143702 346095 615948 687890
41194 687890 408773 -22586 -326066 -505754 -744065 -1012130 -1022553 -607068 41169 591098
41184 591098 906197 1039120 1003627 733463 267764 -170719 -346227 -199632 137719 434316
41174 434316 466624 179897 -192584 -297615 -57187 204608 162729 -64572 -55072 352022
41164 352022 822500 921110 598834 198403 71586 292816 695663 1071839 1300238 1335922
41154 1335922 1160951 828228 541864 539106 764936 776384 195056 -749761 -1359027 -1219976
41144 -1219976 -634478 -199400 -157742 -310651 -377536 -213041 212619 784308 1214800 1262328
$$ packed form
41214d02743O08912N27246j26239o74013o37060k93728p9509Q6690M58175P99901
41204B67632O31692J2904m43689l83544r0932N6070R3569K02393K69853P1942
41194F87890k79117m31359l03480j79688k38311k68065j0423M15485O48237N49929
41184E91098L15099J32923l5493k70164m65699m38483j75508J46595L37351K96597
41174D34316L2308k86727l72481j05031K40428K61795m1879k27301R500M07094
41164C52022M70478R8610l22276m00431j26817K21230M02847L76176K28399L5684
41154A335922j74971l32723k86364k758K25830J1448n81328r44817o09266J39051
41144a219976N85498M35078M1658j52909o6885J64495M25660N71689M30492M7528
$$ plain form
41134 1262328 987009 638994 337235 57105 -111047 23804 411456 677241 512979
41125 512979 -9740 -611450 -1110098 -1427310 -1463835 -1168872 -673203 -208899 90180 257093
41115 257093 422793 698989 1023609 1127955 848243 490860 599413 1222547 1719773 1550125
41105 1550125 985625 687803 774976 757493 343026 -142894 -220306 206977 867371 1377960
41095 1377960 1412800 935156 386644 366204 993561 1835979 2523306 3080187 3526962 3599706
41085 3599706 3186326 2690444 2547852 2592324 2303835 1555340 740087 246360 153236 373038
41075 373038 739820 983121 938947 780177 763040 809086 652282 313406 36685 -189304
41065 -189304 -582534 -1024042 -1083827 -724018 -465202 -620456 -848485 -785592 -659605 -835318
$$ packed form
41134A262328k75319l48015l01759k80130j68152J34851L87652K65785j64262
41125E12979n22719o01710m98648l17212l6525K94963M95669M64304K99079J66913
41115B57093J65700K76196L24620J04346k79712l57383J08553O23134M97226j69648
41105A550125n64500k97822Q7173j7483m14467m85920p7412M27283O60394N10589
41095A377960L4840m77644n48512k0440O27357Q42418O87327N56881M46775P2744
41085C599706m13380m95882j42592M4472k88489p48495q15253m93727r3124K19802
41075C73038L66782K43301m4174j58770j7137M6046j56804l38876k76721k25989
41065a89304l93230m41508n9785L59809K58816j55254k28029O2893J25987j75713
$$ plain form
41055 -835318 -1117285 -1032704 -589018 -232148 -173446 -246956 -362780 -601452 -839402 -749829
41045 -749829 -277704 262384 638475 881279 953976 687004 204547 -22128 182355 371368
41035 371368 124347 -287150 -284588 163243 502303 355060 -47884 -228999 15308 508259
41025 508259 926731 1112811 1239421 1573677 1980622 1907110 1129906 275087 147488 674447
41015 674447 1056228 956076 904789 1323468 1778958 1649881 1049434 524488 165034 -350269
41005 -350269 -976754 -1227886 -912408 -395508 -28346 183592 226603 -69682 -584989 -796651
40995 -796651 -453216 25826 167300 81655 72746 -12761 -475562 -1038510 -1084737 -576325
40985 -576325 -112359 -1402 103425 436044 589278 172102 -443428 -563165 -141982 194050
$$ packed form
41055h35318k81967Q4581M43686L56870N8702p3510j15824k38672k37950Q9573
41045g49829M72125N40088L76091K42804P2697k66972m82457k26675K04483J89013
41035C71368k47021m11497K562M47831L39060j47243m02944j81115K44307M92951
41025E08259M18472J86080J26610L34256M06945p3512p77204q54819j27599N26959
41015F74447L81781j00152n1287M18679M55490j29077o00447n24946l59454n15303
41005c50269o26485k51132L15478N16900L67162K11938M3011k96285n15307k11662
40995g96651L43435M79042J41474q5645q909q5507m62801n62948m6227N08412
40985e76325M63966J10957J04827L32619J53234m17176o15530j19737M21183L36032
$$ plain form
40975 194050 34123 -359329 -534680 -434674 -376551 -700826 -1532542 -2646089 -3452327 -3386437
40965 -3386437 -2530782 -1662174 -1407063 -1475896 -1072529 -19747 956659 1214221 1023070
40956 1023070 1027708 1211479 1005932 362192 11522 398404 941833 829889 133819 -444789
40946 -444789 -662261 -891138 -1271185 -1415761 -1123864 -777911 -735623 -793263 -591150 -180064
40936 -180064 172503 439165 725785 938403 922204 771600 679031 617819 467561 292995
40926 292995 189825 19812 -357075 -739807 -861357 -881164 -1154507 -1551150 -1483985 -709128
40916 -709128 310340 988609 1228848 1284653 1306499 1246814 1038121 690833 320811 153202
40906 153202 351284 781534 1107928 1169488 1102508 1068216 1064586 1042644 978144 768494 304049
$$ packed form
40975A94050j59927l93452j75351J00006N8123l24275q31716j113547q06238O5890
40965c386437Q55655Q68608K55111o8833M03367J052782R76406K57562j91151
40956A023070M638J83771k05547o43740l50670L86882N43429j11944o96070n78608
40946d44789k17472k28877l80047j44576K91897L45953M2288n7640K02113M11086
40936a80064L52567K66662K86620K12618j6199j50604r2569o1212j50258j74566
40926B92995j03170j70013l76887l82732j21550j9807k73343l96643O7165P74857
40916g09128J019468O78269K40239N5805K1846n9685k08693l47288l70022j67609
40906A53202J98082M30250L26394O1560o6980l4292l630k1942o4500k09650m64445
$$ plain form
40895 304049 -269356 -612939 -650503 -719233 -1085307 -1503897 -1475866 -846448 -412 475014
40885 475014 270817 -361609 -754759 -427992 371768 893701 695828 36681 -559998 -815738
40875 -815738 -671984 -139964 549334 934470 800342 487667 425546 525854 383358 -31685
40865 -31685 -247777 128537 969111 1779403 2114088 1870875 1353581 1014059 998745 1035347
40855 1035347 873363 625980 462198 208802 -376388 -1087759 -1439291 -1289482 -916679
40846 -916679 -527899 -127748 126789 -55003 -567742 -820629 -406700 439071 1216116 1672189
40836 1672189 1768143 1493499 997624 621815 505768 388336 63954 -221363 -154000 109613
40826 109613 189276 90100 112397 238696 103587 -377548 -812753 -919648 -903019 -1015173
$$ packed form
40895C04049n73405l43583l7564o8730l66074m18590K8031O29418Q46036M75426
40885D75014k04197o32426l93150L26767P99760N21933j97873o59147n96679k55740
40875h15738J43754N32020O89298L85136j34128l12675o2121J00308j42496m15043
40865c1685k16092L76314Q40574Q10292L34685k43213n17294l39522j5314L6602
40855A035347j61984k47383j63782k53396n85190p11371l51532J49809L72803
40846i16679L88780M00151K54537j81792n12739k52887M13929Q45771P77045M56073
40836A672189R5954k74644m95875l75809j16047j17432l24382k85317O7363K63613
40826A09613P9663r9176K2297J26299j35109m81135m35205j06895J6629j12154
$$ plain form
40816 -1015173 -1090665 -856158 -473113 -375648 -635371 -847602 -697539 -344301 -116485 -51219
40806 -51219 74590 379098 740243 984455 1038366 887654 542335 98393 -281245 -513084
40796 -513084 -631228 -629255 -389334 117291 651083 872814 663675 181171 -330012 -644807
40786 -644807 -567523 -76159 527519 839912 803182 739018 854929 940358 716616 295478
40776 295478 48100 119876 327835 509423 719283 1017758 1258416 1202739 756735 34837
40766 34837 -717383 -1215013 -1275141 -990437 -704974 -692270 -864966 -913036 -742021 -640786
40756 -640786 -920009 -1481239 -1909589 -1972815 -1824772 -1648972 -1344029 -796165 -304849 -372534
40746 -372534 -1031120 -1701020 -1865839 -1620364 -1348361 -1115693 -718966 -204114 65581 -82350
$$ packed form
40816a015173p5492K34507L83045R7465k59723k12231J50063L53238K27816O5266
40806e1219J25809L04508L61145K44212N3911j50712l45319m43942l79638k31839
40796e13084j18144J973K39921N06625N33792K21731k09139m82504n11183l14795
40786f44807P7284M91364O03678L12393l6730o4164J15911Q5429k23742m21138
40776B95478k47378P1776K07959J81588K09860K98475K40658n5677m46004p21898
40766C4837p52220m97630o0128K84704K85463J2704j72696m8070J71015J01235
40756f40786k79223n61230m28350o3226J48043J75800L04943N47864M91316o7685
40746c72534o58586o69900j64819K45475K72003K32668L96727N14852K69695j47931
$$ plain form
40736 -82350 -365816 -435697 -314560 -286282 -491938 -804305 -1022979 -1039297 -847335 -542631
40726 -542631 -331787 -424883 -826319 -1240838 -1252313 -671410 254890 1016987 1289463 1202141
40716 1202141 1129530 1257851 1452600 1513917 1397108 1135098 712756 161098 -316058 -483505
40706 -483505 -348466 -177154 -212142 -441711 -647320 -602753 -240907 260968 546797 384621
40696 384621 393 -20323 661344 1678214 2297534 2238554 1944037 1942089 2156241 2088938
40686 2088938 1576750 1037311 901742 1079351 1161710 962566 618168 267527 -75682 -326437
40676 -326437 -286002 75584 488691 702342 797372 984984 1186264 1080848 610006 172228
40666 172228 151976 424527 559412 429384 331340 469178 620284 507067 277099 312783
$$ packed form
40736h2350k83466o9881J21137K8278k05656l12367k18674j6318J91962L04704
40726e42631K10844r3096m01436m14519j1475N80903R26300P62097K72476q7322
40716A202141p2611J28321J94749O1317j16809k62010m22342n51658m77156j67447
40706d83505J35039J71312l4988k29569k05609M4567L61846N01875K85829j62176
40696C84621l84228k0716O81667J016870O19320n8980k94517j948K14152o7303
40686B088938n12188n39439j35569J77609Q2359j99144l44398l50641l43209k50755
40676c26437M0435L61586M13107K13651R5030J87612K01280j05416m70842m37778
40666A72228k0252K72551J34885j30028r8044J37838J51106j13217k29968L5684
$$ plain form
40656 312783 646179 883441 749797 420361 188378 63670 -80611 -136354 170465 842177
40646 842177 1459143 1560976 1110077 530344 285420 399579 429297 2184 -669921 -1032785
40636 -1032785 -952109 -896187 -1184773 -1423936 -1071867 -313315 130554 -36542 -433370 -695632
40626 -695632 -854239 -908123 -623841 -63447 212473 -102841 -512919 -388438 158999 595729
40616 595729 846529 1200904 1512680 1247547 399720 -320439 -437726 -292246 -394876 -691141
40606 -691141 -796161 -559560 -59330 604641 1160363 1161606 555992 -26063 13153 468609
40596 468609 721563 659679 661630 801203 680345 100634 -622653 -1126602 -1344930 -1302497
40586 -1302497 -1017663 -732679 -790638 -1110091 -1209920 -949815 -801190 -1123700 -1602739 -1731175
$$ packed form
40656C12783L33396K37262j33644l29436k31983j24708j44281n5743L06819O71712
40646H42177O16966J01833m50899n79733k44924J14159K9718m27113o72105l62864
40636a032785Q0676N5922k88586k39163L52069P58552M43869j67096l96828k62262
40626f95632j58607n3884K84282N60394K75920l15314m10078J24481N47437M36730
40616E95729K50800L54375L11776k65133q47827p20159j17287J45480j02630k96265
40606f91141j05020K36601N00230O63971N55722J243o05614n82055L9216M55456
40596D68609K52954o1884J951J39573j20858n79711p23287n03949k18328M2433
40586a302497K84834K84984n7959l19453r9829K60105J48625l22510m79039j28436
$$ plain form
40576 -1731175 -1467441 -1068137 -643981 -281088 -236923 -533829 -661398 -207203 470254 754801
40566 754801 726312 961814 1541015 1965499 2030223 2026111 1997730 1576170 778580 227117
40556 227117 209241 198961 -228849 -635937 -452785 42944 143492 -262303 -738345 -1082626
40546 -1082626 -1374325 -1453946 -1077524 -497580 -201060 -103467 301375 966167 1206909 754822
40536 754822 180719 -9221 -48688 -304245 -567208 -422787 106634 733576 1325199 1699944
40526 1699944 1426202 422366 -532335 -557595 156773 546125 28789 -890793 -1427307
40517 -1427307 -1367693 -949821 -381934 209098 645194 795089 673374 336124 -132663 -474317
40507 -474317 -373825 143585 673583 904639 875589 673025 235209 -326388 -577365 -291256
$$ packed form
40576a731175K63734L99304M24156L62893M4165k96906j27569M54195O77457K84547
40566G54801k8489K35502N79201M24484O4724m112k8381m21560p97590n51463
40556B27117j7876j0280m27810m07088J83152M95729J00548m05795m76042l44281
40546a082626k91699p9621L76422N79944K96520R7593M04842O64792K40742m52087
40536G54822n74103j89940l9467k55557k62963J44421N29421O26942N91623L74745
40526A699944k73742j003836r54701k5260P14368L89352n17336r19582n36514
40517a427307N9614M17872N67887N91032M36096J49895j21715l37250m68787l41654
40507d74317J00492N17410N29998K31056k9050k02564m37816n61597k50977K86109
$$ plain form
40497 -291256 127606 144176 -177936 -365242 -288227 -219713 -207129 23685 426242 480281
40487 480281 -22690 -538530 -549146 -392693 -744272 -1472996 -1669513 -870930 305234 971210
40477 971210 976039 790498 706294 557763 130172 -511189 -1138658 -1596433 -1861828 -1978114
40467 -1978114 -1942726 -1636224 -964125 -140558 339826 198950 -267987 -532022 -420768 -140064
40457 -140064 167211 525917 798945 652416 12099 -736783 -1199803 -1401199 -1585537 -1826772
40447 -1826772 -2065973 -2329429 -2614009 -2695352 -2376105 -1862102 -1563322 -1518914 -1348603 -848540
40437 -848540 -309558 -65248 3417 224322 533875 454314 -277039 -1293903 -1964902 -2058884
40427 -2058884 -1885869 -1806115 -1788055 -1561405 -1087860 -669875 -562870 -660061 -677319 -525716
$$ packed form
40497b91256M18862J6570l22112j87306P7015O8514J2584K30814M02557N4039
40487D80281n02971n15840j0616J56453l51579p28724j96517P98583J176164O65976
40477I71210M829j85541q4204j48531m27591o41361o27469m57775k65395j16286
40467a978114L5388L06502O72099Q23567M80384j40876m66937k64035J11254K80704
40457a40064L07275L58706K73028j46529o40317p48882m63020k01396j84338k41235
40447a826772k39201k63456k84580q1343L19247N14003K98780M4408J70311N00063
40437h48540N38982K44310O8665K20905L09553p9561p31353j016864o70999r3982
40427b058884J73015P9754J8060K26650M73545M17985J07005r7191j7258J51603
$$ plain form
40417 -525716 -345380 -249243 -225297 -280078 -476400 -759527 -903896 -743386 -355758 79254
40407 79254 504811 940760 1299149 1434031 1360544 1221025 990369 458318 -328133 -835579
40397 -835579 -598097 77515 372728 9273 -392540 -264910 23626 -265150 -1052490 -1492965
40387 -1492965 -1212920 -806937 -847835 -1024369 -739977 -116494 217208 120149 100069 499574
40377 499574 1058992 1382928 1396433 1185987 759826 171771 -378137 -740988 -906591 -776430
40367 -776430 -120224 1022370 2089414 2421324 1920352 1141916 730815 837128 1090201
40358 1090201 1124162 1065221 1334114 1916206 2128631 1421454 204672 -561573 -515282 -141458
40348 -141458 104427 306458 548380 502381 -20162 -576981 -653242 -379943 -200244 -115324
$$ packed form
40417e25716J80336R6137K3946n4781j96322k83127j44369J60510L87628M35012
40407G9254M25557M35949L58389J34882p3487j39519k30656n32051p86451n07446
40397h35579K37482O75612K95213l63455m01813J27630K88536k88776p87340m40475
40387a492965K80045M05983m0898j76534K84392O23483L33702r7059k0080L99505
40377D99574N59418L23936J3505k10446m26161n88055n49908l62851j65603J30161
40367g76430O56206J142594J067044L31910n00972p78436m11101J06313K53073
40358A090201L3961n8941K68893N82092K12425p07177j216782p66245M6291L73824
40348a41458K45885K02031K41922m5999n22543n56819p6261K73299J79699Q4920
$$ plain form
40338 -115324 158448 473372 346268 -227029 -642245 -497728 -54793 267533 421843 547965
40328 547965 640043 668686 754583 935116 940389 466130 -414422 -1281234 -1733039 -1625472
40318 -1625472 -1087464 -447198 -41291 43761 -2352 4643 41922 9986 -91155 -226647
40308 -226647 -433999 -722793 -952074 -944321 -682424 -305187 43995 296017 454652 598384
40298 598384 824056 1109458 1280323 1180640 831153 373862 -66703 -398550 -515236 -347809
40288 -347809 35897 441345 664484 603853 320294 29963 -11710 306391 863944 1412621
40278 1412621 1764752 1892053 1864798 1711913 1378116 871076 408126 267872 453610 668694
40268 668694 725445 796316 1082627 1406598 1403877 1032562 602360 331259 165902 50159
$$ packed form
40338a15324K73772L14924j27104n73297m15216J44517M42935L22326J54310J26122
40328E47965R2078K8643Q5897J80533N273m74259q80552q66812m51805J07567
40318a625472N38008O40266M05907Q5052m6113O995L7279l1936j01141j35492
40308b26647k07352k88794k29281P753K61897L77237L49182K52022J58635J43732
40298E98384K25672K85402J70865r9683l49487m57291m40565l31847j16686J67427
40288c47809L83706M05448K23139o0631k83559k90331m1673L18101N57553N48677
40278A412621L52131J27301k7255j52885l33797n07040m62950j40254J85738K15084
40268F68694N6751P0871K86311L23971k721l71315m30202k71101j65357j15743
$$ plain form
40258 50159 69540 256628 509772 777012 1072881 1248976 1034817 433436 -175964 -468298
40248 -468298 -481176 -387831 -241894 -114335 -201747 -551777 -880845 -894107 -619855 -237061
40238 -237061 219432 745670 1154816 1253300 1104830 886510 620997 288101 57898 147475
40228 147475 542000 1066554 1586318 1914841 1742708 1002640 163471 -207491 -92621 107997
40218 107997 249883 558622 1086567 1505182 1564280 1419772 1358966 1449639 1572421 1591481
40208 1591481 1419615 1103339 866478 865158 920941 758537 488030 523983 981467 1479793
40198 1479793 1635390 1448410 1108933 739910 476467 507067 841618 1229630 1425808 1354648
40188 1354648 990533 376112 -170514 -223487 219487 692363 901636 1058901 1371862 1593980
$$ packed form
40258E0159J9381J87088K53144K67240K95869J76095k14159o01381o09400k92334
40248d68298j2878R3345J45937J27559q7412l50030l29068j3262K74252L82794
40238b37061M56493N26238M09146R8484j48470k18320k65513l32896k30203Q9577
40228A47475L94525N24554N19764L28523j72133p40068q39169l70962J14870K00618
40218A07997J41886L08739N27945M18615N9098j44508o0806R0673J22782J9060
40208A591481j71866l16276k36861j320N5783j62404k70507L5953M57484M98326
40198A479793J55597j86980l39477l69023k63443L0600L34551L88012J96178p1160
40188A354648l64115o14421n46626n2973M42974M72876K09273J57265L12961K22118
$$ plain form
40178 1593980 1410755 967530 632018 442842 173141 -189201 -375238 -195356 278147
40169 278147 805942 1070294 829084 215569 -268155 -295075 -98026 -92753 -328769 -589062
40159 -589062 -798454 -964532 -902017 -444594 172204 554399 701635 894050 1080764 859021
40149 859021 126401 -669118 -1043923 -896196 -338949 486171 1280976 1651327 1529960 1285415
40139 1285415 1219756 1186587 887276 337001 -152794 -310012 -100678 242267 307713 -148573
40129 -148573 -823051 -1059225 -578726 203290 757766 1072299 1427290 1755989 1639787 959468
40119 959468 214462 7987 354324 693314 605564 352109 537399 1279646 1983018 2072106
40109 2072106 1690904 1375672 1241637 961800 516329 415934 968355 1742389 2069043
$$ packed form
40178A593980j83225m43225l35512j89176k69701l62342j86037J79882M73503
40169B78147N27795K64352k41210o13515m83724k6920J97049N273k36016k60293
40159e89062k09392j66078O2515M57423O16798L82195J47236J92415J86714k21743
40149H59021p32620p95519l74805J47727N57247Q25120P94805L70351j21367k44545
40139A285415o5659l3169k99311n50275m89795j57218K09334L42945O5446m56286
40129a48573o74478k36174M80499P82016N54476L14533L54991L28699j16202o80319
40119I59468p45006k06475L46337L38990q7750k53455J85290P42247P03372Q9088
40109B072106l81202l15232j34035k79837m45471j00395N52421P74034L26654
$$ plain form
40100 2069043 1796292 1266144 799411 519712 476409 570810 457182 -144894 -1051073 -1766483
40090 -1766483 -2013620 -1909066 -1682960 -1455395 -1258032 -1054413 -736186 -268945 181262
40081 181262 422624 486247 528330 545859 391603 37530 -374156 -718697 -941564 -967464
40071 -967464 -780976 -586526 -647585 -921490 -1058989 -833619 -415235 -174269 -351616 -914698
40061 -914698 -1549401 -1789071 -1396724 -703965 -353832 -593609 -1022123 -1164977 -1064829 -1060362
40051 -1060362 -1153018 -951865 -277465 477937 754315 421129 -200305 -786272 -1233487 -1448742
40041 -1448742 -1227601 -545153 213279 588874 556689 426424 274247 -151936 -844744 -1248622
40031 -1248622 -883031 -24518 598583 687170 605061 778512 1207277 1614109 1780023 1631896
$$ packed form
40100B069043k72751n30148m66733k79699m3303R4401j13628o02076r06179p15410
40090a766483k47137J04554K26106K27565J97363K03619L18227M67241M50207
40081A81262K41362O3623M2083J7529j54256l54073m11686l44541k22867k5900
40071i67464J86488J94450o1059k73905j37499K25370M18384K40966j77347n63082
40061i14698o34703k39670L92347O92759L50133k39777m28514j42854J00148M467
40051a060362r2656K01153O74400P55402K76378l33186o21434n85967m47215k15255
40041a448742K21141O82448P58432L75595l2185j30265j52177m26183o92808m03878
40031a248622L65591Q58513O23101Q8587q2109J73451M28765M06832J65914j48127
$$ plain form
40021 1631896 1225994 756418 426729 248435 91344 -78327 -198264 -341135 -710657
40012 -710657 -1356607 -2086074 -2671925 -2937531 -2677092 -1841578 -860310 -377693 -485993 -582037
40002 -582037 -232345 180991 34506 -616364 -1146897 -1215604 -1018805 -769172 -452330 -191132
39992 -191132 -348141 -989480 -1586292 -1589493 -1127109 -813526 -932758 -1105679 -823212 -97236
39982 -97236 558318 705710 391226 -37413 -369056 -627632 -781724 -606376 8397 756292
39972 756292 1146248 1011716 618293 289611 120953 72915 127278 249502 339927 315001
39962 315001 145528 -200030 -683864 -1035112 -893836 -264755 360299 515168 245441 -99312
39952 -99312 -379083 -690947 -1003472 -1117487 -1003706 -858755 -747639 -486119 -12898 389904
$$ packed form
40021A631896m05902m69576l29689j78294j57091j69671j19937j42871l69522
40012g10657o45950p29467n85851k65606K60439Q35514R81268M82617j08300r6044
40002e82037L49692M13336j46485o50870n30533o8707J96799K49633L16842K61198
39992a91132j57009o41339n96812l201M62384L13583j19232j72921K82467P25976
39982i7236O55554J47392l14484m28639l31643k58576j54092J75348O14773P47895
39972G56292L89956j34532l93423l28682j68658m8038N4363J22224R0425k4926
39962C15001j69473l45558m83834l51248J41276O29081O25054J54869k69727l44753
39952i9312k79771l11864l12525j14015J13781J44951J11116K61520M73221M02802
$$ plain form
39942 389904 445468 245996 52403 -98859 -335207 -603346 -660857 -399208 38396 464773
39932 464773 796203 998375 1066089 1073147 1088976 1043561 829895 528853 348103 326752 291615
39921 291615 137081 -41077 -129357 -116688 22185 357815 834228 1239492 1417745 1350444
39911 1350444 1025145 483939 35677 71132 527444 883114 874753 835220 1043177 1165573
39901 1165573 808128 279889 214137 606801 855883 701721 497450 494803 499827 416608
39891 416608 525399 912756 1145525 898825 489296 374644 489146 525830 554576 824869
39881 824869 1168385 1178675 908381 817427 987945 939653 396909 -241405 -479421 -394122
39871 -394122 -367743 -414003 -212198 262401 573293 404077 -991 -179665 -41177 131526
$$ packed form
39942C89904N5564j99472j93593j51262k36348k68139n7511K61649M37604M26377
39932D64773L31430K02172O7714P058J5829m5415k13666l01042j80750k1351l5137
39921B91615j54534j78158q8280J2669J38873L35630M76413M05264J78253o7301
39911A350444l25299n41206m48262L5455M56312L55670q361l9533K07957J22396
39901A165573l57445n28239o5752L92664K49082j54162k04271k647N024q3219
39891D16608J08791L87357K32769k46700m09529j14652J14502L6684K8746K70293
39881H24869L43516J0290k70294r0954J70518m8292n42744o38314k38016Q5299
39871c94122K6379m6260K01805M74599L10892j69216m05068j78674J38488J72703
$$ plain form
39861 131526 168526 218907 452917 821087 1199583 1520869 1607475 1157414 194250 -671738
39851 -671738 -831278 -451486 -256271 -533654 -804934 -589304 -52186 345715 476083 506720
39841 506720 506822 424018 296368 208056 147365 106193 161539 274092 218527 -59908 -242176
39830 -242176 -47841 371435 729977 1049357 1453034 1760287 1719037 1480308 1389519 1419639
39820 1419639 1268446 926162 656375 467750 133359 -258606 -328511 -61840 109019 22775
39810 22775 30631 299065 441374 204312 22727 404235 1100829 1404513 1088600 612606
39800 612606 488600 809443 1333916 1713694 1669903 1210127 653359 267114 -20389 -367294
39790 -367294 -650939 -640808 -430367 -371823 -587762 -822189 -814398 -601885 -396453 -324135
$$ packed form
39861A31526L7000N0381K34010L68170L78496L21286Q6606m50061r63164q65988
39851f71738j59540L79792J95215k77383k71280K15630N37118L97901J30368L0637
39841E06720J02q2804j27650q8312o0691m1172N5346J12553n5565k78435j82268
39830b42176J94335M19276L58542L19380M03677L07253m1250k38729r0789L0120
39820A419639j51193l42284k69787j88625l34391l91965o9905K66671J70859q6244
39810B2775P856K68434J42309k37062j81585L81508O96594L03684l15913m75994
39800F12606j24006L20843N24473L79778m3791m59776n56768l86245k87503l46905
39790c67294k83645J0131K10441N8544k15939k34427P791K12513K05432P2318
$$ plain form
39780 -324135 -347511 -345470 -242184 -109403 -103871 -247375 -354764 -268942 -66402 87609 182011
39769 182011 300939 397322 306824 -10991 -364647 -480560 -219642 314965 849112 1169342
39759 1169342 1289292 1308105 1168770 768360 294019 140779 375653 560266 291358 -297228
39749 -297228 -737484 -712484 -186259 674554 1483606 1797990 1564405 1190831 955717 638415
39739 638415 18152 -607751 -826105 -745666 -745769 -809638 -646613 -321169 -174222 -188985 -34760
39728 -34760 255708 266830 -52156 -224234 -16136 184246 32488 -203793 -64717 457511
39718 457511 972284 1127878 829680 312346 91271 472457 1028333 1022397 455917 108973
39708 108973 351710 629265 525259 575800 1322084 2150212 1994446 903783 -10271 -111909
$$ packed form
39780c24135k3376K041J03286J32781N532j43504j07389Q5822K02540J54011R4402
39769A82011J18928R6383r0498l17815l53656j15913K60918N34607N34147L20230
39759A169342J19950J8813j39335m00410m74341j53240K34874J84613k68908n88586
39749b97228m40256K5000N26225Q60813Q09052L14384k33585l73574k35114l17302
39739F38415o20263o25903k18354Q0439j03o3869J63025L25444J46947j4763J54225
39728c4760K90468J1122l18986j72078K08098K00382j51758k36281J39076N22228
39718D57511N14773J55594k98198n17334k21075L81186N55876n936n66480l46944
39708A08973K42737K77555j04006N0541P46284Q28128j55766j090663r14054j01638
$$ plain form
39698 -111909 130996 127357 -44033 -88525 -91093 -287183 -666196 -1102140 -1545188 -1870559
39688 -1870559 -1880348 -1655322 -1551433 -1633565 -1485611 -859413 -156796 96743 -12831 18634
39678 18634 362868 717860 837752 792983 671795 403242 37399 -85957 273459 798492
39668 798492 829102 121900 -785680 -1150430 -875045 -531982 -523030 -559216 -198565 412576
39658 412576 764692 799116 961614 1388613 1581809 1160610 509959 282684 521902 699203
39648 699203 493337 134143 6511 256475 806646 1449868 1854097 1743573 1217202 731414
39638 731414 653182 915986 1158832 1100609 751405 376074 289148 572445 947021 1012417
39628 1012417 635704 15693 -608979 -1128653 -1407685 -1225371 -599476 -30167 -102296 -775951
$$ packed form
39698a11909K42905l639j71390m4492k568j96090l79013m35944m43048l25371
39688a870559r789K25026J03889q2132J47954O26198P02617K53539j09574L1465
39678A8634L44234L54992J19892m4769j21188k68553l65843j23356L59416N25033
39668G98492L0610p07202r07580l64750K75385L43063Q952l6186L60651O11141
39658D12576L52116L4424J62498M26999J93196m21199o50651k27275K39218J77301
39648F99203k05866l59194j27632K49964N50171O43222M04229j10524n26371m85788
39638G31414p8232K62804K42846n8223l49204l75331q6926K83297L74576O5396
39628A012417l76713o20011o24672n19674k79032J82314O25895N69309p2129o73655
$$ plain form
39618 -775951 -1305362 -1024885 -75200 846691 1353866 1676902 2063579 2247048 1832280 1016194
39608 1016194 488327 587293 942204 1086026 1052718 1094927 1120157 842286 396730 370043
39598 370043 1100908 2203071 2912456 2794667 2084693 1454694 1441840 1960580 2380324 2201310
39588 2201310 1586590 1066600 844815 684055 400496 77801 -249327 -702631 -1184311
39579 -1184311 -1281888 -822065 -217751 44647 15493 50506 202777 260761 248992 418037
39569 418037 738620 858857 685612 621743 1001900 1555522 1686270 1157739 305414 -359572
39559 -359572 -602631 -555357 -472772 -435776 -301700 33343 402162 519637 325288 13004
39549 13004 -261519 -500903 -662355 -562288 -120058 443600 789518 770869 492154 166618
$$ packed form
39618g75951n29411K80477R49685R21891N07175L23036L86677J83469m14768q16086
39608A016194n27867R8966L54911J43822l3308M2209K5230k77871m45556k6687
39598C70043P30865J102163P09385j17789p09974o29999j2854N18740M19744j79014
39588B201310o14720n19990k21785j60760k83559l22695l27128m53304m81680
39579a184311r7577M59823O04314K62398k9154L5013J52271N7984j1769J69045
39569D18037L20583J20237j73245o3869L80157N53622J30748n28531q52325o64986
39559c59572k43059M7274Q2585L6996J34076L35043L68819J17475j94349l12284
39549A3004k74523k39384j61452J00067M42230N63658L45918j8649k78715l25536
$$ plain form
39539 166618 4721 133350 481971 770694 714334 284372 -215685 -340793 133342 941762
39529 941762 1503999 1500510 1193593 1013268 962826 731086 303861 45582 120350 260628
39519 260628 269329 333156 584139 744519 564054 288974 276751 388883 232840 -141078
39509 -141078 -264866 63509 535205 767712 640846 238785 -181107 -224621 213191 595298
39499 595298 296469 -469559 -812249 -369244 219622 288356 31014 967 198749 226766
39489 226766 78333 158828 568279 881219 728978 226616 -286691 -632966 -798642 -807222
39479 -807222 -764240 -867286 -1170084 -1379530 -1066306 -163137 824488 1255225 1040379 741326
39469 741326 854909 1181012 1165701 735391 369689 326484 271161 -121623 -613992 -762361
$$ packed form
39539A66618j61897J28629L48621K88723n6360m29962n00057j25108M74135Q08420
39529I41762N62237l489l06917j80325n0442k31740m27225k58279P4768J40278
39519B60628Q701O3827K50983J60380j80465k75080j2223J12132j56043l73918
39509a41078j23788L28375M71696K32507j26866m02061m19892m3514M37812L82107
39499E95298k98829p66028l42690M43005N88866O8734k57342l0047J97782K8017
39489B26766j48433Q0495M09451L12940j52241n02362n13307l46275j65676q580
39479h07222M2982j03046l02798k09446L13224R03169R87625M30737k14846k99053
39469G41326J13583L26103j5311m30310l65702m3205n5323l92784m92369j48369
$$ plain form
39459 -762361 -504650 -55193 494073 1077855 1410949 1290466 990356 909352 946325 700935
39449 700935 220821 19059 310546 745015 1021814 1277365 1641415 1842818 1580109 1006266
39439 1006266 557343 489327 783609 1280924 1681375 1631384 1091768 493804 292237 453748
39429 453748 580968 446605 205105 124237 264226 410403 266073 -217585 -690893 -735604
39419 -735604 -367576 -2300 107700 98157 65944 -177067 -648450 -861785 -386608 467620
39409 467620 980740 921484 669103 498284 246354 -221500 -677552 -881496 -945084 -1115658
39399 -1115658 -1408927 -1643399 -1670681 -1430723 -947518 -391157 32465 358683 816153 1375020
39389 1375020 1606319 1221878 541992 143246 182571 350020 362571 173206 -229363 -821646
$$ packed form
39459g62361K57711M49457N49266N83782L33094j20483l00110q1004L6973k45390
39449G00935m80114k01762K91487M34469K76799K55551L64050K01403k62709n73843
39439A006266m48923o8016K94282M97315M00451m9991n39616n97964k01567J61511
39429D53748J27220j34363k41500q0868J39989J46177j44330m83658m73308m4711
39419g35604L68028L65276J10000r543l2213k43011m71383k13335M75177Q54228
39409D67620N13120n9256k52381j70819k51930m67854m56052k03944o3588j70574
39399a115658k93269k34472k7282K39958M83205N56361M23622L26218M57470N58867
39389A375020K31299l84441o79886l98746L9325J67449J2551j89365m02569n92283
$$ plain form
39379 -821646 -1281193 -1103054 -196888 853304 1330316 1057735 412493 -156199 -444155
39370 -444155 -483573 -450520 -527041 -683697 -659343 -315157 83785 157734 -68997 -181342
39360 -181342 96274 623795 1123366 1469942 1622509 1524287 1219888 872741 536655 127403
39350 127403 -242759 -194567 395806 1068518 1334283 1355664 1632470 2133083 2293728 1938887
39340 1938887 1629710 1827894 2178594 2040754 1440203 1029906 1208784 1696862 2003073
39331 2003073 1972100 1756691 1489430 1164797 781650 479018 463091 758373 1075683 1063548
39321 1063548 706052 305001 42722 -178616 -353022 -163123 543774 1323089 1579226
39312 1579226 1316465 1028888 912411 665795 129538 -373226 -549408 -585951 -785405 -1045814
$$ packed form
39379h21646m59547J78139R06166J050192M77012k72581o45242n68692k87956
39370d44155l9418L3053p6521j56656K4354L44186L98942P3949k26731j12345
39360a81342K77616N27521M99571L46576J52567r8222l04399l47147l36086m09252
39350A27403l70162M8192N90373O72712K65765K1381K76806N00613J60645l54841
39340A938887l09177J98184L50700j37840o00551m10297J78878M88078L06211
39331B003073l0973k15409k67261l24633l83147l02632j5927K95282L17310j2135
39321A063548l57496m01051k62279k21338j74406J89899P06897P79315K56137
39312A579226k62761k87577j16477k46616n36257n02764j76182l6543j99454k60409
$$ plain form
39302 -1045814 -1039839 -720209 -317214 47603 424214 756192 831279 550098 66631 -349548
39292 -349548 -473283 -220470 247333 592623 668190 720301 982003 1171766 783459 -90960
39282 -90960 -652121 -317380 573544 1258176 1485096 1569476 1680383 1548628 952716 119007
39272 119007 -547271 -897262 -1032087 -1039497 -916858 -641472 -171951 512296 1241594 1660299
39262 1660299 1582181 1244547 1017895 940886 744339 265555 -390506 -1044545 -1522058 -1562716
39252 -1562716 -995402 -109154 449839 330810 -178033 -588930 -748066 -747814 -574898 -156384
39242 -156384 377146 764483 905224 894439 865628 967025 1314970 1720133 1650113 826179
39232 826179 -244214 -717017 -370083 239015 538002 456661 167076 -224854 -576843 -687527
$$ packed form
39302a045814N975L19630M02995L64817L76611L31978P5087k81181m83467m16179
39292c49548j23735K52813M67803L45290P5567N2111K61702J89763l88307q74419
39282i0960n61161L34741Q90924O84632K26920Q4380J10907j31755n95912q33709
39272A19007o66278l49991j34825p410J22639K75386M69521O84247P29298M18705
39262A660299p8118l37634k26652p7009j96547m78784o56061o54039m77513m0658
39252a562716N67314Q86248N58993j19029n08843m10897j59136K52J72916M18514
39242a56384N33530L87337J40741j0785k8811J01397L47945M05163p0020q23934
39232H26179j070393m72803L46934O09098K98987q1341k89585l91930l51989j10684
$$ plain form
39222 -687527 -558707 -369313 -93108 446776 1018530 1026530 435213 111393 737153 1808625
39212 1808625 2342800 2266068 2346554 2871400 3222885 2921559 2347064 2059800 1977737 1699776
39202 1699776 1255580 1015704 1066194 1165720 1256020 1568037 2154275 2663924 2741636 2444805
39192 2444805 2114238 1959249 1916698 1845639 1692242 1440530 1052018 585961 311708 499344
39182 499344 1026635 1356762 1059197 270822 -496949 -927961 -1123223 -1335266 -1678068 -2066041
39172 -2066041 -2261318 -2023464 -1393996 -760939 -428238 -241753 45621 180711 -305136
39163 -305136 -1195146 -1570403 -947559 81273 689590 802629 778498 590249 33352 -518990
39153 -518990 -384612 385642 963430 907733 727883 1012441 1588916 1962273 2114575 2341240
$$ packed form
39222f87527J28820J89394K76205N39884N71754Q000n91317l23820O25760J071472
39212A808625N34175p6732Q0486N24846L51485l01326n74495k87264q2063k77961
39202A699776m44196k39876N0490R9526R0300L12017N86238N09649P7712k96831
39192B444805l30567j54989m2551p1059j53397k51712l88512m66057k74253J87636
39182D99344N27291L30127k97565p88375p67771m31012j95262k12043l42802l87973
39172b066041j95277K37854O29468O33057L32701J86485K87374J35090m85847
39163c05136q90010l75257O22844J028832O08317J13039k4131j88249n56897n52342
39153e18990J34378P70254N77788n5697j79850K84558N76475L73357J52302K26665
$$ plain form
39143 2341240 2579135 2449728 1890964 1304178 1058507 1164125 1435508 1696481 1810289
39134 1810289 1756669 1708930 1829993 1983670 1855315 1380760 863221 634258 765716 1120785
39124 1120785 1489583 1639089 1435472 1009616 668213 595310 778154 1217968 1960708 2821070
39114 2821070 3339834 3249295 2839707 2620495 2683644 2649988 2264115 1809573 1790985 2297294
39104 2297294 2826128 2775826 2066304 1220689 816700 912804 1096794 1062439 961744 1096837
39094 1096837 1422458 1572425 1362324 1056271 1044755 1393914 1840809 2153067 2326779 2424205
39084 2424205 2390879 2162801 1875244 1786695 1952907 2111302 1990419 1650006 1392721 1397549
39074 1397549 1593685 1871573 2220357 2598756 2857993 2927604 2953158 3104583 3343715 3536459
$$ packed form
39143B341240K37895j29407n58764n86786k45671J05618K71383K60973J13808
39134A810289n3620m7739J21063J53677j28355m74555n17539k28963J31458L55069
39124A120785L68798J49506k03617m25856l41403p2903J82844M39814P42740Q60362
39114B821070N18764r0539m09588k19212O3149l3656l85873m54542j8588N06309
39104B297294N28834n0302p09522q45615m03989R6104J83990l4355j00695J35093
39094A096837L25621J49967k10101l06053j1516L49159M46895L12258J73712R7426
39084B424205l3326k28078k87557q8549J66212J58395j20883l40413k57285M828
39074A397549J96136K77888L48784L78399K59237O9611K5554J51425K39132J92744
$$ plain form
39064 3536459 3708606 3996798 4392876 4756126 5080239 5506099 5996023 6237877 6051287
39055 6051287 5730102 5759462 6245106 6805927 7023755 6854791 6590098 6530731 6720046 6912630
39045 6912630 6818321 6456971 6216373 6426237 6934947 7308686 7416952 7529374 7759542 7760104
39035 7760104 7236324 6516307 6234920 6546309 7028935 7355903 7631637 7933979 7952710 7433501
39025 7433501 6745902 6604935 7255620 8228445 8919818 9169258 9217937 9323829 9534385 9715728
39015 9715728 9718032 9571951 9526614 9800901 10322383 10848740 11310097 11816520 12309268 12481882
39005 12481882 12203872 11817016 11794896 12221384 12805850 13326645 13828860 14398071 14966164
38996 14966164 15426043 15805862 16237003 16814454 17558582 18482983 19633696 21030296 22580645
$$ packed form
39064C536459J72147K88192L96078L63250L24113M25860M89924K41854j86590
39055F051287l21185K9360M85644N60821K17828j68964k64693n9367J89315J92584
39045F912630r4309l61350k40598K09864N08710L73739J08266J12422K30168N62
39035G760104n23780p20017k81387L11389M82626L26968K75734L02342J8731n19209
39025G433501o87599j40967O50685R72825O91373K49440M8679J05892K10556J81343
39015I715728K304j46081m5337K74287N21482N26357M61357N06423M92748J72614
39005A2481882k78010l86856k2120M26488N84466N20795N02215N69211N68093
38996A4966164M59879L79819M31141N77451P44128R24401J150713J396600J550349
$$ plain form
38987 22580645 24116616 25577248 27110756 28882514 30812601 32683048 34524619 36650092
38979 36650092 39173574 41756504 44105655 46554023 49790391 54046315 58890093 63856955
38971 63856955 68936513 74332964 80123894 86437810 93702803 102328545 112211419 122904394
38963 122904394 134327776 147030607 161616965 178103634 196001755 214899116 234744138
38956 234744138 255531472 276809292 297493694 316058634 330896628 340664530 344497454
38949 344497454 342037848 333388358 319182941 300715251 279750355 257896764 236084214
38942 236084214 214749084 194436882 175914397 159604787 145233596 132293997 120666584
38935 120666584 110491336 101598174 93485450 85875570 78901615 72629922 66775176 61138656
$$ packed form
38987B2580645J535971J460632J533508J771758J930087J870447J841571K125473
38979C6650092K523482K582930K349151K448368L236368M255924M843778M966862
38971F3856955N079558N396451N790930O313916P264993Q625742R882874J0692975
38963A22904394J1423382J2702831J4586358J6486669J7898121J8897361J9845022
38956B34744138K0787334K1277820K0684402J8564940J4837994R767902L832924
38949C44497454k459606q649490j4205417j8467690k0964896k1853591k1812550
38942B36084214k1335130k0312202j8522485j6309610j4371191j2939599j1627413
38935A20666584j0175248q893162q112724p609880o973955o271693n854746n636520
$$ plain form
38927 61138656 56033390 51904290 48652822 45716247 42820760 40281793 38387281 36773044
38919 36773044 34743506 32144462 29589334 27715997 26480879 25411153 24353924 23582491
38911 23582491 23155012 22606211 21530037 20167696 19062694 18308442 17537492 16583355 15713711
38902 15713711 15144766 14736829 14344060 14111798 14160984 14225903 13908441 13173354 12351022 11724974
38892 11724974 11307656 10958625 10555812 10083692 9650157 9354933 9109041 8750730 8400187
38883 8400187 8439696 8967251 9518965 9584548 9186190 8664184 8116374 7441286 6770730 6365512
38873 6365512 6104508 5585359 4842513 4483390 4866866 5537245 5803414 5603462 5432323
38864 5432323 5590235 5891332 6061862 6059849 5935413 5664806 5265265 4888832 4644096 4427802
$$ packed form
38927F1138656n105266m129100l251468k936575k895487k538967j894512j614237
38919C6773044k029538k599044k555128j873337j235118j069726j057229p71433
38911B3582491m27479n48801j076174j362341j105002p54252p70950r54137q69644
38902A5713711n68945m07937l92769k32262M9186O4919l17462p35087q22332o26048
38892A1724974m17318l49031m02813m72120m33535k95224k45892l58311l50543
38883H400187L9509N27555N51714O5583l98358n22006n47810o75088o70556m05218
38873F365512k61004n19149p42846l59123L83476O70379K66169j99952j71139
38864E432323J57912L01097J70530k013j24436k70607l99541l76433k44736k16294
$$ plain form
38854 4427802 4081273 3668749 3462407 3631727 4034690 4346926 4339295 4017096 3583432 3329633
38844 3329633 3460814 3887821 4225678 4149528 3759369 3450161 3421374 3514103 3582098 3765646
38834 3765646 4210157 4700636 4831134 4465145 3823372 3178495 2663803 2326205 2146274
38825 2146274 2020093 1913664 2006075 2468561 3123229 3559156 3600384 3420113 3166979 2763867
38815 2763867 2193018 1725127 1660927 1973644 2362824 2569936 2524926 2281133 1944644 1632772
38805 1632772 1412629 1286641 1249953 1314990 1485875 1765582 2141181 2470407 2472294 2011446
38795 2011446 1351361 935253 941038 1227854 1624946 1991961 2080033 1742308 1312143 1329982
38785 1329982 1769662 1992204 1676981 1308136 1382121 1606434 1431118 1034907 1084946 1612937
$$ packed form
38854D427802l46529m12524k06342J69320M02963L12236p631l22199m33664k53799
38844C329633J31181M27007L37857p6150l90159l09208k8787R2729O7995J83548
38834C765646M44511M90479J30498l65989o41773o44877n14692l37598j79931
38825B146274j26181j06429R2411M62486O54668M35927M1228j80271k53134m03112
38815B763867n70849m67891o4200L12717L89180K07112m5010k43793l36489l11872
38805A632772k20143j25988l6688O5037J70885K79707L75599L29226J887m60848
38795B011446o60085m16108N785K86816L97092L67015Q8072l37725m30165J7839
38785A329982M39680K22542l15223l68845P3985K24313j75316l96211N0039N27991
$$ plain form
38775 1612937 1849825 1355253 738327 901205 1892873 2867341 3040433 2425712 1676753
38766 1676753 1397752 1642820 2014956 2187363 2237286 2422115 2762362 3011323 2961741 2598472
38756 2598472 2006609 1340117 848659 706711 814675 973596 1211894 1652828 2073951
38747 2073951 1993180 1342424 704213 619284 918508 1045620 852917 718483 944500 1387174
38737 1387174 1720534 1782430 1574533 1169869 772934 692330 1056297 1627078 2052152 2247079
38727 2247079 2364512 2413835 2152282 1483797 788970 592500 891434 1056664 554861 -369791
38717 -369791 -934754 -693686 39899 675720 1024060 1316640 1689168 1919573 1746285 1256427
38707 1256427 804094 615928 608376 552511 288803 -184541 -669020 -822869 -483712 5183
$$ packed form
38775A612937K36888m94572o16926J62878R91668R74468J73092o14721p48959
38766A676753k79001K45068L72136J72407M9923J84829L40247K48961m9582l63269
38756B598472n91863o66492m91458j41948J07964J58921K38298M40934M21123
38747B073951q0771o50756o38211q4929K99224J27112j92703j34434K26017M42674
38737A387174L33360O1896k07897m04664l96935q0604L63967N70781M25074J94927
38727B247079J17433M9323k61553o68485o94827j96470K98934J65230n01803r24652
38717c69791n64963K41068P33585O35821L48340K92580L72528K30405j73288m89858
38707A256427m52333j88166p552n5865k63708m73344m84479j53849L39157M88895
$$ plain form
38697 5183 40732 -515619 -1090137 -1085058 -584793 -89297 211840 460041 593146 385889
38687 385889 52882 180385 827759 1267579 986394 448487 386302 739162 885627 665160
38677 665160 522045 721272 1024609 1175639 1176411 997811 506999 -155004 -528081 -359822
38667 -359822 105613 475286 565241 363768 -6423 -195552 125381 762496 1087855 821369
38657 821369 416017 453138 920874 1309941 1216583 678525 99301 -60017 264493 551086
38647 551086 267847 -345607 -527725 -122808 128470 -285617 -836881 -766444 -195741 207641
38637 207641 295261 430719 633553 529666 160519 101633 598363 1183301 1385950 1322097
38627 1322097 1318985 1391315 1398596 1393550 1502449 1671610 1764199 1734915 1566247 1254899 991208
$$ packed form
38697E183L5549n56351n74518N079N00265M95496L01137K48201J33105k07257
38687C85889l33007J27503O47374M39820k81185n37907o2185L52860J46465k20467
38677F65160j43115J99227L03337J51030P72j78600m90812o62003l73077J68259
38667c59822M65435L69673Q9955k01473l70191j89129L20933O37115L25359k66486
38657H21369m05352L7121M67736L89067r3358n38058n79224j59318L24510K86593
38647E51086k83239o13454j82118M04917K51278m14087n51264P0437N70703M03382
38637B07641Q7620J35458K02834j03887l69147n8886M96730N84938K02649o3853
38627A322097l112P2330P281n046J08899J69161R2589k9284j68668l11348k63691
$$ plain form
38616 991208 1074872 1468811 1708347 1483684 1074364 948997 1136106 1271282 1119860 779469
38606 779469 467827 352893 497148 737230 721195 325575 -40617 161147 892090 1489869
38596 1489869 1378768 635518 -181788 -577264 -441172 -12108 386126 657243 1013137
38587 1013137 1657595 2416809 2841151 2692196 2175897 1662016 1331564 1151393 1028800
38578 1028800 897207 775834 816682 1145313 1575309 1674873 1277863 755618 556872 615030
38568 615030 510060 159688 -13200 302850 836529 1079055 889094 527599 239689 58915
38558 58915 -38707 -33417 75768 279704 603833 953948 970479 343924 -640714 -1173296
38548 -1173296 -751932 227772 935579 1022639 826951 769350 889130 1038582 1216126 1483899
$$ packed form
38616I91208Q3664L93939K39536k24663m09320j25367J87109J35176j51422l40391
38606G79469l11642j14934J44255K40082j6035l95620l66192K01764P30943N97779
38596A489869j11101p43250q17306l95476J36092M29064L98234K71117L55894
38587A013137O44458P59214M24342j48955n16299n13881l30452j80171j22593
38578A028800j31593j21373M0848L28631M29996R9564l97010n22245j98746N8158
38568F15030j04970l50372j72888L16050N33679K42526j89961l61495k87910j80774
38558E8915r7622N290J09185K03936L24129L50115J6531o26555r84638n32582
38548a173296M21364R79704P07807Q7060j95688n7601J19780J49452J77544K67773
$$ plain form
38538 1483899 1731553 1778678 1646016 1480128 1229585 707248 95245 55876 974616 2225558
38528 2225558 2639065 1797758 503637 -210387 -161059 180440 578480 1175315 1877496
38519 1877496 2212239 1946414 1417792 1064619 971285 1047991 1288987 1596950 1667961 1361879
38509 1361879 963011 793769 778909 668968 483016 421666 521514 698994 950915 1193782
38499 1193782 1117869 593519 41958 -37974 233793 371407 329806 468863 757703 707082
38489 707082 256894 76533 641140 1520792 1986813 1925220 1730303 1607481 1428182 1089307
38479 1089307 632290 122016 -312876 -475562 -389275 -388222 -649151 -864763 -707018 -379420
38469 -379420 -311895 -494832 -555280 -361995 -91392 223327 709547 1225800 1410682 1234277
$$ packed form
38538A483899K47654M7125j32662j65888k50543n22337o12003l9369R18740J250942
38528B225558M13507q41307j294121p14024M9328L41499L98040N96835P02181
38519A877496L34743k65825n28622l53173r3334P6706K40996L07963P1011l06082
38509A361879l98868j69242j4860j09941j85952o1350R9848J77480K51921K42867
38499A193782p5913n24350n51561p9932K71767J37614m1601J39057K88840n0621
38489G07082m50188j80361N64607Q79652M66021o1593j94917j22822j79299l38875
38479A089307m57017n10274m34892j62686Q6287J053k60929k15612J57745L27598
38469c79420O7525j82937o0448J93285K70603L14719M86220N16253J84882j76405
$$ plain form
38459 1234277 1044978 973080 762083 349167 120596 314449 596694 576300 384151 343658
38449 343658 357592 83690 -448223 -845308 -900315 -728627 -418718 18068 332352 130976
38439 130976 -550516 -1131801 -1165175 -863252 -731739 -907406 -1118825 -1139279 -998420 -822782
38429 -822782 -716341 -771148 -985489 -1180159 -1171435 -997548 -784275 -437200 246003 1102439
38419 1102439 1549216 1212875 440656 -44128 83918 520733 819893 882151 910276 1056675
38409 1056675 1256350 1368991 1376121 1372458 1363945 1155265 553980 -303699 -960942 -1056006 -650249
38398 -650249 -79504 407679 760125 998944 1164528 1337440 1539848 1637338 1501664 1260616
38388 1260616 1209529 1441534 1713436 1723734 1406550 925964 511647 344012 477356 799130
$$ packed form
38459A234277j89299p1898k10997m12916k28571J93853K82245k0394j92149m0493
38449C43658J3934k73902n31913l97085n5007J71688L09909M36786L14284k01376
38439A30976o81492n81285l3374L01923J31513j75667k11419k0454J40859J75638
38429h22782J06441n4807k14341j94670Q724J73887K13273L47075O83203Q56436
38419A102439M46777l36341p72219m84784J28046M36815K99160O2258K8125J46399
38409A056675J99675J12641P130l663q513k08680o01285q57679o57243r5064M05757
38398f50249N70745M87183L52446K38819J65584J72912K02408R7490j35674k41048
38388A260616n1087K32005K71902J0298l17184m80586m14317j67635J33344L21774
$$ plain form
38378 799130 1117987 1311810 1351135 1241746 1059817 979640 1095300 1242096 1171152 877938
38368 877938 569324 347339 174019 129473 387770 873415 1257963 1412293 1550105 1773006
38358 1773006 1813166 1472640 1020271 840660 912212 951088 877398 789400 633566 298756
38348 298756 -30101 -6364 368506 694595 674703 388261 39666 -273441 -473043 -454050
38338 -454050 -239222 10757 211492 394237 496993 352550 -27636 -377494 -503881 -504026
38328 -504026 -530205 -516684 -314728 16473 241732 247838 179778 265296 575474 985142 1332782
38317 1332782 1553426 1612353 1396057 850701 231312 -43825 81584 170129 -102621 -453968
38307 -453968 -416372 -41086 233863 286137 386643 587897 561047 184630 -160296 -103672
$$ packed form
38378G99130L18857J93823L9325j09389j81929q0177J15660J46796p0944k93214
38368H77938l08614k21985j73320m4546K58297M85645L84548J54330J37812K22901
38358A773006M0160l40526m52369j79611P1552L8876p3690q7998j55834l34810
38348B98756l28857K3737L74870L26089j9892k86442l48595l13107j99602J8993
38338d54050K14828K49979K00735J82745J02756j44443l80186l49858j26387j45
38328e04026k6179J3521K01956L31201K25259O106o8060Q5518L10178M09668L47640
38317A332782K20644N8927k16296n45356o19389k75137J25409Q8545k72750l51347
38307d53968L7596L75286K74949N2274J00506K01254k6850l76417l44926N6624
$$ plain form
38297 -103672 266453 674274 1015438 1214464 1087446 660201 330974 384914 584738 563762
38287 563762 388223 368964 520615 612824 613718 651541 605883 179451 -581679 -1204946 -1311189
38276 -1311189 -947246 -374283 181115 525342 565274 486948 610069 960527 1223914 1212657
38266 1212657 1109283 1105272 1072075 823287 509307 473739 787511 1144447 1200443 870210
38256 870210 334302 -95521 -157997 137268 462910 491936 275507 154271 273274 391625
38246 391625 299703 229646 580626 1288835 1776900 1625687 1045165 518308 221630 64914
38236 64914 97744 452102 903278 930549 376158 -284846 -535555 -413513 -301208 -368289
38226 -368289 -494383 -565979 -561280 -449294 -254065 -124257 -124372 -87301 92431 181554 -71175
$$ packed form
38297a03672L70125M07821L41164J99026j27018m27245l29227N3940J99824k0976
38287E63762j75539j9259J51651R2209Q94L7823m5658m26432p61130o23267j06243
38276a311189L63943N72963N55398L44227L9932p8326J23121L50458K63387j1257
38266A212657j03374m011l3197k48788l13980l5568L13772L56936N5996l30233
38256H70210n35908m29823o2476K95265L25642K9026k16429j21236J19003J18351
38246C91625r1922p0057L50980P08209M88065j51213n80522n26857k96678j56716
38236F4914L2830L54358M51176K7271n54391o61004k50709J22042J12305o7081
38226c68289j26094p1596M699J11986J95229J29808j15L7071J79732Q9123k52729
$$ plain form
38215 -71175 -464374 -539199 -173839 351726 812944 1187619 1388152 1272024 965477 783292
38205 783292 755873 613857 298584 54625 -76973 -354443 -736040 -727482 -168699 325698
38195 325698 192138 -201936 -64377 685610 1369792 1513807 1295863 1061481 918542 880456
38185 880456 960545 1021109 900623 759518 927151 1347579 1586714 1477245 1301700 1176523
38175 1176523 755978 -129880 -967612 -1135141 -727514 -378370 -420139 -630402 -713283 -630915
38165 -630915 -477878 -379705 -524283 -962082 -1336382 -1141306 -361406 404345 586928 223596
38155 223596 -205978 -325176 -123325 167243 328292 377510 580319 1129183 1824153 2273513
38145 2273513 2416266 2551945 2757210 2621263 1822008 702263 -74899 -303201 -321698
$$ packed form
38215g1175l93199p4825L65360N25565M61218L74675K00533j16128l06547j82185
38205G83292k7419j42016l15273k43959j31598k77470l81597Q558N58783M94397
38195C25698j33560l94074J37559P49987O84182J44015k17944k34382j42939l8086
38185H80456Q0089O0564j20486j41105J67633M20428K39135j09469j75545j25177
38175A176523m20545q85858q37732j67529M07627L49144m1769k10263q2881Q2368
38165f30915J53037R8173j44578m37799l74300J95076P79900P65751J82583l63332
38155B23596m29574j19198K01851K90568J61049M9218K02809N48864O94970M49360
38145B273513J42753J35679K05265j35947p99255j119745p77162k28302j8497
$$ plain form
38136 -321698 -407511 -452674 -285596 4749 193639 184268 74561 101739 500840 1197566
38126 1197566 1647070 1268878 128908 -1066500 -1750302 -1995543 -2116982 -2103717 -1714303
38117 -1714303 -903895 138796 1216938 2103929 2458401 2118131 1428791 962331 911666
38108 911666 1021380 1061196 1039406 955679 716583 391637 225745 267598 281329 157580
38098 157580 87166 141158 29823 -416099 -817283 -693517 -149411 312733 548490 856934
38088 856934 1305664 1489371 1168337 733405 705209 1031674 1241991 1151563 1032471 1093685
38078 1093685 1141597 879250 305496 -337040 -839159 -1070709 -881833 -225252 592939 1009763
38068 1009763 723213 57483 -320209 -61312 548679 923710 740457 158665 -409693
$$ packed form
38136c21698q5813m5163J67078K90345J88890r371j09707K7178L99101O96726
38126A197566M49504l78192j139970j195408o83802k45241j21439J3265L89414
38117a714303Q10408J042691J078142Q86991L54472l40270o89340m66460n0665
38108I11666J09714L9816k1790q3727k39096l24946j65892M1853J3731j23749
38098A57580p0414N3992j11335m45922m01184J23766N44106M62144K35757L08444
38088H56934M48730J83707l21034m34932k8196L26465K10317r0428j19092O1214
38078A093685M7912k62347n73754o42536n02119k31550J88876O56581Q18191M16824
38068A009763k86550o65730l77692K58897O09991L75031j83253n81792n68358
$$ plain form
38059 -409693 -657127 -548787 -249559 58412 304227 509812 677735 745704 677455 554677
38049 554677 513021 588801 685431 702691 643346 565239 484895 384158 273724 171875 28440
38038 28440 -235216 -565517 -729431 -514510 38431 665718 1133744 1400216 1539074 1602448
38028 1602448 1596473 1528229 1427747 1353386 1376828 1490540 1529618 1324241 1007539 1028651 1684965
38017 1684965 2694219 3406715 3446598 2995977 2435731 1888205 1222276 406557 -284237
38008 -284237 -450209 45578 857483 1378065 1262578 711511 161029 -222183 -571548 -915266
37998 -915266 -1029127 -792076 -453513 -363745 -573124 -858943 -1033733 -1057250 -938712 -722984
37988 -722984 -539376 -500174 -558792 -591522 -599855 -716755 -1025683 -1458195 -1834669 -1940784
$$ packed form
38059d09693k47434J08340K99228L07971K45815K05585J67923O7969o8249j22778
38049E54677m1656P5780R6630J7260n9345p8107q0344j00737j10434j01849j43435
38038B8440k63656l30301j63914K14921N52941O27287M68026K66472J38858O3374
38028A602448n975o8244j00482p4361K3442J13712L9078k05377l16702K1112O56314
38017A684965J009254P12496L9883m50621n60246n47526o65929q15719o90794
38008b84237j65972M95787Q11905N20582j15487n51067n50482l83212l49365l43718
37998i15266j13861K37051L38563Q9768k09379k85819j74790k3517J18538K15728
37988g22984J83608L9202n8618l2730q333j16900l08928m32512l76474j06115
$$ plain form
37978 -1940784 -1655057 -1110696 -644759 -470774 -499591 -588401 -780452 -1087148 -1224810 -907176
37968 -907176 -309929 110114 205890 159353 -48696 -657931 -1486051 -1830996 -1367547 -698352
37958 -698352 -554045 -781548 -668827 -53425 516976 683441 704471 851159 932512 703213
37948 703213 315325 27102 -209279 -500377 -609127 -229693 458326 924577 952544 800085
37938 800085 685503 514317 244559 139863 377055 653825 531375 51754 -333805 -438952
37928 -438952 -588720 -1066549 -1615181 -1746939 -1392231 -951602 -749540 -721652 -690548 -674779
37918 -674779 -755464 -825054 -697085 -390386 -102005 74924 221912 387888 502534 545783
37908 545783 642447 907713 1307248 1714071 1972995 1875752 1281366 398898 -238262 -312209
$$ packed form
37978a940784K85727N44361M65937J73985k8817q8810j92051l06696j37662L17634
37968i07176N97247M20043R5776m6537k08049o09235q28120l44945M63449O69195
37958f98352J44307k27503J12721O15402N70401J66465K1030J46688Q1353k29299
37948G03213l87888k88223k36381k91098j08750L79434O88019M66251K7967j52459
37938H00085j14582j71186k69758j04696K37192K76770j22450m79621l85559j05147
37928d38952j49768m77829n48632j31758L54708M40629K02062K7888L1104J5769
37918f74779q0685o9590J27969L06699K88381J76929J46988J65976J14646M3249
37908E45783R6664K65266L99535M06823K58924r7243n94386q82468o37160p3947
$$ plain form
37898 -312209 -143027 -334831 -1034235 -1776822 -2071504 -1872211 -1398819 -788446 -155811 196273
37888 196273 -33241 -724499 -1347506 -1478845 -1164633 -722625 -372466 -186302 -218543 -427012
37878 -427012 -527245 -231085 279203 383984 -252645 -1170505 -1599010 -1366686 -1002732 -927287
37868 -927287 -921850 -590498 -28883 303291 231897 51567 84952 346296 668692 904496
37858 904496 922359 626587 102007 -397254 -687307 -777712 -742806 -641058 -591469 -710786
37848 -710786 -886048 -825698 -461186 -80259 102221 277009 700366 1207122 1378513 1108561
37838 1108561 689644 363162 112428 -42399 132762 771067 1586110 2070167 1974946 1502026
37828 1502026 1052713 848266 775888 591338 279049 140902 435717 990515 1318723 1124803
$$ packed form
37898c12209J69182j91804o99404p42587k94682J99293M73392O10373O32635L52084
37888A96273k29514o91258o23007j31339L14212M42008L50159J86164l2241k08469
37878d27012j00233K96160N10288J04781o36629r17860m28505K32324L63954P5445
37868i27287N437L31352N61615L32174p1394j80330L3385K61344L22396K35804
37858I04496J7863k95772n24580m99261k90053r0405L4906J01748M9589j19317
37848g10786j75262O0350L64512L80927J82480J74788M23357N06756J71391k69952
37838A108561m18917l26482k50734j54827J75161O38305Q15043M84057r5221m72920
37828A502026m49313k04447p2378j84550l12289j38147K94815N54798L28208j93920
$$ plain form
37818 1124803 570748 53595 -148340 -24212 205853 252001 23909 -249578 -317845 -298575
37808 -298575 -535752 -1040389 -1370101 -1219250 -866755 -788324 -1004605 -1115399 -896068 -537010
37798 -537010 -263350 -19415 320573 645635 741969 643233 605743 723284 811627 794079
37788 794079 949401 1476624 1958169 1710861 745310 -102703 -265061 -207093 -629954 -1287587
37778 -1287587 -1308776 -559709 124032 187178 34069 105952 30475 -679307 -1598386 -1816105
37768 -1816105 -1148406 -256641 298405 480640 347910 -106988 -598797 -649268 -235144 151727
37758 151727 256191 378285 725757 940232 603464 -147644 -837103 -1185465 -1147302 -732837
37748 -732837 -134942 229394 167248 -1178 72004 214677 51802 -340409 -561189 -546033
$$ packed form
37818A124803n54055n17153k01935J24128K30065M6148k28092k73487o8267J9270
37808b98575k37177n04637l29712J50851L52495P8431k16281j10794K19331L59058
37798e37010K73660K43935L39988L25062R6334r8736l7490J17541Q8343j7548
37788G94079J55322N27223M81545k47308r65551q48013j62358N7968m22861o57633
37778a287587k1189P49067O83741O3146j53109P1883p5477p09782r19079k17719
37768a816105O67699Q91765N55046J82235j32730m54898m91809n0471M14124L86871
37758A51727J04464J22094L47472K14475l36768p51108o89459l48362L8163M14465
37748g32837N97895L64336o2146j68426P3182J42673j62875l92211k20780J5156
$$ plain form
37738 -546033 -597316 -763708 -699783 -274670 117785 78529 -294514 -652755 -864576 -967138
37728 -967138 -870674 -444767 170928 627701 769389 786255 918554 1133160 1168064 859297
37718 859297 381015 127983 312136 697397 842725 627682 395480 500453 867063 1144567
37708 1144567 1174561 1091643 1011659 862765 575236 244538 13198 -71932 -8956 204086
37698 204086 462009 554170 433012 367670 638425 1143989 1516368 1598809 1590756 1694521
37688 1694521 1839708 1846654 1678553 1409742 1092744 799660 682155 825993 1090158 1209060
37678 1209060 1028732 585992 44446 -360587 -424125 -160335 172624 355846 447614 617786
37668 617786 839609 922949 803874 614462 466907 326625 117347 -168202 -470671 -687193
$$ packed form
37738e46033n1283j66392O3925M25113L92455l9256l73043l58241k11821j02562
37728i67138R6464M25907O15695M56773J41688J6866J32299K14606L4904l08767
37718H59297m78282k53032J84153L85261J45328k15043k32202J04973L66610K77504
37708A144567K9994q2918p9984j48894k87529l30698k31340q5130O2976K13042
37698B04086K57923R2161j21158o5342K70755N05564L72379Q2441q053J03765
37688A694521J45187O946j68101k68811l16998k93084j17505J43838K64165J18902
37678A209060j80328m42740n41546m05033o3538K63790L32959J83222R1768J70172
37668F17786K21823Q3340j19075j89412j47555j40282k09278k85549l02469k16522
$$ plain form
37658 -687193 -716080 -558421 -315576 -11469 454868 1058130 1528208 1694071 1763212 1956927
37648 1956927 2029276 1561146 664693 -72123 -378826 -560964 -848597 -993886 -776845 -455797
37638 -455797 -337189 -242596 170236 793119 1198406 1223885 1022716 653736 56813 -585898
37628 -585898 -870805 -644956 -194839 85278 12767 -361795 -797242 -939518 -626422 -139620
37618 -139620 83408 -4230 -48768 164835 456192 594094 605861 612973 604576 549218 557103
37607 557103 747514 1044258 1231228 1155333 815088 339750 -54789 -176200 2446 337913
37597 337913 651258 822894 819885 738556 747596 839755 736435 273160 -190652 -81063 616860
37586 616860 1224528 1169739 660760 360458 592658 1101912 1458514 1457131 1176993 865127
$$ packed form
37658f87193k8887J57659K42845L04107M66337O03262M70078J65863O9141J93715
37648A956927P2349m68130q96453p36816l06703j82138k87633j45289K17041L21048
37638d55797J18608R4593M12832O22883M05287K5479k01169l68980n96923o42711
37628e85898k84907K25849M50117K80117p2511l74562m35447j42276L13096M86802
37618a39620K23028q7638m4538K13603K91357J37902J1767P112q397n5358P885
37607E57103J90411K96744J86970p5895l40245m75338l94539j21411J78646L35467
37597C37913L13345J71636l009q1329R040R2159j03320m63275m63812J09589O97923
37586F16860O07668n4789n08979l00302K32200N09254L56602j383k80138l11866
$$ plain form
37576 865127 768910 941489 1181027 1213307 921528 399430 -124714 -403771 -369590 -279295
37566 -279295 -488124 -972371 -1273915 -1083015 -672684 -492690 -483500 -154487 659915 1477801
37556 1477801 1734920 1406738 881217 417550 -12993 -449615 -796086 -993113 -1118383
37547 -1118383 -1223348 -1245978 -1206013 -1304777 -1612888 -1785624 -1403609 -593361 36171 191064
37537 191064 273551 708580 1202246 1100394 340896 -435793 -750242 -802846 -983105 -1266294
37527 -1266294 -1365798 -1198810 -900585 -568456 -281500 -220336 -446525 -644843 -419047 146835
37517 146835 527257 430436 162246 173780 484899 797781 1034105 1421446 2001322 2363573
37507 2363573 2103477 1387803 785023 574144 516317 343702 128700 -422 -175738 -515665
$$ packed form
37576H65127r6217J72579K39538L2280k91779n22098n24144k79057L4181R0295
37566b79295k08829m84247l01544J90900M10331J79994R190L29013Q14402Q17886
37556A477801K57119l28182n25521m63667m30543m36622l46471j97027j25270
37547a118383j04965k2630L9965r8764l08111j72736L82015Q10248O29532J54893
37537A91064Q2487M35029M93666j01852p59498p76689l14449n2604j80259k83189
37527a266294r9504J66988K98225L32129K86956O1164k26189j98318K25796N65882
37517A46835L80422r6821k68190J1534L11119L12882K36324L87341N79876L62251
37507B363573k60096p15674o02780k10879n7827j72615k15002j29122j75316l39927
$$ plain form
37497 -515665 -791654 -754408 -609487 -712910 -898144 -640664 74099 589634 442651 -107984
37487 -107984 -633746 -1111191 -1608027 -1865580 -1677883 -1360799 -1316600 -1335600 -874553 43826
37477 43826 721978 630822 -30426 -682113 -934302 -727494 -202943 419239 973749 1417052
37467 1417052 1696318 1670869 1337403 982094 842888 741499 361878 -199543 -518216 -443245
37457 -443245 -265544 -280754 -507001 -832233 -1107857 -1108894 -775768 -499669 -743439 -1328875
37447 -1328875 -1568465 -1225806 -840573 -865482 -980761 -652104 20162 477038 479518 243467
37437 243467 -62011 -472154 -870374 -887545 -336307 441082 815259 454807 -334296 -864015
37427 -864015 -730285 -199642 195908 362844 641518 1100581 1279810 855309 178163 -183065
$$ packed form
37497e15665k75989L7246J44921j03423j85234K57480P14763N15535j46983n50635
37487a07984n25762m77445m96836k57553J87697L17084M4199j9000M61047R18379
37477D3826O78152r1156o61248o51687k52189K06808N24551O22182N54510M43303
37467A417052K79266k5449l33466l55309j39206j01389l79621n61421l18673P4971
37457d43245J77701j5210k26247l25232k75624j037L33126K76099k43770n85436
37447a328875k39590L42659L85233k4909j15279L28657O72266M56876K480k36051
37437B43467l05478m10143l98220j7171N51238P77389L74177l60452p89103n29719
37427h64015J33730N30643L95550J66936K78674M59063J79229m24501o77146l61228
$$ plain form
37417 -183065 -144124 15686 208602 511671 743548 578420 91111 -235496 -120479 226728
37407 226728 474528 496457 258682 -282554 -1000673 -1540219 -1612270 -1251024 -724587 -303872
37397 -303872 -111740 -44837 142720 525286 838454 820259 608046 494695 378284 -123018
37387 -123018 -963140 -1514697 -1308411 -587388 68863 360122 300309 -31108 -470461 -740161
37377 -740161 -737587 -679114 -717873 -653496 -314583 37058 102041 137067 613137 1332001 1483966
37366 1483966 764469 -78868 -156105 457947 934675 804773 400091 195658 150256 -83097
37356 -83097 -550712 -914645 -927564 -716074 -498371 -233136 237029 786837 1024373 764790
37346 764790 281422 -17728 13315 298114 751969 1226899 1407813 1080532 465176 -5215
$$ packed form
37417a83065L8941J59810J92916L03069K31877j65128m87309l26607J15017L47207
37407B26728K47800K1929k37775n41236p18119n39546p2051L61246N26437M20715
37397c03872J92132O6903J87557L82566L13168j8195k12213j13351j16411n01302
37387a23018q40122n51557K06286P21023O56251K91259n9813l31417m39353k69700
37377g40161K574N8473l8759O4377L38913L51641O4983L5026M76070P18864J51965
37366A483966p19497q43337p7237O14052M76728j29902m04682k04433m5402k33353
37356h3097m67615l63933j2919K11490K17703K65235M70165N49808K37536k59583
37346G64790m83368k99150L1043K84799M53855M74930J80914l27281o15356m70391
$$ plain form
37336 -5215 -236896 -506497 -896819 -1048021 -660329 20543 486071 585531 602247 777931
37326 777931 1015477 1088424 964307 825769 829284 901867 804655 430040 -10849 -227369
37316 -227369 -277610 -561571 -1288134 -2134004 -2602977 -2585237 -2363885 -2179510 -2027807 -1843232
37306 -1843232 -1641526 -1442332 -1207108 -881927 -420014 166382 661496 704023 221255 -321206
37296 -321206 -417848 -199008 -238633 -703916 -1139339 -1196769 -1111518 -1208791 -1359862 -1294718 -1132056
37285 -1132056 -1162312 -1309684 -1261535 -1025235 -913366 -1000568 -1018491 -844344 -711830 -813249
37275 -813249 -997566 -1008362 -787844 -423989 -4802 367085 610031 808663 1127533 1493408
37265 1493408 1589600 1295210 908458 752846 738774 523987 -4355 -598071 -923271 -814397
$$ packed form
37336e215k31681k69601l90322j51202L87692O80872M65528R9460J6716J75684
37326G77931K37546P2947j24117j38538L515P2583r7212l74615m40889k16520
37316b27369n0241k83961p26563q45870m68973J7740K21352J84375J51703J84575
37306a843232K01706J99194K35224L25181M61913N86396M95114M2527m82768n42461
37296c21206r6642K18840l9625m65283m35423n7430Q5251r7273j51071O5144J62662
37285a132056l0256j47372M8149K36300J11869q7202j7923J74147J32514j01419
37275h13249j84317j0796K20518L63855M19187L71887K42946J98632L18870L65875
37265A493408R6192k94390l86752j55612j4072k14787n28342n93716l25200J08874
$$ plain form
37255 -814397 -335828 239875 557197 444633 84966 -147130 -15167 417018 865910 1029728
37245 1029728 815489 438324 209027 170790 61774 -297177 -720688 -875790 -662268 -255594
37235 -255594 123806 353828 414557 388391 401609 464952 440504 251407 31385 -23489 150468
37224 150468 507926 949853 1243836 1091784 481064 -180523 -493329 -498645 -481599 -526869
37214 -526869 -561849 -671187 -971687 -1251265 -1169037 -825832 -677965 -785860 -636371 47907
37204 47907 779825 982354 849990 1025261 1575487 1836642 1321574 322858 -548666 -1047218
37194 -1047218 -1269778 -1258515 -991430 -642065 -481101 -496630 -404806 -107610 144494 190617
37184 190617 279647 684068 1197901 1386717 1249922 1208052 1382582 1336295 742964 -70069
$$ packed form
37255h14397M78569N75703L17322j12564l59667k32096J31963M32185M48892J63818
37245A029728k14239l77165k29297l8237j09016l58951m23511j55102K13522M06674
37235b55594L79400K30022O0729k6166J3218O3343k4448j89097k20022n4874J73957
37224A50468L57458M41927K93983j52052o10720o61587l12806n316J7046m5270
37214e26869l4980j09338l00500k79578Q2228L43205J47867j07895J49489O84278
37204D7907P31918K02529j32364J75271N50226K61155n15068r98716q71524m98552
37194a047218k22560J1263K67085L49365J60964j5529R1824K97196K52104M6123
37184A90617Q9030M04421N13833J88816j36795m1870J74530m6287n93331q13033
$$ plain form
37174 -70069 -574052 -733364 -846942 -919124 -694709 -271914 -173393 -675626 -1437900 -1952206
37164 -1952206 -2060856 -1879877 -1510902 -1054149 -701008 -588485 -667303 -838336 -1083226 -1359979
37154 -1359979 -1535808 -1532634 -1375272 -1021927 -390195 315270 581443 141340 -641667 -1187255
37144 -1187255 -1330737 -1304811 -1275212 -1208522 -1090830 -953059 -718064 -305169 137394 361992
37134 361992 350812 256346 58936 -406501 -1074953 -1617007 -1837104 -1824839 -1663927 -1314331
37124 -1314331 -882583 -662381 -715028 -718946 -491003 -384113 -821299 -1603653 -2073932 -1946899
37114 -1946899 -1630578 -1641429 -1973917 -2208023 -2074819 -1726701 -1489105 -1495384 -1622017 -1715267
37104 -1715267 -1770596 -1838259 -1838315 -1614975 -1183188 -780075 -617201 -702616 -955953 -1330549 -1709185
$$ packed form
37174g0069n03983j59312j13578p2182K24415M22795R8521n02233p62274n14306
37164a952206j08650J80979L68975M56753L53141J12523p8818j71033k44890k76753
37154a359979j75829L174J57362L53345O31732P05465K66173m40103p83007n45588
37144a187255j43482K5926K9599O6690J17692J37771K34995M12895M42563K24598
37134C61992j1180r4466j97410m65437o68452n42054k20097J2265J60912L49596
37124a314331M31748K20202n2647l918K27943J06890m37186p82354m70279J27033
37114a946899L16321j0851l32488k34106J33204L48118K37596o279j26633r3250
37104a715267n5329o7663n6K23340M31787M03113J62874q5415k53337l74596l78636
$$ plain form
37093 -1709185 -1856237 -1675750 -1408380 -1347485 -1418469 -1275756 -805110 -291830 -54817 -133529
37083 -133529 -392109 -697548 -880643 -748263 -336660 -13891 -110930 -497638 -694181 -387118
37073 -387118 281259 890121 1075046 737073 98989 -410167 -459283 -87869 350216 520653
37063 520653 358818 31100 -266763 -462321 -598479 -684113 -602546 -296992 -45590 -297937
37053 -297937 -1055190 -1632774 -1370504 -488892 132955 44149 -309424 -321335 -12025 213878
37043 213878 267834 389453 590533 560374 200064 -131691 -108560 84513 30961 -280512
37033 -280512 -392999 10551 680022 1131517 1249589 1319530 1516504 1675275 1669343 1702845
37023 1702845 1951905 2136739 1825919 1074381 377090 21897 -108792 -101996 116725 359292
$$ packed form
37093a709185j47052J80487K67370O0895p0984J42713M70646N13280K37013p8712
37083a33529k58580l05439j83095J32380M11603L22769r7039l86708j96543L07063
37073c87118O68377O08862J84925l37973o38084n09156m9116L71414M38085J70437
37063E20653j61835l27718k97863j95558j36158q5634Q1567L05554K51402k52347
37053b97937p57253n77584K62270Q81612O21847q8806l53573j1911L09310K25903
37043B13878N3956J21619K01080l0159l60310l31755K3131J93073n3552l11473
37033b80512j12487M03550O69471M51495J18072O9941J96974J58771n932L3502
37023A702845K49060J84834l10820p51538o97291l55193j30689O796K18721K42567
$$ plain form
37013 359292 154546 -569273 -1237906 -1397293 -1294239 -1313431 -1296877 -948785 -520950 -442626
37003 -442626 -528258 -244131 388038 853738 1033080 1297105 1693992 1769506 1336500 755901
36993 755901 278947 -245980 -819307 -1111771 -1097371 -1206115 -1539436 -1599408 -1164996 -747827
36983 -747827 -706762 -594380 13070 651829 645360 145454 -233778 -388990 -561712 -585798
36973 -585798 -170474 306916 175143 -464685 -863685 -764300 -624391 -716695 -803351 -776848
36963 -776848 -863436 -1057717 -1041141 -774088 -509012 -174128 495904 1158569 1094164 434528
36953 434528 190287 670943 866415 19404 -1085081 -1241669 -555410 -106604 -330128
36944 -330128 -695459 -791943 -812243 -924595 -907498 -580838 -111604 243717 389867 378340
$$ packed form
37013C59292k04746p23819o68633j59387J03054j9192J6554L48092M27835P8324
37003d42626q5632K84127O32169M65700J79342K64025L96887P5514m33006n80599
36993G55901m76954n24927n73327k92464J4400j08744l33321n9972M34412M17169
36983g47827M1065J12382O07450O38759o469m99906l79232j55212j72722k4086
36973e85798M15324M77390j31773o39828l99000R9385J39909r2304q6656K6503
36963g76848q6588j94281J6576K67053K65076L34884O70032O62665o4405o59636
36953D34528k44241M80656J95472q47011j104485j56588O86259M48806k23524
36944c30128l65331r6484k0300j12352J7097L26660M69234L55321J46150j1527
$$ plain form
36934 378340 390254 623510 957124 964587 581437 442770 1077480 2026256 2332992 1755396
36924 1755396 908936 331322 40449 -22272 191208 450293 310425 -203867 -505497 -291632
36914 -291632 -10177 -171853 -602903 -752773 -463011 -62739 136684 129949 80843 121470
36904 121470 249279 305666 131224 -184795 -324561 -82662 431380 984079 1467268 1883906
36894 1883906 2214501 2383257 2291116 1877368 1240413 656003 328757 158773 -88115 -436721
36884 -436721 -726787 -911980 -1072801 -1158673 -1013568 -693423 -473525 -465059 -480229 -367748
36874 -367748 -246088 -295685 -510970 -746718 -851867 -722366 -395908 -97568 3657 49750
36864 49750 265729 546091 606012 513030 649067 1079666 1389830 1287306 964611 683768
$$ packed form
36934C78340J1914K33256L33614P463l83150j38667O34710R48776L06736n77596
36924A755396q46460n77614k90873o2721K13480K59085j39868n14292l01630K13865
36914b91632K81455j61676m31050j49870K89762M00272J99423o735m9106M0627
36904A21470J27809N6387j74442l16019j39766K41899N14042N52699M83189M16638
36894A883906L30595J68756r2141m13748o36955n84410l27246j69984k46888l48606
36884d36721k90066j85193j60821q5872J45105L20145K19898Q466j5170J12481
36874c67748J21660m9597k15285k35748j05149J29501L26458K98340J01225M6093
36864D9750K15979K80362N9921r2982J36037M30599L10164j02524l22695k80843
$$ plain form
36854 683768 400306 31024 -267601 -342331 -241782 48437 698700 1595675 2198542 2180139
36844 2180139 1869607 1702854 1596731 1289721 932834 800191 705121 327203 -64694 111693
36834 111693 801109 1288957 1188769 839658 596197 342616 -28668 -216310 17472 378263
36824 378263 463385 366868 442464 668285 688872 401231 72704 -144365 -416489 -805353
36814 -805353 -973039 -588154 150220 710305 897136 982453 1098515 907246 192604 -520516
36804 -520516 -472149 267098 806599 642253 283643 367411 688332 645505 261296 73893
36794 73893 181286 99953 -380458 -841707 -923554 -828641 -864099 -906805 -662558 -166753 294440
36783 294440 570965 693885 689883 586077 484549 440025 363689 199796 77174 124359
$$ packed form
36854F83768k83462l69282k98625p4730J00549K90219O50263Q96975O02867j8403
36844B180139l10532j66753j06123l07010l56887j32643r5070l77918l91897J76387
36834A11693O89416M87848j00188l49111k43461k53581l71284j87642K33782L60791
36824C78263Q5122r6517P5596K25821K0587k87641l28527k17069k72124l88864
36814h05353j67686L84885P38374N60085J86831Q5317J16062j91269p14642p13120
36804e20516M8367P39247N39501j64346l58610Q3768L20921m2827l84209j87403
36794G3893J07393q1333m80411m61249q1847R4913l5458m2706K44247M95805M61193
36783B94440K76525J22920m002j03806j01528m4524p6336j63893j22622M7185
$$ plain form
36773 124359 242227 234514 102515 51806 208292 419145 362644 -134965 -877818 -1465748
36763 -1465748 -1738344 -1910061 -2120674 -2072176 -1456423 -608864 -247969 -505556 -696111 -254576
36753 -254576 499885 813758 392603 -457109 -1314457 -1925851 -2155956 -1983765 -1527720 -932967
36743 -932967 -331408 31141 -102995 -603945 -931116 -745322 -305005 -23249 86320 227976
36733 227976 386712 468724 644335 1092152 1539295 1518866 1030878 533467 319298 302515
36723 302515 377976 544240 653195 486858 166683 78260 286036 416790 250858 39051
36713 39051 64500 255018 422542 536653 541965 255116 -277112 -632279 -554915 -386232
36703 -386232 -593301 -1084192 -1396132 -1409344 -1400871 -1423664 -1149604 -498205 11838 -125408
$$ packed form
36773A24359J17868p713j31999n0709J56486K10853n6501m97609p42853n87930
36763a465748k72596j71717k10613M8498O15753Q47559L60895k57587j90555M41535
36753b54576P54461L13873m21155q49712q57348o11394k30105J72191M56045N94753
36743i32967O01559L62549j34136n00950l27171J85794M40317K81756J09569J41656
36733B27976J58736Q2012J75611M47817M47143k0429m87988m97411k14169j6783
36723C02515P5461J66264J08955j66337l20175q8423K07776J30754j65932k11807
36713C9051K5449J90518J67524J14111N312k86849n32228l55167P7364J68683
36703c86232k07069m90891l11940j3212Q473k2793K74060O51399N10043j37246
$$ plain form
36693 -125408 -686202 -991284 -805704 -573904 -695929 -952202 -902111 -579584 -393028 -434798
36683 -434798 -351381 11348 272277 73214 -367470 -578264 -445518 -149641 262909 799553
36673 799553 1179336 1085549 726144 645661 935203 1102550 820790 343228 34385 -56470
36663 -56470 30860 363011 824346 1041777 886113 674485 589043 316171 -345927 -913369
36653 -913369 -759668 18662 773908 1153002 1277752 1239430 974602 631921 551434 778597
36643 778597 971512 865310 519169 88459 -306802 -455006 -147301 511170 1156527 1569538
36633 1569538 1752835 1630972 1057792 201119 -448648 -611135 -487465 -402293 -470104 -715528
36623 -715528 -1174176 -1672749 -1801277 -1359697 -653450 -148815 13766 15555 42609 133961
$$ packed form
36693a25408n60794l05082J85580K31800j22025k56273N0091L22527J86556m1770
36683d34798Q3417L62729K60929j99063m40684k10794J32746K95877M12550N36644
36673G99553L79783r3787l59405q0483K89542J67347k81760m77562l08843r0855
36663e6470Q7330L32151M61335K17431j55664k11628q5442k72872o62098n67442
36653i13369J53701P78330P55246L79094J24750l8322k64828l42681q0487K27163
36643G78597J92915j06202l46141m30710l95261j48204L07705O58471O45357M13011
36633A569538J83297j21863n73180q56673o49767j62487J23670Q5172o7811k45424
36623g15528m58648m98573j28528M41580P06247N04635J62581J789K7054R1352
$$ plain form
36613 133961 216078 174554 9188 -54359 188278 539010 556517 180347 -134864 -55165
36603 -55165 211509 338323 356199 400480 320332 -42022 -409826 -352436 110744 573594
36593 573594 804040 862228 768342 482310 166904 34976 -62864 -458719 -1050701 -1342122
36583 -1342122 -1187228 -988855 -966499 -764943 -143167 420271 316356 -307991 -793218 -899208
36573 -899208 -911661 -901226 -531279 252134 919055 1054750 926066 981731 1134534 986702
36563 986702 538823 175542 36315 -105609 -318274 -347405 -110777 71498 -45278 -275890
36553 -275890 -356883 -310854 -200247 106595 553977 651718 133758 -407557 -196474 531900
36543 531900 730852 -2520 -900891 -1185780 -1033634 -960681 -901370 -555417 -203846 -398020
$$ packed form
36613A33961Q2117m1524j65366o3547K42637L50732J7507l76170l15211P9699
36603e5165K66674J26814J7876M4281q0148l62354l67804N7390M63180M62850
36593E73594K30446N8188r3886k86032l15406j31928r7840l95855n91982k91421
36583a342122J54894J98373K2356K01556O21776N63438j03915o24347m85227j05990
36573h99208j2453J0435L69947P83413O66921J35695j28684N5665J52803j47832
36563I86702m47879l63281j39227j41924k12665k9131K36628J82275j16776k30612
36553b75890q0993M6029J10607L06842M47382R7741n17960n41315K11083P28374
36543E31900J98952p33372q98371k84889J52146P2953N9311L45953L51571j94174
$$ plain form
36533 -398020 -1007124 -1304370 -1005835 -584482 -454675 -434485 -224334 85273 273026 364685
36523 364685 444235 390695 118757 -144372 -123987 135859 448770 849007 1439397 1986152
36513 1986152 2057417 1609587 1113968 978798 1094373 1115578 988757 943718 1043533 1024801
36503 1024801 662107 86664 -408517 -742209 -1016264 -1190204 -1072979 -711586 -518897
36494 -518897 -809670 -1367494 -1694210 -1588112 -1251149 -913674 -643192 -518777 -672863 -1021302
36484 -1021302 -1176484 -826327 -114642 480347 598362 278951 -115632 -201297 105253 491087
36474 491087 545005 190126 -277473 -614490 -938431 -1485920 -2172502 -2580375 -2404347 -1792252
36464 -1792252 -1176750 -819039 -605514 -318191 -4440 71526 -162370 -426705 -449207 -311668
$$ packed form
36533c98020o09104k97246K98535M21353J29807K0190K10151L09607J87753R1659
36523C64685P9550n3540k71938k63129K0385K59846L12911M00237N90390N46755
36513A986152P1265m47830m95619j35170J15575K1205j26821m5039R9815j8732
36503A024801l62694n75443m95181l33692k74055j73940J17225L61393J92689
36494e18897k90773n57824l26716J06098L36963L37475K70482J24415j54086l48439
36484a021302j55182L50157P11685N94989J18015l19411l94583q5665L06550L85834
36474D91087N3918l54879m67599l37017l23941n47489o86582m07873J76028O12095
36464a792252O15502L57711K13525K87323L13751P5966k33896k64335k2502J37539
$$ plain form
36454 -311668 -266632 -347544 -381643 -294715 -164193 -38074 51402 -34529 -355045 -624733 -469910
36443 -469910 41918 465277 582942 567977 510687 268192 -61703 -39171 429403 759914
36433 759914 469170 -85270 -229372 54359 224818 62721 -139635 -215351 -367916 -691886
36423 -691886 -937718 -907209 -695009 -402089 12530 431151 509718 174186 -95502 222333
36413 222333 1046342 1802793 2078269 1945924 1691003 1412779 969841 271417 -447696 -754474
36403 -754474 -491526 -6245 245778 221060 205217 315405 387250 332192 272025 251749 122474
36392 122474 -177898 -482281 -632860 -619041 -410201 43029 525452 614332 220865 -221509
36382 -221509 -331428 -249643 -278251 -358764 -272633 -127610 -211104 -465223 -528925 -306435 -137012
$$ packed form
36454c11668M5036q0912l4099Q6928J30522J26119Q9476q5931l20516k69688J54823
36443d69910N11828M23359J17665j4965n7290k42495l29895K2532M68574L30511
36433G59914k90744n54440j44102K83731J70459j62097k02356p5716j52565l23970
36423f91886k45832L0509K12200K92920M14619M18621P8567l35532k69688L17835
36413B22333Q24009P56451K75476j32345k54921k78224m42938o98424p19113l06778
36403g54474K62948M85281K52023k4718j5843J10188P1845n5058o0167k0276j29275
36392A22474l00372l04383j50579J3819K08840M53230M82423Q8880l93467m42374
36382b21509j09919Q1785k8608q0513Q6131J45023q3494k54119o3702K22490J69423
$$ plain form
36371 -137012 -319390 -711262 -878759 -509222 302694 1044339 1152630 586092 -54309 -168018
36361 -168018 196962 542736 573954 329857 -143290 -779638 -1221684 -1091998 -616974 -482655
36351 -482655 -906185 -1318436 -1190938 -706978 -292502 59004 519467 834550 601883 17774
36341 17774 -223700 177219 791556 1115685 1153134 1171534 1215184 1118828 829844 490945
36331 490945 264378 193646 182046 44501 -340691 -873582 -1282459 -1346111 -1009750 -341339
36321 -341339 472251 1111241 1305564 1077292 657368 174808 -362235 -788663 -803756 -391065
36311 -391065 64507 246861 227943 123314 -245593 -990637 -1698014 -1794598 -1306100 -821925
36301 -821925 -698273 -713611 -590641 -439788 -494959 -746274 -1060730 -1392530 -1643345 -1573319
$$ packed form
36371a37012j82378l91872j67497L69537Q11916P41645J08291n66538o40401j13709
36361a68018L64980L45774L1218k44097m73147o36348m42046J29686M75024J34319
36351d82655m23530m12251J27498M83960M14476L51506M60463L15083k32667n84109
36341A7774k41474M00919O14337L24129L7449J8400M3650r6356k88984l38899
36331D90945k26567p0732j1600j37545l85192n32891m08877o3652L36361O68411
36321c41339Q13590O38990J94323k28272m19924m82560n37043m26428j5093M12691
36311c91065M55572J82354j8918j04629l68907p45044p07377r6584M88498M84175
36301h21925J23652j5338J22970J50853n5171k51315l14456l31800k50815P0026
$$ plain form
36291 -1573319 -1125689 -629635 -391673 -273985 -3780 268819 139588 -380087 -804649
36282 -804649 -856426 -794733 -891611 -961374 -733356 -436738 -581891 -1189815 -1632454 -1395279
36272 -1395279 -740641 -373405 -579063 -981539 -1151462 -1125926 -1141201 -1124219 -821558 -344888
36262 -344888 -166167 -489989 -1012776 -1455105 -1914542 -2405582 -2489069 -1880608 -1144199 -1117887
36252 -1117887 -1706226 -1913676 -1194801 -128924 504302 696354 823205 838376 502857
36243 502857 100119 181615 649661 772120 243095 -353910 -401339 -81237 20923 -212726
36233 -212726 -433077 -513931 -716676 -1121830 -1357557 -1128615 -701857 -532305 -572460 -346476
36223 -346476 290421 869910 958672 746870 677208 729305 508094 -27347 -388046 -211849
$$ packed form
36291a573319M47630M96054K37962J17688K70205K72599j29231n19675m24562
36282h04649n1777O1693r6878o9763K28018K96618j45153o07924m42639K37175
36272a395279O54638L67236k05658m02476j69923K5536j5275J6982L02661M76670
36262c44888J78721l23822n22787m42329m59437m91040q3487O08461P36409K6312
36252a117887n88339k07450P18875J065877O33226J92052J26851J5171l35519
36243E02857m02738Q1496M68046J22459n29025n97005m7429L20102J02160k33649
36233b12726k20351q0854k02745m05154k35727K28942M26758J69552m0155K25984
36223c46476O36897N79489Q8762k11802o9662N2097k21211n35441l60699J76197
$$ plain form
36213 -211849 284983 686612 886702 1001419 1046424 958576 747555 410380 -107571 -668696
36203 -668696 -914554 -739044 -523639 -579560 -634936 -299931 213239 385388 249181 313753
36193 313753 647351 718277 300417 -122577 -146769 -36245 -122104 -172140 90977 289674
36183 289674 -103046 -803567 -986332 -465348 80958 176962 194959 626791 1216517 1285946
36173 1285946 682424 -38371 -325348 -194103 -32886 -91572 -289612 -412216 -340077 -62865
36163 -62865 418406 1058212 1633941 1822944 1532079 1022550 555280 53533 -644818 -1325273
36153 -1325273 -1561958 -1364110 -1246110 -1474999 -1623503 -1192915 -403995 56259 -50320
36144 -50320 -290042 -240516 36221 303351 513529 638068 490374 61689 -214232 57752
$$ packed form
36213b11849M96832M01629K00090J14717M5005q7848k11021l37175n17951n61125
36203f68696k45858J75510K15405n5921n5376L35005N13170J72149j36207O4572
36193C13753L33598P0926m17860m22994k4192J10524q5859n0036K63117J98697
36183B89674l92720p00521j82765N20984N46306R6004J7997M31832N89726O9429
36173A285946o03522p20795k86977J31245J61217n8686j98040j22604P2139K77212
36163f2865M81271O39806N75729J89003k90865n09529m67270n01747o98351o80455
36153a325273k36685J97848J18000k28889j48504M30588P88920M60254j06579
36144e0320k39722M9526K76737K67130K10178J24539j47694m28685k75921K71984
$$ plain form
36134 57752 607436 776601 398690 -44870 -231612 -479131 -1138686 -1903553 -2166085 -1850128
36124 -1850128 -1405698 -1063433 -630484 -111806 20120 -489050 -1112371 -1129668 -587089 -181324
36114 -181324 -226188 -247809 222009 884433 1061983 614166 62179 -150001 -152719 -328977
36104 -328977 -791282 -1350813 -1807170 -2052119 -1988451 -1571988 -945758 -398497 -170134 -340930
36094 -340930 -809168 -1248629 -1219806 -589818 171398 380366 -123509 -869095 -1408935 -1741156
36084 -1741156 -1941126 -1788162 -1141152 -427950 -277261 -711250 -1112417 -1013760 -560186 -141064
36074 -141064 63334 50312 -151863 -416436 -557089 -594354 -747869 -1017776 -1041992 -582709
36064 -582709 63098 363928 98360 -572485 -1360309 -1965482 -2165596 -2062283 -2059335 -2327215
$$ packed form
36134E7752N49684J69165l77911m43560j86742k47519o59555p64867k62532L15957
36124a850128M44430L42265M32949N18678J31926n09170o23321j7297N42579M05765
36114a81324m4864k1621M69818O62424J77550m47817n51987k12180k718j76258
36104c28977m62305n59531m56357k44949O3668M16463O26230N47261K28363j70796
36094c40930m68238m39461K8823O29988P61216K08968n03875p45586n39840l32221
36084a741156j99970J52964O47010P13202J50689m33989m01167R8657M53574M19122
36074a41064K04398j3022k02175k64573j40653l7265j53515k69907k4216M59283
36064e82709O45807L00830k65568o70845p87824o05173k00114J03313K948k67880
$$ plain form
36054 -2327215 -2490471 -2166953 -1611388 -1402929 -1622144 -1812404 -1720311 -1566195 -1501721 -1300651
36044 -1300651 -799950 -238357 109444 306695 486973 510636 217841 -196811 -412308 -441015
36034 -441015 -524272 -668510 -639424 -401066 -227879 -315814 -541923 -687112 -673877 -503874
36024 -503874 -193427 82240 -29227 -713007 -1684358 -2399384 -2566546 -2345837 -2064293 -1868927
$$ packed form
36054b327215j63256L23518N55565K08459k19215j90260R2093J54116O4474K01070
36044a300651N00701N61593L47801J97251J80278K3663k92795m14652k15497k8707
36034d41015q3257j44238K9086K38358J73187q7935k26109j45189J3235J70003
36024e03874L10447K75667j11467o83780r71351p15026j67162K20709K81544J95366
$$ [...]
##END NTUPLES=NMR SPECTRUM
##END=
