##TITLE=31Pdec_DEP0510
  
  24 sc
 6.10.2023
##JCAMPDX= 6.0         $$ Bruker NMR JCAMP-DX V2.0
##DATA TYPE= NMR SPECTRUM
##DATA CLASS= NTUPLES
##ORIGIN= UXNMR, Bruker Analytische Messtechnik GmbH
##OWNER= root
$$ XWIN-NMR		Version 3.5
$$ Fri Oct  6 13:58:22 2023 Russian Standard Time (UT+4h)  she@DPX200
##.OBSERVE FREQUENCY= 81.013821
##.OBSERVE NUCLEUS= ^31P
##.ACQUISITION MODE= SIMULTANEOUS
##.ACQUISITION SCHEME= undefined
##.AVERAGES= 24
##.DIGITISER RES= 16
##SPECTROMETER/DATA SYSTEM= spect
##.PULSE SEQUENCE= zgpg30
##.SOLVENT NAME= CDCl3
##.SHIFT REFERENCE= (INTERNAL, CDCl3, 0, 248.564)
##AUDIT TRAIL= $$ (NUMBER, WHEN, WHO, WHERE, WHAT)
$$ ##TITLE= Audit trail, XWIN-NMR		Version 3.5
$$ ##JCAMPDX= 5.01
$$ ##ORIGIN= Bruker BioSpin GmbH
$$ ##OWNER= she
$$ F:/spectra/data/she/nmr/P31/1/pdata/1/auditp.txt
$$ ##AUDIT TRAIL=  $$ (NUMBER, WHEN, WHO, WHERE, WHAT)
(   1,<2023-10-06 13:57:24.31 +0400>,<she>,<DPX200>,
      <created by zg, POWCHK disabled, PULCHK disabled
       configuration hash MD5:
       00 E9 B6 7A A2 85 ED C7 34 08 36 98 17 FE 4E 26
       data hash MD5: 32K
       20 EC C8 F2 13 9D 36 4A B0 E7 40 E4 49 CE 14 DE>)
(   2,<2023-10-06 13:57:26.65 +0400>,<she>,<DPX200>,
      <Start of raw data processing
       efp BC_mod = 2 LB = 5 FT_mod = 6 PKNL = 1 PHC0 = -10659.88 PHC1 = 66.68633 SI = 64K 
       data hash MD5: 64K
       1B 0F 0D 48 39 52 D0 73 88 8D 58 F5 C3 BE 69 73>)
(   3,<2023-10-06 13:57:40.96 +0400>,<she>,<DPX200>,
      <pk PHC0 = -168.7296 PHC1 = 0 
       data hash MD5: 64K
       F5 E4 00 57 FA CC FA 19 53 A5 19 B9 C3 C2 67 AF>)
$$ ##END=
$$ 
$$ hash MD5
$$ F8 F7 A8 6B D9 D2 72 32 4F 2E 6D BD DD 91 03 8E
##$RELAX= 
##$RELAX= 
##$RELAX= 
##$RELAX= 
##$RELAX= 
##$RELAX= 
##$RELAX= 
##$RELAX= 
##$RELAX= 
$$ Bruker specific parameters
$$ --------------------------
##$DU= <F:/spectra>
##$EXPNO= 1
##$NAME= <P31>
##$PROCNO= 1
##$TYPE= <nmr>
##$USER= <she>
##$AMP= (0..31)
100 100 100 100 100 100 100 100 100 100 100 100 100 100 100 100 100 100 
100 100 100 100 100 100 100 100 100 100 100 100 100 100 
##$AQSEQ= 0
##$AQ_mod= 1
##$AUNM= <au_zg>
##$AUTOPOS= <>
##$BF1= 81.014009
##$BF2= 200.13
##$BF3= 200.13
##$BF4= 200.13
##$BF5= 200.13
##$BF6= 200.13
##$BF7= 200.13
##$BF8= 200.13
##$BYTORDA= 1
##$CFDGTYP= 0
##$CFRGTYP= 5
##$CHEMSTR= <none>
##$CNST= (0..31)
1 1 145 1 1 1 1 1 1 1 1 1 1 1 1 1 1 1 1 1 1 1 1 1 1 1 1 1 1 1 1 1 
##$CPDPRG= <waltz16>
##$CPDPRG1= <>
##$CPDPRG2= <waltz16>
##$CPDPRG3= <>
##$CPDPRG4= <mlev>
##$CPDPRG5= <mlev>
##$CPDPRG6= <mlev>
##$CPDPRG7= <mlev>
##$CPDPRG8= <mlev>
##$CPDPRGB= <>
##$CPDPRGT= <>
##$D= (0..31)
0 1 0 0 0 0 0 0 0 0 0 0.03 2e-05 3e-06 0 0 0 0 0 0 0 0 0 0 0 0 0 0 0 0 
0 0 
##$DATE= 1696586243
##$DBL= (0..7)
120 120 120 11 120 120 24 19 
##$DBP= (0..7)
150 150 150 150 150 150 150 150 
##$DBP07= 0
##$DBPNAM0= <>
##$DBPNAM1= <>
##$DBPNAM2= <>
##$DBPNAM3= <>
##$DBPNAM4= <>
##$DBPNAM5= <>
##$DBPNAM6= <>
##$DBPNAM7= <>
##$DBPOAL= (0..7)
0.5 0.5 0.5 0.5 0.5 0.5 0.5 0.5 
##$DBPOFFS= (0..7)
$$ [...]
##$SUBNAM2= <"">
##$SUBNAM3= <"">
##$SUBNAM4= <"">
##$SUBNAM5= <"">
##$SUBNAM6= <"">
##$SUBNAM7= <"">
##$SUBNAM8= <"">
##$SUBNAM9= <"">
##$SW= 501.771253377433
##$SWIBOX= (0..15)
0 1 3 0 0 0 0 0 0 0 0 0 0 0 0 0 
##$SW_h= 40650.406504065
##$TD= 32768
##$TD0= 1
##$TE= 0
##$TE2= 300
##$TE3= 300
##$TEG= 300
##$TL= (0..7)
0 120 53 12 22 120 120 120 
##$TP= (0..7)
150 150 150 150 150 150 150 150 
##$TP07= 0
##$TPNAME0= <>
##$TPNAME1= <>
##$TPNAME2= <>
##$TPNAME3= <>
##$TPNAME4= <>
##$TPNAME5= <>
##$TPNAME6= <>
##$TPNAME7= <>
##$TPOAL= (0..7)
0.5 0.5 0.5 0.5 0.5 0.5 0.5 0.5 
##$TPOFFS= (0..7)
0 0 0 0 0 0 0 0 
##$TUNHIN= 0
##$TUNHOUT= 0
##$TUNXOUT= 0
##$USERA1= <user>
##$USERA2= <user>
##$USERA3= <user>
##$USERA4= <user>
##$USERA5= <user>
##$V9= 5
##$VALIST= <valist>
##$VCLIST= <CCCCCCCCCCCCCCC>
##$VD= 0
##$VDLIST= <DDDDDDDDDDDDDDD>
##$VPLIST= <PPPPPPPPPPPPPPP>
##$VTLIST= <TTTTTTTTTTTTTTT>
##$WBST= 1024
##$WBSW= 4
##$XGAIN= (0..3)
0 0 0 0 
##$XL= 0
##$YL= 0
##$YMAX_a= 39996
##$YMIN_a= -46950
##$ZGOPTNS= <>
##$ZL1= 120
##$ZL2= 120
##$ZL3= 120
##$ZL4= 120
##$ABSF1= 0
##$ABSF2= 0
##$ABSG= 0
##$ABSL= 0
##$ALPHA= 0
##$AQORDER= 0
##$ASSFAC= 0
##$ASSFACI= 0
##$ASSFACX= 0
##$ASSWID= 0
##$AUNMP= <proc_1d>
##$AZFE= 0.1
##$AZFW= 0.5
##$BCFW= 0
##$BC_mod= 2
##$BYTORDP= 0
##$COROFFS= 0
##$CY= -3
##$DATMOD= 1
##$DC= 0
##$DFILT= <>
##$DTYPP= 0
##$F1P= 0
##$F2P= 0
##$FCOR= 1
##$FTSIZE= 65536
##$FT_mod= 6
##$GAMMA= 0
##$GB= 0
##$INTBC= 1
##$INTSCL= 6.047779e-11
##$ISEN= 30
##$LB= 5
##$LEV0= 0
##$LPBIN= 0
##$MAXI= 10000
##$MC2= 0
##$MEAN= 0
##$ME_mod= 0
##$MI= 50
##$NCOEF= 0
##$NC_proc= -2
##$NLEV= 6
##$NOISF1= 182.463
##$NOISF2= 159.3651
##$NSP= 0
##$NTH_PI= 0
##$NZP= 0
##$OFFSET= 248.5645
##$PC= 4
##$PHC0= -10828.61
##$PHC1= 66.68633
##$PH_mod= 1
##$PKNL= yes
##$PPARMOD= 0
##$PSCAL= 0
##$PSIGN= 0
##$REVERSE= no
##$SF= 81.0140089999694
##$SI= 65536
##$SIGF1= 159.3651
##$SIGF2= -187.1042
##$SINO= 113.3802
##$SIOLD= 16384
##$SREGLST= <1H.CDCl3>
##$SSB= 0
##$STSI= 65536
##$STSR= 0
##$SW_p= 40650.406504065
##$SYMM= 0
##$S_DEV= 0
##$TDeff= 32768
##$TDoff= 0
##$TI= <>
##$TILT= no
##$TM1= 0
##$TM2= 0
##$TOPLEV= 0
##$USERP1= <user>
##$USERP2= <user>
##$USERP3= <user>
##$USERP4= <user>
##$USERP5= <user>
##$WDW= 1
##$XDIM= 65536
##$YMAX_p= 303375089
##$YMIN_p= -2513508
$$ End of Bruker specific parameters
$$ ---------------------------------
##NTUPLES= NMR SPECTRUM
##VAR_NAME=  FREQUENCY,     SPECTRUM/REAL,   SPECTRUM/IMAG
##SYMBOL=    X,             R,               I
##VAR_TYPE=  INDEPENDENT,   DEPENDENT,       DEPENDENT
##VAR_FORM=  AFFN,          ASDF,            ASDF
##VAR_DIM=   65536,         65536,           65536
##UNITS=     HZ,            ARBITRARY UNITS, ARBITRARY UNITS
##FACTOR=    0.620285442955139, 1,           1
##FIRST=     20137.2065510682, 0,            0
##LAST=      -20513.1999529968, 0,           0
##MIN=       -20513.1999529968, -2513508,    0
##MAX=       20137.2065510682, 303375089,    0
$$ Real data points
##PAGE= N=1
##DATA TABLE= (X++(R..R)), XYDATA
$$ [...]
$$ plain form
37640 29259 27817 26606 24883 22412 19480 15946 11397 6228 1478 -2446 -5940 -9198 -11989 -14362
37626 -14362 -16559 -18301 -19024 -18777 -18046 -16935 -15385 -13938 -13285 -13276 -13325 -13497 -14203 -15179 -15917 -16856 -18922 -22035
37608 -22035 -25196 -27838 -29958 -31146 -30868 -29685 -28927 -29100 -29709 -30601 -32218 -34464 -36543 -38131 -39658 -41267
37592 -41267 -42502 -43124 -43302 -42961 -41914 -40618 -39809 -39368 -38539 -37288 -36441 -36502 -37346 -39022 -41786 -45267 -48651
37575 -48651 -51827 -55465 -59947 -65138 -71077 -77809 -84500 -89676 -92356 -92009 -87581 -77822 -62807 -44289
37561 -44289 -24521 -5506 10957 23731 32973 39386 42912 43037 40075 34924 27684 17692 4838
37548 4838 -10358 -27885 -48206 -71152 -96022 -122661 -151116 -180115 -206962 -228775 -242706 -245509
37536 -245509 -235101 -213125 -184629 -154700 -126304 -101090 -80316 -64285 -52199 -43301 -37248 -33248
$$ packed form
37640B9259j442j211j723k471k932l534m549n169m750l924l494l258k791k373
37626a4362k197j742p23K47P31J111J550J447O53Rm9j72p06r76p38r39k066l113
37608b2035l161k642k120j188K78J183P58j73o09q92j617k246k079j588j527j609
37592d1267j235o22j78L41J047J296Q09M41Q29J251Q47o1q44j676k764l481l384
37575d8651l176l638m482n191n939o732o691n176k680L47M428R759J5015J8518
37561d4289J9768J9015J6463J2774R242O413L526J25k962n151p240r992j2854
37548D838j5196j7527k0321k2946k4870k6639k8455k8999k6847k1813j3931k803
37536b45509J0408K1976K8496K9929K8396K5214K0774J6031J2086Q898O053M000
$$ plain form
37524 -33248 -30122 -27650 -26669 -27451 -29083 -30753 -32424 -33928 -34682 -34759 -35068 -35950 -36697 -36847 -36860 -37066 -37061 -36631
37506 -36631 -36266 -36255 -36280 -36265 -36671 -37561 -38350 -38834 -39438 -40119 -40093 -39093 -37908 -37305 -37362 -38140 -39875 -42083 -43590
37487 -43590 -43928 -43806 -43833 -43842 -43840 -44522 -46325 -48820 -51443 -53880 -55510 -55549 -54145 -52337 -50596 -48514 -46210 -44840
37469 -44840 -45219 -46963 -49440 -52431 -55429 -57548 -58748 -60093 -62187 -64317 -65676 -66396 -66809 -66739 -66204 -65850
37453 -65850 -66013 -66139 -65729 -65003 -64183 -63010 -61457 -60069 -59117 -58286 -57559 -57474 -58137 -59008 -60101 -62238 -65602
37436 -65602 -69067 -71534 -72843 -72783 -70349 -64818 -56754 -47334 -37505 -28307 -20982 -15992 -12711 -10655 -10211
37421 -10211 -11672 -14524 -18237 -22870 -28255 -33522 -38011 -41855 -45159 -47540 -49050 -50560 -52573 -54560
37407 -54560 -56016 -57296 -58766 -60103 -61075 -62124 -63457 -64408 -64403 -63812 -63265 -62855 -62512 -62329 -62041 -61052 -59516
$$ packed form
37524c3248L126K472R81p82j632j670j671j504p54p7l09q82p47j50j3k06NM30
37506c6631L65J1k5J5m06q90p89m84o04o81K6J000J185O03n7p78j735k208j507
37487d3590l38J22k7rKo82j803k495k623k437j630l9J404J808J741K082K304J370
37469d4840l79j744k477k991k998k119j200j345k094k130j359p20m13P0N35L54
37453f5850j63j26M10P26Q20J173J553J388R52Q31P27Q5o63q71j093k137l364
37436f5602l465k467j309O0K434N531Q064R420R829R198P325M990L281K056M44
37421a0211j461k852l713m633n385n267m489l844l304k381j510j510k013j987
37407e4560j456j280j470j337r72j049j333r51NN91N47M10L43J83K88R89J536
$$ plain form
37390 -59516 -58452 -58289 -58243 -57661 -56974 -56762 -56927 -57395 -58566 -60314 -61545 -61533 -60860 -60388 -60215 -60303 -61059 -62463
37372 -62463 -63557 -63647 -63265 -63227 -63554 -64002 -64715 -65634 -66140 -66068 -66226 -67126 -68086 -68303 -67981 -67712 -67661 -68190 -70301 -74534
37352 -74534 -80011 -85226 -88977 -90037 -87180 -80610 -72562 -65486 -60225 -56540 -54334 -53350 -52559 -51002 -48827
37337 -48827 -46751 -45130 -44219 -44532 -46141 -48325 -50647 -53607 -57514 -61488 -64335 -65696 -65730 -64587 -62946
37322 -62946 -62062 -62378 -62842 -62384 -61234 -60032 -58626 -56657 -54453 -52443 -50502 -48784 -48283 -49606 -51911 -53934
37306 -53934 -55279 -55931 -55464 -53708 -51398 -49205 -46906 -44379 -42498 -42061 -42671 -43556 -44585 -45574 -45604 -44161
37290 -44161 -42038 -39996 -37378 -33143 -27421 -20905 -13561 -5058 4333 14436 26033 40012 56402
37277 56402 74849 94487 111900 120823 116346 99317 75278 49720 25691 4866 -11677 -24022
$$ packed form
37390e9516J064J63M6N82O87K12j65m68j171j748j231J2O73M72J73q8p56j404
37372f2463j094r0L82L8l27m48p13r19n06P2j58r00r60k17L22K69N1n29k111m233
37352g4534n477n215l751j060K857O570Q048P076N261L685K206R84P91J557K175
37337d8827K076J621R11l13j609k184k322k960l907l974k847j361l4J143J641
37322f2946Q84l16m64M58J150J202J406J969K204K010J941J718N01j323k305k023
37306e3934j345o52M67J756K310K193K299K527J881M37o10q85j029r89l0J443
37290d4161K123K042K618M235N722O516P344Q503R391J0103J1597J3979J6390
37277E6402J8447J9638J7413Q923m477j7029k4039k5558k4029k0825j6543j2345
$$ plain form
37265 -24022 -33152 -39702 -43934 -46670 -49007 -51143 -52554 -53195 -53564 -53810 -53789 -53725 -53885 -53868 -53200 -52279 -51863 -52019
37247 -52019 -52485 -53519 -55362 -57367 -58771 -59909 -61654 -64091 -66789 -69825 -73388 -76809 -79151 -80393 -80964
37232 -80964 -80580 -78767 -76128 -73875 -72330 -70987 -69706 -68770 -68020 -67019 -65846 -64800 -63728 -62601 -62254
37217 -62254 -63438 -65547 -67311 -68324 -68792 -68391 -66680 -64304 -62460 -61393 -60549 -59867 -59711 -59762 -59219 -57983
37201 -57983 -56609 -55366 -54389 -54437 -56297 -59623 -63337 -66914 -70306 -73110 -74951 -76365 -78100 -79880 -80927
37186 -80927 -81263 -81305 -80611 -78443 -75266 -72356 -70128 -68140 -66566 -66275 -67503 -69677 -72565 -76433 -81200 -86567
37170 -86567 -92924 -101025 -110889 -122077 -134682 -148719 -162519 -172998 -177643 -175445 -166321 -151021 -131611
37157 -131611 -110736 -90148 -70647 -53136 -38518 -26729 -17043 -9345 -4018 -843 794 665 -2121
$$ packed form
37265b4022r130o550m232k736k337k136j411o41l69k46K1O4j60J7O68R21M16j56
37247e2019m66j034j843k005j404j138j745k437k698l036l563l421k342j242n71
37232h0964L84J813K639K253J545J343J281R36P50J001J173J046J072J127L47
37217f2254j184k109j764j013m68M01J711K376J844J067Q44O82J56n1N43J236
37201e7983J374J243R77m8j860l326l714l577l392k804j841j414j735j780j047
37186h0927l36m2O94K168L177K910K228J988J574K91j228k174k888l868m767n367
37170h6567o357q101r864j1188j2605j4037j3800j0479m645K198R124J5300J9410
37157a31611K0875K0588J9501J7511J4618J1789R686P698N327L175J637j29k786
$$ plain form
37144 -2121 -7654 -14997 -23428 -32860 -43098 -53717 -64597 -75530 -85394 -92740 -97162 -99176 -99001 -96545
37130 -96545 -92362 -87462 -82281 -76890 -71963 -68378 -65992 -63969 -62130 -60828 -59723 -57964 -55536 -53256
37116 -53256 -51512 -50155 -49474 -50023 -51526 -53064 -54293 -55373 -55996 -55715 -55072 -55039 -55479 -55446 -54850 -54472 -54457 -54268
37098 -54268 -54096 -54832 -56458 -57866 -58466 -58699 -58822 -58453 -57554 -56663 -55973 -55256 -54728 -54854 -55298 -55264 -54814 -54586 -54307
37079 -54307 -52994 -50692 -48571 -47161 -45867 -44388 -43218 -42477 -41596 -40465 -39642 -39128 -38206 -36785 -35717 -35466
37063 -35466 -35638 -36044 -37028 -38467 -39580 -39972 -39786 -38731 -36186 -32429 -28510 -24720 -20410 -15543 -11061 -7429
37047 -7429 -4011 -186 4066 8902 14693 21173 27723 34733 43466 54365 66837 80809 97034 115448
37033 115448 134543 152760 169173 182399 190284 191419 186078 175351 160486 143339 126188 110528
$$ packed form
37144b121n533p343q431r432j0238j0619j0880j0933r864p346m422k014J75K456
37130i6545M183M900N181N391M927L585K386K023J839J302J105J759K428K280
37116e3256J744J357O81n49j503j538j229j080o23K81O43L3m40L3N96L78J5J89
37098e4268J72p36j626j408o00k33j23L69Q99Q91O90P17N28j26m44L4M50K28K79
37079e4307J313K302K121J410J294J479J170P41Q81J131Q23N14R22J421J068K51
37063c5466j72m06r84j439j113l92J86J055K545L757L919L790M310M867M482L632
37047g429L418L825M252M836N791O480O550P010Q733J0899J2472J3972J6225J8414
37033A15448J9095J8217J6413J3226P885J135n341j0727j4865j7147j7151j5660
$$ plain form
37021 110528 96988 86503 80324 78629 80453 85295 93499 104791 117977 132543 149242 168636
37009 168636 190446 214770 242274 272331 302160 328506 348883 360477 359350 342225 308859 262431
36997 262431 208490 153630 103552 61089 26310 -1433 -22505 -37854 -49264 -57936 -63975 -67729
36985 -67729 -70482 -73215 -75779 -77856 -79691 -81389 -82649 -83707 -85483 -88233 -91115 -93485 -95510 -97094
36971 -97094 -97525 -96811 -96161 -96462 -97304 -98027 -98519 -98461 -97060 -94330 -91598 -90021 -89545 -89802 -90867 -92539 -94012
36954 -94012 -94947 -95848 -96880 -97480 -97706 -98674 -100953 -103640 -105745 -107356 -108738 -109489 -109381 -108993 -108744 -108267 -107385
36937 -107385 -106649 -106262 -105555 -104203 -102839 -101785 -100379 -98304 -96445 -95610 -95500 -95693 -96519 -98105 -99675 -100717
36921 -100717 -101801 -103405 -104887 -105486 -105352 -104816 -103612 -101669 -99683 -98121 -96594 -94925 -93792 -93509 -93242
$$ packed form
37021A10528j3540j0485o179j695J824M842Q204J1292J3186J4566J6699J9394
37009A68636K1810K4324K7504L0057K9829K6346K0377J1594j127j7125l3366m6428
36997B62431n3941n4860n0078m2463l4779k7743k1072j5349j1410q672o039l754
36985f7729k753k733k564k077j835j698j260j058j776k750k882k370k025j584
36971i7094m31P14O50l01q42p23m92N8J401K730K732J577M76k57j065j672j473
36954i4012r35r01j032o00k26r68k279k687k105j611j382p51J08L88K49M77Q82
36937a07385P36L87P07J352J364J054J406K075J859Q35J10j93q26j586j570j042
36921a00717j084j604j482n99J34N36J204J943J986J562J527J669J133K83K67
$$ plain form
36906 -93242 -92277 -91056 -90200 -89490 -88638 -87956 -87456 -86362 -84306 -81963 -79640 -76465 -71871 -66782 -62363 -58666
36890 -58666 -55463 -53213 -52116 -51322 -50258 -49747 -50696 -52584 -54348 -55811 -57133 -57838 -57581 -56978 -56502 -55375
36874 -55375 -52645 -48421 -42846 -34795 -22947 -7370 11226 33048 58589 87167 117555 149349
36862 149349 181740 210715 229145 230809 214646 185596 151789 120188 93747 72046 54086 39662
36850 39662 28368 18970 10578 3360 -2600 -8085 -13603 -18576 -22543 -26145 -29993 -33588 -36336 -38669
36836 -38669 -41204 -43678 -45738 -47829 -50306 -52504 -53712 -54272 -54753 -54932 -54591 -54436 -55194 -56595 -58105 -59776
36820 -59776 -61475 -62369 -62258 -62352 -63598 -65228 -66100 -66393 -66714 -66657 -65723 -64775 -65016 -66202 -67240 -67875 -68397 -68410
36802 -68410 -67349 -65653 -64077 -62381 -60067 -57836 -56941 -57500 -58659 -59950 -61291 -62234 -62477 -62676 -63608 -65026
$$ packed form
36906i3242R65J221Q56P10Q52O82N00J094K056K343K323L175M594N089M419L697
36890e8666L203K250J097P94J064N11r49j888j764j463j322p05K57O03M76J127
36874e5375K730M224N575Q051J1848J5577J8596K1822K5541K8578L0388L1794
36862A49349L2391K8975J8430J664j6163k9050l3807l1601k6441k1701j7960j4424
36850C9662j1294r398q392p218n960n485n518m973l967l602l848l595k748k333
36836c8669k535k474k060k091k477k198j208n60m81j79L41J55p58j401j510j671
36820e9776j699q94J11r4j246j630q72k93l21N7R34R48k41j186j038o35n22j3
36802f8410J061J696J576J696K314K231Q95n59j159j291j341r43k43j99r32j418
$$ plain form
36786 -65026 -66410 -68121 -70568 -72930 -74093 -74319 -74664 -75273 -75571 -75545 -75492 -74939 -73234 -70848 -68848 -67449 -66308
36769 -66308 -65694 -66057 -66818 -66986 -66610 -66466 -66693 -67017 -67823 -69660 -72036 -73948 -75326 -76727 -78096 -79085 -80130
36752 -80130 -81845 -83676 -84543 -84529 -84675 -85382 -86224 -86954 -87442 -86991 -85046 -82319 -79981 -78140 -76247 -74464 -73228
36735 -73228 -71974 -69868 -67417 -65875 -65348 -64962 -64630 -65063 -66261 -67497 -68669 -70160 -71557 -72009 -71761 -71857
36719 -71857 -72403 -72669 -72764 -73585 -75101 -76304 -77001 -78171 -80399 -83427 -87311 -92502 -98563 -104339 -109612 -115267
36703 -115267 -121678 -128415 -135755 -144938 -156683 -170864 -187904 -208873 -233954 -262522 -295175 -333978
36691 -333978 -380129 -433190 -493304 -562339 -641988 -732871 -836849 -958156 -1100479 -1264793 -1451430
36680 -1451430 -1659570 -1877294 -2071300 -2194492 -2212910 -2128704 -1976379 -1797222 -1617709 -1447827
$$ packed form
36786f5026j384j711k447k362j163k26l45o09k98K6N3N53J705K386K000J399J141
36769f6308O14l63p61j68L76J44k27l24q06j837k376j912j378j401j369r89j045
36752h0130j715j831q67J4j46p07q42p30m88M51J945K727K338J841J893J783J236
36735g3228J254K106K451J542N27L86L32m33j198j236j172j491j397m52K48r6
36719g1857n46k66r5q21j516j203o97j170k228l028l884n191o061n776n273n655
36703a15267o411o737p340r183j1745j4181j7040k0969k5081k8568l2653l8803
36691c33978m6151n3061o0114o9035p9649r0883j03978j21307j42323j64314j86637
36680a451430k08140k17724j94006j23192j8418Q4206J52325J79157J79513J69882
$$ plain form
36670 -1447827 -1291022 -1150066 -1025912 -917000 -821744 -739702 -669677 -608882 -555087 -508016
36660 -508016 -467714 -433004 -402573 -376161 -353495 -333254 -314322 -297060 -282127 -268960 -256583
36649 -256583 -245041 -234815 -225630 -217004 -209238 -202685 -196798 -191050 -185990 -182140 -178622 -174244 -169297 -164969
36635 -164969 -161538 -158457 -155613 -153183 -150773 -148066 -145824 -144914 -144760 -144030 -142397 -140415 -138221 -135681 -133313
36620 -133313 -131655 -130121 -127796 -124957 -122476 -120246 -117585 -114720 -112441 -110675 -108830 -107121 -106069 -105089
36606 -105089 -103120 -100365 -97904 -95891 -93625 -91100 -88905 -86830 -84115 -80968 -78335 -76312 -74302 -72546
36592 -72546 -71970 -72605 -73640 -74930 -76930 -79242 -80756 -81233 -81317 -81077 -80042 -78600 -77815 -77802 -77779 -77706 -78381 -79912
36574 -79912 -81608 -83427 -86048 -89428 -92706 -95570 -98268 -100234 -100323 -98609 -96502 -94911 -93661 -92777 -92780 -93411
$$ packed form
36670a447827J56805J40956J24154J08912R5256Q2042P0025O0795N3795M7071
36660e08016M0302L4710L0431K6412K2666K0241J8932J7262J4933J3167J2377
36649b56583J1542J0226R185Q626P766O553N887N748N060L850L518M378M947M328
36635a64969L431L081K844K430K410K707K242R10J54P30J633J982K194K540K368
36620a33313J658J534K325K839K481K230K661K865K279J766J845J709J052R80
36606a05089J969K755K461K013K266K525K195K075K715L147K633K023K010J756
36592g2546N76o35j035j290k000k312j514m77q4K40J035J442P85J3K3P3o75j531
36574g9912j696j819k621l380l278k864k698j966q9J714K107J591J250Q84lo31
$$ plain form
36558 -93411 -93498 -92472 -90854 -89088 -87126 -85212 -83769 -82428 -80458 -78172 -76630 -75972 -75431 -74912 -75009 -75463
36542 -75463 -75179 -73979 -72886 -72471 -72333 -72262 -72433 -72306 -70913 -68470 -66315 -65075 -64330 -64137 -65195 -67306 -69258
36525 -69258 -70586 -71884 -73101 -73176 -71809 -70061 -68700 -67386 -65925 -64881 -64445 -64014 -63343 -62892 -62668 -61980
36509 -61980 -60647 -59213 -57746 -55746 -53445 -51794 -50902 -49900 -48600 -47858 -48030 -48532 -49238 -50827 -53415 -56306
36493 -56306 -59458 -63696 -69076 -74459 -79115 -83345 -87225 -90143 -91965 -93188 -93668 -92651 -90399 -88259 -86777
36478 -86777 -85233 -83303 -81517 -79808 -77309 -74096 -71430 -69774 -68295 -66790 -66348 -67399 -68864 -69981 -71368
36463 -71368 -73547 -75934 -78063 -80264 -82388 -83407 -83002 -82121 -81269 -79774 -77393 -75026 -73089 -70742 -67579
36448 -67579 -64536 -62268 -60137 -57667 -55518 -54131 -52885 -51511 -50911 -51611 -52713 -53313 -53662 -54125 -54349 -54334
$$ packed form
36558i3411q7J026J618J766J962J914J443J341J970K286J542O58N41N19r7m54
36542g5463K84J200J093M15J38P1j71J27J393K443K155J240P45J93j058k111j952
36525f9258j328j298j217p5J367J748J361J314J461J044M36M31O71M51K24O88
36509f1980J333J434J467K000K301J651Q92J002J300P42j72n02p06j589k588k891
36493e6306l152m238n380n383m656m230l880k918j822j223m80J017K252K140J482
36478h6777J544J930J786J709K499L213K666J656J479J505M42j051j465j117j387
36463g1368k179k387k129k201k124j019M05Q81Q52J495K381K367J937K347L163
36448f7579L043K268K131K470K149J387J246J374O00p00j102o00l49m63k24J5
$$ plain form
36432 -54334 -54889 -56156 -56982 -56626 -55760 -54985 -53780 -51831 -49957 -48755 -47702 -46506 -45934 -46270 -46343 -45117 -43068
36415 -43068 -41035 -39065 -37305 -36603 -37052 -37189 -35778 -33339 -30951 -28820 -26916 -25710 -25122 -23947 -21450
36400 -21450 -18483 -16059 -13895 -11270 -8131 -4478 57 5080 9133 11613 13734 16621 19702 22033
36386 22033 23899 25956 27985 29691 31670 34516 38030 42278 48241 56363 65635 75149 85407 97015
36372 97015 109343 121623 134228 147726 161863 176650 193354 213168 235888 260976 288733 319185
36360 319185 350700 380658 406287 423794 428267 416345 388635 348696 300604 248376 196277 147873
36348 147873 105131 69226 41280 21420 8204 67 -3582 -3425 -1007 2663 8099 15873 25249
36335 25249 35169 45217 54473 60831 62622 59488 50419 32702 4778 -30813 -68919 -105315 -137604
$$ packed form
36432e4334n55j267q26L56Q66P75J205J949J874J202J053J196N72l36p3J226K049
36415d3068K033J970J760P02m49j37J411K439K388K131J904J206N88J175K497
36400b1450K967K424K164K625L139L653M535N023M053K480K121K887L081K331
36386B2033J866K057K029J706J979K846L514M248N963Q122R272R514J0258J1608
36372I7015J2328J2280J2605J3498J4137J4787J6704J9814K2720K5088K7757L0452
36360C19185L1515K9958K5629J7507M473j1922k7710l9939m8092n2228n2099m8404
36348A47873m2742l5905k7946j9860j3216q137l649J57K418L670N436P774R376
36335B5249R920J0048R256O358J791l134r069j7717k7924l5591l8106l6396l2289
$$ plain form
36322 -137604 -164151 -184267 -198838 -209155 -215555 -218275 -218678 -218271 -217395 -216080 -215198 -215386 -215795 -215314 -214202
36307 -214202 -213198 -212049 -210329 -208727 -208052 -207815 -207161 -206330 -205779 -204795 -202503 -199429 -196655 -194269 -192030 -190647
36291 -190647 -190801 -191709 -192110 -191974 -191834 -191299 -189763 -187811 -186406 -185330 -183844 -182124 -180612 -178657 -175321 -170939
36275 -170939 -166550 -162486 -158811 -156394 -156042 -157180 -158631 -160022 -161225 -161364 -159800 -157318 -154970 -152578 -149682
36260 -149682 -147024 -145596 -145082 -144682 -144598 -145184 -145585 -144881 -143780 -143532 -143904 -143846 -143337 -142966 -142450 -141277 -140117 -139930
36242 -139930 -140271 -140104 -139587 -139432 -139277 -138397 -137357 -137172 -137439 -137057 -136172 -135589 -134784 -132390 -128289 -123479 -118227
36225 -118227 -112033 -105064 -97985 -90659 -82616 -74520 -67674 -62435 -58558 -56633 -57613 -61245 -66364 -72360
36211 -72360 -79015 -85543 -91295 -96865 -103050 -109372 -115060 -120722 -127373 -134456 -140518 -145138 -148422 -149327 -146386
$$ packed form
36322a37604k6547k0116j4571j0317o400k720m03M07Q76J315Q82j88m09M81J112
36307b14202J004J149J720J602O75K37O54Q31N51R84K292L074K774K386K239J383
36291a90647j54r08m01J36J40N35J536J952J405J076J486J720J512J955L336M382
36275a70939M389M064L675K417L52j138j451j391j203j39J564K482K348K392K896
36260a49682K658J428N14M00Q4n86m01P04J101K48l72N8N09L71N16J173J160J87
36242a39930l41J67N17J55J55Q80J040J85k67L82Q85N83Q05K394M101M810N252
36225a18227O194O969P079P326Q043Q096O846N239L877J925r80l632n119n996
36211g2360o655o528n752n570o185o322n688n662o651p083o062m620l284r05K941
$$ plain form
36196 -146386 -139631 -130029 -117677 -102579 -86705 -73166 -63443 -57096 -53751 -53430 -55264 -57913 -61205
36183 -61205 -65651 -70614 -74759 -78061 -81585 -85490 -89055 -92414 -96353 -100520 -103675 -105671 -107446 -109145
36169 -109145 -109980 -109901 -109695 -109549 -109100 -108789 -109459 -110716 -111274 -110778 -109764 -108127 -105383 -102232 -100078 -99122 -98557
36152 -98557 -98386 -99276 -100856 -101971 -102505 -103192 -103835 -103562 -102675 -102324 -102410 -101667 -99844 -97982 -96519 -94960 -93480
36135 -93480 -93009 -93580 -94278 -94886 -95934 -97146 -97598 -97454 -97799 -98686 -99048 -98585 -98033 -97515 -96364 -94698 -93547
36118 -93547 -93262 -93357 -93823 -94973 -96065 -95862 -94599 -93709 -93594 -93352 -92588 -91762 -90800 -89228 -87690 -87492 -88543
36101 -88543 -89490 -89842 -90174 -90340 -89506 -87968 -86968 -86584 -85795 -84745 -84870 -86491 -88193 -88925 -88839 -87844 -85371
36084 -85371 -81947 -79173 -77683 -76802 -76413 -77322 -79486 -81762 -83727 -85988 -88428 -90040 -90750 -91501 -92216 -91656
$$ packed form
36196a46386O755R602J2352J5098J5874J3539R723O347L345L21j834k649l292
36183f1205m446m963m145l302l524l905l565l359l939m167l155j996j775j699
36169a09145q35P9K06J46M49L11o70j257n58M96J014J637K744L151K154R56N65
36152i8557J71q90j580j115n34o87o43K73Q87L51q6P43J823J862J463J559J480
36135i3480M71n71o98o08j048j212m52J44l45q87l62M63N52N18J151J666J151
36118i3547K85r5m66j150j092K03J263Q90J15K42P64Q26R62J572J538J98j051
36101h8543r47l52l32j66Q34J538J000L84P89J050j25j621j702p32Q6R95K473
36084h5371L424K774J490Q81L89r09k164k276j965k261k440j612p10p51p15N60
$$ plain form
36068 -91656 -89660 -87631 -86359 -85280 -84315 -84477 -86062 -88043 -89798 -91707 -93577 -94349 -93927 -93574 -93950 -94416
36052 -94416 -94678 -95311 -96213 -96344 -95551 -94872 -94571 -93661 -91891 -90373 -89624 -88783 -87338 -85890 -84573 -82470 -79250
36035 -79250 -75802 -72722 -69790 -67395 -66671 -67672 -69030 -69917 -70664 -71140 -70447 -68751 -67476 -67094 -66552 -65384
36019 -65384 -64429 -63821 -62337 -59524 -56607 -54440 -52440 -50371 -49366 -50256 -52529 -55700 -59903 -64399 -67379
36004 -67379 -68286 -68684 -69968 -71818 -73676 -75931 -78679 -80993 -82439 -83815 -85583 -87105 -88188 -89675 -91709
35989 -91709 -93082 -93193 -93001 -93202 -93098 -92151 -91010 -90139 -89031 -87706 -87343 -88579 -90670 -93079 -96183 -99626
35973 -99626 -101765 -101761 -100612 -99280 -97451 -94997 -92872 -91549 -90234 -88566 -87487 -87475 -87616 -87344 -87313 -87522 -86403
35956 -86403 -82988 -78429 -74270 -70777 -67953 -66486 -66481 -66782 -66696 -66951 -67966 -68781 -68732 -68571 -68875 -68952 -68438 -68327
$$ packed form
36068i1656J996K029J272J079R65j62j585j981j755j909j870p72M22L53l76m66
36052i4416k62o33r02j31P93O79L01R10J770J518P49Q41J445J448J317K103L220
36035g9250L448L080K932K395P24j001j358q87p47m76O93J696J275L82N42J168
36019f5384R55O08J484K813K917K167K000K069J005q90k273l171m203m496k980
36004f7379r07l98j284j850j858k255k748k314j446j376j768j522j083j487k034
35989i1709j373j11J92k01J04R47J141Q71J108J325L63j236k091k409l104l443
35973i9626k139MJ149J332J829K454K125J323J315J668J079J2j41K72L1k09J119
35956h6403L415M559M159L493K824J467Nl01Q6k55j015q15M9J61l04p7N14J11
$$ plain form
35938 -68327 -69276 -70423 -71004 -71582 -72653 -73640 -74386 -76018 -79148 -82754 -85872 -88749 -91283 -92121 -90613 -88050
35922 -88050 -85708 -83297 -80488 -78263 -77381 -77094 -76683 -76650 -77114 -76769 -74878 -72721 -71600 -70991 -70037 -69279 -69315
35905 -69315 -69359 -68742 -68434 -69450 -71062 -72076 -72602 -73044 -72769 -71338 -69869 -69597 -70186 -70770 -71439 -72370 -72783 -72201
35887 -72201 -71571 -71782 -72253 -72196 -71973 -71941 -71381 -69918 -68613 -68289 -68125 -67267 -66459 -66678 -67552 -68467 -69806 -71607
35869 -71607 -72486 -71489 -69677 -68408 -67412 -66044 -64923 -64684 -64462 -63354 -62149 -61934 -62180 -61818 -61034 -60453 -59736
35852 -59736 -58552 -57682 -57609 -57221 -55514 -53377 -52142 -51607 -51044 -50824 -51394 -51949 -51827 -51954 -53173 -54351 -53944
35835 -53944 -52288 -50611 -48916 -46663 -44458 -43296 -43033 -43276 -44765 -48206 -52766 -57268 -61781 -66385 -69548
35820 -69548 -69442 -65847 -59165 -48836 -34593 -18171 -1903 13453 27848 40175 49262 55611 60252
$$ packed form
35938f8327r49j147n81n78j071r87p46j632l130l606l118k877k534q38J508K563
35922h8050K342K411K809K225Q82K87M11L3m64L45J891K157J121O09R54P58l6
35905f9315m4O17L08j016j612j014n26m42K75J431J469K72n89n84o69r31m13N82
35887g2201O30k11m71N7K23L2N60J463J305L24J64Q58Q08k19q74r15j339j801
35869g1607q79R97J812J269R96J368J121K39K22J108J205K15k46L62P84N81P17
35852e9736J184Q70P3L88J707K137J235N35N63K20n70n55J22j27j219j178M07
35835e3944J656J677J695K253K205J162K63k43j489l441m560m502m513m604l163
35820f9548J06L595O682J0329J4243J6422J6268J5356J4395J2327R087O349M641
$$ plain form
35807 60252 62788 62402 59834 56540 52725 47962 42772 37857 32701 26744 21046 17072 14688 13066 12519
35792 12519 13612 15415 16489 16841 17238 17547 17421 17584 18602 19323 18353 16168 14034 11922 9317 7013
35776 7013 6067 5861 5144 4132 3688 3345 2127 509 -367 -594 -732 -83 2302 5653 8434 10523 12617
35759 12617 14394 15219 15826 17278 19045 20058 20882 22864 25905 29027 32399 36830 41997 47059 52225
35744 52225 57796 62588 65345 66901 68854 70958 71939 72085 72813 74318 75852 77692 80640 84125 86911
35729 86911 89196 92005 95137 97750 100354 104178 109181 114647 121013 129009 137755 145944 154170 163868
35715 163868 174588 184657 193929 203592 213792 223802 234080 245811 258825 272216 286585 303365
35703 303365 322301 341969 362460 385287 410909 438630 468744 502543 540440 582169 628558
$$ packed form
35807F0252K536l86k568l294l815m763n190m915n156n957n698l974k384j622n47
35792A2519J093J803J074L52L97L09j26J63J018P21r70k185k134k112k605k304
35776G013r46k06p17j012m44l43j218j618q76k27j38O49K385L351K781K089K094
35759A2617J777Q25O07J452J767J013Q24J982L041L122L372M431N167N062N166
35744E2225N571M792K757J556J953K104R81J46P28J505J534J840K948L485K786
35729H6911K285K809L132K613K604L824N003N466O366P996Q746Q189Q226R698
35715A63868J0720J0069R272R663J0200J0010J0278J1731J3014J3391J4369J6780
35703C03365J8936J9668K0491K2827K5622K7721L0114L3799L7897M1729M6389
$$ plain form
35692 628558 680893 738719 800298 864757 931387 996856 1055156 1100346 1127967 1135083 1121807 1092628
35680 1092628 1053795 1009333 961404 913663 871312 837828 814024 800186 796630 802208 814839 833860
35668 833860 859782 891796 927828 966930 1008932 1051198 1087761 1111937 1117719 1098298 1045807 954359
35656 954359 823710 661313 482381 306365 149585 19379 -84667 -165344 -225531 -269297
35646 -269297 -301361 -324681 -340552 -350845 -357943 -362725 -365049 -366091 -367909 -370774 -373225 -374657 -375537
35633 -375537 -375264 -372370 -366994 -360917 -355114 -349421 -344426 -341223 -339211 -336493 -332554 -328422 -324374 -319856
35619 -319856 -315492 -312595 -310641 -307761 -303865 -300792 -299164 -297566 -295109 -292368 -289568 -286184 -282667 -280298
35605 -280298 -279109 -278068 -277306 -277747 -278554 -277553 -274436 -271093 -268530 -265922 -262921 -260264 -257745 -254128 -249596
$$ packed form
35692F28558N2335N7826O1579O4459O6630O5469N8300M5190K7621P116j3276k9179
35680A092628l8833m4462m7929m7741m2351l3484k3804j3838l556N578J2631J9021
35668H33860K5922L2014L6032L9102M2002M2266L6563K4176N782j9421n2491r1448
35656I54359j30649j62397j78932j76016j56780j30206j04046q0677o0187m3766
35646b69297l2064k3320j5871j0293p098m782k324j042j818k865k451j432q80
35633c75537K73K894N376O077N803N693M995L203K012K718L939M132M048M518
35619c19856M364K897J954K880L896L073J628J598K457K741K800L384L517K369
35605b80298J189J041P62m41q07J001L117L343K563K608L001K657K519L617M532
$$ plain form
35590 -249596 -245921 -243748 -242006 -240262 -239261 -238843 -237855 -236482 -236211 -237036 -237206 -236122 -235009 -234282 -232850 -230544
35574 -230544 -228667 -227440 -225380 -221872 -218027 -214408 -210275 -205705 -201993 -199270 -195996 -191442 -186378 -180773
35560 -180773 -173172 -162930 -150640 -135777 -116389 -91816 -63486 -32582 372 32870 60069 78269
35548 78269 86815 86112 76381 59244 37980 14975 -9231 -33738 -56466 -76275 -93682 -108668
35536 -108668 -119988 -127351 -131979 -134265 -133019 -127685 -118951 -106530 -88749 -65111 -36960 -5070 30621
35523 30621 67793 100714 123787 134466 132445 118788 96855 71546 46190 21779 -424 -18188
35511 -18188 -31006 -40962 -49830 -57595 -64522 -72038 -80364 -87685 -92806 -96495 -99423 -101213 -102391 -104734
35497 -104734 -108580 -112235 -114995 -118273 -122723 -126931 -130094 -133384 -137325 -140385 -141635 -142402 -143880 -145337
$$ packed form
35590b49596L675K173J742J744J001M18R88J373K71q25j70J084J113P27J432K306
35574b30544J877J227K060L508L845L619M133M570L712K723L274M554N064N605
35560a80773P601J0242J2290J4863J9388K4573K8330L0904L2954L2498K7199J8200
35548G8269Q546p03r731j7137k1264k3005k4206k4507k2728j9809j7407j4986
35536a08668j1320p363m628k286J246N334Q734J2421J7781K3638K8151L1890L5691
35523C0621L7172L2921K3073J0679k021j3657k1933k5309k5356k4411k2203j7764
35511a8188j2818r956q868p765o927p516q326p321n121l689k928j790j178k343
35497a04734l846l655k760l278m450m208l163l290l941l060j250p67j478j457
$$ plain form
35483 -145337 -146048 -146726 -147691 -147832 -146693 -145497 -144908 -143992 -142423 -141417 -141331 -140719 -139004 -137719 -137889 -138545 -139022
35466 -139022 -140237 -142426 -144071 -144433 -144701 -145392 -145152 -143577 -142608 -143511 -144896 -145297 -145292 -145502 -144950 -143148 -141506
35449 -141506 -140975 -140449 -139076 -137879 -137544 -136903 -135230 -133781 -133448 -133155 -132155 -131597 -132149 -132415 -131409 -130264
35433 -130264 -129774 -128576 -125562 -121796 -118227 -113733 -107345 -100211 -93540 -86733 -79377 -72884 -68203 -63999
35419 -63999 -58942 -53860 -49926 -46898 -44877 -45522 -49540 -55031 -60207 -65675 -72299 -79034 -84823 -90482 -96703
35404 -96703 -102207 -105790 -108224 -110288 -111051 -109983 -108676 -108510 -108588 -107780 -106684 -105747 -103680 -99731 -95474 -92390
35388 -92390 -89751 -86744 -84463 -83795 -83521 -82537 -81827 -82194 -82273 -80872 -79180 -78535 -78054 -76517 -74482 -72472 -69209
35371 -69209 -63806 -57685 -52295 -46952 -40811 -34716 -29047 -22038 -12370 -1289 9864 22005 36190
$$ packed form
35483a45337p11o78r65j41J139J196N89R16J569J006Q6O12J715J285j70o56m77
35466a39022j215k189j645l62k68o91K40J575R69r03j385m01Nk10N52J802J642
35449a41506N31N26J373J197L35O41J673J449L33K93J000N58n52k66J006J145
35433a30264M90J198L014L766L569M494O388P134O671O807P356O493M681M204
35419f3999N057N082L934L028K021o45m018n491n176n468o624o735n789n659o221
35404i6703n504l583k434k064p63J068J307J66p8Q08J096R37K067L949M257L084
35388i2390K639L007K281O68K74R84P10l67p9J401J692O45M81J537K035K010L263
35371f9209N403O121N390N343O141O095N669P009R668J1081J1153J2141J4185
$$ plain form
35358 36190 51593 67711 86340 109288 136337 167411 204323 248419 299018 356182 422451 499997
35346 499997 588744 689097 803567 933970 1080203 1243220 1425199 1624718 1834758 2044118
35336 2044118 2231819 2357796 2372810 2252887 2024546 1748707 1479482 1241102 1036351 862569
35326 862569 716298 592457 486609 396586 320308 254864 198675 151640 112482 78628 48888
35315 48888 23509 1669 -18278 -36249 -51010 -63112 -74499 -85557 -95270 -103818 -112172 -119711
35303 -119711 -125154 -129418 -134675 -140994 -146659 -151268 -155754 -159948 -162972 -165470 -168654 -171714 -172944 -172787
35289 -172787 -173051 -173839 -174101 -174397 -176135 -178692 -180231 -180789 -181759 -183031 -183513 -183744 -185035 -186675 -186950 -186163 -185736
35272 -185736 -185103 -182624 -178912 -176110 -174346 -171941 -168559 -165109 -161165 -155608 -149271 -143804 -138355 -130482
$$ packed form
35358C6190J5403J6118J8629K2948K7049L1074L6912M4096N0599N7164O6269P7546
35346D99997Q8747J00353J14470J30403J46233J63017J81979J99519K10040K09360
35336B044118J87701J25977J5014j19923k28341k75839k69225k38380k04751j73782
35326H62569j46271j23841j05848r0023p6278o5444n6189m7035l9158l3854k9740
35315D8888k5379k1840j9947j7971j4761j2102j1387j1058r713q548q354p539
35303a19711n443m264n257o319n665m609m486m194l024k498l184l060j230J57
35289a72787k64p88k62k96j738k557j539n58r70j272m82k31j291j640k75P87M27
35272a85736O33K479L712K802J764K405L382L450L944N557O337N467N449P873
$$ plain form
35258 -130482 -119940 -108526 -96783 -84230 -72547 -65203 -63736 -67100 -74305 -84750 -96333 -106454
35246 -106454 -114929 -123269 -131319 -137392 -141283 -144253 -146379 -146783 -146148 -146129 -146609 -146330 -145787 -146593 -148497 -150047
35230 -150047 -151710 -155226 -160211 -164548 -167832 -171323 -174829 -176808 -177394 -178136 -178850 -177837 -175146 -172602 -170706
35215 -170706 -168538 -166590 -166594 -168469 -170332 -171529 -172883 -174171 -174289 -173751 -174086 -174885 -174353 -172582 -171365 -170988
35199 -170988 -170167 -168927 -168479 -168524 -167774 -166916 -167882 -170310 -171927 -172298 -173045 -174503 -175357 -175593 -176499 -177726 -177566
35182 -177566 -176201 -175549 -175857 -175642 -174996 -175601 -177291 -177891 -176745 -175290 -173962 -171667 -168523 -165880 -163350 -158888
35166 -158888 -152134 -144691 -137018 -128176 -118688 -110331 -102773 -93541 -81561 -67606 -51099 -29913 -3813
35153 -3813 25077 55549 87780 119873 146950 164296 168958 158590 132320 93353 47701 -201
$$ packed form
35258a30482J0542J1414J1743J2553J1683P344J467l364p205j0445j1583j0121
35246a06454q475q340q050o073l891k970k126m04O35J9m80K79N43q06j904j550
35230a50047j663l516m985m337l284l491l506j979n86p42p14J013K691K544J896
35215a70706K168J948mj875j863j197j354j288j18N38l35p99N32J771J217L77
35199a70988Q21J240M48m5P50Q58r66k428j617l71p47j458q54k36r06j227J60
35182a77566J365O52l08K15O46o05j690o00J146J455J328K295L144K643K530M462
35166a58888O754P443P673Q842R488Q357P558R232J1980J3955J6507K1186K6100
35153c813K8890L0472L2231L2093K7077J7346M662j0368k6270l8967m5652m7902
$$ plain form
35141 -201 -48169 -93196 -131479 -161902 -186099 -204706 -216774 -223070 -226285 -227232 -224023 -215535 -202557
35128 -202557 -185094 -161866 -133093 -100715 -65468 -26968 12824 49265 78387 97652 103831 94402
35116 94402 71821 42769 12271 -18420 -48200 -74605 -96861 -116618 -134486 -149081 -160313 -170177
35104 -170177 -179381 -186551 -191527 -196033 -200311 -202651 -203194 -204649 -208224 -212171 -215317 -218639 -222431 -225444
35090 -225444 -227820 -231460 -236380 -240130 -241863 -243571 -246256 -248406 -249394 -250869 -253474 -255557 -256329 -257081 -258111
35075 -258111 -257838 -256130 -255146 -255720 -256281 -256431 -258092 -261797 -265347 -267502 -269619 -272367 -274264 -274860 -275982 -278400
35059 -278400 -280620 -282305 -285438 -290664 -295849 -299741 -303692 -308360 -312224 -314874 -318301 -323257 -327697 -330400
35045 -330400 -332822 -335813 -337970 -338868 -340533 -343932 -347265 -349347 -351388 -353859 -355092 -354722 -355050 -357094 -358659
$$ packed form
35141b01m7968m5027l8283l0423k4197j8607j2068o296l215r47L209Q488J2978
35128b02557J7463K3228K8773L2378L5247L8500L9792L6441K9122J9265O179r429
35116I4402k2581k9052l0498l0691k9780k6405k2256j9757j7868j4595j1232r864
35104a70177r204p170m976m506m278k340n43j455l575l947l146l322l792l013
35090b25444k376l640m920l750j733j708k685k150r88j475k605k083p72p52j030
35075b58111K73J708R84n74n61j50j661l705l550k155k117k748j897n96j122k418
35059b78400k220j685l133n226n185l892l951m668l864k650l427m956m440k703
35045c30400k422k991k157q98j665l399l333k082k041k471j233L70l28k044j565
$$ plain form
35030 -358659 -358088 -356585 -354942 -351358 -344456 -335183 -323648 -307203 -283441 -251841 -210476 -154330 -78833
35017 -78833 17954 138093 284485 455674 642224 830263 1006521 1159625 1281267 1369344
35007 1369344 1427565 1460223 1470067 1462126 1445203 1426972 1410736 1398750 1394801 1401084 1416227 1439107
34995 1439107 1471528 1514953 1568129 1630284 1702744 1784282 1867966 1945168 2009081 2051334 2059265
34984 2059265 2021767 1937416 1815122 1669214 1515435 1367560 1233192 1113234 1006782 914447
34974 914447 835942 768249 708784 657597 614344 576251 541407 510926 485373 462146 438972
34963 438972 416948 397561 379744 362527 347499 335747 325188 313714 302270 292207 282404 271710
34951 271710 261443 252789 244448 235429 227317 221206 215293 208205 201747 197608 194310 190210 186544 184549
$$ packed form
35030c58659N71J503J643L584O902R273J1535J6445K3762L1600M1365N6146P5497
35017g8833R6787J20139J46392J71189J86550J88039J76258J53104J21642Q8077
35007A369344N8221L2658R844p941j6923j8231j6236j1986l949O283J5143K2880
34995A439107L2421M3425N3176O2155P2460Q1538Q3684P7202O3913M2253P931
34984B059265l7498q4351j22294j45908j53779j47875j34368j19958j06452r2335
34974I14447p8505o7693n9465n1187m3253l8093l4844l0481k5553k3227k3174
34963D38972k2024j9387j7817j7217j5028j1752j0559j1474j1444j0063r803j0694
34951B71710j0267q654q341r019q112o111n913p088o458m139l298m100l666j995
$$ plain form
34937 184549 182573 179073 175648 174016 172690 169717 166048 163207 160295 156310 152795 151162 149988 147868
34923 147868 146261 146552 146971 145527 143396 142409 141795 140384 139333 139637 139635 138085 137015 138428 140843 142186
34907 142186 143349 145663 147641 147702 147534 149356 152236 154404 156732 160663 165201 169209 174183 181447 189126
34892 189126 195264 201487 210278 221148 232848 246715 264231 283727 303017 322951 344834 366643
34880 366643 385136 399300 408399 409384 400156 383307 363125 341121 317736 295650 277465 262352
34868 262352 248757 238200 232801 231413 231929 235199 242997 254509 268697 287882 315022 349381 388479
34855 388479 432016 479896 528208 570697 602159 617389 610168 578220 527556 467983 405925 344601
34843 344601 287933 239294 198240 162799 133469 111230 93791 77952 63846 52963 44046 34962
$$ packed form
34937A84549j976l500l425j632j326k973l669k841k912l985l515j633j174k120
34923A47868j607K91M19j444k131r87o14j411j051L04kj550j070J413K415J343
34907A42186J163K314J978O1j68J822K880K168K328L931M538M008M974P264P679
34892A89126O138O223Q791J0870J1700J3867J7516J9496J9290J9934K1883K1809
34880C66643J8493J4164R099R85r228j6849k0182k2004k3385k2086j8185j5113
34868B62352j3595j0557n399j388N16L270P798J1512J4188J9185K7140L4359L9098
34855C88479M3537M7880M8312M2489L1462J5230p221l1948n0664n9573o2058o1324
34843C44601n6668m8639m1054l5441k9330k2239j7439j5839j4106j0883q917r084
$$ plain form
34831 34962 26595 20740 16115 10533 5036 1746 -403 -3672 -7275 -9279 -10661 -13224 -15469 -14885 -12446
34816 -12446 -10549 -8431 -4028 1517 5634 8785 12761 16367 17332 16725 17008 17423 15847 13434 12838 13484
34800 13484 13245 13070 15264 18694 20453 20763 21571 21877 19347 15242 12895 12418 11557 10488 11083 12641
34784 12641 13062 13153 15181 18355 20287 21595 24407 27631 28503 27636 27796 28848 28721 28191 29807 33061
34768 33061 35462 37411 41238 46351 50139 52718 56067 59468 60626 60352 61348 63251 63655 63069 64023 66171
34752 66171 67204 67702 70202 74231 77103 78797 81199 83439 82933 80227 77895 75546 70936 65110 61269
34737 61269 59259 56234 52065 48974 46594 42619 37778 34944 33834 31748 28976 28302 29691 30654 31412
34722 31412 34422 39247 43096 46064 50610 56290 60318 63018 67420 73717 79306 83943 89537 95189
$$ packed form
34831C4962q367n855m625n582n497l290k149l269l603k004j382k563k245N84K439
34816a2446J897K118M403N545M117L151L976L606R65o07K83M15j576k413n96O46
34800A3484k39j75K194L430J759L10Q08L06k530m105k347m77q61j069N95J558
34784A2641M21R1K028L174J932J308K812L224Q72q67J60J052j27n30J616L254
34768C3061K401J949L827N113L788K579L349L401J158k74R96J903M04n86R54K148
34752F6171J033M98K500M029K872J694K402K240n06k706k332k349m610n826l841
34737F1269k010l025m169l091k380l975m841k834j110k086k772o74J389R63P58
34722C1412L010M825L849K968M546N680M028K700M402O297N589M637N594N652
$$ plain form
34708 95189 97895 98042 98920 100987 101951 102231 104849 109992 115059 119994 127070 135523 141941 146101 151000
34693 151000 157072 161859 165431 170539 177190 182535 186356 191243 197171 201376 203807 207203 211564 214103
34679 214103 214941 217253 221446 224753 226886 230450 235381 238639 239938 242151 245522 247039 246018 244644
34665 244644 242391 235706 224110 211192 198903 186267 174167 165647 160653 155984 151170 148901 149112
34652 149112 148341 145629 143416 141925 138418 132763 128017 124674 120048 114089 110006 108355 106355 103809
34638 103809 103703 106102 107452 106926 107384 109063 108532 105126 102383 101796 101180 100401 102540 107918 113056 117005
34622 117005 122680 130482 136727 140011 143114 147042 149280 149595 151493 156169 160943 165308 172353 182464
34608 182464 191767 198794 206641 216630 225910 233352 241731 251909 260825 267375 274426 282912 289864 294431
$$ packed form
34708I5189K706J47Q78K067R64K80K618N143N067M935P076Q453O418M160M899
34693A51000O072M787L572N108O651N345L821M887N928M205K431L396M361K539
34679B14103Q38K312M193L307K133L564M931L258J299K213L371J517j021j374
34665B44644k253o685j1596j2918j2289j2636j2100q520m994m669m814k269K11
34652A49112p71k712k213j491l507n655m746l343m626n959m083j651k000k546
34638A03809j06K399J350n26M58J679n31l406k743n87o16p79K139N378N138L949
34622A17005N675P802O245L284L103L928K238L15J898M676M774M365P045J0111
34608A82464R303P027P847R989R280P442Q379J0178Q916O550P051Q486O952M567
$$ plain form
34594 294431 299931 307836 315469 321676 328782 336883 342303 343980 345512 348731 351183 351950 353678 356550
34580 356550 356477 351813 345840 340269 332424 321275 310009 299994 288342 274104 260790 250054 238938
34567 238938 226063 214434 205454 196314 186088 178233 174186 170556 165525 161826 160510 158007 152451
34554 152451 146785 142552 136832 128473 121156 116990 113062 107517 102958 100560 97003 90640 84698 81016
34540 81016 76602 69709 63232 58759 53375 45767 39362 35926 32150 26001 20332 16729 12064 4715
34526 4715 -2080 -6672 -12449 -21157 -29137 -34041 -38931 -45775 -51258 -53103 -54295 -56882 -57880 -55528 -53335
34511 -53335 -53623 -53235 -49920 -46783 -46070 -44728 -40558 -36591 -34875 -32112 -26043 -20044 -16806 -13473 -7669
34496 -7669 -2143 1218 5865 14273 23204 29961 37332 47539 57463 64804 72978 84993 98499 111802
$$ packed form
34594B94431N500P905P633O207P106Q101N420J677J532L219K452P67J728K872
34580C56550p3m664n973n571p845j1149j1266j0015j1652j4238j3314j0736j1116
34567B38938j2875j1629q980r140j0226p855m047l630n031l699j316k503n556
34554A52451n666m233n720q359p317m166l928n545m559k398l557o363n942l682
34540H1016m414o893o477m473n384p608o405l436l776o149n669l603m665p349
34526D715o795m592n777q708p980m904m890o844n483j845j192k587r98K352K193
34511e3335k88L88L315L137P13J342M170L967J716K763O069N999L238L333N804
34496g669N526L361M647Q408Q931O757P371J0207R924P341Q174J2015J3506J3303
$$ plain form
34482 111802 128591 151581 177513 203484 231985 264283 294882 317972 333665 342868 342416 330924
34470 330924 313450 294614 272726 245981 218314 193445 169094 142797 117592 96318 76259
34459 76259 55240 37114 25388 17327 10229 7548 12779 23173 35571 52424 75569 99604
34447 99604 117665 128539 132487 126347 109163 86841 64718 40953 13203 -14347 -37072 -57000
34435 -57000 -77222 -95147 -108071 -119585 -133497 -146929 -156254 -164273 -174614 -184617 -190705 -195369
34423 -195369 -201987 -208224 -211443 -215028 -222326 -229862 -233555 -236051 -240863 -245038 -244975 -243868 -245999 -249217 -250446
34408 -250446 -252917 -260251 -268859 -273979 -277914 -284703 -292155 -296932 -302008 -311088 -320872 -326735 -330779 -336473
34394 -336473 -340903 -340525 -339175 -341990 -346578 -348491 -350228 -356314 -364578 -370786 -376879 -386181 -395473 -400490
$$ packed form
34482A11802J6789K2990K5932K5971K8501L2298L0599K3090J5693R203m52j1492
34470C30924j7474j8836k1888k6745k7667k4869k4351k6297k5205k1274k0059
34459G6259k1019j8126j1726q061p098k681N231J0394J2398J6853K3145K4035
34447I9604J8061J0874L948o140j7184k2322k2123k3765k7750k7550k2725j9928
34435e7000k0222j7925j2924j1514j3912j3432r325q019j0341j0003o088m664
34423a95369o618o237l219l585p298p536l693k496m812m175O3J107k131l218j229
34408b50446k471p334q608n120l935o789p452m777n076r080r784n863m044n694
34394c36473m430L78J350k815m588j913j737o086q264o208o093r302r292n017
$$ plain form
34380 -400490 -404334 -411938 -421050 -427306 -433137 -442914 -454138 -462286 -469492 -479629 -489724 -495254 -499215
34367 -499215 -506950 -516734 -524429 -532558 -545592 -560983 -574140 -587591 -606004 -626859 -645421 -664283
34355 -664283 -688622 -716684 -744397 -774554 -811698 -852490 -890862 -928153 -968386 -1008114 -1040592
34344 -1040592 -1065069 -1081821 -1083048 -1059805 -1014335 -955706 -887546 -810046 -729142 -652643 -581042
34333 -581042 -512487 -452630 -408956 -379456 -357349 -342717 -338870 -341843 -344892 -349467 -360720 -376009
34321 -376009 -388729 -399006 -408934 -411116 -393664 -352894 -289871 -199190 -74769 75375 231973
34310 231973 380097 511968 619205 695687 746229 780809 802008 808064 804098 798370 790714 776501
34298 776501 758774 744498 732139 715236 695266 678806 665000 648174 629911 616036 604508
$$ packed form
34380d00490l844p604r112o256n831r777j1224q148p206j0137j0095n530l961
34367d99215p735r784p695q129j3034j5391j3157j3451j8413k0855j8562j8862
34355f64283k4339k8062k7713l0157l7144m0792l8372l7291m0233l9728l2478
34344a040592k4477j6752j227K3243M5470N8629O8160P7500Q0904P6499P1601
34333e81042O8555N9857M3674K9500K2107J4632L847k973l049m575j1253j5289
34321c76009j2720j0277r928k182J7452M0770O3023R0681J24421J50144J56598
34310B31973J48124J31871J07237P6482N0542L4580K1199O056l966n728p656j4213
34298G76501j7727j4276j2359j6903j9970j6460j3806j6826j8263j3875j1528
$$ plain form
34287 604508 588816 570692 557022 546971 534609 521332 512855 506643 495329 480013 467463 456970
34275 456970 443019 428113 419379 414955 407154 396707 390374 386973 379635 369668 364275 362504 357322
34262 357322 349581 346036 345488 340913 333477 330385 330675 327260 321131 319232 320168 316566 309790 307631 309090
34247 309090 306293 299929 297763 299347 297351 292770 293500 298925 301159 300425 303879 310294 311544 308381 309147
34232 309147 313729 314456 311970 314249 320675 323154 322327 326431 334671 338126 336722 338865 344681 346296 344301
34217 344301 346932 353075 353120 346728 342691 341216 333690 320079 308995 300307 285489 265668 251462
34204 251462 244291 235772 226094 224630 231451 236675 239231 247841 262349 272855 278653 289168 304719
34191 304719 315352 320265 329213 342954 351545 353663 357940 363234 357382 337714 313196 284578 243236
$$ packed form
34287F04508j5692j8124j3670j0051j2362j3277q477o212j1314j5316j2550j0493
34275D56970j3951j4906q734m424p801j0447o333l401p338r967n393j771n182
34262C57322p741l545n48m575p436l092K90l415o129j899R36l602o776k159J459
34247C09090k797o364k166J584j996m581P30N425K234p34L454O415J250l163P66
34232C09147M582P27k486K279O426K479q27M104Q240L455j404K143N816J615j995
34217C44301K631O143M5o392m037j475p526j3611j1084q688j4818j9821j4206
34204B51462p171q519r678j464O821N224K556Q610J4508J0506N798J0515J5551
34191C04719J0633M913Q948J3741Q591K118M277N294n852j9668k4518k8618m1342
$$ plain form
34178 243236 192288 148130 117646 93644 75029 70380 78499 86660 91893 103569 121973 135545
34166 135545 142602 154151 171616 183486 187691 195263 207941 214450 213057 215342 223346 225761 221165
34153 221165 221979 230707 235489 234004 238121 249820 256490 255518 259353 270542 276227 273330 274488 282853
34139 282853 286050 281588 282894 293253 299159 296610 298391 308136 313193 310670 314218 327212 335740 336082
34125 336082 342085 357161 366446 365398 368391 380083 386369 382991 384620 395918 402353 399629 403066
34112 403066 417541 427630 428053 433945 450119 460730 460662 466228 483030 494627 495184 501443 519705
34099 519705 533274 535674 543554 563222 577728 580983 590884 614205 632803 639341 651710 676886
34087 676886 696333 703028 716518 744807 768370 778949 796315 828835 855973 868434 886417 918845
$$ packed form
34178B43236n0948m4158l0484k4002j8615m649Q119Q161N233J1676J8404J3572
34166A35545P057J1549J7465J1870M205P572J2678O509j393K285Q004K415m596
34153B21165Q14Q728M782j485M117J1699O670r72L835J1189N685k897J158Q365
34139B82853L197m462J306J0359N906k549J781R745N057k523L548J2994Q528L42
34125C36082O003J5076R285j048K993J1692O286l378J629J1298O435k724L437
34112D03066J4475J0089M23N892J6174J0611o8N566J6802J1597N57O259J8262
34099E19705J3569K400P880J9668J4506L255R901K3321J8598O538J2369K5176
34087F76886J9447O695J3490K8289K3563J0579J7366L2520K7138J2461J7983L2428
$$ plain form
34075 918845 944358 952613 963907 987469 1002006 998988 1002768 1025495 1045304 1051997 1069792 1110603
34063 1110603 1150068 1174980 1208334 1261376 1308329 1336030 1370408 1425429 1474969 1504464 1540057
34052 1540057 1596529 1648318 1683383 1731990 1809264 1884318 1940222 2007603 2103478 2196126 2268091
34041 2268091 2352938 2470171 2586716 2684131 2798602 2950893 3104403 3238374 3392393 3590264
34031 3590264 3793014 3978098 4188808 4451539 4724148 4983339 5279492 5644371 6032598
34022 6032598 6419066 6861408 7397053 7977116 8576749 9266764 10096313 11016638 12008084
34013 12008084 13163448 14552033 16131424 17898503 19988805 22514358 25459970 28870164
34005 28870164 32970803 37965104 43903748 50924562 59411516 69745010 82170537 97143421
$$ packed form
34075I18845K5513Q255J1294K3562J4537l018L780K2727J9809O693J7795M0811
34063A110603L9465K4912L3354N3042M6953K7701L4378N5021M9540K9495L5593
34052A540057N6472N1789L5065M8607P7274P5054N5904O7381R5875R2648P1965
34041B268091Q4847J17233J16545R7415J14471J52291J53510J33971J54019J97871
34031C590264K02750J85084K10710K62731K72609K59191K96153L64879L88227
34022F032598L86468M42342N35645N80063N99633O90015Q29549R20325R91446
34013A2008084J155364J388585J579391J767079K090302K525553K945612L410194
34005B8870164M100639M994301N938644P020814Q486954J0333494J2425527J4972884
$$ plain form
33997 97143421 115475350 137839512 164477413 195527302 230456666 265674356 293094431
33990 293094431 303375089 292405047 264603088 229382033 194699108 164021026 137844023
33983 137844023 116002510 98187253 83677027 71675983 61758373 53666577 46985495
33976 46985495 41314854 36515759 32533302 29166427 26209306 23637894 21471318 19597842
33968 19597842 17893874 16375202 15084331 13949777 12886741 11923674 11107276 10383998
33960 10383998 9687071 9046060 8505559 8022724 7543123 7096428 6724504 6390598 6047064
33951 6047064 5721669 5453822 5212354 4955529 4709301 4510399 4331377 4134350 3942579
33942 3942579 3789497 3650408 3491515 3335662 3215100 3107421 2980328 2853737 2757573 2672067
$$ packed form
33997I7143421J8331929K2364162K6637901L1049889L4929364L5217690K7420075
33990B93094431J0280658j0970042k7801959l5221055l4682925l0678082k6177003
33983A37844023k1841513j7815257j4510226j2001044r917610q091796o681082
33976D6985495n670641m799095l982457l366875k957121k571412k166576j873476
33968A9597842j703968j518672j290871j134554j063036r63067q16398p23278
33960A0383998o96927o41011n40501m82835m79601m46695l71924l33906l43534
33951F047064l25395k67847k41468k56825k46228j98902j79022j97027j91771
33942C942579j53082j39089j58893j55853j20562j07679j27093j26591r6164q5506
$$ plain form
33932 2672067 2567818 2462803 2383586 2310693 2217234 2122845 2056039 2000106 1928004 1855062 1806576
33921 1806576 1767352 1712796 1657379 1624265 1598233 1555506 1510213 1485791 1469408 1439124 1407878
33910 1407878 1396675 1391152 1367684 1336887 1319711 1305478 1274451 1237846 1215372 1196302 1161808
33899 1161808 1123362 1100711 1083676 1053270 1019403 1000720 987741 962392 934119 920802 913118
33888 913118 892998 868884 858110 852398 834783 813338 804636 800683 785085 765584 758258 755428
33876 755428 741120 722823 716465 714996 702815 686682 681669 680783 668845 652732 647835 647778 637127
33863 637127 621305 614800 612168 599618 583370 578032 578235 569677 557092 553737 554147 544678 530647
33850 530647 526119 526901 520062 510149 509641 513114 506999 495812 493082 495274 490012 481314 481406 485871 481814
$$ packed form
33932B672067j04249j05015p9217p2893r3459r4389o6806n5933p2102p2942m8486
33921A806576l9224n4556n5417l3114k6032m2727m5293k4422j6383l0284l1246
33910A407878j1203n523k3468l0797j7176j4233l1027l6605k2474j9070l4494
33899A161808l8446k2651j7035l0406l3867j8683j2979k5349k8273j3317p684
33888I13118k0120k4114j0774n712j7615k1445q702l953j5598j9501p326k830
33876G55428j4308j8297o358j469j2181j6133n013q86j1938j6113m897n7j0651
33863F37127j5822o505k632j2550j6248n338K03q558j2585l355M10r469j4031
33850E30647m528P82o839r913n08L473o115j1187k730K192n262q698R2M465m057
$$ plain form
33835 481814 472762 471058 473432 468275 459484 459037 463147 459377 450393 447453 447417 439384 427308 423025 423269
33820 423269 416215 404493 399257 397661 388598 374852 367319 362847 349826 330590 316785 307766 295064
33807 295064 283398 285992 303406 327191 359229 406474 461109 506776 540606 569651 590754 594782
33795 594782 586505 579539 574906 564128 549405 540597 535815 524991 509587 499283 492418 479222 461537
33782 461537 450019 444459 435868 425494 422919 427739 431657 436210 449738 469025 482487 489642 499373
33769 499373 511045 515663 513953 515030 518577 516183 509046 506666 509097 507837 503071 502742 505661 502945
33755 502945 495376 492353 494307 492954 488229 488134 492329 492539 488936 489731 494813 496012 493276 494463 499322
33740 499322 499809 496221 497000 502394 504155 501627 502417 506880 507634 504893 506701 513224 516153 514487 515856
$$ packed form
33835D81814r052j704K374n157q791m47M110l770q984k940l6q033j2076m283K44
33820D23269p054j1722n236j596r063j3746p533m472j3021j9236j3805r019j2702
33807B95064j1666K594J7414K3785L2038M7245N4635M5667L3830K9045K1103M028
33795E94782q277o966m633j0778j4723q808m782j0824j5404j0304o865j3196j7685
33782D61537j1518n560q591j0374k575M820L918M553J3528J9287J3462P155R731
33769D99373J1672M618j710J077L547k394p137k380K431j260m766l29K919k716
33755E02945p569l023J954j353m725r5M195K10l603P95N082J199k736J187M859
33740D99322M87l588P79N394J761k528P90M463P54k741J808O523K929j666J369
$$ plain form
33725 515856 521434 524481 524632 528679 536251 539494 538148 540381 547600 552792 554956 560777 570759 578074
33711 578074 582547 591615 605943 617968 626129 636762 650574 661192 668634 680342 697127 711656
33699 711656 722579 736584 754737 770358 782379 797423 816578 833404 847120 864567 886859
33688 886859 907098 923613 942658 965700 986814 1004921 1025831 1049706 1069096 1081789 1093023
33677 1093023 1102431 1101163 1084431 1054378 1007942 934705 830547 702539 558423 403425 249520
33666 249520 114367 6544 -77671 -140772 -179406 -195654 -200135 -199683 -193012 -181545 -172779 -169373
33654 -169373 -166229 -162072 -163054 -171727 -183767 -199132 -225311 -265675 -315183 -371225 -438122 -516964
33642 -516964 -600749 -682453 -757909 -818556 -853090 -860415 -851072 -832883 -805353 -770233 -735502 -704736
$$ packed form
33725E15856N578L047J51M047P572L243j346K233P219N192K164N821R982P315
33711E78074M473R068J4328J2025Q161J0633J3812J0618P442J1708J6785J4529
33699G11656J0923J4005J8153J5621J2021J5044J9155J6826J3716J7447K2292
33688H86859K0239J6515J9045K3042K1114J8107K0910K3875J9390J2693J1234
33677A093023R408j268j6732l0053m6436p3237j04158j28008j44116j54998j53905
33666B49520j35153j07823q4215o3101l8634j6248m481M52O671J1467Q766L406
33654a69373L144M157r82q673j2040j5365k6179m0364m9508n6042o6897p8842
33642e16964q3785q1704p5456o0647l4534p325R343J8189K7530L5120L4731L0766
$$ plain form
33630 -704736 -673509 -640384 -610975 -587314 -563902 -538390 -515844 -498381 -480956 -461517 -445053
33619 -445053 -433320 -420741 -404837 -390825 -381535 -372551 -361566 -352677 -347044 -339030 -326137 -313311
33607 -313311 -303088 -290997 -275100 -260469 -249661 -238048 -223178 -209504 -199381 -188548 -175059
33596 -175059 -163500 -155838 -147264 -135663 -126052 -120999 -115773 -107641 -100761 -96976 -90938 -79496 -67105
33583 -67105 -56798 -44568 -27785 -10465 5122 23587 47986 74652 101502 133021 171893 214205
33571 214205 258362 310410 375051 449550 531316 621603 714282 789220 825597 817735 773927 707158
33559 707158 632165 563262 506866 459961 419854 389588 370496 357435 346501 340343 340968 344573
33547 344573 348556 356466 370765 387670 404308 423982 449075 475635 500203 524948 550576 570972
$$ packed form
33630g04736L1227L3125K9409K3661K3412K5512K2546J7463J7425J9439J6464
33619d45053J1733J2579J5904J4012R290Q984J0985Q889N633Q014J2893J2826
33607c13311J0223J2091J5897J4631J0808J1613J4870J3674J0123J0833J3489
33596a75059J1559P662Q574J1601R611N053N226Q132O880L785O038J1442J2391
33583f7105J0307J2230J6783J7320J5587J8465K4399K6666K6850L1519L8872M2312
33571B14205M4157N2048O4641P4499Q1766R0287R2679P4938L6377p862m3808o6769
33559G07158p4993o8903n6396m6905m0107l0266j9092j3061j0934o158O25L605
33547C44573L983P910J4299J6905J6638J9674K5093K6560K4568K4745K5628K0396
$$ plain form
33535 570972 580625 581205 575915 564131 546875 530699 520286 513233 507146 505363 510482 518903 527395
33522 527395 538729 555363 573915 591349 610390 633341 656781 677867 699744 725173 750807
33511 750807 773134 793778 813289 825828 825966 815246 796890 770226 735958 700726 670213 643033
33499 643033 616798 594321 578168 564952 551014 538256 528629 518539 504692 490115 478484 467805
33487 467805 455523 444578 438390 434831 430876 428107 427957 426775 421546 415500 412276 409495 403813 397264
33473 397264 392714 387998 380507 372742 367486 362198 354033 345605 339945 334435 325635 315444 306687 297260
33459 297260 284561 271092 259715 247857 232342 215488 200567 185781 168695 152167 139709
33448 139709 129216 117296 105578 96746 88616 78234 67759 60221 53532 44712 36012 30725 26922
$$ packed form
33535E70972R653N80n290j1784j7256j6176j0413p053o087j783N119Q421Q492
33522E27395J1334J6634J8552J7434J9041K2951K3440K1086K1877K5429K5634
33511G50807K2327K0644J9511J2539J38j0720j8356k6664l4268l5232l0513k7180
33499F43033k6235k2477j6153j3216j3938j2758r627j0090j3847j4577j1631j0679
33487D67805j2282j0945o188l559l955k769j50j182n229o046l224k781n682o549
33473C97264m550m716p491p765n256n288q165q428n660n510q800j0191q757r427
33459B97260j2699j3469j1377j1858j5515j6854j4921j4786j7086j6528j2458
33448A39709j0493j1920j1718q832q130j0382j0475p538o689q820q700n287l803
$$ plain form
33435 26922 21434 16143 14207 13816 11795 9654 10058 11048 9833 8606 10540 13604 14408 14534 16939 19694
33419 19694 19516 18119 18912 20781 21232 22356 27421 34686 40648 46323 54263 62556 67875 71512 76379
33404 76379 80977 82262 81450 81060 79264 73255 65362 59885 56657 53507 51930 54212 57851 59013 58852
33389 58852 60508 62713 62405 60893 61212 62038 60293 57226 55816 54719 50897 45704 42287 39481 34475
33374 34475 29098 27224 28130 28513 28819 31425 34770 35613 35151 36821 39921 41399 42031 44814 49082 52105
33358 52105 54662 59135 63976 66001 66371 68454 71609 73003 73789 77452 83614 89281 94659 102002 110376
33343 110376 117364 124327 134206 145629 154847 161914 169315 176279 180323 182824 187123 192547 196002 197928
33329 197928 200937 204155 204833 204153 205512 208372 209561 209280 210071 211243 210139 207540 205947 203837 197569
$$ packed form
33435B6922n488n291j936l91k021k141M04R90j215j227J934L064Q04J26K405K755
33419A9694j78j397P93J869M51J124N065P265N962N675P940Q293N319L637M867
33404G6379M598J285q12l90j796o009p893n477l228l150j577K282L639J162j61
33389E8852J656K205l08j512L19Q26j745l067j410j097l822n193l417k806n006
33374C4475n377j874R06L83L06K606L345Q43m62J670L100J478O32K783M268L023
33358E2105K557M473M841K025L70K083L155J394P86L663O162N667N378P343Q374
33343A10376O988O963R879J1423R218P067P401O964M044K501M299N424L455J926
33329A97928L009L218O78o80J359K860J189k81P91J172j104k599j593k110o268
$$ plain form
33314 197569 187746 177913 168260 156573 144071 134096 125992 116299 105093 95201 86162 75120 62898
33301 62898 53173 46258 39553 33399 30520 30250 29216 27232 26784 27281 25612 21880 18818 16118 11172
33286 11172 4895 904 -750 -3244 -6816 -8682 -8786 -9798 -11628 -11686 -10433 -10975 -13273 -14390 -14429 -16606
33270 -16606 -21470 -26511 -31365 -37859 -44948 -49224 -50510 -51671 -52994 -52234 -50009 -49415 -50198 -48903 -44981
33255 -44981 -41281 -38391 -34035 -28254 -23672 -20337 -15707 -9997 -6113 -4072 -887 3778 7313 9717
33241 9717 13897 19967 24750 27433 30374 33800 35163 34360 34221 35102 34178 30773 27307 24409 20271 15391
33225 15391 12712 12391 11502 9462 8575 8662 6571 1826 -2436 -4956 -7648 -10759 -11981 -11377 -12037 -14861
33209 -14861 -17537 -19418 -22358 -26002 -27438 -26481 -26239 -27525 -27790 -26490 -26323 -28079 -29365 -29543 -30894 -33750
$$ packed form
33314A97569r823r833r653j1687j2502r975q104r693j1206r892r039j1042j2222
33301F2898r725o915o705o154k879k70j034j984m48M97j669l732l062k700m946
33286A1172o277l991j654k494l572j866j04j012j830n8J253n42k298j117l9k177
33270a6606m864n041m854o494p089m276j286j161j323P60K225N94p83J295L922
33255d4981L700K890M356N781M582L335M630N710L884K041L185M665L535K404
33241I717M180O070M783K683K941L426J363q03j39Q81r24l405l466k898m138m880
33225A5391k679l21q89k040q87Q7k091m745m262k520k692l111j222O04o60k824
33209a4861k676j881k940l644j436R57K42j286k65J300J67j756j286j78j351k856
$$ plain form
33193 -33750 -35500 -35602 -36636 -39199 -40707 -40443 -40873 -42723 -43606 -42729 -42112 -42007 -40124 -36646 -35054 -36557
33177 -36557 -38524 -39671 -41864 -45475 -47988 -48768 -50359 -53513 -55721 -56126 -57068 -59198 -59903 -58187 -56350
33162 -56350 -55242 -52580 -47703 -43270 -40559 -37674 -34013 -31811 -31510 -30258 -26778 -23196 -20438 -16434 -10531
33147 -10531 -4924 135 7922 20190 35212 52627 75517 105727 141738 183166 232620 290732
33135 290732 353486 416119 475062 524247 554945 562576 550124 523041 485101 441021 397823 360158
33123 360158 327807 299998 278285 263124 251966 243264 238503 238164 239783 242219 247776 257880 270674
33110 270674 285023 302697 324357 347451 370104 392696 413307 426200 427758 420138 406786 388545
33098 388545 366608 344753 325442 307389 289628 274185 262205 251499 240703 232006 226983 223479
$$ packed form
33193c3750j750j02j034k563j508K64m30j850q83Q77O17J05J883L478J592j503
33177c6557j967j147k193l611k513p80j591l154k208m05r42k130p05J716J837
33162e6350J108K662M877M433K711K885L661K202L01J252L480L582K758M004N903
33147a0531N607N059P787J2268J5022J7415K2890L0210L6011M1428M9454N8112
33135B90732O2754O2633N8943M9185L0698P631j2452k7083l7940m4080m3198l7665
33123C60158l2351k7809k1713j5161j1158q702m761l39J619K436N557J0104J2794
33110B70674J4349J7674K1660K3094K2653K2592K0611J2893J558p620j3352j8241
33098C88545k1937k1855j9311j8053j7761j5443j1980j0706j0796q697n023l504
$$ plain form
33086 223479 219342 215506 212703 208975 203279 197856 194235 190502 185258 180513 177864 175452 171571 167750
33072 167750 165416 163136 159993 158133 159017 160559 160816 161064 162443 163124 161797 160530 161167 162146 161772 161376
33056 161376 162393 163604 164090 165642 169446 173636 176823 180619 185981 190655 193221 196107 201517 207723
33042 207723 212476 216707 221775 226468 229885 234011 240200 246325 250553 254779 261186 268596 275392 282760
33028 282760 291824 300737 307936 315186 324220 333564 342000 351929 365783 382167 398955 417147 438227
33015 438227 460823 483662 508990 539432 574243 612170 655258 706309 765427 832719 911728
33004 911728 1006464 1117370 1243380 1384816 1539914 1700216 1852678 1984650 2085065 2145069
32994 2145069 2162181 2141970 2092496 2019440 1929042 1831597 1737360 1651252 1575047 1511687 1463347
$$ packed form
33086B23479m137l836k803l728n696n423l621l733n244m745k649k412l881l821
33072A67750k334k280l143j860Q84J542K57K48J379O81j327j267O37R79l74l96
33056A61376J017J211M86J552L804M190L187L796N362M674K566K886N410O206
33042B07723M753M231N068M693L417M126O189O125M228M226O407P410O796P368
33028B82760R064Q913P199P250R034R344Q436R929J3854J6384J6788J8192K1080
33015D38227K2596K2839K5328L0442L4811L7927M3088N1051N9118O7292P9009
33004I11728R4736J10906J26010J41436J55098J60302J52462J31972J00415O0004
32994B145069J7112k0211m9474p3056r0398r7445r4237q6108p6205o3360m8340
$$ plain form
32983 1463347 1428082 1402815 1387617 1383424 1388151 1398959 1415567 1436853 1456338 1465245 1457806 1429388
32971 1429388 1371835 1276269 1140733 972654 785708 596860 422893 274102 151246 50786
32961 50786 -29020 -89557 -135448 -171974 -200830 -222149 -238310 -251768 -261518 -265885 -266762 -267088 -266422
32948 -266422 -263153 -258807 -255866 -253391 -249185 -244251 -240811 -237869 -233113 -227323 -222515 -217691 -210822 -203167
32934 -203167 -197175 -191992 -185536 -179049 -174901 -171727 -166509 -159719 -153730 -147964 -140452 -132351 -125868 -119391
32920 -119391 -109754 -97659 -85803 -73429 -58033 -40642 -23853 -6346 14911 38838 62681 88668
32908 88668 121931 163406 211387 268455 339644 425137 522605 635756 772625 936793 1129585
32897 1129585 1359849 1640846 1977922 2370689 2822429 3320167 3790903 4100279 4129956 3868541
$$ packed form
32983A463347l5265k5267j5198m193M727J0808J6608K1286J9485Q907p439k8418
32971A429388n7553r5566j35536j68079j86946j88848j73967j48791j22856j00460
32961E0786p9806o0537m5891l6526k8856k1319j6161j3458r750m367q77l26O66
32948b66422L269M346K941K475M206M934L440K942M756N790M808M824O869P655
32934b03167N992N183O456O487M148L174N218O790N989N766P512Q101O483O477
32920a19391R637J2095J1856J2374J5396J7391J6789J7507K1257K3927K3843K5987
32908H8668L3263M1475M7981N7068P1189Q5493R7468J13151J36869J64168J92792
32897A129585K30264K80997L37076L92767M51740M97738M70736L09376K9677k61415
$$ plain form
32887 3868541 3419433 2919679 2457799 2059456 1721918 1441070 1212542 1027371 876140
32878 876140 753755 657142 581198 519656 468310 425315 389342 359424 336193 321265 314986
32867 314986 315972 322722 333691 345103 350745 345485 328098 299957 262710 218658 171659 125440
32855 125440 81685 41121 5246 -24640 -48895 -68184 -81777 -89041 -91405 -90772 -86896 -78240 -64271
32842 -64271 -44879 -18707 15523 56777 102706 151491 200119 242015 269603 279419 273021 253931
32830 253931 226047 193978 161704 130693 101130 74310 51753 32938 16424 2435 -8141
32819 -8141 -16417 -24442 -32203 -38348 -43223 -48386 -53686 -57687 -60552 -63679 -66880 -68703 -69264 -70002 -70932
32804 -70932 -70891 -70177 -70181 -70649 -70070 -68528 -67434 -66751 -65290 -63445 -62641 -62312 -60416 -56834 -53241 -49772 -44986
$$ packed form
32887C868541m49108m99754m61880l98343l37538k80848k28528j85171j51231
32878H76140j22385r6613p5944o1542n1346m2995l5973k9918k3231j4928o279
32867C14986R86O750J0969J1412N642n260j7387k8141l7247m4052m6999m6219
32855A25440m3755m0564l5875k9886k4255j9289j3593p264k364O33L876Q656J3969
32842f4271J9392K6172L4230M1254M5929M8785M8628M1896K7588R816o398j9090
32830B53931k7884l2069l2274l1011k9563k6820k2557j8815j6514j3989j0576
32819h141q276q025p761o145m875n163n300m001k865l127l201j823n61p38r30
32804g0932M1P14mm68N79J542J094O83J461J845Q04L29J896L582L593L469M786
$$ plain form
32787 -44986 -39133 -34179 -30344 -25790 -20016 -14311 -8496 -595 9754 20979 33293 49073 68420
32774 68420 87969 105143 118672 121716 99121 38527 -54414 -155080 -236087 -284674 -305743 -311435
32762 -311435 -310140 -304440 -295550 -285785 -276477 -266483 -254622 -241998 -230351 -219749 -209803 -201682 -196671
32749 -196671 -193742 -190802 -187479 -184616 -181958 -178651 -175244 -172852 -170930 -168035 -164057 -159568 -153815 -145805
32735 -145805 -136615 -128129 -120128 -111163 -101693 -93877 -88787 -86398 -87681 -93925 -104198 -115978 -128016
32722 -128016 -140257 -151621 -160543 -167366 -173527 -178810 -181954 -183492 -185172 -186945 -187341 -186532 -186177 -186484 -186287
32707 -186287 -185818 -186464 -187777 -187627 -185442 -182663 -179918 -176489 -172602 -169581 -167559 -165498 -163503 -162654 -162657 -162153
32691 -162153 -161170 -160729 -160267 -158159 -154637 -151527 -149290 -147006 -144987 -144541 -145232 -145146 -143788 -142033 -139497 -134830
$$ packed form
32787d4986N853M954L835M554N774N705N815P901J0349J1225J2314J5780J9347
32774F8420J9549J7174J3529L044k2595o0594r2941j00666q1007m8587k1069n692
32762c11435J295N700Q890R765R308R994J1861J2624J1647J0602R946Q121N011
32749a96671K929K940L323K863K658L307L407K392J922K895L978M489N753Q010
32735a45805R190Q486Q001Q965R470P816N090K389j283o244j0273j1780j2038
32722a28016j2241j1364q922o823o161n283l144j538j680j773l96Q09L55l07J97
32707a86287M69o46j313J50K185K779K745L429L887L021K022K061J995Q49lN04
32691a62153R83M41M62K108L522L110K237K284K019M46o91Q6J358J755K536M667
$$ plain form
32675 -134830 -128473 -122230 -116218 -108917 -99998 -90279 -79194 -65164 -48160 -29087 -7038 19959 52106
32662 52106 88723 131281 182432 242827 312117 392259 486632 597225 726184 878603 1060128
32651 1060128 1273695 1520885 1798618 2083115 2319883 2445872 2431952 2301365 2105409 1887406
32641 1887406 1670368 1465580 1279584 1114186 968102 840613 731227 637499 556533 487267
32631 487267 428680 377635 331191 289268 252677 220384 191072 165401 144278 126657 111121
32620 111121 97774 86515 75430 63079 50581 39507 29519 19891 11355 4486 -1908 -8945 -15984
32607 -15984 -22402 -29024 -36096 -41907 -45262 -47397 -49695 -51493 -51921 -51971 -52890 -54367 -55998 -58671 -62781
32592 -62781 -66921 -70027 -72983 -76542 -79639 -81423 -82952 -85142 -87011 -87657 -88039 -89049 -89684 -88898 -87356
$$ packed form
32675a34830O357O243O012P301Q919R719J1085J4030J7004J9073K2049K6997L2147
32662E2106L6617M2558N1151O0395O9290Q0142R4373J10593J28959J52419J81525
32651A060128K13567K47190K77733K84497K36768J25989j3920j30587j95956k18003
32641A887406k17038k04788j85996j65398j46084j27489j09386r3728q0966o9266
32631D87267n8587n1045m6444m1923l6591l2293k9312k5671k1123j7621j5536
32620A11121j3347j1259j1085j2351j2498j1074r988r628q536o869o394p037p039
32607a5984o418o622p072n811l355k135k298j798m28n0r19j477j631k673m110
32592f2781m140l106k956l559l097j784j529k190j869o46l82j010o35P86J542
$$ plain form
32577 -87356 -85622 -82488 -76959 -70111 -63254 -55966 -47605 -38993 -31022 -23423 -16574 -12639 -13098 -16813 -22081
32562 -22081 -28792 -36992 -45317 -52690 -59796 -67154 -73478 -77633 -80462 -83038 -84911 -85716 -86643 -88554 -90426
32547 -90426 -91339 -92184 -93728 -94853 -94543 -93824 -93979 -94605 -95180 -96645 -99593 -102663 -104664 -106568 -109594 -112998
32531 -112998 -115647 -118021 -120852 -123433 -125200 -127223 -130251 -132921 -133805 -133599 -133472 -132984 -131557 -130278 -130177
32516 -130177 -130277 -129341 -128025 -127415 -127040 -126286 -126155 -127528 -129188 -129625 -129419 -129924 -130937 -131604 -132152 -132842 -132633
32499 -132633 -130869 -128855 -127944 -127440 -126238 -124985 -124666 -124556 -123552 -122107 -120902 -119056 -115674 -111804 -108891
32484 -108891 -106699 -104590 -103290 -103314 -103094 -100845 -97031 -92981 -88398 -82275 -74878 -66798 -57336 -45802 -33008
32469 -33008 -19407 -3252 17201 40951 65775 90955 116029 137979 152185 155525 146925 126346
$$ packed form
32577h7356J734L134N529O848O857P288Q361Q612P971P599O849L935m59l715n268
32562b2081o711q200q325p373p106p358o324m155k829k576j873q05r27j911j872
32547i0426r13q45j544j125L10P19j55o26n75j465k948l070k001j904l026l404
32531a12998k649k374k831k581j767k023l028k670q84K06J27M88J427J279J01
32516a30177j00R36J316O10L75P54J31j373j660m37K06n05j013o67n48o90K09
32499a32633J764K014R11N04J202J253L19J10J004J445J205J846L382L870K913
32484a08891K192K109J300k4K20K249L814M050M583O123P397Q080R462J1534J2794
32469c3008J3601J6155K0453K3750K4824K5180K5074K1950J4206L340q600k0579
$$ plain form
32457 126346 95692 59714 23601 -9928 -39876 -64903 -84087 -98395 -109087 -115637 -117147 -114601
32445 -114601 -109554 -101776 -90381 -76180 -60636 -43480 -23599 -1435 21526 44598 66948 85664
32433 85664 96917 98653 90660 73324 48331 19464 -9551 -37354 -63614 -86796 -105351 -119894
32421 -119894 -131992 -141754 -148681 -153737 -158382 -162537 -165603 -168454 -172247 -176310 -179420 -182212 -186109 -190859
32407 -190859 -195268 -199393 -203852 -208027 -211201 -214426 -218926 -223603 -226461 -227555 -228281 -228798 -228582 -228593 -230264
32392 -230264 -233033 -235286 -237062 -239470 -242226 -244224 -245873 -248446 -251702 -254500 -257062 -260212 -263038 -263807
32378 -263807 -262708 -261422 -260538 -259714 -259666 -261438 -264179 -266081 -267162 -268819 -271151 -273146 -275017 -277906 -281563
32363 -281563 -284666 -287138 -289890 -292655 -294452 -295859 -298535 -302687 -307201 -311905 -317492 -323596 -329191 -334571
$$ packed form
32457A26346l0654l5978l6113l3529k9948k5027j9184j4308j0692o550j510K546
32445a14601N047P778J1395J4201J5544J7156J9881K2164K2961K3072K2350J8716
32433H5664J1253J736p993j7336k4993k8867k9015k7803k6260k3182j8555j4543
32421a19894j2098r762o927n056m645m155l066k851l793m063l110k792l897m750
32407a90859m409m125m459m175l174l225m500m677k858j094p26n17K16j1j671
32392b30264k769k253j776k408k756j998j649k573l256k798k562l150k826p69
32378b63807J099J286Q84Q24M8j772k741j902j081j657k332j995j871k889l657
32363b81563l103k472k752k765j797j407k676m152m514m704n587o104n595n380
$$ plain form
32349 -334571 -340745 -347186 -352400 -356356 -360170 -363844 -366541 -368643 -371174 -373567 -374305 -373334 -371411 -367305 -357951
32334 -357951 -340927 -314290 -274298 -215869 -135317 -30628 99914 255662 429279 606832
32324 606832 773098 915993 1027430 1103646 1145836 1158552 1146865 1116151 1073489 1026393 979755
32313 979755 935813 896576 863907 837657 816494 800858 792960 794089 804276 824284 855090 895258
32301 895258 941387 991049 1042175 1089014 1121890 1132673 1119253 1084720 1034638 975594 913621
32290 913621 852166 792395 735493 683171 636054 593606 555815 523055 494266 467353 441628
32279 441628 417882 396014 374751 353894 334631 317291 300886 285157 271035 258726 247356
32268 247356 236823 228030 220954 214414 207993 202247 196870 190741 184042 178212 173480 168444 162354 155804
$$ packed form
32349c34571o174o441n214l956l814l674k697k102k531k393p38R71J923M106R354
32334c57951J7024K6637L9992N8429Q0552J04689J30542J55748J73617J77553
32324F06832J66266J42895J11437P6216M2190J2716j1687l0714m2662m7096m6638
32313I79755m3942l9237l2669k6250k1163j5636p898J129J0187K0008L0806M0168
32301H95258M6129M9662N1126M6839L2876J0783j3420l4533n0082n9044o1973
32290I13621o1455n9771n6902n2322m7117m2448l7791l2760k8789k6913k5725
32279D41628k3746k1868k1263k0857j9263j7340j6405j5729j4122j2309j1370
32268B47356j0533q793p076o540o421n746n377o129o699n830m732n036o090o550
$$ plain form
32254 155804 148965 141243 133028 125661 119337 113066 106948 102338 99440 96966 94544 93265 93332 93333 92420 91175
32238 91175 89799 87550 84560 82134 80626 78922 76555 74395 72714 70588 67815 65474 63963 62351
32224 62351 60223 58259 56484 53878 50330 47071 44622 42166 39444 37323 35925 34140 31621 29418
32210 29418 28047 26754 25233 24161 23531 22385 20835 20377 21520 22896 23328 23019 22224 20740 19301 19498
32194 19498 21565 24018 26056 28453 31589 34612 37227 40341 44188 47734 50655 54037 58364 62623
32180 62623 66136 69439 72659 74903 75989 76907 77847 77614 75693 72959 69608 64348 56411 46465 34806
32165 34806 20745 4803 -10384 -22465 -31052 -36358 -38142 -37025 -34927 -33078 -31041 -28546 -26544
32152 -26544 -25591 -24925 -24048 -23533 -23479 -22906 -21561 -20580 -20511 -20425 -19795 -19460 -19880 -20289 -20448 -21355 -23202 -24538 -24512
$$ packed form
32254A55804o839p722q215p367o324o271o118m610k898k474k422j279O7Jr13j245
32238I1175j376k249k990k426j508j704k367k160j681k126k773k341j511j612
32224F2351k128j964j775k606l548l259k449k456k722k121j398j785k519k203
32210B9418j371j293j521j072o30j146j550m58J143J376M32l09p95j484j439J97
32194A9498K067K453K038K397L136L023K615L114L847L546K921L382M327M259
32180F2623L513L303L220K244J086R18R40k33j921k734l351n260p937r946j1659
32165C4806j4061j5942j5187j2081q587n306j784J117K098J849K037K495K002
32152b6544R53O66Q77N15N4N73J345R81O9Q6O30L35m20m09j59r07j847j336K6
$$ plain form
32133 -24512 -24190 -24580 -25090 -24997 -24697 -24433 -23507 -21824 -20557 -20258 -19992 -19340 -19492 -21264 -23748 -25980 -28221
32116 -28221 -30493 -31678 -31378 -31013 -31815 -33206 -34245 -35084 -35893 -35968 -35091 -34222 -33781 -32834 -31096 -30052 -30874
32099 -30874 -32796 -34689 -36634 -38746 -40147 -40435 -40701 -41845 -43311 -44572 -46295 -48878 -51366 -53037 -54462
32084 -54462 -55895 -56236 -54881 -53036 -51929 -51223 -50376 -49937 -50246 -50456 -50165 -50398 -51678 -52751 -52592 -52031 -51989
32067 -51989 -51787 -50717 -49735 -49911 -50698 -51321 -52471 -54992 -58173 -60871 -63079 -64879 -65216 -63321 -60199 -57176
32051 -57176 -54078 -50240 -46121 -42511 -39311 -36479 -34935 -35134 -35948 -36329 -36837 -38198 -39676 -40322 -40518 -40860
32035 -40860 -40808 -39961 -39330 -39803 -40545 -40454 -40010 -40164 -40613 -40784 -41294 -42797 -44428 -45027 -44966 -45350 -46395 -47973 -50572
32016 -50572 -54192 -57406 -59004 -59561 -59973 -59691 -57957 -55669 -54340 -54162 -54603 -55860 -58165 -60615 -62258 -63463
$$ packed form
32133b4512L22l90n10R3L00K64R26J683J267K99K66O52j52j772k484k232k241
32116b8221k272j185L00L65q02j391j039q39q09p5Q77Q69M41R47J738J044q22
32099c0874j922j893j945k112j401k88k66j144j466j261j723k583k488j671j425
32084e4462j433l41J355J845J107P06Q47M39l09k10K91k33j280j073J59N61M2
32067e1989K02J070R82j76p87o23j150k521l181k698k208j800l37J895L122L023
32051e7176L098L838M119L610L200K832J544j99q14l81n08j361j478o46j96l42
32035d0860N2Q47O31m73p42R1M44j54m49j71n10j503j631n99O1l84j045j578k599
32016e0572l620l214j598n57m12K82J734K288J329J78m41j257k305k450j643j205
$$ plain form
32000 -63463 -64804 -65580 -64884 -63155 -61335 -59540 -57908 -57522 -58955 -60989 -62258 -63098 -64342 -65519 -65820 -65632
31984 -65632 -65447 -64442 -61860 -58759 -56635 -55326 -53870 -52352 -51255 -50080 -48409 -47274 -47663 -48667 -48872
31969 -48872 -48593 -48870 -49311 -48900 -48075 -47999 -48490 -48527 -48085 -47636 -46580 -44112 -41043 -38970 -38219 -38292 -39581 -42764
31951 -42764 -47100 -51132 -54552 -57717 -60000 -60421 -59398 -58108 -56639 -54451 -52094 -50717 -50332 -50222 -50554
31936 -50554 -51974 -54111 -56100 -58068 -60522 -62867 -64122 -64557 -65012 -65233 -64560 -63619 -63586 -64262 -64599 -64638 -65236
31919 -65236 -66300 -66965 -67112 -67148 -66781 -65585 -64278 -63870 -64040 -63830 -63282 -62786 -61596 -58851 -55515 -53437 -52894
31902 -52894 -52781 -52748 -53315 -54361 -55359 -56842 -59886 -64317 -68976 -73348 -77397 -80336 -81315 -80950 -80485 -79862 -78278
31885 -78278 -76162 -74771 -74220 -73705 -73297 -73697 -74558 -74881 -74831 -75390 -76380 -76644 -76005 -75362 -75005 -74453 -73770 -73408 -72982
$$ packed form
32000f3463j341p76O96J729J820J795J632L86j433k034j269q40j244j177l01J88
31984f5632J85J005K582L101K124J309J456J518J097J175J671J135l89j004k05
31969d8872K79k77m41M11Q25P6m91l7M42M49J056K468L069K073P51p3j289l183
31951d2764m336m032l420l165k283m21J023J290J469K188K357J377L85J10l32
31936e0554j420k137j989j968k454k345j255m35m55k21O73R41L3o76l37l9n98
31919f5236j064o65j47l6L67J196J307M08j70K10N48M96J190K745L336K078N43
31902e2894J13L3n67j046r98j483l044m431m659m372m049k939r79L65M65O23J584
31885g8278K116J391N51N15M08m00q61l23N0n59r90k64O39O43L57N52O83L62M26
$$ plain form
31866 -72982 -71767 -70208 -69407 -69463 -69861 -71059 -73920 -77866 -81353 -83872 -85841 -86922 -86349 -84683 -83408 -82895
31850 -82895 -82425 -81913 -81850 -81761 -80611 -78614 -76911 -75678 -74284 -73028 -72772 -73074 -72654 -71646 -71417 -72159 -72612
31833 -72612 -72210 -71609 -71031 -70014 -68972 -69108 -70440 -71607 -71850 -71605 -71002 -69483 -67123 -64783 -62779 -60888
31817 -60888 -59612 -59784 -60891 -61464 -61243 -61291 -61957 -62430 -62408 -62456 -62517 -61725 -59860 -57433 -54243 -49567 -43895 -38727
31799 -38727 -34415 -29850 -24510 -19190 -14557 -10665 -8251 -8867 -13374 -21617 -33570 -49123 -66565 -82994
31785 -82994 -96607 -107229 -114616 -117997 -117526 -114479 -109659 -103034 -95107 -87023 -79123 -71010 -63208 -57126
31771 -57126 -53101 -50118 -47628 -45999 -45009 -43743 -42385 -42435 -44710 -48632 -53726 -60106 -67160 -73490 -78603
31756 -78603 -83145 -87142 -89688 -90723 -91386 -92125 -92103 -90969 -89578 -88473 -87297 -86249 -86538 -88700 -91865 -95169
$$ packed form
31866g2982J215J559Q01n6l98j198k861l946l487k519j969j081N73J666J275N13
31850h2895M70N12O3Q9J150J997J703J233J394J256K56l02M20J008K29p42m53
31833g2612M02O01N78J017J042j36j332j167k43K45O03J519K360K340K004J891
31817f0888J276j72j107n73K21m8o66m73K2m8o1P92J865K427L190M676N672N168
31799c8727M312M565N340N320M633L892K414o16m507q243j1953j5553j7442j6429
31785h2994j3613j0622p387l381M71L047M820O625P927Q084P900Q113P802O082
31771e7126M025K983K490J629R90J266J358n0k275l922n094o380p054o330n113
31756g8603m542l997k546j035o63p39K2J134J391J105J176J048k89k162l165l304
$$ plain form
31740 -95169 -98518 -101559 -103498 -104476 -105697 -107697 -109830 -111807 -114207 -117053 -119470 -121243 -123205 -125576 -127458
31725 -127458 -128513 -129604 -131237 -132751 -133616 -134078 -134075 -132996 -131056 -129443 -128579 -127699 -126653 -126560 -128055 -130303
31709 -130303 -132382 -134258 -135886 -136849 -137498 -139026 -141728 -144493 -146539 -148307 -150149 -151630 -152730 -154318 -156793
31694 -156793 -159544 -162244 -165290 -168431 -170476 -171029 -171205 -172056 -173579 -175675 -178568 -181702 -183775 -184566 -185394
31679 -185394 -187222 -189691 -192464 -195972 -200193 -204255 -207932 -212022 -216580 -220314 -222479 -223907 -225433 -226756
31665 -226756 -227600 -228356 -228627 -226499 -220238 -209481 -194077 -173145 -146215 -114225 -78806 -41929 -6799
31652 -6799 22598 43956 57692 65116 67012 64534 59748 54188 48101 41873 36719 33194 30565 28611
31638 28611 28693 32119 38921 49234 64542 86514 115751 152431 196702 247260 300485 351662 395968
$$ packed form
31740i5169l349l041j939r78j221k000k133j977k400k846k417j773j962k371j882
31725a27458j055j091j633j514q65m62LJ079J940J613Q64Q80J046R3j495k248
31709a30303k079j876j628r63o49j528k702k765k046j768j842j481j100j588k475
31694a56793k751k700l046l141k045n53j76q51j523k096k893l134k073p91q28
31679a85394j828k469k773l508m221m062l677m090m558l734k165j428j526j323
31665b26756q44p56k71K128O261J0757J5404K0932K6930L1990L5419L6877L5130
31652f799K9397K1358J3736P424J896k478m786n560o087o228n154l525k629j954
31638B8611Q2L426O802J0313J5308K1972K9237L6680M4271N0558N3225N1177M4306
$$ plain form
31625 395968 428201 443897 442354 427360 403886 375222 343834 312807 284637 259815 237949 219237
31613 219237 203685 190197 177796 166707 157090 147876 138084 128230 119224 110938 102963 95659 89222
31600 89222 82810 75884 69486 64925 62036 59785 57642 55246 51724 46583 40560 34586 28746 23154
31586 23154 18838 16603 15844 15468 15145 14778 13722 11568 8876 6228 3460 596 -1547 -2591 -3351 -4444
31570 -4444 -5285 -5416 -5669 -6860 -8439 -9566 -10530 -11967 -13640 -15064 -16394 -17630 -18000 -17254 -16611 -17227 -18601
31553 -18601 -19509 -19587 -18977 -17449 -15066 -12780 -11252 -9968 -8518 -7735 -8485 -10361 -12719 -15921 -20316 -24977
31537 -24977 -28745 -31664 -34158 -35724 -35700 -34597 -33484 -32831 -32964 -34716 -38436 -43161 -47876 -52705 -57800
31522 -57800 -62110 -64483 -65135 -64846 -63698 -61775 -60033 -59081 -57986 -55667 -52656 -50176 -48362 -46774 -45803
$$ packed form
31625C95968L2233J5696j543j4994k3474k8664l1388l1027k8170k4822k1866j8712
31613B19237j5552j3488j2401j1089r617r214r792r854r006q286p975p304o437
31600H9222o412o926o398m561k889k251k143k396l522n141o023n974n840n592
31586B3154m316k235p59l76l23l67j056k154k692k648k768k864k143j044p60j093
31570d444q41j31k53j191j579j127r64j437j673j424j330j236l70P46O43o16j374
31553a8601r08p8O10J528K383K286J528J284J450P83p50j876k358l202m395m661
31537b4977l768k919k494j566K4J103J113O53j33j752l720m725m715m829n095
31522e7800m310k373o52K89J148J923J742R52J095K319L011K480J814J588R71
$$ plain form
31507 -45803 -46080 -47164 -48177 -49152 -50475 -51788 -52711 -53951 -56311 -59243 -61664 -63553 -65430 -66859 -66805 -64927
31491 -64927 -61423 -56285 -49903 -43707 -38944 -35403 -32415 -30273 -29441 -29211 -28516 -27383 -26354 -25251 -23842
31476 -23842 -22986 -23666 -25495 -27440 -29314 -31283 -32715 -33025 -33033 -34026 -36050 -38385 -41003 -44091 -46812 -48096
31460 -48096 -48164 -47877 -47101 -45150 -42300 -39459 -36806 -34140 -32001 -31025 -30733 -30397 -30604 -32453 -35665 -38912
31444 -38912 -41619 -44048 -46114 -47573 -48976 -50965 -52984 -54068 -54503 -55347 -56737 -58040 -59209 -60540 -61505
31429 -61505 -61327 -60439 -59967 -60178 -60712 -61847 -64030 -66590 -68445 -69748 -71353 -73050 -73853 -73676 -73220 -72474 -70939
31412 -70939 -69045 -67806 -67197 -66353 -65183 -64288 -63567 -62380 -60929 -59957 -59292 -58170 -56845 -56338 -56700 -57070 -57362
31395 -57362 -58358 -60082 -61537 -62107 -61900 -60788 -58458 -55372 -52387 -49543 -46514 -43979 -43126 -43955 -45510 -47574
$$ packed form
31507d5803k77j084j013r75j323j313r23j240k360k932k421j889j877j429N4J878
31491f4927L504N138O382O196M763L541K988K142Q32K30O95J133J029J103J409
31476b3842Q56o80j829j945j874j969j432l10qr93k024k335k618l088k721j284
31460d8096o8K87P76J951K850K841K653K666K139R76K92L36k07j849l212l247
31444c8912k707k429k066j459j403j989k019j084m35q44j390j303j169j331r65
31429f1505J78Q88M72k11n34j135k183k560j855j303j605j697q03J77M56P46J535
31412g0939J894J239O09Q44J170Q95P21J187J451R72O65J122J325N07l62l70k92
31395e7362r96j724j455n70K07J112K330L086K985K844L029K535Q53q29j555k064
$$ plain form
31379 -47574 -50558 -53929 -56426 -57894 -59326 -61064 -62526 -63749 -65556 -67984 -70054 -71332 -72275 -72951 -72916
31364 -72916 -72589 -73220 -75159 -77523 -79807 -82395 -85186 -87186 -87936 -88090 -88227 -88316 -88616 -89809 -91846 -93876
31348 -93876 -95656 -97872 -100811 -103915 -106937 -110307 -114058 -117639 -121144 -125495 -131012 -136972 -142952 -149426
31334 -149426 -156701 -164436 -172660 -182083 -192994 -204948 -217960 -232887 -250307 -270213 -293188 -320494
31322 -320494 -352407 -387809 -426223 -469067 -518199 -574515 -638914 -713259 -799162 -896940 -1007179
31311 -1007179 -1132161 -1273801 -1430940 -1600410 -1778606 -1956054 -2107588 -2193256 -2178681 -2060449
31301 -2060449 -1871187 -1657768 -1453943 -1271534 -1110495 -969714 -848243 -743194 -651474 -572187
31291 -572187 -504971 -447544 -397150 -353120 -315867 -284411 -257017 -233425 -214293 -198966 -185771
$$ packed form
31379d7574k984l371k497j468j432j738j462j223j807k428k070j278r43o76L5
31364g2916L27o31j939k364k284k588k791k000p50j54j37q9l00j193k037k030
31348i3876j780k216k939l104l022l370l751l581l505m351n517n960n980o474
31334a49426p275p735q224r423j0911j1954j3012j4927j7420j9906k2975k7306
31322c20494l1913l5402l8414m2844m9132n6316o4399p4345q5903r7778j10239
31311a007179j24982j41640j57139j69470j78196j77448j51534q5668J4575J18232
31301b060449J89262K13419K03825J82409J61039J40781J21471J05049R1720P9287
31291e72187O7216N7427N0394M4030L7253L1456K7394K3592J9132J5327J3195
$$ plain form
31280 -185771 -174057 -164123 -155527 -147318 -139623 -133185 -127550 -121421 -114566 -107767 -101168 -94444 -88363 -84313
31266 -84313 -82240 -80676 -78762 -76700 -74337 -71041 -66996 -62995 -58933 -54199 -49506 -46620 -46081 -46793 -47968
31251 -47968 -49781 -51930 -53285 -53411 -53011 -52532 -51692 -50594 -49914 -49707 -49367 -48962 -49274 -50399 -51636 -52761 -53956
31234 -53956 -54445 -52859 -49175 -44819 -40676 -36537 -32600 -29794 -28277 -27221 -26415 -26533 -27508 -28297 -28694 -29764
31218 -29764 -32001 -34555 -36745 -38780 -40487 -40909 -39858 -38412 -37264 -35935 -34229 -33067 -33178 -34169 -35480
31203 -35480 -37071 -38694 -39725 -40224 -40902 -41603 -41176 -39369 -37538 -36930 -37530 -39030 -41550 -44733 -47473 -49229
31187 -49229 -50542 -51731 -52267 -51900 -51223 -50661 -50093 -49888 -50921 -53053 -54907 -55658 -55764 -55495 -54199 -51671 -48883
31170 -48883 -46674 -44976 -43897 -44151 -45685 -47189 -47729 -47683 -47461 -46614 -44977 -43443 -42811 -42908 -43407 -44314 -45145
$$ packed form
31280a85771J1714R934Q596Q209P695O438N635O129O855O799O599O724O081M050
31266h4313K073J564J914K062K363L296M045M001M062M734M693K886N39p12j175
31251d7968j813k149j355j26M00M79Q40J098O80K07L40M05l12j125j237j125j195
31234e3956m89J586L684M356M143M139L937K806J517J056Q06j18r75p89l97j070
31218b9764k237k554k190k035j707m22J051J446J148J329J706J162j11r91j311
31203c5480j591j623j031m99o78p01M27J807J831O08o00j500k520l183k740j756
31187d9229j313j189n36L67O77N62N68K05j033k132j854p51j06K69J296K528K788
31170d8883K209J698J079k54j534j504n40M6K22Q47J637J534O32r7m99r07q31
$$ plain form
31153 -45145 -44940 -43821 -43201 -43756 -44488 -44481 -44224 -44409 -44735 -44779 -44767 -44640 -43595 -41503 -39630 -39034 -39272 -39420 -39237
31134 -39237 -38556 -36836 -34275 -32166 -31187 -30347 -28518 -25921 -23224 -20305 -16881 -13334 -9969 -6475 -3047
31119 -3047 -1080 -1856 -5397 -11299 -19526 -29525 -39668 -48606 -56244 -62640 -67079 -69204 -69955 -70309 -70009
31104 -70009 -68504 -66164 -63596 -60704 -57401 -54340 -51976 -49738 -47093 -44581 -42902 -41885 -41250 -41504 -43183
31089 -43183 -46006 -49598 -54119 -59312 -63947 -67142 -69379 -71336 -72731 -73209 -73372 -73871 -74374 -74444 -74545 -75161
31073 -75161 -75820 -76059 -76489 -77777 -79312 -79986 -79622 -78714 -77410 -75728 -74107 -72878 -71788 -70746 -70217 -70208 -69833
31056 -69833 -68784 -68212 -69161 -71022 -72508 -73261 -73524 -73186 -72333 -71942 -72823 -74495 -76057 -77498 -79185 -80834
31040 -80834 -81976 -82731 -83161 -82640 -80806 -78447 -76528 -75113 -74068 -73852 -74609 -75394 -75396 -75113 -75261 -75426 -74938 -74213
$$ packed form
31153d5145K05J119O20n55p32PK57j85l26m4J2J27J045K092J873N96k38j48J83
31134c9237O81J720K561K109R79Q40J829K597K697K919L424L547L365L494L428
31119c047J967p76l541n902q227r999j0143q938p638o396m439k125p51l54L00
31104g0009J505K340K568K892L303L061K364K238K645K512J679J017O35k54j679
31089d3183k823l592m521n193m635l195k237j957j395m78j63m99n03p0j01o16
31073g5161o59k39m30j288j535o74L64R08J304J682J621J229J090J042N29RL75
31056f9833J049N72r49j861j486p53k63L38Q53L91q81j672j562j441j687j649
31040h0834j142p55m30N21J834K359J919J415J045K16p57p85kK83j48j65M88P25
$$ plain form
31022 -74213 -73986 -73969 -73548 -73085 -73275 -73789 -73763 -73101 -72224 -71077 -69516 -68095 -67377 -66946 -66106 -65010 -64191 -63643
31004 -63643 -63307 -63723 -65146 -66719 -67565 -68020 -68694 -69012 -67864 -65082 -61121 -55907 -49032 -40389 -29403 -14173
30988 -14173 7484 36669 73900 119864 173950 232397 289152 338508 376329 399897 408341 403090
30976 403090 386788 361948 331272 298285 266180 236323 208912 184477 163593 145801 130196
30965 130196 116740 105886 97547 91733 89700 93082 102130 115931 133857 155361 178501 199838
30953 199838 215905 224234 223719 215211 201363 184811 166768 148006 130201 114929 101933 89797
30941 89797 77926 66700 56253 46516 38066 31496 26204 21083 16137 12156 9086 6007 2502 -1104
30927 -1104 -4680 -8298 -11588 -14137 -16262 -18355 -19901 -20230 -19773 -19389 -18938 -17847 -16663 -16608 -17812 -19286
$$ packed form
31022g4213K27J7M21M63j90n14K6O62Q77J147J561J421P18M31Q40J096Q19N48
31004f3643L36m16j423j573q46m55o74l18J148K782L961N214O875Q643J0986J5230
30988a4173K1657K9185L7231M5964N4086N8447N6755M9356L7821K3568Q444n251
30976D03090j6302k4840l0676l2987l2105k9857k7411k4435k0884j7792j5605
30965A30196j3456j0854q339n814k033L382R048J3801J7926K1504K3140K1337
30953A99838J6067Q329n15q508j3848j6552j8043j8762j7805j5272j2996j2136
30941H9797j1871j1226j0447r737q450o570n292n121m946l981l070l079l505l606
30927a104l576l618l290k549k125k093j546l29M57L84M51J091J184N5j204j474
$$ plain form
30911 -19286 -20450 -21422 -22060 -22064 -21873 -22261 -23127 -23826 -24465 -25710 -27550 -29431 -31396 -33906 -36770 -39429 -42067
30894 -42067 -45237 -48614 -51285 -53052 -54289 -54888 -54608 -54167 -54549 -55448 -55679 -54969 -53980 -52769 -50662 -47610
30878 -47610 -44369 -41333 -38411 -35980 -34661 -34167 -33669 -33263 -33841 -35553 -37657 -39844 -42465 -45413 -48061
30863 -48061 -50357 -52743 -54963 -56144 -56159 -55795 -55575 -55561 -56220 -58223 -61292 -64390 -67020 -69229 -70345 -69053
30847 -69053 -64826 -58226 -49766 -39650 -28609 -17745 -7432 2513 11607 18792 23773 27057 28651
30834 28651 27941 24883 20117 13832 5739 -3834 -14137 -25404 -38838 -55021 -73403 -93262 -113671
30821 -113671 -132286 -145627 -151276 -149135 -140648 -127940 -113728 -100514 -89190 -79241 -70437 -63376 -58366
30808 -58366 -54992 -53020 -52589 -53291 -54139 -54691 -55234 -55724 -55605 -54801 -53822 -52760 -51291 -49784 -49225 -49825 -50783
$$ packed form
30911a9286j164r72o38mJ91l88q66o99o39j245j840j881j965k510k864k659k638
30894d2067l170l377k671j767j237n99K80M41l82q99k31P10R89J211K107L052
30878d7610L241L036K922K431J319M94M98M06n78j712k104k187k621k948k648
30863d8061k296k386k220j181j5L64K20J4o59k003l069l098k630k209j116J292
30847f9053M227O600Q460J0116J1041J0864J0313R945R094P185M981L284J594
30834B8651p10l058m766o285q093r573j0303j1267j3434j6183j8382j9859k0409
30821a13671j8615j3341n649K141Q487J2708J4212J3214J1324R949Q804P061N010
30808e8366L374J972M31p02q48n52n43m90J19Q04R79J062J469J507N59o00r58
$$ plain form
30791 -50783 -51594 -52513 -53591 -54352 -54666 -54858 -54763 -53761 -51936 -50163 -48895 -47898 -47228 -47303 -47834 -47932 -47530 -47597 -48729
30772 -48729 -50561 -52687 -54975 -56808 -57289 -56533 -55664 -55302 -55072 -54753 -54667 -54667 -53978 -52477 -51051 -50354 -50194 -50340
30754 -50340 -50823 -51195 -50649 -49172 -47582 -46191 -44509 -42450 -40619 -39194 -37700 -36174 -35308 -35143 -34832 -34017
30738 -34017 -33254 -32778 -32071 -31046 -30435 -30595 -31110 -31945 -33771 -36666 -39660 -42049 -44102 -46117 -47935 -49801
30722 -49801 -52498 -56140 -59917 -63449 -67184 -70947 -73268 -72750 -69092 -62464 -53142 -42323 -32019 -23387
30708 -23387 -16059 -9619 -4635 -1670 -378 -256 -1315 -3452 -6104 -9018 -12392 -15823 -18203 -19134 -19375
30693 -19375 -19381 -18547 -16476 -13851 -11358 -8805 -6000 -3513 -1885 -992 -776 -1728 -4098 -7496 -11638 -16487
30677 -16487 -21230 -24383 -25523 -25856 -26540 -27543 -28672 -30399 -32811 -34906 -35854 -36022 -36000 -35578 -34477 -33162
$$ packed form
30791e0783q11r19j078p61l14j92R5J002J825J773J268R97O70p5n31r8M02o7j132
30772d8729j832k126k288j833m81P56Q69L62K30L19Q6%O89J501J426O97J60j46
30754e0340m83l72N46J477J590J391J682K059J831J425J494J526Q66J65L11Q15
30738c4017P63M76P07J025O11j60n15q35j826k895k994k389k053k015j818j866
30722d9801k697l642l777l532l735l763k321N18L658O628R322J0819J0304Q632
30708b3387P328O440M984K965J292J22j059k137k652k914l374l431k380r31k41
30693a9375oQ34K071K625K493K553K805K487J628Q93K16r52k370l398m142m849
30677a6487m743l153j140l33o84j003j129j727k412k095r48j68K2M22J101J315
$$ plain form
30661 -33162 -32097 -31066 -29980 -29467 -29947 -30894 -31708 -32453 -33153 -33288 -32669 -31895 -31262 -30125 -28029 -25561 -23459
30644 -23459 -21795 -20698 -20844 -22454 -24725 -26988 -29604 -33088 -37409 -42786 -49903 -58302 -65615 -69545 -69992
30629 -69992 -68385 -65769 -62483 -58864 -55172 -51332 -47604 -44924 -43886 -43964 -44375 -44979 -45746 -46187 -46073 -45921
30613 -45921 -46059 -45989 -45426 -45068 -45529 -46278 -46494 -46207 -45817 -45237 -44312 -43414 -42817 -42191 -41410 -41109 -41675 -42506 -42994
30594 -42994 -43470 -44354 -45165 -45188 -44410 -43080 -41166 -39042 -37860 -38263 -39429 -40187 -40388 -40421 -40207 -39578 -38865 -38213
30576 -38213 -37017 -34931 -32724 -31255 -30292 -29197 -28009 -26908 -25347 -22707 -19252 -15583 -11750 -7749 -4228
30561 -4228 -1805 -265 768 1019 171 -1529 -4141 -8671 -15799 -24541 -33025 -40008 -44858 -46984 -46369
30546 -46369 -44023 -40886 -36867 -31880 -27017 -23620 -21808 -20991 -21187 -22700 -25012 -27194 -29035 -30787 -32216
$$ packed form
30661c3162J065J031J086N13m80r47q14p45p00j35O19P74O33J137K096K468K102
30644b3459J664J097j46j610k271k263k616l484m321n377p117q399p313l930m47
30629f9992J607K616L286L619L692L840L728K680J038p8m11o04p67m41J14J52
30613d5921j38P0N63L58m61p49k16K87L90N80R25Q98N97O26P81L01n66q31m88
30594d2994m76q84q11k3P78J330J914K124J182m03j166p58k01l3K14O29P13O52
30576c8213J196K086K207J469R63J095J188J101J561K640L455L669L833M001L521
30561d228K423J540J033K51q48j700k612m530p128q742q484o983m850k126O15
30546d6369K346L137M019M987M863L397J812Q17j96j513k312k182j841j752j429
$$ plain form
30531 -32216 -32928 -33207 -33574 -33878 -33717 -33298 -33039 -32773 -32216 -31714 -31630 -31572 -31139 -30886 -31580 -32988 -34372 -35698 -37392
30512 -37392 -39335 -41024 -42289 -42990 -42530 -40598 -37909 -35309 -32684 -29663 -26748 -24751 -23576 -22641 -22032
30497 -22032 -22227 -23159 -24530 -26557 -29345 -31986 -33385 -33650 -33701 -33876 -33889 -33712 -33466 -32864 -31780 -30998 -31356 -32469
30479 -32469 -33243 -33276 -32839 -31993 -30814 -30025 -30220 -30696 -30129 -28154 -25314 -21876 -17788 -13567 -10079 -7603 -5989
30462 -5989 -5486 -6400 -8224 -10102 -11945 -14226 -16977 -20014 -23871 -29552 -37592 -48270 -62478 -81301
30448 -81301 -104790 -131714 -160004 -186510 -206912 -217292 -216008 -203667 -181871 -152982 -120362 -87350
30436 -87350 -55885 -26860 -1332 19676 36215 49075 58661 65146 69314 72022 72997 71241 66393
30423 66393 58677 47811 33163 14860 -6207 -29081 -52230 -72644 -86944 -93693 -93880 -89363 -81868
$$ packed form
30531c2216p12k79l67l04J61M19K59K66N57N02Q4N8M33K53o94j408j384j326j694
30512c7392j943j689j265p01M60J932K689K600K625L021K915J997J175R35O09
30497b2032j95r32j371k027k788k641j399k65n1j75j3J77K46O02J084P82l58j113
30479c2469p74l3M37Q46J179P89j95m76N67J975K840L438M088M221L488K476J614
30462e989N03r14j824j878j843k281k751l037l857n681q040j0678j4208j8823
30448h1301k3489k6924k8290k6506k0402j0380J284J2341K1796K8889L2620L3012
30436h7350L1465K9025K5528K1008J6539J2860R586O485M168K708R75j756m848
30423F6393p716j0866j4648j8303k1067k2874k3149k0414j4300o749j87M517P495
$$ plain form
30410 -81868 -73136 -64595 -56549 -48583 -40792 -33855 -28095 -23420 -20010 -18068 -17012 -15877 -14391 -12788
30396 -12788 -10861 -8243 -5420 -3394 -2435 -2127 -2435 -3678 -5655 -7866 -10365 -13352 -16134 -17661 -17936
30381 -17936 -17784 -17459 -16675 -15805 -15668 -16082 -15946 -14899 -13725 -13025 -12606 -12296 -12192 -11916 -10758 -8845 -7243
30364 -7243 -6649 -6832 -7409 -8247 -8977 -9076 -8617 -8150 -7760 -7011 -5734 -4057 -1778 1381 4945 8063 10625
$$ packed form
30410h1868Q732Q541Q046P966P791O937N760M675L410J942J056J135J486J603
30396a2788J927K618K823K026R59L08l08j243j977k211k499k987k782j527k75
30381a7936J52L25P84Q70J37m14J36J047J174P00M19L10J04K76J158J913J602
30364g243N94j83n77q38p30r9M59M67L90P49J277J677K279L159L564L118K562
$$ [...]
##END NTUPLES=NMR SPECTRUM
##END=
