##TITLE=31Pdec_DE2_k
 CDCl3, 24 sc
 4.7.2023
##JCAMPDX= 6.0         $$ Bruker NMR JCAMP-DX V2.0
##DATA TYPE= NMR SPECTRUM
##DATA CLASS= NTUPLES
##ORIGIN= UXNMR, Bruker Analytische Messtechnik GmbH
##OWNER= root
$$ XWIN-NMR		Version 3.5
$$ Tue Jul  4 16:26:54 2023 Russian Standard Time (UT+4h)  she@DPX200
##.OBSERVE FREQUENCY= 81.013821
##.OBSERVE NUCLEUS= ^31P
##.ACQUISITION MODE= SIMULTANEOUS
##.ACQUISITION SCHEME= undefined
##.AVERAGES= 24
##.DIGITISER RES= 16
##SPECTROMETER/DATA SYSTEM= spect
##.PULSE SEQUENCE= zgpg30
##.SOLVENT NAME= CDCl3
##.SHIFT REFERENCE= (INTERNAL, CDCl3, 0, 248.564)
##AUDIT TRAIL= $$ (NUMBER, WHEN, WHO, WHERE, WHAT)
$$ ##TITLE= Audit trail, XWIN-NMR		Version 3.5
$$ ##JCAMPDX= 5.01
$$ ##ORIGIN= Bruker BioSpin GmbH
$$ ##OWNER= she
$$ F:/spectra/data/she/nmr/P31/1/pdata/1/auditp.txt
$$ ##AUDIT TRAIL=  $$ (NUMBER, WHEN, WHO, WHERE, WHAT)
(   1,<2023-07-04 16:25:28.45 +0400>,<she>,<DPX200>,
      <created by zg, POWCHK disabled, PULCHK disabled
       configuration hash MD5:
       00 E9 B6 7A A2 85 ED C7 34 08 36 98 17 FE 4E 26
       data hash MD5: 32K
       3B 43 63 AD 7D 1B CA 18 A5 40 2A 32 20 E0 82 42>)
(   2,<2023-07-04 16:26:02.68 +0400>,<she>,<DPX200>,
      <Start of raw data processing
       efp BC_mod = 2 LB = 1 FT_mod = 6 PKNL = 1 PHC0 = -10850.01 PHC1 = 439.4848 SI = 64K 
       data hash MD5: 64K
       AA 34 FD 6D 67 43 79 85 27 57 83 E1 AB 34 2D 9E>)
(   3,<2023-07-04 16:26:18.21 +0400>,<she>,<DPX200>,
      <pk PHC0 = 11.7923 PHC1 = 0 
       data hash MD5: 64K
       C0 A6 1B 1C 8B 0F 41 07 46 B4 BA EC 37 53 F8 C1>)
(   4,<2023-07-04 16:26:26.79 +0400>,<she>,<DPX200>,
      <abs ABSG = 5 
       data hash MD5: 64K
       B0 38 FC 24 00 46 C8 E6 0E 63 A3 4B F9 51 4E 75>)
$$ ##END=
$$ 
$$ hash MD5
$$ 28 19 B4 78 56 33 08 BE CA FA 98 A0 A0 FF 59 39
##$RELAX= 
##$RELAX= 
##$RELAX= 
##$RELAX= 
##$RELAX= 
##$RELAX= 
##$RELAX= 
##$RELAX= 
##$RELAX= 
$$ Bruker specific parameters
$$ --------------------------
##$DU= <F:/spectra>
##$EXPNO= 1
##$NAME= <P31>
##$PROCNO= 1
##$TYPE= <nmr>
##$USER= <she>
##$AMP= (0..31)
100 100 100 100 100 100 100 100 100 100 100 100 100 100 100 100 100 100 
100 100 100 100 100 100 100 100 100 100 100 100 100 100 
##$AQSEQ= 0
##$AQ_mod= 1
##$AUNM= <au_zg>
##$AUTOPOS= <>
##$BF1= 81.014009
##$BF2= 200.13
##$BF3= 200.13
##$BF4= 200.13
##$BF5= 200.13
##$BF6= 200.13
##$BF7= 200.13
##$BF8= 200.13
##$BYTORDA= 1
##$CFDGTYP= 0
##$CFRGTYP= 5
##$CHEMSTR= <none>
##$CNST= (0..31)
1 1 145 1 1 1 1 1 1 1 1 1 1 1 1 1 1 1 1 1 1 1 1 1 1 1 1 1 1 1 1 1 
##$CPDPRG= <waltz16>
##$CPDPRG1= <>
##$CPDPRG2= <waltz16>
##$CPDPRG3= <>
##$CPDPRG4= <mlev>
##$CPDPRG5= <mlev>
##$CPDPRG6= <mlev>
##$CPDPRG7= <mlev>
##$CPDPRG8= <mlev>
##$CPDPRGB= <>
##$CPDPRGT= <>
##$D= (0..31)
0 1 0 0 0 0 0 0 0 0 0 0.03 2e-05 3e-06 0 0 0 0 0 0 0 0 0 0 0 0 0 0 0 0 
0 0 
##$DATE= 1688473527
##$DBL= (0..7)
120 120 120 11 120 120 24 19 
##$DBP= (0..7)
150 150 150 150 150 150 150 150 
##$DBP07= 0
##$DBPNAM0= <>
##$DBPNAM1= <>
##$DBPNAM2= <>
$$ [...]
##$SUBNAM3= <"">
##$SUBNAM4= <"">
##$SUBNAM5= <"">
##$SUBNAM6= <"">
##$SUBNAM7= <"">
##$SUBNAM8= <"">
##$SUBNAM9= <"">
##$SW= 501.771253377433
##$SWIBOX= (0..15)
0 1 3 0 0 0 0 0 0 0 0 0 0 0 0 0 
##$SW_h= 40650.406504065
##$TD= 32768
##$TD0= 1
##$TE= 0
##$TE2= 300
##$TE3= 300
##$TEG= 300
##$TL= (0..7)
0 120 53 12 22 120 120 120 
##$TP= (0..7)
150 150 150 150 150 150 150 150 
##$TP07= 0
##$TPNAME0= <>
##$TPNAME1= <>
##$TPNAME2= <>
##$TPNAME3= <>
##$TPNAME4= <>
##$TPNAME5= <>
##$TPNAME6= <>
##$TPNAME7= <>
##$TPOAL= (0..7)
0.5 0.5 0.5 0.5 0.5 0.5 0.5 0.5 
##$TPOFFS= (0..7)
0 0 0 0 0 0 0 0 
##$TUNHIN= 0
##$TUNHOUT= 0
##$TUNXOUT= 0
##$USERA1= <user>
##$USERA2= <user>
##$USERA3= <user>
##$USERA4= <user>
##$USERA5= <user>
##$V9= 5
##$VALIST= <valist>
##$VCLIST= <CCCCCCCCCCCCCCC>
##$VD= 0
##$VDLIST= <DDDDDDDDDDDDDDD>
##$VPLIST= <PPPPPPPPPPPPPPP>
##$VTLIST= <TTTTTTTTTTTTTTT>
##$WBST= 1024
##$WBSW= 4
##$XGAIN= (0..3)
0 0 0 0 
##$XL= 0
##$YL= 0
##$YMAX_a= 4695
##$YMIN_a= -4219
##$ZGOPTNS= <>
##$ZL1= 120
##$ZL2= 120
##$ZL3= 120
##$ZL4= 120
##$ABSF1= 248.5645
##$ABSF2= -253.2056
##$ABSG= 5
##$ABSL= 3
##$ALPHA= 0
##$AQORDER= 0
##$ASSFAC= 0
##$ASSFACI= 0
##$ASSFACX= 0
##$ASSWID= 0
##$AUNMP= <proc_1d>
##$AZFE= 0.1
##$AZFW= 0.5
##$BCFW= 0
##$BC_mod= 2
##$BYTORDP= 0
##$COROFFS= 0
##$CY= -3
##$DATMOD= 1
##$DC= 0
##$DFILT= <>
##$DTYPP= 0
##$F1P= 0
##$F2P= 0
##$FCOR= 1
##$FTSIZE= 65536
##$FT_mod= 6
##$GAMMA= 0
##$GB= 0
##$INTBC= 1
##$INTSCL= 6.047779e-11
##$ISEN= 30
##$LB= 1
##$LEV0= 0
##$LPBIN= 0
##$MAXI= 10000
##$MC2= 0
##$MEAN= 0
##$ME_mod= 0
##$MI= 50
##$NCOEF= 0
##$NC_proc= -6
##$NLEV= 6
##$NOISF1= 182.463
##$NOISF2= 159.3651
##$NSP= 0
##$NTH_PI= 0
##$NZP= 0
##$OFFSET= 248.5645
##$PC= 4
##$PHC0= -10838.22
##$PHC1= 439.4848
##$PH_mod= 1
##$PKNL= yes
##$PPARMOD= 0
##$PSCAL= 0
##$PSIGN= 0
##$REVERSE= no
##$SF= 81.0140089999694
##$SI= 65536
##$SIGF1= 159.3651
##$SIGF2= -187.1042
##$SINO= 113.3802
##$SIOLD= 16384
##$SREGLST= <1H.CDCl3>
##$SSB= 0
##$STSI= 65536
##$STSR= 0
##$SW_p= 40650.406504065
##$SYMM= 0
##$S_DEV= 0
##$TDeff= 32768
##$TDoff= 0
##$TI= <>
##$TILT= no
##$TM1= 0
##$TM2= 0
##$TOPLEV= 0
##$USERP1= <user>
##$USERP2= <user>
##$USERP3= <user>
##$USERP4= <user>
##$USERP5= <user>
##$WDW= 1
##$XDIM= 65536
##$YMAX_p= 451871312
##$YMIN_p= -237785195
$$ End of Bruker specific parameters
$$ ---------------------------------
##NTUPLES= NMR SPECTRUM
##VAR_NAME=  FREQUENCY,     SPECTRUM/REAL,   SPECTRUM/IMAG
##SYMBOL=    X,             R,               I
##VAR_TYPE=  INDEPENDENT,   DEPENDENT,       DEPENDENT
##VAR_FORM=  AFFN,          ASDF,            ASDF
##VAR_DIM=   65536,         65536,           65536
##UNITS=     HZ,            ARBITRARY UNITS, ARBITRARY UNITS
##FACTOR=    0.620285442955139, 1,           1
##FIRST=     20137.2065510682, 0,            0
##LAST=      -20513.1999529968, 0,           0
##MIN=       -20513.1999529968, -237785195,  0
##MAX=       20137.2065510682, 451871312,    0
$$ Real data points
##PAGE= N=1
##DATA TABLE= (X++(R..R)), XYDATA
$$ [...]
13251I64033j257354l78698M9964m21940o25172j6688N14545M21849K99086M10303
13241d0072J13764n96377o06982M05384J087036M35880o28929q13207l15187K6898
13231i31792K55896O24692N03514m85568j121908r8697J676500K046565O24956
13222C094158q12715r39094l13106l013j64436l90492m03485m5264N71302P67918
13212A361773M6980q56700p30087K43744N78919k82217j107520p91355N5145K62189
13202a219129q9672n7024N12957P73275K32798m86690m78732K51174P31345K15765
13192C86067p58648r21305K1234Q55642N23044l78167o24152l01963m43531j021012
13182b662791q41379L87137J374038J146145L28219j26502k80517m89906m42247
$$ plain form
13251 964033 -293321 -672019 -622055 -1043995 -1669167 -1685855 -1171310 -749461 -450375 -40072
13241 -40072 73692 -522685 -1129667 -724283 362753 798633 169704 -643503 -958690 -931792
13231 -931792 -675896 -51204 452310 -33258 -1155166 -1253863 422637 2469202 3094158
13222 3094158 2281443 1342349 1029243 1026230 861794 471302 67817 22553 593855 1361773
13212 1361773 1408753 552053 -178034 65710 644629 362412 -745108 -1536463 -1481318 -1219129
13202 -1219129 -1308801 -1365825 -852868 -79593 153205 -333485 -812217 -561043 170302 386067
13192 386067 -372581 -1293886 -1272652 -417010 106034 -272133 -896285 -1198248 -1641779 -2662791
13182 -2662791 -3504170 -3117033 -1742995 -596850 -268631 -395133 -675650 -1165556 -1607803
13173a607803J22610O27753N57073L38359L96208J85938p17528j379701p06648
13164b183739O83259J215336O31502O2947M1187k7575l73397m20064j37829l20999
13154h29372r72714q93304K84691J052181K33440r11802m00789J333701J847798
13145G43830K04197j640676j520207K25585J591955J510943N65949l26522q26577
13136E28477q82569n01267j1541Q3273k47629m92767l16651M1726J90114K7518
13126a581316k96695m90463k06498M94780Q47751K49460n90204l39112Q97179
13117a015118J400423L33680q74574p37041p9660n28606j502514r47843J087258
13108b863995K053286P24248q39853m87226P63190N79444q53241j199943K56660
$$ plain form
13173 -1607803 -1485193 -857440 -300367 37992 434200 620138 -97390 -1477091 -2183739
13164 -2183739 -1500480 -285144 346358 409305 450492 422917 49520 -370544 -508373 -829372
13154 -829372 -1802086 -2695390 -2410699 -1358518 -1125078 -2036880 -2437669 -1103968 743830
13145 743830 948027 -692649 -2212856 -1987271 -395316 1115627 1681576 1355054 528477
13136 528477 -354092 -855359 -866900 -783627 -1031256 -1524023 -1840674 -1798948 -1608834 -1581316
13126 -1581316 -1878011 -2368474 -2574972 -2080192 -1232441 -982981 -1573185 -1912297 -1015118
13117 -1015118 385305 718985 -155589 -892630 -972290 -1500896 -3003410 -3951253 -2863995
13108 -2863995 -810709 -86461 -926314 -1413540 -650350 -70906 -924147 -2124090 -1867430
13099a867430J538481J043106k39060n13035J97180M62667k36044q67442m39473
13090i21050O79911J294928P79715l37261j037180q58267k25074J85326J89276
13081b49676P3140M5928N5542P4238J60420J66586k10378q71777j143322n19292
13071b418591N58112J036523M33480n69844q64572j29937Q39904J004924J52457
13062D2456r26675j245469n64740L98685O87251J03463n56700m64598J45449L11817
13052b069061j48745k16214P18334J558193Q88269p37553j285465j13594J114093
13043b91743R43806J35832J12197O00058L06200p73870j350279r02038k29619
13034a449456Q0711L32861O50020N58948L6615k12948K7203J17170j44710o5312
$$ plain form
13099 -1867430 -328949 714157 475097 -37938 159242 621909 385865 -481577 -921050
13090 -921050 -241139 1053789 1833504 1496243 459063 -399204 -624278 -438952 -249676
13081 -249676 -176536 -130608 -75066 -828 159592 326178 115800 -755977 -1899299 -2418591
13071 -2418591 -1860479 -823956 -390476 -960320 -1824892 -1954829 -1114925 -110001 42456
13062 42456 -884219 -2129688 -2694428 -2295743 -1608492 -1505029 -2061729 -2526327 -2380878 -2069061
13052 -2069061 -2217806 -2434020 -1715686 -157493 730776 -6777 -1292242 -1405836 -291743
13043 -291743 652063 787895 900092 1500150 1806350 1032480 -317799 -1219837 -1449456
13034 -1449456 -1368745 -1035884 -385864 173084 209699 -3249 23954 141124 -3586 -68898
13024f8898N07520N79452k89757r24036l26377N66781L44390n59303o61251N0137
13014g81342K33382l70316n29555K02822O16232q5839q65250m54599P45086J372925
13004H3546R13124q8371r39095j135054m20483O84163R96975J16266q21396o52936
12994a263261J55886L76775j3414j2876N13693N40838l43214j147255r49756j36581
12984b279165M48728P32844J016853J004426J89250j029160j519200q17947K82151
12975a971220P65510N32149K02415J44533J47123l8024k71438k86883q4356J55289
12965g04902L56245N06799M81907J92146j80091l76365m04482l87711k22931J82601
12955e56784M63356J67285m31842n56277p9787K48581p651l04243p4754L35210
$$ plain form
13024 -68898 438622 1018074 728317 -195719 -522096 44685 389075 -170228 -831479 -781342
13014 -781342 -547960 -918276 -1447831 -1245009 -628777 -714616 -1579866 -2034465 -1289379 83546
13004 83546 996670 908299 -30796 -1165850 -1586333 -902170 94805 211071 -610325 -1263261
12994 -1263261 -1107375 -730600 -744014 -756890 -243197 297641 -45573 -1192828 -2142584 -2279165
12984 -2279165 -1830437 -1097593 -80740 923686 1112936 83776 -1435424 -2253371 -1971220
12975 -1971220 -1205710 -673561 -471146 -326613 -179490 -217514 -488952 -775835 -860191 -704902
12965 -704902 -348657 158142 640049 832195 652104 275739 -128743 -516454 -739385 -556784
12955 -556784 -93428 73857 -357985 -914262 -994049 -745468 -753119 -1057362 -1132116 -796906
12945g96906L03906l1399n0725L84970Q30501Q43657K48853p96782j602228j358096
12935b024249k65706L84102q5254o57361j26163J004528J288677N35509q8784
12926c4701K5346K61818J06883j14218j22152k11976m94573n24719j06962L01860
12916i13394L72569L64924M43451K42037m26799j005270q45814q2011N67592O69611
12906f13104M60650M05298M99667K06400o39949j117697k52715J194745J258203
12897A401498l83445j580295q21949M13801J48014p45616j21991J518054J675737
12888A503808J02570p82385o9366K61125q73857j585759l79625J117917R06166
12879B00594j43499j58650M01956j25200j373106j446053m0247J233683J355011
$$ plain form
12945 -796906 -493000 -524399 -575124 -190154 640347 1484004 1732857 936075 -666153 -2024249
12935 -2024249 -2289955 -1905853 -1991107 -2648468 -2774631 -1770103 -481426 54083 -34701
12926 -34701 -9355 252463 359346 245128 122976 -89000 -583573 -1108292 -1215254 -913394
12916 -913394 -540825 -175901 267550 509587 82788 -922482 -1768296 -1850307 -1282715 -613104
12906 -613104 -152454 252844 752511 958911 318962 -798735 -1051450 143295 1401498
12897 1401498 1018053 -562242 -1384191 -970390 -822376 -1567992 -1689983 -171929 1503808
12888 1503808 1606378 823993 754627 1015752 141895 -1443864 -1823489 -705572 200594
12879 200594 57095 -101555 300401 175201 -1197905 -2643958 -2684205 -1450522 -95511
12870i5511P91274J21966n17906p90938m65329j76504n54265r46671l73395O80422
12860b326857R10631K81600q6128J05272M3055n29193q47459m94204K6488K67451
12850b649344L51182M07775M09746N38888Q72920Q87148J57897o93633p07561
12841d24982K8586O30320P12761M73843q9949r63383j503827j176418n13870k47646
12831c074565j8685P71242J424267Q61412l10358m09308O98173J294623L41994
12822A578795j187100j832778j252714m7004R25899R28102M6925n30112M9497
12813a320490R05646O92992j88565k67274M34655M42796n26957r88877j66289
12804i82363Q27705R26532N46429L64996K00375j20965j81560m549l12478j029500
$$ plain form
12870 -95511 695763 817729 299823 -491115 -956444 -1132948 -1687213 -2633884 -3007279 -2326857
12860 -2326857 -1416226 -1134626 -1220754 -1115482 -1072427 -1601620 -2449079 -2943283 -2916795 -2649344
12850 -2649344 -2298162 -1890387 -1480641 -941753 -68833 818315 976212 282579 -424982
12841 -424982 -396396 233924 946685 1420528 1330579 367196 -1136631 -2313049 -2826919 -3074565
12831 -3074565 -3093250 -2322008 -897741 -36329 -346687 -755995 -57822 1236801 1578795
12822 1578795 391695 -1441083 -2693797 -2740801 -1814902 -886800 -839875 -1369987 -1320490
12813 -1320490 -414844 278148 89583 -177691 256964 699760 172803 -816074 -982363
12804 -982363 -154658 771874 1318303 1683299 1883674 1762709 1581149 1576600 1264122 234622
12794B34622r40588K95381J190847N41331p45949j099681n05880m8800r0393j96063
12784a365173k75551n32341o03556Q7914J176001J497007N70411o88290j001679
12775a135257j78391P41061P77749J82150p2269J74044O5358o45182q37195K49869
12765f78063J482321J289244l6076r30859r40109q84619r67994n01657M34640
12756a733172P68616J80266l97391l45706j05117q5764q8795k3816k8644J65768
12746a693755P79507J069095K92880o86456m67723M90205N34761k87386l26296
12737b95168N99580P91899k10274p36697k2143M59753j87073o30936J42029R53903
12727H64873O30886q8021l85682r24115j866012j580265O08193K412895J658059
$$ plain form
12794 234622 -705966 -410585 780262 1321593 575644 -524037 -1029917 -1078717 -1169110 -1365173
12784 -1365173 -1640724 -2173065 -2776621 -2688707 -1512706 -15699 554712 -133578 -1135257
12775 -1135257 -1313648 -572587 205162 387312 315043 489087 554445 -90737 -927932 -678063
12765 -678063 804258 2093502 2057426 1126567 186458 -698161 -1666155 -2167812 -1733172
12756 -1733172 -964556 -784290 -1181681 -1527387 -1632504 -1718268 -1807063 -1830879 -1859523 -1693755
12746 -1693755 -914248 154847 447727 -238729 -706452 -216247 318514 31128 -295168
12737 -295168 304412 1096311 886037 149340 127197 586950 399877 -231059 -89030 864873
12727 864873 1495759 1407738 1022056 97941 -1768071 -3348336 -2740143 -327248 1330811
12718A330811l70131j051421l73971j74193o79471n52287L29174P00332K02367
12709f38790l13355n23962q10263r84238n30199K03961N30779O41648R30040Q55305
12699f39074k3657p55003l71907L52193K69192l8407M98371J100811L61674j004647
12689b50454j141432k34650q5669p82263n67089Q39628J527946N83997m87424
12680e97410l76405J57011K2518m31509m55610j96167J8074L89880Q21447O00969
12670d7202k83106o83562L0853Q92366P55629j04373o39119n29465k40017r7269
12660i45265k2399R5086K28674K83178J68160m3669j09362m279p1692m44511o69004
12649a535083l41829K56579N92144M95459K3366o26078p73320J43316J229440
$$ plain form
12718 1330811 960680 -90741 -464712 -638905 -1318376 -1870663 -1541489 -841157 -638790
12709 -638790 -952145 -1476107 -2286370 -3270608 -3800807 -3596846 -3066067 -2424419 -1494379 -639074
12699 -639074 -662731 -1417734 -1789641 -1437448 -1168256 -1206663 -708292 392519 754193 -250454
12689 -250454 -1391886 -1626536 -1712205 -2494468 -3061557 -2221929 -693983 -109986 -597410
12680 -597410 -973815 -816804 -794286 -1225795 -1681405 -1877572 -1859498 -1469618 -648171 -47202
12670 -47202 -330308 -1013870 -983017 -90651 664978 560605 -78514 -607979 -847996 -945265
12660 -945265 -967664 -872578 -643904 -360726 -192566 -236235 -345597 -349876 -421568 -866079 -1535083
12649 -1535083 -1876912 -1620333 -1028189 -532730 -509364 -1135442 -1908762 -1765446 -536006
12640e36006Q21472p95252j174019N53392J780118K72623k010318j709116P52084
12631b045022K025731J093748J54690L74383L13950p64243j294430l06419Q00589
12622C52977P32124K36726K56626K46681l17413o52961k18993J55635j12383k92194
12612C86825J9741k2873o40317n29643P80889J566785N38021q77754p03939N98737
12602A116472J193794O71271p3528o70090j138252q94759K79022J132927N85752
12593B202609l61467j36582Q16793R00366R1597k73726K4344m1862o24059q13430
12583A784583n63661q10592j520972j519368n56287K32597K87204K97043M94967
12574a874486R5262r03223j139180o7351Q96578N65577j28404J90761J012416
$$ plain form
12640 -536006 285466 -509786 -1683805 -1130413 649705 922328 -1087990 -2797106 -2045022
12631 -2045022 -19291 1074457 1229147 1603530 1917480 1153237 -141193 -447612 352977
12622 352977 1085101 1321827 1578453 1825134 1507721 854760 635767 791402 679019 386825
12612 386825 406566 383693 -256624 -786267 -5378 1561407 2099428 1221674 517735 1116472
12602 1116472 2310266 2981537 2908009 2237919 1099667 204908 483930 1616857 2202609
12593 2202609 1841142 1704560 2521353 3421719 3513316 3239590 3263934 3222072 2598013 1784583
12583 1784583 1220922 410330 -1110642 -2630010 -3186297 -2953700 -2666496 -2369453 -1874486
12574 -1874486 -1779224 -2682447 -3821627 -3888978 -2992400 -2426823 -2555227 -2364466 -1352050
12565a352050R22117N9250j90407M30756P17692O9451o53529o61058l12915j70515
12555a141208q3661J49793J71341j38447p2536P69948J406468O41868j000355
12546G03211j688712o73661P57007R71262j83751j545605j897189p92162J122784
12537c226816K287192J526083m18110j471968p99836J97156J02456m69816k03784
12528b477443N69309M84759m38992p85739q4485N33046L01605r5840M1909K69159
12518a682712Q923l23322l7922P06808J183899R92452K77505m09861l23828O47838
12508A039780J311188L94924j380703j826037l36976J090012P46749m18532o15911
12499D494k4930m3661o64939n94273L72305R80046N87068j2180q4724Q6343M5397
$$ plain form
12565 -1352050 -429933 -370683 -561090 -130334 587358 656809 3280 -657778 -970693 -1141208
12555 -1141208 -1224869 -1075076 -903735 -1042182 -1114718 -344770 1061698 1703566 703211
12546 703211 -985501 -1659162 -902155 69107 -114644 -1660249 -3557438 -4349600 -3226816
12537 -3226816 -939624 586459 168349 -1303619 -2103455 -1906299 -1803843 -2273659 -2477443
12528 -2477443 -1908134 -1423375 -1862367 -2648106 -2732591 -2199545 -1897940 -1993780 -1951871 -1682712
12518 -1682712 -1673789 -1997111 -2035033 -1328225 -144326 848126 1125631 715770 391942 1039780
12508 1039780 2350968 2745892 1365189 -460848 -797824 292188 1038937 620405 4494
12499 4494 -20436 -64097 -729036 -1323309 -951004 29042 616110 603930 519206 605549 650946
12488F50946k07791o60185j248864j286392j84941J132412J039227k66359p34181
12479a766128L96076J258456L19029j092627r38412K56078M63001m04707n59827
12470b069061M22820R36761K49760k66340L47090R65131M49194l63358k32646
12461D39351L17330O0104p47549r36483m35578p3346L8077L04226L62653k93261
12451i64476q25687m1410J365904J536776L88479k62267K32496M02890n30615
12442A302090j123177k02405R90283P15563o13747j291334p92129Q4718P21115
12433b09023R78181O74347m3578m37562k57984k80707q46646r53932L1045R44225
12423d01634N73760k86798k67144J20866m84080j529649j143027P28135K018784
$$ plain form
12488 650946 443155 -217030 -1465894 -2752286 -2937227 -1804815 -765588 -1031947 -1766128
12479 -1766128 -1370052 -111596 207433 -885194 -1823606 -1567528 -1104527 -1509234 -2069061
12470 -2069061 -1646241 -709480 -459720 -726060 -378970 586161 1035355 671997 439351
12461 439351 756681 816785 69236 -867247 -1302825 -1376171 -1338094 -1033868 -671215 -964476
12451 -964476 -1790163 -1831573 -465669 1071107 1459586 1197319 1429815 1832705 1302090
12442 1302090 178913 -23492 966791 1682354 1068607 -222727 -1014856 -930138 -209023
12433 -209023 769158 1443505 1399927 962365 704381 423674 -422972 -1376904 -1345859 -401634
12423 -401634 172126 -114672 -381816 -260950 -745030 -2274679 -3417706 -2689571 -670787
12414f70787J567797M26583j87028l64429m27044r5361N64316P81681L38579k6211
12404A908096K4040j10272o61146r41175o57655m94207p25174n44363L87608R57162
12394h57086K44088q23725o88660N90791J506112J186127K41674m05695o14457
12385C79169p40235q96592q83344o27208l42040j43080K65150J125591J893056
12376C0467J596681K28459r14831q44626j86815r9575n07289m72559R8568L75295
12366f96225J11311k681L49559N36101N1362o68319q60808l19080N18247R47992
12356c2541N48725k52484m74176Q9771M22496j38901o77945j45095P50036N73295
12346F63181m62322q63758l07720P9262j59862k52762P1918J09828k23206r6041
$$ plain form
12414 -670787 897010 1323593 1136565 772136 345092 249731 814047 1595728 1934307 1908096
12404 1908096 1932136 1821864 1160718 219543 -438112 -932319 -1657493 -2201856 -1814248 -857086
12394 -857086 -612998 -1436723 -2125383 -1534592 -28480 1157647 1399321 993626 379169
12385 379169 -361066 -1257658 -2141002 -2768210 -3110250 -3253330 -2988180 -1862589 30467
12376 30467 1627148 1855607 940776 96150 -90665 -190240 -697529 -1170088 -1071520 -696225
12366 -696225 -584914 -587595 -238036 298065 349427 -318892 -1179700 -1498780 -980533 -32541
12356 -32541 516184 263700 -210476 -120705 301791 162890 -515055 -660150 89886 663181
12346 663181 200859 -662899 -970619 -891357 -1051219 -1303981 -1232063 -1122235 -1345441 -1441482
12336a441482M79429L72660n84910j026809l20037L76935K71715L35926J260531
12327b76042J727250M48749j351524j444384J60148J343472R37056n7553l61227
12318A125945o8828J0997l18446n24839j32067O88504J199972Q10516k04195r19451
12308A668108q26771l35415m8907q28Q4784K04303J76272O9533J24754L53438
12298A469271M98922L75336Q2763j56136l14615n57575q05315o17411M0818K99529
12288C15587m38773j096207j24059J794853K105552J29531j575608r16685O78008
12279H72199Q01253j72826l40302K02103j3480o49692j36516J082805J016308
12270B661852l38830j026898o73140p62392j258114m77455J157128J029479r76553
$$ plain form
12336 -1441482 -962053 -589393 -1174303 -2201112 -2521149 -2144214 -1872499 -1536573 -276042
12327 -276042 1451208 1899957 548433 -895951 -735803 607669 1544725 1487172 1125945
12318 1125945 1057117 1068114 749668 224829 92762 781266 1981238 2791754 2587559 1668108
12308 1668108 841337 505922 457015 456187 540971 745274 921546 991079 1115833 1469271
12298 1469271 1968193 2343529 2426292 2270156 1955541 1397966 592651 -24760 16058 315587
12288 315587 -123186 -1219393 -1343452 451401 2556953 2686484 1110876 194191 872199
12279 872199 1673452 1500626 1160324 1362427 1348947 699255 562739 1645544 2661852
12270 2661852 2323022 1296124 622984 -139408 -1397522 -1874977 -717849 311630 -664923
12261f64923j602168L44666J635302Q5091j456025J17104K634982J999041j157848
12252A935222k553708q67483R94506R93634L69006M06424K39066q75860j693581
12243a052774r56049M83546R49510K74409l59401k50665J55714K04144p9941j66986
12233g98493J68471M85849K85166k38352m58732j97342J99679N06001O80768N18349
12223A151364M9000m0734N68965Q36744k02421j464575j144483K63376N50743
12214E67979n49518r14737K36691R64726M6463r36153n08686K19263j13641n97875
12204a585488k0964O52375J03573p46579l68030O14131O82533J58983K55383N63531
12194C09448P48p11070j05949J165296J097394m02519j372992p71757M85893J319027
$$ plain form
12261 -664923 -2267091 -1922425 -287123 -202032 -1658057 -1540953 1094029 3093070 1935222
12252 1935222 -618486 -1485969 -491463 502171 871177 1277601 1516667 640807 -1052774
12243 -1052774 -2008823 -1525277 -575767 -301358 -660759 -911424 -755710 -551566 -631507 -798493
12233 -798493 -630022 -144173 140993 -97359 -556091 -753433 -553754 -47753 633015 1151364
12223 1151364 1200364 1159630 1728595 2565339 2362918 898343 -246140 17236 567979
12214 567979 18461 -896276 -659585 305141 351604 -584549 -1093235 -873972 -987613 -1585488
12204 -1585488 -1606452 -954077 -850504 -1597083 -1965113 -1350982 -668449 -509466 -254083 309448
12194 309448 310196 -400874 -506823 658473 1755867 1353348 -19644 -791401 -305508 1013519
12184A013519J424583O38476q15861j637496p64044P99625J120371P7908o66954
12175A190127k40430N14025N84820j17693j093046j544443p40257Q54801J515360
12166I23264M89916o63556l75933M53218Q7074j015949j010372K03974R63980
12157E5616O16371J34726R9041N2532j50629j33812q8207m90265r21819o79156
12147a505602j83029k29642l73728K29936R66948O46342k86363m25803J67406
12138i93535L07604L4174L89018J108760Q49252l32842r64757o81161n84167r69365
12128a837019q62841n2741N01798N49278Q18053J191437O84843m58694p50808
12119b16694M3629M42509k04940p09936k17793N03341O64672O03346N93365J39251
$$ plain form
12184 1013519 2438102 3076578 2260717 623221 -140823 658802 1779173 1857081 1190127
12175 1190127 949697 1463722 2048542 1930849 837803 -706640 -1446897 -592096 923264
12166 923264 1413180 749624 373691 826909 913983 -101966 -1112338 -908364 55616
12157 55616 671987 806713 905754 958286 807657 673845 585638 95373 -826446 -1505602
12147 -1505602 -1688631 -1918273 -2292001 -2062065 -1095117 -448775 -735138 -1160941 -993535
12138 -993535 -685931 -651757 -262739 846021 1695273 1362431 397674 -283487 -867654 -1837019
12128 -1837019 -2699860 -2752601 -2250803 -1701525 -883472 307965 992808 534114 -216694
12119 -216694 -173065 269444 64504 -645432 -863225 -359884 304788 908134 1501499 1640750
12109A640750p72991j175006o03711J63916M23726L92439L26696J6238m52980
12100d0923n53105k05414J75646M94421P67550M64221n82539j103629K7935J581332
12090A025495J379421l24028j146972k70734N53232K2797r97112j347941j059925
12081b165767l57302Q17716J702936J112655m75248j161804m59428J53637k2841
12072h55446R0937R08836J129930J72049o07222l14681L823m26308n56828L45070
12062a09840J034134M41004l46376n2861N00839K5124p85539n26858L13722J98113
12052F91462p45429r48090k1075P44646N20395n50L9792M40426M97200M3251m71149
12041G90879o23513m88535m36239n01337k70458L29745O21455J82240k43268K24798
$$ plain form
12109 1640750 867759 -307247 -910958 -747042 -323316 69123 395819 412057 -40923
12100 -40923 -594028 -799442 -623796 -129375 638175 1102396 519857 -583772 -555837 1025495
12090 1025495 2404916 2080888 933916 663182 1216414 1239211 242099 -1105842 -2165767
12081 -2165767 -2523069 -1705353 -2417 1110238 634990 -526814 -986242 -832605 -855446
12072 -855446 -764509 144327 1274257 1446306 839084 524403 528226 101918 -454910 -109840
12062 -109840 924294 1365298 1018922 966061 1466900 1492024 706485 179627 493349 691462
12052 691462 -53967 -1002057 -1023132 -278486 241909 241359 281151 721577 1218777 1262028 790879
12041 790879 167366 -321169 -757408 -1258745 -1529203 -1199458 -578003 -395763 -639031 -414233
12031d14233J072212J038958K6278q55084r33149m43823L56049J157218J007310
12022B011736o02782k246246j935131M4444J479650J387654Q41283N72165l848
12013A548925r26628j079703j92881N07846L94994K90631N38694K49245o96309
12004F34814r45373j7114O35113P1082n38667p4750N80069K32291n65352o82902
11994f70789k95342j31717l1816L64582N54242Q7816l97445k04081K50766K53393
11984b20391r8843l98992o02769n93737j41081K82671n2697n68376N5109J365742
11974i73364J302280m20012j438210m10350Q59193N69895j60421L46189J136653
11965H11853L90138j140822j228342J75791J032636N49314o239K20518N31319
$$ plain form
12031 -414233 657979 1696937 1723215 868131 -65018 -508841 -152792 1004426 2011736
12022 2011736 1408954 -837292 -2772423 -2727979 -1248329 139325 980608 1552773 1548925
12013 1548925 622297 -457406 -650287 -142441 252553 543184 1081878 1331123 634814
12004 634814 -310559 -327673 307440 378522 -160145 -234895 345174 577465 12113 -670789
11994 -670789 -966131 -1097848 -1129664 -765082 -210840 -123024 -520469 -724550 -473784 -220391
11984 -220391 -319234 -718226 -1320995 -1914732 -2055813 -1773142 -1825839 -2394215 -2339106 -973364
11974 -973364 328916 -91096 -1529306 -1939656 -1080463 -510568 -670989 -324800 811853
11965 811853 1201991 61169 -1167173 -991382 41254 590568 584329 804847 1336166
11956A336166K98552j2969P8085K48079R4263k01961l13543k88090l51448m83990
11946D03144l70773J65865O49902K91461p34451j021822J30186J265965P09657
11937A489134p26338r53302q4960j98967j561518j907272k27024J453211J311170
11928a405866K99524K3888K84675L38799N68511J198980J205854J65203n77018
11919B102550j60842K39571k51863m05554O55338J287330k9519j735321j520783
11910A80907j09248R8220r45813j133400J74455J416006J531954J084296O67852
11901B965229J35439n03445q97139j024021r77335n28053J30414O0957q80044
11892a517998j282757k73136Q82728Q09206L13231P49323J349550M79408j278854
$$ plain form
11956 1336166 1634718 1621749 1699834 1947913 2042176 1840215 1526672 1238582 887134 403144
11946 403144 32371 198236 848138 1139599 405148 -616674 -486488 779477 1489134
11937 1489134 762796 -190506 -275466 -474433 -2035951 -3943223 -4170247 -2717036 -1405866
11928 -1405866 -1106342 -1082454 -797779 -458980 109531 1308511 2514365 2679568 2102550
11919 2102550 1941708 2181279 1929416 1523862 2179200 3466530 3437011 1701690 180907
11910 180907 71659 169879 -775934 -1909334 -1734879 -318873 1213081 2297377 2965229
11901 2965229 3100668 2597223 1700084 676063 -301272 -829325 -698911 -637954 -1517998
11892 -1517998 -2800755 -3073891 -2191163 -1381957 -1068726 -319403 1030147 1509555 230701
11883B30701j703253k68723J217933J254468J76342q75341j078349k19536R17930
11874c47828Q91669n27028j526742n79023J263557J867971R76826J8097l13678
11865A723821n15306p70663o61334j87578K09560L97819L95134K2870m83464m08966
11855b78107J04965j00581j108541j244180K64280J637788J139734l13652q78652
11846g76946n07423q1514N14695J380905J296659l02819j580880q68260N57941
11837c67642O81169O6993K86542P18006m890q88731k85098O51041j75575j631670
11827i49855r79395J151567J598577P4093o02922K65910K75500j206392j629263
11818b002180m901J111425J77952o14359N71879J793296O82214j463890j846902
$$ plain form
11883 230701 -1472552 -1741275 -523342 731126 907468 32127 -1046222 -1265758 -347828
11874 -347828 543841 16813 -1509929 -2088952 -825395 1042576 2019402 2037499 1723821
11865 1723821 1208515 437852 -223482 -411060 -201500 196319 591453 614323 130859 -278107
11855 -278107 -173142 -273723 -1382264 -2626444 -2362164 -724376 415358 101706 -776946
11846 -776946 -1284369 -1365883 -851188 529717 1826376 1523557 -57323 -925583 -367642
11837 -367642 313527 380520 667062 1385068 1380178 491447 206349 857390 681815 -949855
11827 -949855 -1929250 -777683 820894 894987 292065 557975 833475 -372917 -2002180
11818 -2002180 -2007081 -895656 -717704 -1332063 -760184 1033112 1715326 251436 -1595466
11809a595466m88196M21784J94306M4341M91841O06962k22623j303953j548975
11800c399979n90946R18133J764832J281639J52938l91073j25297J44272o2498
11791c07979m24761n47201k55751N38316J345355J048869m88222j535017p04147
11782a330538P67906P89778l13864n18616M61827R52479L61407r4540J35271J66783
11772A377893k57686k23753L81727M70240k17879o63552n00080m35337n10497
11763e78924J2688Q15224O96712k08660n53407k19672l16318o94480r4029J064010
11753g6856R12411m54358q55335J05563L00458q81373j191845L74666J542512
11744b24157O88315m09539L295N19075m90656j531234o54244P65727K68761j305942
$$ plain form
11809 -1595466 -2083662 -1661878 -1467572 -1423231 -931390 -324428 -547051 -1851004 -3399979
11800 -3399979 -3990925 -3072792 -1307960 -26321 126617 -264456 -389753 -245481 -307979
11791 -307979 -732740 -1279941 -1535692 -997376 347979 1396848 908626 -626391 -1330538
11782 -1330538 -562632 227146 -86718 -605334 -143507 808972 1170379 1075839 1211110 1377893
11772 1377893 1120207 896454 1278181 1748421 1530542 866990 366910 -68427 -578924
11763 -578924 -566236 248988 945700 737040 183633 -36039 -352357 -1046837 -1140866 -76856
11753 -76856 835555 381197 -474138 -368575 -68117 -949490 -2141335 -1766669 -224157
11744 -224157 464158 54619 57914 576989 86333 -1444901 -2099145 -1333418 -1064657 -2370599
11734b370599j126953Q86948J981817R71840k61569r930R23656Q66927l31995
11725A530142j339834j018053L08841J086361K87781j078440j104881K80516J098462
11716E0895K52940r52835j020222l10032J61318L77880N54802K38303n12797n23602
11706a683350N57226J212796M00428o17325m04168K64675J9633n89335l17025
11697a156445L33518J90173j49012N70908J510518P32244j404033k414298j324191
11688c110618J96065O23056L77396L03659K36599j33839l89468j47033K93188
11679a750995N61277O63177N64838J43423l20505l91357k20969k51210l24834
11670a327155r435L87934J95637l65341m45142l1339O3664k70952k27193L68326
$$ plain form
11734 -2370599 -3497552 -2610604 -628787 343053 81484 71554 995210 1862137 1530142
11725 1530142 190308 -827745 -518904 567457 855238 -223202 -1328083 -1047567 50895
11716 50895 303835 -649000 -1669222 -1979254 -1817936 -1440056 -885254 -646951 -1159748 -1683350
11706 -1683350 -1126124 86672 487100 -130225 -534393 -269718 -250085 -839420 -1156445
11697 -1156445 -822927 -632754 -781766 -210858 1299660 2031904 627871 -1786427 -3110618
11688 -3110618 -2914553 -2291497 -1914101 -1610442 -1373843 -1507682 -1897150 -2044183 -1750995
11679 -1750995 -1189718 -526541 38297 181720 -138785 -530142 -751111 -1002321 -1327155
11670 -1327155 -1336590 -948656 -753019 -1118360 -1563502 -1594841 -1531177 -1802129 -2029322 -1660996
11660a660996N78738p7400p39196n36206J52942N00081M73428M81336M26458J7903
11650c82912l90459k00934L52091L95086k63689p87087n27886P9722K77779R3026
11640a355263P2023K58157K05767p3257j1082M96605P78053M59377P9393Q9216
11630I98989o334p20760j423234j094767J15264J073061J183538P96592K90596
11621A212945k54940n76522m23808k14085n17187r36341n64773M39330R11627
11612i23754M69890L1678K19056M40382R6582l48301j79626M61975Q78299O24877
11602A771058l16193j495791j917349q80107Q03735J418329N63946l00632o4687
11593d17691M78300J55461o04480n76814J75658M34720j84225o89734l36845K80781
$$ plain form
11660 -1660996 -1082258 -1159658 -1898854 -2435060 -2282118 -1782037 -1308609 -827273 -400815 -382912
11650 -382912 -773371 -974305 -622214 -227128 -490817 -1277904 -1805790 -1726068 -1448289 -1355263
11640 -1355263 -1283240 -1025083 -819316 -892573 -903655 -407050 371003 830380 909773 998989
11630 998989 992655 271895 -1151339 -2246106 -2130842 -1057781 125757 922349 1212945
11621 1212945 958005 381483 -42325 -256410 -773597 -1709938 -2274711 -1835381 -923754
11612 -923754 -453864 -422186 -203130 237252 333834 -14467 -194093 267882 1146181 1771058
11602 1771058 1454865 -40926 -1958275 -2838382 -2034647 -616318 -52372 -353004 -417691
11593 -417691 60609 216070 -388410 -965224 -789566 -354846 -539071 -1228805 -1565650 -1284869
11583a284869K43715l05862m39311J92551Q89863Q63326K19712k71395j32505
11574b4775M25398Q82866Q21261J43745o45548o46632K58898P46727l54570j991731
11564c84361j935534r4531J071867J94320r51086m27246P26541M43317p40093
11555b096806o22046Q25704J323031J3723j183523n58650J053783J753790R42386
11546A451392n36796j556174j460203m65805M18283M84823J92517K66311M82420
11537g23232L35601K04684N44934O58634j45413q87382k81123Q52628O70421o20207
11527F09545j108237m16047q8642o18166o62691K37094O46482j75166q80668k94850
11517b751346Q13671J279392J193577J003181M85143l79140q39554n79896k98165
$$ plain form
11583 -1284869 -1041154 -1347016 -1786327 -1593776 -703913 159413 379125 107730 -24775
11574 -24775 400623 1283489 2104750 2248495 1602947 956315 1215213 1961940 1607370 -384361
11564 -384361 -2319895 -2414426 -1342559 -1148239 -2099325 -2526571 -1800030 -1356713 -2096806
11555 -2096806 -2718852 -1893148 -570117 -556394 -1739917 -2298567 -1244784 509006 1451392
11546 1451392 914596 -641578 -2101781 -2567586 -2149303 -1664480 -1471963 -1205652 -723232
11537 -723232 -387631 -182947 361987 1020621 875208 -12174 -293297 559331 1229752 609545
11527 609545 -498692 -914739 -1003381 -1621547 -2284238 -2047144 -1400662 -1575828 -2456496 -2751346
11517 -2751346 -1937675 -658283 535294 1538475 2023618 1644478 804924 225028 -73137
11508g3137l94682l00537K56222N49684Q5480n53098o63831l22470K7411Q1947
11498a307011k55835n49048J3040J184928J299209k58654j426485l70243J269465
11489d00634P91852j000332j093237N19270Q93251n35140r34915P57252J858419
11480H55786O71556o96493k85174M70140j82625j085620o14100K98269J77829
11471c90432k37076K20211O76541j1132q74199n50262L30096O05164O64556J013291
11461A446758O63822q29214j634435l52190J280818Q95212q47349j605165r87506
11452a969249l25463k6985L61716M73943j43905n15877L57798J457078J178823
11443H47879p1886p28816n88166m99410m33873J36943P01516M10235l71600p82521
$$ plain form
11508 -73137 -467819 -768356 -512134 37550 123030 -430068 -1093899 -1416369 -1388958 -1307011
11498 -1307011 -1562846 -2111894 -2098854 -913926 385283 126629 -1299856 -1670099 -400634
11489 -400634 391218 -609114 -1702351 -1183081 -289830 -824970 -1759885 -1002633 855786
11480 855786 1527342 830849 545675 1015815 833190 -252430 -866530 -568261 -390432
11471 -390432 -627508 -407297 269244 258112 -616087 -1166349 -836253 -231089 433467 1446758
11461 1446758 2110580 1281366 -353069 -705259 575559 1470771 623422 -981743 -1969249
11452 -1969249 -2294712 -2321697 -1959981 -1486038 -1629943 -2145820 -1788022 -330944 847879
11443 847879 775993 47177 -540989 -1040399 -1474272 -1337329 -635813 -225578 -597178 -1379699
11433a379699q55603p83117k7961J285382J555938R4193j184330m99486Q62792
11424i31891O83628n13618n61768O09163J102912L69467k27673L9766M15525L11435
11414A296946o3255n91250j163156j044123J36359J216012Q45068m76515j147821
11405i91735p22310m9135K61195K33015j8232j62999K55598P98442L55335q19998
11395h60824r27039N08451J518288P82127k96243k46934K9235m77962n68411O96598
11385A57286J462178n105j842219j298858P33043J351739M30377J14612N60291
11376A663344O753j381026j495081j05140P20452K14051k16528J2059j94968j006247
11366a782331j015525J68427J128420J027703O30705N00573K13757k77073l91965
$$ plain form
11433 -1379699 -2235302 -3018419 -3046380 -1760998 -205060 -110867 -1295197 -1794683 -931891
11424 -931891 -248263 -761881 -1323649 -714486 388426 757893 530220 569986 985511 1296946
11414 1296946 1233691 642441 -520715 -1564838 -1428479 -212467 632601 156086 -991735
11405 -991735 -1714045 -1763180 -1501985 -1268970 -1287202 -1450201 -1194603 -396161 -40826 -860824
11395 -860824 -1787863 -1279412 238876 1021003 724760 477826 507061 29099 -539312 157286
11385 157286 1619464 1614359 -227860 -1526718 -793675 558064 988441 1103053 1663344
11376 1663344 1670097 289071 -1206010 -1311150 -590698 -376647 -593175 -581116 -776084 -1782331
11366 -1782331 -2797856 -2629429 -1501009 -473306 157399 657972 871729 594656 202691
11357B02691k51703m86170p33795j54684P18428N75686m10520q88754o34610n00948
11347b564379l74112N76535J778034J686405L64972n25676l41327R688Q3311L20699
11337A014150M72381k35601j263759j161441L3974P23136K03387n68483p06154
11328a488410k62319M74871J038817O20490n98045q35613P10360J886820N80827
11319B127798j564183j440665N00128J045467m09680j097738K60005J520741R13814
11310A855687m85165j181069j319775j191271k51687J206881J702517R01534J85540
11301A423192J05370m46431j682309j938163l95961J333758J556472O00535m26319
11292A30144j188395j469058p41020N88150J074404K80376n31979m30153J0676
$$ plain form
11357 202691 -49012 -535182 -1268977 -1423661 -705233 -129547 -540067 -1428821 -2063431 -2564379
11347 -2564379 -2938491 -2361956 -583922 1102483 1467455 941779 600452 610140 693451 1014150
11337 1014150 1486531 1250930 -12829 -1174270 -1140296 -417160 -213773 -782256 -1488410
11328 -1488410 -1750729 -1275858 -237041 383449 -214596 -1050209 -339849 1546971 2127798
11319 2127798 563615 -877050 -376922 668545 258865 -838873 -578868 941873 1855687
11310 1855687 1370522 189453 -1130322 -2321593 -2573280 -1366399 336118 1237652 1423192
11301 1423192 1528562 1082131 -600178 -2538341 -2934302 -1600544 -44072 556463 130144
11292 130144 -1058251 -2527309 -3268329 -2680179 -1605775 -1325399 -1857378 -2287531 -2276855
11283b276855J74173L98660P94222O59845j36929o23319k58053L07650N36736
11274d23870P40890J041287R18434K49402l87238o98968q53718p21698k01764
11265c37243j4833o67922j069807k3178J362122R82751p87323j447685k64087
11256b267205Q02362M69201j55809J2337L19662O9144j60681O6119J27202k12764
11246i30432j29555O19310R77997L45212m25126n03626j93445K8650K29115K90813
11236C08913j99882r38492j043298m49042R0125L84289P86609R33991J53953r51044
11226i23878j044667j40969N37253O16579O97642O82017l1425q68199o68256J90167
11216i53736L27456k09631k38379J57365q6836o05414p0782J088968J137030J12727
$$ plain form
11283 -2276855 -2102682 -1704022 -909800 -249955 -386884 -1010203 -1268256 -960606 -423870
11274 -423870 317020 1358307 2276741 2526143 2138905 1439937 586219 -135479 -337243
11265 -337243 -352076 -1019998 -2089805 -2112983 -750861 231890 -555433 -2003118 -2267205
11256 -2267205 -1464843 -995642 -1151451 -1139114 -819452 -750308 -910989 -844870 -717668 -930432
11246 -930432 -1059987 -440677 537320 882532 457406 -46220 -239665 -211015 18100 308913
11236 308913 109031 -829461 -1872759 -2321801 -2231676 -1847387 -1060778 -126787 27166 -923878
11226 -923878 -1968545 -2109514 -1572261 -955682 -258040 423977 392552 -475647 -1143903 -953736
11216 -953736 -626280 -835911 -1074290 -916925 -1003761 -1609175 -1679957 -590989 546041 658768
11206F58768l09521K0532l25243j223642r90444K66462N61244l01018l60230O28813
11196a374279N60491q75608j122859P62493K124150J015795p62124r91477m24148
11187a087566n67525p22489K76836J443535J177829q5573p79010n24878l3048
11178i01889J50175k72814j215758j524560j01469J866115J941414J57884q58943
11169g59845j40067K18412r86277j810627o05801J111356J311702N88765N06087
11160e66295Q58595O61441J36684j43465n18557j083174r05022K12662R17032
11151d30099N04133M4212J59030j39487j105604j170019K09940J027284p5529
11142i76139j379081r29469L15062M16307l25510l89624K52279O12396O02340
$$ plain form
11206 658768 349247 369779 44536 -1179106 -2169550 -1903088 -1341844 -1642862 -2003092 -1374279
11196 -1374279 -813788 -1689396 -2812255 -2049762 74388 1090183 328059 -663418 -1087566
11187 -1087566 -1655091 -2377580 -2100744 -657209 520620 435047 -343963 -868841 -901889
11178 -901889 -751714 -1024528 -2240286 -3764846 -3866315 -2000200 -58786 99098 -759845
11169 -759845 -899912 -681500 -1667777 -3478404 -4084205 -2972849 -1661147 -1072382 -566295
11160 -566295 292300 953741 1090425 946960 428403 -654771 -1559793 -1347131 -430099
11151 -430099 74034 118246 277276 137789 -967815 -2137834 -1927894 -900610 -976139
11142 -976139 -2355220 -3284689 -2969627 -2553320 -2878830 -3268454 -3016175 -2403779 -1801439
11133a801439N72300J61381p10910r79900j03280P39411N14654o8376j58915k90025
11123b125099q73268r33529O7805Q55928M20592j96430J65942P32012L66532l87046
11113a906561n53999m96163p72167p19932J89510J014226Q93507N10153O09233
11104a232193O18555J11301o2467M69285N15227n05034j176801n07308J90592
11095a578843l53897r88188j21018J487955J931875Q79547o06137j712398j913598
11086b974702q06569P66804J021134j49590p07144K12893P95487j91632j143758
11077c177077n10041N23976M24346L0175M92826P38037l79465j425465o85383
11068c968071O77588O11000k79351p8543R18434R80572J50813j45431J60135N2178
$$ plain form
11133 -1801439 -1229139 -1067758 -1778668 -2758568 -2861848 -2122437 -1607783 -1676159 -1835074 -2125099
11123 -2125099 -2998367 -3931896 -3864091 -3008163 -2587571 -2784001 -2618059 -1886047 -1519515 -1906561
11113 -1906561 -2460560 -2956723 -3728890 -4448822 -4259312 -3245086 -2351579 -1841426 -1232193
11104 -1232193 -613638 -502337 -564804 -95519 419708 -85326 -1262127 -1769435 -1578843
11095 -1578843 -1932740 -2920928 -3041946 -1553991 377884 1257431 651294 -1061104 -2974702
11086 -2974702 -3781271 -3014467 -1993333 -2142923 -2850067 -2637174 -1841687 -2033319 -3177077
11077 -3177077 -3687118 -3163142 -2738796 -2708621 -2215795 -1477758 -1857223 -3282688 -3968071
11068 -3968071 -3290483 -2679483 -2958834 -3037377 -2118943 -1138371 -987558 -1132989 -972854 -920676
11058i20676l36548k05608O497m62131p52690K55957J502225J135440l44164q23894
11048i45592N2682O76954L24333q9016j8337j8209l78743o83256p60194p71964
11038b611342n28254J52096P34267O49371K36560J31603L03962M26326M42154
11029f3257J97692m96532j012893m40196O56530O98152k80293n53243J94580K26536
11019h72924q76015j076961M18538J290234m1071j483878o98153J038086J186597
11010a115547Q0545k48194L06847L99814J7735M5705J31446m94231j058027m50913
11000b384820N57369N04737k88482m69125O0544M84715P14572R48585O68445l10729
10990D85811r56918o33394k14826k77102P9993J163295J455417J55035j090694
$$ plain form
11058 -920676 -1257224 -1462832 -1456335 -1918466 -2671156 -2415199 -912974 222466 -121698 -945592
11048 -945592 -892910 -215956 108377 19361 1024 -17185 -395928 -1079184 -1839378 -2611342
11038 -2611342 -3139596 -2987500 -2253233 -1603862 -1367302 -1235699 -931737 -505411 -63257
11029 -63257 134435 -362097 -1374990 -1815186 -1158656 -460504 -740797 -1294040 -1099460 -872924
11019 -872924 -1748939 -2825900 -2407362 -1117128 -1158199 -2642077 -3340230 -2302144 -1115547
11010 -1115547 -1035002 -1283196 -976349 -576535 -558800 -513095 -381649 -875880 -1933907 -2384820
11000 -2384820 -1827451 -1322714 -1611196 -2080321 -2019777 -1535062 -820490 128095 796540 485811
10990 485811 -471107 -1104501 -1319327 -1596429 -1516436 -353141 1102276 1257311 166617
10981A66617q05110L3306J43604J37097O15827M76759p35708j248896j28508O53687
10971f91325l11323j103686n250J064008l3660j503486o65473J199265J104784
10962i46146m59920p62428K73127N08995k26595l50689K6276l97996j036214m03201
10952c774791P09318N39418j64465M67075J608215J063789n47515q34820k2405
10943i56181k34285j079298k79390J602342J553803n47666j419024P9681J139895
10934a40123J1089j130750j80327J326330R03156r98133k031698j379666k36634
10925c856756K69732J99862J55551L50438M02837j7087m67803k56848L19572L33062
10915b567440p0214J26825O49634P8636j256896j124352P65347J638710Q0301
$$ plain form
10981 166617 -638493 -605187 -461583 -324486 291341 768100 32392 -1216504 -1345012 -691325
10971 -691325 -1002648 -2106334 -2111584 -1047576 -1081236 -2584722 -3250195 -2050930 -946146
10962 -946146 -1406066 -2168494 -1895367 -1386372 -1612967 -1963656 -1937380 -2335376 -3371590 -3774791
10952 -3774791 -3065473 -2526055 -2690520 -2223445 -615230 448559 -98956 -933776 -956181
10943 -956181 -1190466 -2269764 -2549154 -946812 606991 59325 -1359699 -1280018 -140123
10934 -140123 -129034 -1259784 -1440111 -113781 789375 -208758 -2240456 -3620122 -3856756
10925 -3856756 -3587024 -3387162 -3231611 -2881173 -2478336 -2495423 -2963226 -3220074 -2900502 -2567440
10915 -2567440 -2637654 -2510829 -1861195 -1782559 -3039455 -4163807 -3398460 -1759750 -1679449
10906a679449j404151n09843J087752Q68864k73819j12396Q48637P51164n3271
10897d76512j31025L0681o33326j083513p3423R26346M6257j333210p33826J062594
10887b398957J397714K56270k13480K66018J02206p90214r14179o9052N19250
10878a844424M56858K15574k48034q13280m36648Q96489J225307k63501j366684
10869b178343m43142P35633L46936k33613L85440M39820j306019k077482L43749
10860c987021K805174J515750j337600j209917J083037J241337q24199j408580
10852b122019L7351N25541m48269l56204J033490J248346O9213k11214M94890
10843B71125J3580j437976j361058K32929Q04442K7178l4538O51379J33464j168668
$$ plain form
10906 -1679449 -3083600 -3593443 -2505691 -1636827 -1910646 -2023042 -1174405 -423241 -476512
10897 -476512 -607537 -576856 -1210182 -2293695 -2367118 -1440772 -1394515 -2727725 -3461551 -2398957
10887 -2398957 -1001243 -744973 -958453 -692435 -590229 -1380443 -2294622 -2363674 -1844424
10878 -1844424 -1387566 -1171992 -1420026 -2233306 -2669954 -1773465 -548158 -811659 -2178343
10869 -2178343 -2621485 -1885852 -1538916 -1772529 -1387089 -947269 -2253288 -4330770 -3987021
10860 -3987021 -1181847 333903 -1003697 -2213614 -1130577 110760 -713439 -2122019
10852 -2122019 -2084668 -1559127 -2007396 -2363600 -1330110 -81764 -12551 -223765 271125
10843 271125 284705 -1153271 -2514329 -2281400 -1476958 -1449780 -1484318 -832939 -699475 -1868143
10833a868143q47525P73592R29460n65292j128278k24424J48216k73023J99094
10824b856323J205292O78717q48075p76934P65651J114094j01706p15176l05250
10815a839710k62468j28117J416965K590738O52916k553073k599741L39866J868368
10806e14256P09172j34088L66158j30896j873105k022917j10519R48647K21745
10797b540059n6625O11163J71241j211858r33388P98312R00987p10422p61368
10788c732017J149020J730411L05786k9146J302425J018054j522488k541093n26357
10779b845405J102727J84525q56095j13060O60403K76207L75510J289285O86196
10770G60293j492943j840699N28539J882993J86439j503599n93207Q96143N81846
$$ plain form
10833 -1868143 -2715668 -1942076 -1012616 -1577908 -2706186 -2930610 -2782394 -3055417 -2856323
10824 -2856323 -1651031 -972314 -1820389 -2597323 -1831672 -717578 -819284 -1534460 -1839710
10815 -1839710 -2102178 -2230295 -813330 1777408 2430324 -122749 -2722490 -2382624 -514256
10806 -514256 194916 60828 426986 296090 -1577015 -3599932 -3710451 -2761804 -2540059
10797 -2540059 -2596684 -1985521 -1814280 -3026138 -3959526 -3161214 -2260227 -2970649 -3732017
10788 -3732017 -2582997 -852586 -546800 -575946 726479 1744533 222045 -2319048 -2845405
10779 -2845405 -1742678 -1558153 -2414248 -2527308 -1866905 -1590698 -1215188 74097 760293
10770 760293 -732650 -2573349 -2044810 -161817 24622 -1478977 -2072184 -1176041 -594195
10761e94195l02449q1327J89134n47562j015450l47349J90077L7182M67265J443869
10751e60805J066129n77998r45799L93079Q75259k38254n84450N03208N25697
10742D56066j305987k243856q05376P98763P13537J861k12900l88105l87311N42803
10732b830505J191103j40555j662001l27152K249266J648490j638252k540881
10724d050487R2794J851239O06222n98547K9799K42546q09719o63999R82480J034050
10714a283622q74709j185303P99662J313419p17196j495711M04280J306613m62248
10705b194815j400080K93718J203002o58929j940628k14177J676665J049655k61426
10696b447015k81088l82912j333376j002896J056704J787377L5661j197924k33598
$$ plain form
10761 -594195 -896644 -977971 -788837 -1336399 -2351849 -2699198 -2509121 -2471939 -2004674 -560805
10751 -560805 505324 -72674 -1018473 -625394 249865 11611 -572839 -69631 456066
10742 456066 -849921 -3093777 -3899153 -3100390 -2386853 -2384992 -2597892 -2985997 -3373308 -2830505
10732 -2830505 -1639402 -1779957 -3441958 -3769110 -1519844 128646 -1509606 -4050487
10724 -4050487 -3957693 -2106454 -1500232 -2098779 -2068980 -1826434 -2636153 -3300152 -2317672 -1283622
10714 -1283622 -2158331 -3343634 -2543972 -1230553 -1947749 -3443460 -3039180 -1732567 -2194815
10705 -2194815 -3594895 -3301177 -2098175 -2757104 -4697732 -4911909 -3235244 -2185589 -2447015
10696 -2447015 -2728103 -3111015 -4444391 -5447287 -4390583 -2603206 -2567545 -3765469 -3999067
10687c999067O65521J68226O8520Q08858L32257j041483m26127J636746J292548
10678d94001j331028j804083L94845P96898j450486j861548O21021J448883o44515
10669d324014j129897J270858J815273q75996j657196J291014K509069o50086
10661a750975k913684p39435J589119M59703q68458L64701J029921q02750j424811
10652e056669Q32742J572137j045905k000849J101899K840197j60407k804245
10644d721100r60552J187357m00272k053643M8147K515757J567116j28510L79155
10635b566545O27896j009245j050100J543164J702453k207401l875223m1820L073354
10626c803467P94026j884492j86334J809451j9308j630297O09644K161776o69375
$$ plain form
10687 -3999067 -3333546 -3165320 -3096800 -2287942 -1955685 -2997168 -3423295 -1786549 -494001
10678 -494001 -1825029 -3629112 -3234267 -2437369 -3887855 -5749403 -5128382 -3679499 -4324014
10669 -4324014 -5453911 -4183053 -2367780 -3243776 -4900972 -3609958 -1100889 -1750975
10661 -1750975 -4664659 -5404094 -3814975 -3355272 -4223730 -3859029 -2829108 -3631858 -5056669
10652 -5056669 -4223927 -2651790 -3697695 -5698544 -4596645 -1756448 -1916855 -4721100
10644 -4721100 -5681652 -4494295 -4894567 -6948210 -6900063 -4384306 -2817190 -2945700 -2566545
10635 -2566545 -1938649 -2947894 -3997994 -2454830 -752377 -2959778 -6835001 -6876821 -3803467
10626 -3803467 -3009441 -4893933 -5080267 -3270816 -3290124 -4920421 -4310777 -2149001 -2818376
10617b818376k842834j05892K414946j86117l132983j059720J972676P14242j332168
10608f376226M95542K550333L38068k340928q62250J298004o2405j489128M84248
10599e964742J636510j286299k966196N01507L152959j5899l205589n70977K777910
10590e940816Q00092k077372k79194J795886r53671l449292j86669L515296J487565
10581e288175j519565M08966K582395m35041l208835k1063L088559l28911m037707
10572h759377p07996L747178J326933k838957q09338K802707N77902k688799J05942
10563g243805L483695m4857m500858j435424L537269J414281k985983j039039
10555h814721K573682k36479m122524p88678L872996R11990l758539p48927M084719
$$ plain form
10617 -2818376 -5661210 -5767102 -3352156 -3538273 -6671256 -7730976 -5758300 -5044058 -6376226
10608 -6376226 -5880684 -3330351 -2992283 -5333211 -6195461 -4897457 -4959862 -6448990 -5964742
10599 -5964742 -4328232 -5614531 -8580727 -8079220 -4926261 -4942160 -8147749 -8718726 -5940816
10590 -5940816 -5140724 -7218096 -7497290 -5701404 -6655075 -10104367 -10291036 -6775740 -5288175
10581 -5288175 -6807740 -6398774 -3816379 -4251420 -7460255 -7481318 -4392759 -4721670 -8759377
10572 -8759377 -9467373 -5720195 -4393262 -7232219 -8041557 -5238850 -4660948 -7349747 -7243805
10563 -7243805 -3760110 -3804967 -8305825 -9741249 -6203980 -4789699 -7775682 -8814721
10555 -8814721 -6241039 -6477518 -10600042 -11388720 -7515724 -6603734 -10362273 -11111200 -7026481
10546g026481J032354m121437j431485L444702O31529l979539n29173M473316
10538g506214O62194n080768j731297L833514L35272n078561r09166N046080O37958
10529i790988n799795j278224N499030P00666o624679j771951N859636O81991
10521a2524314p400290j680670P407876J677775q274340k845394P439666J992409
10513a4207282q335026k088147Q721003J003650j1771551l820565J0430774K063401
10505a8003743j3944172n445437J1933706K475881j7198543p074070J4683756
10498c2572622K369526k3832036j0593994J8866435k90239m1095045k0473338
10491a07621313L0015752o665909r9258270n4255455J70701081L25158243J93797183
$$ plain form
10546 -7026481 -5994127 -10115564 -11547049 -8102347 -7470818 -11450357 -11979530 -7506214
10538 -7506214 -6844020 -11924788 -13656085 -9822571 -9487299 -14565860 -15475026 -10428946 -9790988
10529 -9790988 -15590783 -16869007 -11369977 -10669311 -17293990 -19065941 -13206305 -12524314
10521 -12524314 -19924604 -21605274 -14197398 -12519623 -20793963 -23639357 -16199691 -14207282
10513 -14207282 -22542308 -24630455 -15909452 -14905802 -26677353 -30497918 -20067144 -18003743
10505 -18003743 -31947915 -37393352 -25459646 -22983765 -40182308 -47256378 -32572622
10498 -32572622 -30203096 -54035132 -64629126 -45762691 -46052930 -87147975 -107621313
10491 -107621313 -77605561 -84271470 -183529740 -237785195 -67084114 258074129 451871312
10484D51871312p9489573j87835172q1385662K3011499p24766m9957586k4284332
10477E1205720J8081432K853828k7102930j1419759J5817093L082291k1104022
10470C1413653j0349045J2333501N114088j3798508p327832R551875M009903j0856305
10462B0091330n354664Q845058M362696q639392m939610O620328K938747p978973
10454A5945520m679877N686852L205483n831923l266859M939869K135083n681409
10446A2452739k856414M677174K155779m521697j522981M810373J016990n983717
10438A0228246k188876N678769K828816n274746l836978L233446K183515l894618
10430H957574k489219L384411K020023l460127j763443L974753K599312l128596
$$ plain form
10484 451871312 372381739 184546567 103160905 126172404 125447638 75490052 51205720
10477 51205720 69287152 72140980 45038050 33618291 49435384 52517675 31413653
10470 31413653 21064608 33398109 38512197 24713689 17385857 26937732 30947635 20091330
10462 20091330 14736666 23581724 27944420 19305028 14365418 20985746 23924493 15945520
10454 15945520 11265643 16952495 20157978 14326055 11059196 15999065 18134148 12452739
10446 12452739 9596325 14273499 16429278 11907581 10384600 15194973 16211963 10228246
10438 10228246 8039370 13718139 16546955 11272209 7435231 10668677 12852192 8957574
10430 8957574 6468355 9852766 11872789 8412662 6649219 10623972 13223284 10094688
10422A0094688k425890K392314J310811l293205j913843K851283J655361k879440
10414G792079j540668L044083J629354l410235k866175J472654J119299k056680
10406E183711j55108M202837K503058k887496k986544R07984N81923k841674j797466
10397B711225K253863J741865j932794j277691K406757J676697k384486k417081
10389B778355R51437R32983j887834j297594J782861J382586j225085j68577K737462
10380E986594J176297k825548k105631K001128K087185j439074j714617J178868
10372D345202R71135k038230j620066J859606J868126j728531k368654R34027
10364B222615K290258J81746o33141J109928J462863k62887n57583O03667j45866
$$ plain form
10422 10094688 7668798 10061112 11371923 8078718 6164875 9016158 10671519 7792079
10414 7792079 6251411 9295494 10924848 7514613 4648438 6121092 7240391 5183711
10406 5183711 5028603 9231440 11734498 8847002 5860458 6768442 7350365 4508691 2711225
10397 2711225 4965088 6706953 4774159 3496468 5903225 7579922 5195436 2778355
10389 2778355 3729792 4662775 2774941 1477347 3260208 4642794 3417709 3249132 5986594
10380 5986594 7162891 4337343 2231712 4232840 6320025 4880951 3166334 4345202
10372 4345202 5316337 3278107 1658041 3517647 5385773 3657242 1288588 2222615
10364 2222615 4512873 4694619 4061478 5171406 6634269 6371382 5813799 6417466 6271600
10355F271600k055846j285168J186426R62064j381072j502846L27141L04951r32741
10346A894509J83238K220561R12918k192934j912114J098577J666549l97414p97302
10337B676588M95100k24651k131740r78435K237053K395002m07574j122654R43303
10328C881992J413443o38070j501742l02416k4240r53370l69144J243385P38190
10319C488028j111949n40517J961642K214076o7649j022894J95384N69025o19858
10310E065288j004820l01354m30260j001268k00859Q21383q0322j226124J02875
10301A744539J984669R29121j500300j409014L28083K28560q90518l2867J351885
10292B734158Q6846j758980k05127K616912J765760j293690j212832J287587Q83764
$$ plain form
10355 6271600 4215754 2930586 4117012 5079076 3698004 2195158 2522299 2827250 1894509
10346 1894509 2077747 4298308 5211226 3018292 1106178 2204755 3871304 3473890 2676588
10337 2676588 3171688 2947037 815297 -163138 2073915 4468917 4061343 2938689 3881992
10328 3881992 5295435 4657365 3155623 2853207 2828967 1875597 1506453 2749838 3488028
10319 3488028 2376079 1835562 3797204 6011280 5943631 4920737 5116121 5685146 5065288
10310 5065288 4060468 3759114 3328854 2327586 2126727 2948110 2867788 1641664 1744539
10301 1744539 3729208 4658329 3158029 1749015 2077098 2305658 1415140 1382273 2734158
10292 2734158 2821004 1062024 856897 3473809 5239569 3945879 2733047 4020634 4904398
10283D904398k141067k345380O45556J513785q53285j682914N93797J953365P18525
10274C306780K0215R24501N28097j587814k010102q9858P09479o04817r70001
10265B26480N35633J093975j16988n41838M03945L69568p67342m60446J180807
10256A923794J260612l03452o71558K76256m1264j263859m93378J656567J614440
10247C958158m81762r81231L47326J07460j803353j801628L67141R79381n98153
10238I3339r17635O42043P64407r66212r50889J347433J979766j67118j214102
10229F11032N95488J943899P62498m57903O9414M31077n24894r45527j61668j45656
10219B177760j159510r25464N34571M35083j180391q87606J698366K625818M15634
$$ plain form
10283 4904398 2763331 417951 1063507 2577292 1724007 41093 634890 2588255 3306780
10274 3306780 3326995 4251496 4779593 3191779 1181677 1091819 1801298 1196481 226480
10265 226480 762113 1856088 1739100 1197262 1601207 1970775 1203433 742987 1923794
10256 1923794 3184406 2880954 2209396 2485652 2444388 1180529 687151 2343718 3958158
10247 3958158 3476396 2495165 2842491 2949951 1146598 -655030 -287889 691492 93339
10238 93339 -824296 -182253 582154 -384058 -1334947 12486 1992252 1825134 611032
10229 611032 1206520 3150419 3912917 3455014 3524428 3955505 3430611 2485084 2323416 2177760
10219 2177760 1018250 92786 627357 1062440 -117951 -1005557 692809 3318627 3734261
10210C734261j432173o46489N24995K33660l3649M99186R748j696755j971674
10201g78890k59085N90108l34614l78675J200285J411627p18300j812051J6137
10192a063458J927135J484508L19028J64121k00327j458058j570570K84951J604023
10183A491353Q04317k55404j33662k25510j240002j289675L09174J221615K28420
10174I10626o07683O9368N60368k52990p26220P8908M66128l88049o61716M86370
10164f4890J150544L42714k08851L70788M33409o30903r24946K17233Q20010J60651
10154A665759J29366J139082Q62548j175428k024886l58065J112566M27964n58463
10145A220443k06276l3531j107931j461404J70154J668213J247214L94075N92014
$$ plain form
10210 3734261 2302088 1655599 2180594 2414254 2380605 2879791 2889539 1192784 -778890
10201 -778890 -1037975 -447867 -782481 -1161156 39129 1450756 732456 -1079595 -1063458
10192 -1063458 863677 2348185 2667213 2831334 2631007 1172949 -397621 -112670 1491353
10183 1491353 2295670 2040266 1906604 1681094 441092 -848583 -539409 682206 910626
10174 910626 302943 372311 932679 679689 -46531 32377 498505 110456 -551260 -64890
10164 -64890 1085654 1428368 1219517 1590305 2023714 1392811 467865 685098 1505108 1665759
10154 1665759 1795125 2934207 3796755 2621327 596441 238376 1350942 1778906 1220443
10145 1220443 1014167 980636 -127295 -1588699 -1418545 249668 1496882 1890957 2482971
10136B482971N90816n20057r95730J51684P84910n81310j836160q93164P44244
10127g1796Q30790L3005J7214M03224J79519j31310N2037l0484n64984l00788
10117D16427P75258O99977q62593j359382L93812J861696R20228p03524n78285
10108A563614N97114Q25596Q9443n39667r34095j078325l33718Q22298O41276
10099A653536q66510j342818P7764J218222O41306j38731Q9038N8438r17089j046448
10089e73292M94311J445809K91594r17150k49922O28100l34077j674765j021293
10080a910685P16514J093046K39596L2408N96615O25848Q1312p5602Q2741m3244
10070A438549J4660Q25931J454377P48976o08657j057993l76474M79752Q96136
$$ plain form
10136 2482971 3073787 2553730 1558000 1709684 2494594 1913284 77124 -816040 -71796
10127 -71796 758994 791999 809213 1212437 1391956 1260646 1312683 1282199 717215 416427
10117 416427 1191685 1891662 1029069 -330313 63499 1925195 2845423 2141899 1563614
10108 1563614 2160728 2986324 3075767 2536100 1602005 523680 189962 1012260 1653536
10099 1653536 787026 -555792 -478028 740194 1381500 1242769 1331807 1390245 473156 -573292
10089 -573292 -78981 1366828 1658422 741272 491350 1119450 785373 -889392 -1910685
10080 -1910685 -1194171 -101125 138471 170879 767494 1393342 1474654 1399052 1481793 1438549
10070 1438549 1453209 2279140 3733517 4482493 3873836 2815843 2439369 2919121 3815257
10061C815257P25069j77019j397557j838287j084847o2521L12070J65322n9945
10052C97542k40621j97707J57665K83742j28822j33969R91305J868820P85443
10043C783398j241346j733028o42581j08067o11945n56031L52732O10463N4899
10034i1506J93547J034176Q95192k22030m53853L20134K08746r05390j021451
10025d2435L425P5999q50863l59039J567581J752752n70164j889273k17328J574545
10015A045200P53349r71378j022230k09375k86818m21323O33273J482663M64395
10006A467756j042679p36360Q37831J363088L07783q87473j133543m46902O29009
9997C58510J143354L85023q75943j152804n01241k19369l63356M7436N03581l01230
$$ plain form
10061 3815257 4540326 4363307 2965750 1127463 42616 -19905 292165 457487 397542
10052 397542 156921 -40786 116879 400621 271799 137830 1129135 2997955 3783398
10043 3783398 2542052 809024 166443 58376 -553569 -1109600 -756868 -146405 -91506
10034 -91506 102041 1136217 2031409 1809379 1355526 1675660 1884406 979016 -42435
10025 -42435 -39010 36989 -813874 -1172913 394668 2147420 1577256 -312017 -529345 1045200
10015 1045200 1798549 827171 -195059 -404434 -691252 -1112575 -479302 1003361 1467756
10006 1467756 425077 -311283 526548 1889636 2197419 1309946 176403 -270499 358510
9997 358510 1501864 1886887 1010944 -141860 -643101 -862470 -1225826 -1178390 -674809 -976039
9987i76039j273278k1451K490444K470412n65564k465928r01397J062372K13255
9978C2826j787527j589653O27478K176183J962947Q96492k02657r46193q91463
9969B78433k05322L29897O37946J129095J052386o61127k777883k711197m37979
9960c365751J348708J313648P07098K74562o98079j762511j206942O66950J446631
9951a275686M71154l95745k87722k81538n15305Q9525R55190L72416r36920o36977
9941b441608Q07684O89806r44798j299313P2639P78202L13172N02027J145345
9932c76844K35443j438032j129480M55476J03759j713704j514408N26777R36007
9923c915006k36689K18378J701287O25443j901471j273667J640241J372624j973333
$$ plain form
9987 -976039 -2249317 -2270768 219676 2690088 2124524 -341404 -1242801 -180429 32826
9978 32826 -1754701 -3344354 -2716876 -540693 1422254 2318746 2116089 1169896 278433
9969 278433 73111 403008 1040954 2170049 3222435 2561308 -216575 -2927772 -3365751
9960 -3365751 -2017043 -703395 3703 278265 -419814 -2182325 -3389267 -2722317 -1275686
9951 -1275686 -804532 -1200277 -1487999 -1769537 -2284842 -2195317 -1240127 -867711 -1804631 -2441608
9941 -2441608 -1633924 -944118 -1888916 -3188229 -3115590 -2337388 -2024216 -1522189 -376844
9932 -376844 -141401 -1579433 -2708913 -2253437 -2149678 -3863382 -5377790 -4851013 -3915006
9923 -3915006 -4151695 -3933317 -2232030 -1606587 -3508058 -4781725 -3141484 -1768860 -3742193
9914c742193k687495j28055M76602j391025q75022J465461l4797l982276l180848
9905a4079648O75148j311362p140264n904332j391331j0592592k9405318k5917535
9897i5067234J3219381N2490016M9849381J3613144j2041066q383660K618686
9890A6298648J263400m335232k131389K148026j54608l983820k029682J464892
9882H540235R7205k692168j332153J378435O22623j363023o24127Q74690L9873
9873E541590j008202L33753J668089M31251j034370k27233P44071l40324j442800
9864D665825n53148L97810l19219q40495J41958N61406n83383q54236O10281Q49343
9854D076142j141009j773392O60787K318061L61633k002752j177540R14286R22915
$$ plain form
9914 -3742193 -6429688 -6557743 -6081141 -7472166 -8347188 -6881727 -6916524 -10898800 -14079648
9905 -14079648 -13404500 -14715862 -21856126 -27760458 -29151789 -39744381 -69149699 -95067234
9897 -95067234 -81847853 -29357837 20491544 34104688 22063622 13679962 16298648
9890 16298648 17562048 13226816 11095427 13243453 13088845 9105025 7075343 8540235
9882 8540235 8637440 5945272 4613119 5991554 6614177 5251154 4627027 5501717 5541590
9873 5541590 4533388 4867141 6535230 6966481 5932111 5704878 6448949 6108625 4665825
9864 4665825 4112677 4510487 4191268 3350773 3492731 4054137 3470754 2616518 3226799 4076142
9854 4076142 2935133 1161741 1822528 4140589 4502222 2499470 1321930 2236216 3159131
9845C159131j77121J17934R33805K52512r35643o55761L97538N61399J56952m8445
9835C762301p73723k098273k102377o2823J664523J214461N320o5104N43729Q72009
9825B960043J300728J745207R22720r08386j485493l26375K41645p33122j156601
9816B560366L206O88080k80989r29843P7744R74721L81690k51683J31846N5255
9806C410393j180097j579535k08416O46116m55192j330339j01571J458451J277230
9797A937040M85825P06495Q80817k01607j024057p9255J015422K00368j404411
9788B516637j486785k62860M96247M90872N11458N17606J78339m1940Q8802j6739
9778B991637k37298L75746J293257O35011j362882j965691l66484P05114m62841
$$ plain form
9845 3159131 2982010 3099944 4033749 4286261 3350618 2694857 3092395 3653794 3810746 3762301
9835 3762301 2988578 890305 -1212072 -1274895 389628 1604089 1609409 1544305 2088034 2960043
9825 2960043 4260771 6005978 6928698 6020312 4534819 4208444 4450089 3716967 2560366
9816 2560366 2563572 3251652 2970663 2040820 2118564 3093285 3474975 3223292 3355138 3410393
9806 3410393 2230296 650761 442345 1088461 633269 -697070 -798641 659810 1937040
9797 1937040 2422865 3129360 4010177 3808570 2784513 2705258 3720680 3921048 2516637
9788 2516637 1029852 766992 1263239 1754111 2265569 2783175 2961514 2919574 3008376 2991637
9778 2991637 2754339 3130085 4423342 5058353 3695471 1729780 1363296 2068410 1605569
9769A605569j671524o74535J123915J363817M63626O9795O2430m00940q16989
9760A125164n25965j92349l18686j69557L98552K75427m42618r852J531049J545106
9750C216271p37118k188224n45074J859629J826935J6763r36103o46368l81562
9741A485149k40272K53578L94129l64916q49915j12589O94601L42877l72853m24310
9731H05479m48062r48699p40450P67706J860952J208460J55936K28308N64206
9722C453836P7333j41543Q68323J416013k06271k360625k240568o7722J552476
9713B351252J374923K54388q37303j403363r71437J28712N02560l44951j026832
9704B7949n28152J63462M1515j22392M80131R63271M19270l32424k10089M77740
$$ plain form
9769 1605569 -65955 -740490 383425 1747242 2210868 2280663 2343093 1942153 1125164
9760 1125164 599199 406850 88164 -81393 317159 592586 149968 140116 1671165 3216271
9750 3216271 2479153 290929 -254145 1605484 3432419 3449182 2513079 1866711 1485149
9741 1485149 1244877 1498455 1892584 1527668 677753 565164 1259765 1602642 1229789 805479
9731 805479 357417 -591282 -1331732 -564026 1296926 2505386 2661322 2889630 3453836
9722 3453836 3531169 3389626 4257949 5673962 5467691 3107066 866498 798776 2351252
9713 2351252 3726175 3980563 3143260 1739897 768460 897172 1399732 1054781 27949
9704 27949 -500203 -336741 -295226 -417618 62513 1025784 1445054 1112630 902541 1380281
9694A380281J059253J439063J105312o04314k390129j853974M96044J267236m55409
9685A443363j391969L70716K000980Q47919r94827n18569J056258Q62898n54836
9676C121933q30338k65223o49823j308324l69860J284924J233638k46047p62637
9667A208243N8405M10877k40929o68638m74760m07688m35391N9808O39799N32497
9657F82223K77545O22568P94568l6956p97281k59728N26681l9587j219656j245003
9647f94626l22819J70498L32186J035543J685370J174719P6380m32213o66893
9638B358145j216545j081535M91098J817667J103850m69181p13571j0238n4136
9629B225554n49010k47824J47185o07538j335731l13847J150332O42344r55423
$$ plain form
9694 1380281 2439534 3878597 4983909 4379595 1989466 135492 631536 1898772 1443363
9685 1443363 51394 422110 2423090 3271009 2276182 1757613 2813871 3676769 3121933
9676 3121933 2291595 2026372 1376549 68225 -301635 983289 2216927 1970880 1208243
9667 1208243 1266648 1677525 1436596 767958 293198 -114490 -549881 -490073 149726 682223
9657 682223 959768 1582336 2376904 2339948 1542667 1282939 1809620 1770033 550377 -694626
9647 -694626 -1017445 -846947 -514761 520782 2206152 3380871 3457251 3025038 2358145
9638 2358145 1141600 60065 551163 2368830 3472680 3003499 2289928 2279690 2225554
9629 2225554 1676544 1428720 1575905 968367 -367364 -681211 469121 1111465 156042
9620A56042q39481P81381J176985L2419k66238P49874Q46802o15342j441970m93386
9610H7086N94737N30713J68181K43992P3422n72110p45532k58748r8020l96289
9600c72568k14462L53058K09041l81938J9722J171863J114900n08706j688296
9591b97386j238628k85782J20289M38160Q84629O05317m49762r09181j56432P32939
9581e55837R36875R17145R24675M13219m56442o56652j93417k00283o55487k02022
9571B71774J112066J297714l31127j658753r14593O63336R37706L3103l80659
9562A030567J45934N15375j0751r02783j196030n15680N56563R33510K63932l87364
9552D33273J14143J162738J131095j50050j040621m80011O39563R68473L84436
$$ plain form
9620 156042 -683439 97942 1274927 1307346 1041108 1790982 2637784 2022442 580472 87086
9610 87086 681823 1212536 1380717 1624709 1698131 1126021 380489 121741 23721 -372568
9600 -372568 -587030 -233972 -24931 -406869 -387147 784716 1899616 1390910 -297386
9591 -297386 -1536014 -1821796 -1701507 -1263347 -378718 226599 -223163 -1132344 -1288776 -555837
9581 -555837 381038 1298183 2222858 2636077 2179635 1522983 1329566 1129283 473796 271774
9571 271774 1383840 2681554 2350427 691674 -222919 440417 1378123 1411226 1030567
9562 1030567 1176501 1691876 1681125 778342 -417688 -933368 -376805 556705 820637 433273
9552 433273 547416 1710154 2841249 2691199 1650578 1170567 1810130 2778603 3163039
9543C163039l70291p55176o16883r1980L18272K48868J40738O18396J240017R05114
9533D800114l78549j226044p19250L63748N89951m27629j665474j738377l43258
9524g44768J181615J184142j79919r97201k52667P40732N02130l08462j96237
9515I29365O26570P95567J59162k91410l86287p86523j291110r75811M4455O71648
9505e04374N98285M53249L11250k82519q89335n33253M48564O41695j54541n48918
9495d59897J79084J001752Q29355l6614o34463m81828L30397J252681J380168
9486C360635L84371p08371o74094J50804M03154k45249q62099r29489q24586o36942
9476e81866N0738J008450J278926N44460m48102r64555q66023j92937Q05448J320501
$$ plain form
9543 3163039 2792748 2037572 1420689 1328709 1646981 1895849 2036587 2654983 3895000 4800114
9533 4800114 4421565 3195521 2476271 2840019 3429970 3002341 1336867 -401510 -744768
9524 -744768 436847 1620989 1441070 443869 191202 931934 1434064 1125602 929365
9515 929365 1555935 2351502 2510664 2219254 1832967 1046444 -244666 -1220477 -1176022 -504374
9505 -504374 93911 547160 858410 575891 -313444 -846697 -398133 243562 89021 -459897
9495 -459897 -280813 720939 1550294 1513680 879217 397389 727786 1980467 3360635
9486 3360635 3745006 3036635 2362541 2513345 2916499 2671250 1809151 879662 55076 -581866
9476 -581866 -531128 477322 1756248 2300708 1852606 888051 22028 -170909 634539 1955040
9466A955040P21797m19137r91302q13566m73539r7269N29369R53636M91183m96025
9456A360187r67299o84200k15284K32614P93585J079847O07233j71893m57232
9447A577558m02181o41688r46646o45334J7041K69170J82736L59582O89532O99915
9437A159685O01821O79720L45654p34415j397242n85811O08530M58323n61153
9428E75112o14715L59849P24831Q7813k35796K56068N70673K86175J35827K00580
9418B346417m12748j622197j997076r02180N73845J265771J105073M67402k24819
9409E99488k17983P71600J556266Q25384p18037j260067o12164j32889k01555
9400F10043O1120O37067M61158m02649o28334M9216M47896J23906r4611M6343
$$ plain form
9466 1955040 2676837 2257700 1266398 452832 -20707 -117976 411393 1365029 1856212 1360187
9456 1360187 392888 -291312 -506596 -273982 519603 1599450 2206683 2034790 1577558
9447 1577558 1175377 533689 -412957 -1058291 -1041250 -772080 -589344 -229762 459770 1159685
9437 1159685 1761506 2441226 2786880 2052465 655223 69412 677942 1136265 575112
9428 575112 -39603 320246 1045077 1132890 897094 1153162 1723835 2010010 2145837 2346417
9418 2346417 1933669 311472 -1685604 -2587784 -2013939 -748168 356905 824307 599488
9409 599488 381505 1153105 2709371 3534755 2816718 1556651 944487 811598 610043
9400 610043 671163 1308230 1769388 1366739 738405 787621 1235517 1359423 1264812 1311155
9390A311155q8688l66297n7522K91829m79082j582678j037833Q16222J486415
9381B93521M66062L5571J059857J348739k79716j537500m13329J387666J261389
9372C622260k58243r23171m92501l29180n23965q7367O94597N17198o08369j290121
9362C21138r44459l86449k19771n9118M50313R06278P55735N7362n48769m72375
9352a40115J47382M93456J54213j69315K42750P67567L39280o24604p36302P180
9342D81492J64251o10035q47274K70584J472017J318535J23514r15128j201219
9333B56737o13155P50444J914226J497136k83847j405839p35532M02505L47670
9324B130345n41471q71154m24704l8518l3713k1665J87354M52507P33858R69057
$$ plain form
9390 1311155 1222467 856170 798648 1090477 611395 -971283 -2009116 -1192894 293521
9381 293521 759583 795154 1855011 3203750 2924034 1386534 973205 2360871 3622260
9372 3622260 3364017 2440846 1948345 1619165 1095200 1007833 1702430 2219628 1611259 321138
9362 321138 -623321 -1009770 -1229541 -1288659 -838346 67932 823667 881029 332260 -140115
9352 -140115 7267 500723 654936 485621 728371 1495938 1835218 1210614 474312 481492
9342 481492 645743 35708 -811566 -540982 931035 2249570 2373084 1457956 256737
9333 256737 -356418 394026 2308252 3805388 3521541 2115702 1380170 1782675 2130345
9324 2130345 1588874 717720 293016 254498 220785 199120 386474 838981 1572839 2541896
9314B541896Q72964L32443l68137r37475j215480r41739j18428M84469J31224
9305G81737o52705p29419j04524K18136J2319k1126J43175k22006q97966p01532
9295b173911M53253J191315Q57780L71102L59505J90220m52008p34083k66381
9286b03208N3606l37201o89313m44886k53072n70370o55482N5070Q19632P83110
9276a442114K06643k50225l98491j01856Q03256J661428J390059K02958m72183
9267A599475k35253k43156r53593j164054j71041Q42053O60143j88395n59978
9258d13799l00278J92795P58430J038403N13851l66173m25012L37384N77574j46879
9248A766296o50120k28102K86946K59518K02252K76028k30741j118592r77465
$$ plain form
9314 2541896 3414860 3747303 3379166 2441691 1226211 284472 166044 650513 781737
9305 781737 129032 -600387 -704911 -486775 -474456 -495582 -352407 -574413 -1472379 -2173911
9295 -2173911 -1720658 -529343 328437 699539 1059044 1249264 797256 63173 -203208
9286 -203208 -149602 -486803 -1176116 -1621002 -1874074 -2444444 -3099926 -3044856 -2225224 -1442114
9276 -1442114 -1235471 -1485696 -1884187 -1986043 -1182787 478641 1868700 2071658 1599475
9267 1599475 1364222 1121066 167473 -996581 -1167622 -325569 334574 146179 -413799
9258 -413799 -714077 -521282 237148 1275551 1789402 1423229 998217 1335601 1913175 1766296
9248 1766296 1116176 888074 1175020 1434538 1636790 1912818 1682077 563485 -413980
9239d13980M01602J306977P56127j53207m60225o99054j019096l81847J046667
9230C83964J197858n60242j795951o31602J268682J436167K59275l60151k06395
9221I91605k53476m36456j56221J78733K9973m4068L30427K61771o23481r70728
9211f91921K9093R18465L57120n77602m14048K27704K18301J16090O23144P54790
9201A561136j58195o03593N02349J357573J85131j365638q15149Q98983J091061
9192B653658j98407p96793k99901n124O4360P30930J140971n70j476866j162999
9182F49259K08815K87532o97123o03079M21026K66459r71793j107501k6198K33675
9172a338928l88220J36977J620439J512684k64865p11418R12880J519750l85984
$$ plain form
9239 -413980 -12378 1294599 2050726 1897519 1437294 738240 -280856 -662703 383964
9230 383964 1581822 1021580 -774371 -1405973 -137291 1298876 1558151 1198000 991605
9221 991605 738129 301673 145452 324185 354158 310090 640517 902288 278807 -691921
9211 -691921 -662828 255637 612757 35155 -378893 -151189 67112 183202 806346 1561136
9201 1561136 1402941 799348 1301697 2659270 2844401 1478763 663614 1562597 2653658
9192 2653658 2455251 1658458 1358557 1353433 1417793 2148723 3289694 3289124 1812258 649259
9182 649259 858074 1145606 448483 -154596 266430 532889 -438904 -1546405 -1572603 -1338928
9172 -1338928 -1727148 -1590171 30268 1542952 1278087 566669 1479549 2999299 2613315
9163B613315j974209r91429N42948K27091o55633l9296R56766L47162q01169k74270
9153d8724J179390J091382m82252j202461l47437M62913K67870q2124O8883J67731
9143A075171j78347m62422l13997o5611P487R2889L03239M21836K78589m5844
9133A112990l04342j68580L92095O94722j436j209225j491634m10720P95617J004499
9123D13986O02325L90947K18361l13709p31018m49872K9408j10264n19130j67521
9113f36487R16345J536035R95599n2459o23906n41320k35472P2743M87500Q51755
9103B770333N69924n85339j698474j452657J03959J263672P32494o41466j066126
9094c680k10073O75191P27714L45784J04132k1731j31782q3974L0725j17825m58707
$$ plain form
9163 2613315 639106 -352323 190625 417716 -237917 -277213 679553 1026715 225546 -48724
9153 -48724 1130666 2222048 1739796 537335 189898 652811 920681 838557 907440 1075171
9143 1075171 896824 434402 120405 54794 62281 155170 458409 880245 1158834 1112990
9133 1112990 808648 640068 1032163 1726885 1725449 516224 -975410 -1386130 -590513 413986
9123 413986 1016311 1407258 1625619 1311910 580892 131020 160428 50164 -468966 -636487
9113 -636487 279858 1815893 2811492 2759033 2135127 1593807 1358335 1431078 1918578 2770333
9103 2770333 3340257 2754918 1056444 -396213 -292254 971418 1703912 1062446 -3680
9094 -3680 -213753 461438 1189152 1534936 1639068 1617337 1485555 1401581 1432306 1314481 855774
9083H55774n69137l94014k21830n2457K46800L80824J00180r2851K50573M41333
9073I45195l05322j143928n85797R35384J364942J06544j080624p64040L63849
9064a63797J049030J145784Q91060R8709r50579j234912n82628j97039o64154
9055f08526q86527q0501O82583L10028l27967J05188J051674J003335K5650m99954
9045G74983k15978j14021o40403j016552n69755M27545J330157J634958J060608
9036B671542j8962n17491L1017M76463m50936j988007k093395l35182J397579
9027h27372J382221M7594r95086r08297p4463O50323O20581j16708p09414l80731
9017a311352M56225O42308o0154o16536l13192K56278L11262P2873R1938J67190
$$ plain form
9083 855774 286637 -107377 -329207 -381664 -134864 245960 346140 253289 503862 945195
9073 945195 639873 -504055 -1089852 -154468 1210474 1317018 236394 -527646 -163797
9064 -163797 885233 2031017 2922077 3020786 2070207 835295 252667 55628 -608526
9055 -608526 -1495053 -1575554 -892971 -582943 -910910 -805722 245952 1249287 1274937 774983
9045 774983 559005 444984 -195419 -1211971 -1781726 -1354181 -24024 1610934 2671542
9036 2671542 2652580 2135089 2166106 2642569 2191633 203626 -1889769 -2224951 -827372
9027 -827372 554849 602443 -392643 -1300940 -1375403 -725080 -104499 -221207 -930621 -1311352
9017 -1311352 -855127 -212819 -272973 -889509 -1202701 -946423 -635161 -562288 -470350 -303160
9007c03160j53775n67602m85742j02050P741K7051N30349J163677R54290J2447
8997A083226l99693J38488M74341j72785q01831k32836Q95659J084512K90044
8988B359125j68637K61690P45343N73487K4964m64032q46252r27517l55517N22739
8978A725393P71539J92418l83814m67740n81347j097287j400886q79870K7893
8969b093701M66677K78863o0876j42883J46085O20107P90218L84412q3711M7711
8959C52902M78129M09659l0260p3210J06086l24394r63944n19643O49590N74648
8949F59563r96394j730824m03707J009679O84437l5773O73681J584971N45003
8940A990636j449284j608842J01580J068042L20439m57094k72978j49085o11518
$$ plain form
9007 -303160 -456935 -1024537 -1510279 -1612329 -1604588 -1577537 -1047188 116489 1070779 1083226
8997 1083226 683533 822021 1296362 1123577 321746 88910 984569 2069081 2359125
8988 2359125 2190488 2452178 3197521 3771008 3795972 3331940 2485688 1558171 1202654 1725393
8978 1725393 2496932 2689350 2305536 1837796 1256449 159162 -1241724 -2121594 -2093701
8969 -2093701 -1627024 -1348161 -1409037 -1551920 -1405835 -785728 4490 388902 305191 352902
8959 352902 831031 1240690 1210430 1137220 1243306 918912 -45032 -564675 84915 659563
8949 659563 -336831 -2067655 -2471362 -1461683 -777246 -813019 -139338 1445633 1990636
8940 1990636 541352 -1067490 -965910 102132 422571 -34523 -307501 -456586 -1068104
8931a068104o18308K10266O64558J44334k72442J56606O02271L12694j58984j98505
8921b25614j06637j16512J44128N86332M57415k35093m99287o5519J34388k93370
8911b19769m92879J7114M84657L52014J45243K77376L00155o367p4786L24275
8901A107033O03430M50576J72261k83915j187367j758372q53986P83360J027866
8892F0886l40997j093704j16740Q80871M76312q5500N89769J335729M88155j048702
8882A146079j253911k87012J39668j56046J23796J007105R87779l07192j251282
8873A48984o13061O74414Q72855l18170j498510j212187M05702J650735J161616
8864A272378l22422q77278m9724O27815J20635n92798l35243L36807K40833m67853
$$ plain form
8931 -1068104 -1686412 -1476146 -811588 -667254 -939696 -783090 -180819 131875 -27109 -225614
8921 -225614 -332251 -448763 -304635 281697 739112 504019 4732 -60787 73601 -219769
8911 -219769 -712648 -695534 -210877 141137 286380 563756 863911 857544 782758 1107033
8901 1107033 1710463 2161039 2333300 2049385 862018 -896354 -1750340 -966980 60886
8892 60886 -280111 -1373815 -1490555 -609684 -133372 -218872 370897 1706626 2194781 1146079
8882 1146079 -107832 -394844 -255176 -411222 -287426 719679 1707458 1400266 148984
8873 148984 -464077 210337 1083192 765022 -733488 -1945675 -1539973 110762 1272378
8864 1272378 949956 72678 22954 650769 771404 178606 -156637 180170 421003 -46850
8854d6850p35759k23867O30561J399481J570533O03700r70939j589828p63151
8845a26119J31819J86011L84094J240093J036504j252836l066982j402650K193304
8836f76762L233835O46980j925810j606142K50367J108856P92939L56815j49606
8827B031472q90463j031749j68928M44394k08155j044214n96997N70921R55283
8818F1564O08357N97380P17134j09926j457888j589392j96457J012170R27644
8809E70586M43132N22869N78549j15497q15875n41277J35881R0535l24793N302
8799E49412O75507K06341j167506j308956M88914J990762J189751o65127j040061
8790I19037Q1057N56737l60016j182895r10420l01122M5128P03699J609969J274216
$$ plain form
8854 -46850 -782609 -1006476 -375915 1023566 2594099 3197799 2226860 637032 -126119
8845 -126119 5700 191711 575805 1815898 2852402 1599566 -1467416 -2870066 -676762
8836 -676762 2557073 3204053 1278243 -327899 -77532 1031324 1824263 2181078 2031472
8827 2031472 1141009 109260 -59668 384726 176571 -867643 -1464640 -893719 61564
8818 61564 669921 1267301 1984435 1874509 416621 -1172771 -1369228 -357058 570586
8809 570586 1013718 1536587 2115136 1999639 1183764 642487 778368 868903 544110 549412
8799 549412 1224919 1431260 263754 -1045202 -556288 1434474 2624225 1959098 919037
8790 919037 1000094 1556831 1196815 13920 -896500 -1197622 -1152494 -448795 1161174 2435390
8780B435390p57068k341339j453964P40198J510526M64718l24533J90194O83658
8771A147780M4339p06145j98379R52715J030823j97793j156647p10086L50142
8762E56749N35542k81764q12998k64478N09378K79900o61033q34152K02803J026943
8752B56890L09076j214365j645630m16455J092105J404931N84196k47660l90826
8743b67738j34562j21424n49411j029851j065410n63758J37314O61865Q75645
8734b057330Q22723O00782L43646J49690q608j60460j83126N651J96205J40999
8724a49828j9966L8668K67449L20306J55827P6466J65169J95320J39853K41605
8714A430869M99162N81562L20605j58519p25676j141374q86070J39560R60801
$$ plain form
8780 2435390 1678322 -663017 -2116981 -1376783 133743 598461 273928 464122 1147780
8771 1147780 1192119 485974 287595 1240310 2271133 2073340 916693 206607 556749
8762 556749 1092291 810527 -2471 -266949 242429 522329 -138704 -972856 -770053 256890
8752 256890 565966 -648399 -2294029 -2710484 -1618379 -213448 370748 123088 -267738
8743 -267738 -402300 -523724 -1073135 -2102986 -3168396 -3732154 -3594840 -2932975 -2057330
8734 -2057330 -1234607 -633825 -290179 -140489 -149097 -309557 -492683 -487032 -290827 -149828
8724 -149828 -169794 -131126 136323 456629 612456 688922 854091 1049411 1189264 1430869
8714 1430869 1930031 2511593 2832198 2673679 1948003 806629 -79441 60119 1020920
8705A020920N91372l57121l65989O19292R70269p1287j170069j014074j93957
8696B9356J27909J03262L69638M55556l17791j113194n83495P72932J116660J32040
8686A092873m37433M37554J408248P63352j071744k166348j573358j55133Q02106
8677h99883Q88500M43820j32662n76100o20651j42106N34991Q02838M45885m5962
8667F98670r2842K11521K93689n6735m59646n28904k57631J72047N25996M93473
8657I99638K0493l70807j67775K69888J23165n92805r38559l88715N33167J135364
8647F23054J252625Q68443l7973r63362j119035n48213r4897M717L56325Q74878
8637A216562M62906j003547j824811q15684P25365Q22647l58084j069476o51353
$$ plain form
8705 1020920 1612292 1255171 889182 1508474 2478743 2407456 1237387 223313 29356
8696 29356 157265 260527 630165 1085721 767930 -345264 -928759 -155827 960833 1092873
8686 1092873 655440 1092994 2501242 3264594 2192850 26502 -1546856 -1701989 -899883
8677 -899883 -11383 432437 299775 -276325 -896976 -1039082 -504091 298747 744632 698670
8667 698670 605828 817349 1111038 1054303 594657 65753 -191878 -19831 506165 999638
8657 999638 1020131 649324 481549 751437 874602 281797 -656762 -1045477 -512310 623054
8647 623054 1875679 2744122 2706149 1742787 623752 75539 -19358 -14641 341684 1216562
8637 1216562 1679468 675921 -1148890 -1964574 -1239209 -416562 -774646 -1844122 -2495475
8628b495475M1262M65563R12935J236461O77866o79467j542029r93535L90085
8619a986334J382207J417073Q05493J67277j31721k48076n35947q23148m69562
8610d22738N02377J011922L38005o96014q39322j79319K28630O6477n7177J20873
8600G3714K24368J50949J87729J96517k65324r16646q78091m7367N95366L83659
8590b95126j55185k27016Q9655J37185k69022n47467q7258Q80366J310459N23933
8580A360524p21425r73137m5970O36871J31401o13676l19185N81227P27990K1491
8570G86111m34017k45804q9259j86576R1844Q33508J103335L63498o46220r98934
8560E77486p58661n25187m10913m6692O71011J239043R76080j68231j230066j059350
$$ plain form
8628 -2495475 -2454213 -1988650 -1075715 160746 838612 159145 -1382884 -2376419 -1986334
8619 -1986334 -604127 812946 1618439 1785716 1653995 1405919 869972 46824 -422738
8610 -422738 79639 1091561 1429566 733552 -105770 -285089 -56459 10018 -47159 73714
8600 73714 298082 449031 636760 833277 567953 -348693 -1226784 -1274151 -678785 -295126
8590 -295126 -450311 -677327 -587672 -450487 -719509 -1266976 -1354234 -473868 836591 1360524
8580 1360524 639099 -334038 -380008 256863 388264 -225412 -544597 36630 764620 786111
8570 786111 352094 106290 17031 -169545 -77701 755807 1859142 2222640 1576420 577486
8560 577486 -181175 -706362 -1117275 -1163967 -492956 746087 1722167 1553936 323870 -735480
8550g35480K49063J302866J156052M01763p350j33113l81978l85686K23625O70975
8540B360737R6060q22678q30266j92353j28172n19607j48131Q55145R26974k17846
8530A379863r00854k36594L95942k65300j221382q57521N28496J320061Q87304
8521A030015j8827o26197p62317m82751O454L01735K81111K78036L70283J00774
8511D78316o09961r92489n14017K13511L15461j03054k86614O1511O20861R86404
8501A69929Q55706J59095n67802n41160J08455K85473m14993q96744k07335Q95714
8491a53662J107501N70591L83612N82553J24385j131972j871941j159791K71983
8482a276741J098336R36217K80997l62695o60062l13474N33614J068047O52779
$$ plain form
8550 -735480 -486417 816449 1972501 2374264 2366914 2233801 1851823 1466137 1689762 2360737
8540 2360737 2456797 1634119 803853 611500 483328 -36279 -184410 670735 1597709 1379863
8530 1379863 479009 242415 638357 373057 -848325 -1705846 -1177350 142711 1030015
8521 1030015 1011188 384991 -377326 -860077 -853623 -551888 -270777 7259 377542 478316
8511 478316 -131645 -1124134 -1638151 -1424640 -1109179 -1212233 -1498847 -1437336 -816475 169929
8501 169929 1025635 1184730 616928 75768 184223 469696 54703 -842041 -1049376 -153662
8491 -153662 953839 1524430 1908042 2490595 2614980 1483008 -388933 -1548724 -1276741
8482 -1276741 -178405 757812 1038809 676114 16052 -297422 236192 1304239 1957018
8473A957018k46709n99488k07173J01830k21457o59478n33014p4798N4654p8121
8463e06736J61272P81465J005376M49540l23679p03882p48843o64941l28152K03836
8453f74744M18886J46265n9055J02285J01159k97055k45970Q02646J751751J231911
8443C278079k45484r76714n47207n3267j5442J87507O14756K85601r34079j530526
8433F3224m55021J104653J232623j28542j208251p29494P00117J534331J055961
8424C169601l951m73786j53655J14666j82470m83742k38012N7267k13349n23305
8414A069264p9560N81763L06779o94029j116582o55134k06324m3098M42484J043968
8404F49531O83118n56239j197124p06646j99794k08015K06141J236666J402230
$$ plain form
8473 1957018 1710309 1110821 903648 1005478 784021 124543 -408471 -483269 -428615 -506736
8463 -506736 -345464 436001 1441377 1890917 1567238 863356 114513 -550428 -878580 -674744
8453 -674744 -255858 -109593 -168648 -66363 34796 -262259 -508229 294417 2046168 3278079
8443 3278079 3032595 2055881 1508674 1455407 1439965 1627472 2242228 2527829 1593750 63224
8433 63224 -391797 712856 1945479 1816937 608686 -120808 579309 2113640 3169601
8424 3169601 3165650 2691864 2538209 2652875 2470405 1986663 1748651 1805918 1592569 1069264
8414 1069264 989704 1571467 1878246 1184217 67635 -587499 -793823 -836921 -394437 649531
8404 649531 1332649 776410 -420714 -1127360 -1327154 -1535169 -1329028 -92362 1309868
8395A309868R8221r88128n81546L7786n35850j154007j94146J243421R40132o50273
8385d74522j079856P8051P39717o4563p60366o8464J001129J000041J55929m44308
8375H2788n17655m26677k67815J9444K37787K36878J89997K35000K75789K84050
8365C49586L27945K86686L6888j87907j68266j71784l98904l48404L77570J028042
8355A131452N98923m54518o70505K64221J088407Q67386R8369m02270n78828o46351
8345A296286m95556j19633R8035m2382k62741l05804j61862K23910P68951Q58698
8335A857902L6639r57038q98518J05926O78057K26419k89166k8760N10743N27751
8325A769955J10353k37488l86004l56903j39821j33776q27704j661189j318287
$$ plain form
8395 1309868 1408089 419961 -161585 -123799 -659649 -1813656 -2007802 -764381 175751 -474522
8385 -474522 -1554378 -1476327 -736610 -801173 -1561539 -1630003 -628874 371167 527096 82788
8375 82788 -434867 -861544 -1129359 -1109915 -872128 -635250 -445253 -210253 65536 349586
8365 349586 677531 964217 1001105 813198 644932 473148 74244 -274160 103410 1131452
8355 1131452 1730375 1275857 605352 869573 1957980 2825366 2923735 2521465 1942637 1296286
8345 1296286 800730 681097 779132 736750 474009 168205 6343 230253 999204 1857902
8335 1857902 1894541 937503 38985 144911 822968 1049387 760221 731461 1242204 1769955
8325 1769955 1880308 1642820 1256816 899913 760092 626316 -201388 -1862577 -3180864
8316c180864L19383J656414J440803K15066q77364j436697j256162L2199J683684
8307a403538J772277j37361j668912p60101J156938J242949m52271j297354k59750
8298a807123Q81755P19535R3075L1816K5795m97562p39815N0232J007053Q82296
8288F47057j3951l61034K24986Q34806N58549n62445j615725j519837j37402J156215
8278g88781Q31901o76142j327690l12725Q62566Q41893M16185Q03173J350354
8269B000734P20704o07488j010762l52954N7596r3341J92877R74828Q91832m55433
8259B318593j508141j057951J1077L56501J76928L24849N81302K84407j34940
8250A352625J90989Q21233M62109r15832j824436j323482j50527N67502O97518
$$ plain form
8316 -3180864 -2861481 -1205067 235736 450802 -426562 -1863259 -3119421 -3087222 -1403538
8307 -1403538 368739 231378 -1437534 -2197635 -1040697 202252 -250019 -1547373 -1807123
8298 -1807123 -925368 -205833 -112758 -80942 -55147 -552709 -1292524 -1242292 -235239 647057
8288 647057 633106 272072 497058 1331864 1890413 1327968 -287757 -1807594 -1944996 -788781
8278 -788781 43120 -633022 -1960712 -2273437 -1410871 -568978 -152793 650380 2000734
8269 2000734 2721438 2113950 1103188 750234 807830 714489 907366 1882194 2774026 2318593
8259 2318593 810452 -247499 -236422 120079 297007 621856 1203158 1487565 1352625
8250 1352625 1543614 2364847 2826956 1911124 86688 -1236794 -1387321 -819819 -122301
8241a22301O75191N47274J44554k98152l76007j33160O0035P9169P1978P5413
8231G23994L4194O0022J90744J3601q07956j585474j066718O77679J717348O19240
8221E76674j265281j321543O33648J917526Q01438r96487r42792O22894J343911
8212A369988N49784j50118J37921K71139o49598j585344j193169J96591J276968
8203B24162J412944P21227m92150j497940j339172j99082L80508l67294j081874
8194b238671k42215J436485K005973J037570j32143n31286m43617k80165O6532
8185F78463N72102Q22014O09608J23613m09173p25156n20300n3074j66181r50632
8175a8716j187129j59864Q81725M91210n99119o61158J38496J81674n84049m87170
$$ plain form
8241 -122301 552890 1100164 1244718 946566 570559 437399 497434 576603 648581 723994
8231 723994 758188 818210 1008954 1022555 214599 -1370875 -2437593 -1759914 -42566 576674
8221 576674 -688607 -2010150 -1376502 541024 1342462 345975 -596817 26077 1369988
8212 1369988 1919772 1769654 1907575 2178714 1529116 -56228 -1249397 -1052806 224162
8203 224162 1637106 2358333 1866183 368243 -970929 -1170011 -789503 -1156797 -2238671
8194 -2238671 -2480886 -1044401 961572 1999142 1866999 1335713 892096 611931 678463
8185 678463 1250565 2072579 2682187 2805800 2396627 1671471 1151171 1098097 931916 -18716
8175 -18716 -1205845 -1365709 -483984 7226 -591893 -1253051 -1114555 -932881 -1516930 -2004100
8165b004100Q08608J522429P22193j94463k5410K96494l54560j189985r19557
8156a338351J19288Q09983J056350J193156P09422p34230j901114j409151J6366
8147a478281N05171j29593l56198L92620Q76059K42286n68065l68432M76574O70884
8137B63025k19946j273280j243689J86414J939504K339790Q25143j187201j725480
8128i5720n46012O86024N86275l63484p81647k56576L87003L73176j15046l46890
8118d72897M6176P46171J142521Q62428j4187j017761j481951r60349K36662J095396
8108A82209R10870J60512j28538J79038K17569m29292j024299q65675l60897j85094
8098a343597o4510N97298J328374J032227k32775j094946p38430J21590N48465
$$ plain form
8165 -2004100 -1195492 326937 1049130 854667 829257 1125751 771191 -418794 -1338351
8156 -1338351 -1219063 -409080 647270 1840426 2549848 1815618 -85496 -1494647 -1478281
8147 -1478281 -973110 -1102703 -1458901 -1066281 -190222 52064 -516001 -884433 -407859 263025
8137 263025 43079 -1230201 -2473890 -2287476 -347972 1991818 2816961 1629760 -95720
8128 -95720 -641732 44292 630567 267083 -514564 -771140 -384137 -10961 -126007 -472897
8118 -472897 -426721 319450 1461971 2324399 2310212 1292451 -189500 -1149849 -913187 182209
8108 182209 1093079 1253591 1125053 1304091 1521660 1092368 68069 -797606 -1158503 -1343597
8098 -1343597 -1408107 -810809 517565 1549792 1317017 222071 -516359 -394769 153696
8089A53696O37239P70736N72341l31276j127287p07942M48296O63152m51374j242599
8079f15018m25472R40779R79444l00161j147788n66415O44680J303104J098179
8070A911332K90521p20974j247134p35677L09045P34385L01754j43967k14306
8061D84979m13403p42609l99946N22681O83737k50108o88995K87032J144913L82498
8051A010779q16191n17348O88768P71574l09523q16136l14246K068k31416k49399
8041g81070j21614n39005q19335K39251J631741J170044o99309j262889n0337
8032a232523N00783l84891m11035J210790J725404l26785j930592l35919K173498
8023I88730J888405m27026j228159m2889M82887n74903j477385j346545j029623
$$ plain form
8089 153696 790935 1561671 2134012 1802736 675449 -32493 415803 1078955 627581 -615018
8079 -615018 -1040490 -99711 879733 579572 -568216 -1134631 -489951 813153 1911332
8070 1911332 2201853 1480879 233745 -501932 -192887 541498 843252 699285 484979
8061 484979 71576 -671033 -1070979 -548298 135439 -114669 -803664 -516632 628281 1010779
8051 1010779 194588 -322760 366008 1137582 828059 11923 -302323 -300255 -531671 -781070
8041 -781070 -902684 -1441689 -2261024 -2021773 -390032 780012 80703 -1182186 -1232523
8032 -1232523 -731740 -1116631 -1527666 -316876 1408528 1081743 -848849 -1184768 988730
8023 988730 2877135 2450109 1221950 1179061 1661948 1087045 -390340 -1736885 -2766508
8014b766508n33279R93367K538998J792423j012549k779949j837613R3853R76748
8005b534509R58948Q68694N74322N196j52207J47298p0488r13033j096781j41520
7995b354080O96804N91218M38459R47318J214662M83978k73817K3952O94071M88886
7985B951451l82855q38258o75166m57226l41206j65163j02959k44037j19717M88133
7975A12997R24962O62902J94428J06184N6044m13303q33442o08900j52624j44664
7965i5416k75284J39955Q00746Q58782L65616J22710K77156J74670m08899q64752
7955A095284o89567q6712M55310O30043L91825K8096k3421J56722j01610q96966
7945I59004j125907L8519J515625J433248k51318j603107j382607m90587j74174
$$ plain form
8014 -2766508 -3299787 -2306420 232578 2025001 1012452 -1767497 -3605110 -3511257 -2534509
8005 -2534509 -1575561 -706867 -132545 -127349 -279556 -132258 -202746 -1115779 -2212560 -2354080
7995 -2354080 -1657276 -1066058 -627599 319719 1534381 2018359 1744542 1768494 2462565 2951451
7985 2951451 2568596 1730338 1055172 597946 256740 91577 -11382 -255419 -375136 112997
7975 112997 1037959 1700861 1895289 2001473 2057517 1644214 810772 201872 49248 -95416
7965 -95416 -370700 -230745 570001 1428783 1794399 1917109 2194265 2368935 1960036 1095284
7955 1095284 405717 319005 774315 1404358 1796183 1824279 1800858 1957580 1855970 959004
7945 959004 -166903 -128384 1387241 2820489 2569171 966064 -416543 -907130 -1081304
7936a081304j20261N71071J452381J224974j15589j024912n33466M96841P51396
7927A621131K13161k10446k04971k60656n72462o39148j24622N45956P38024L22564
7917A428531l70903r17836r32425k80690N66455P87673J55480n73766n39012J96591
7907d79902Q01061O83380R3365k03572K35628R34386R02677p2476q83714m94059
7897A516774M64745N23438l38115o29371J87755P73964J81881n38882k11476L93270
7887B323983o3203j123050j364925q28061o42222p12371J05249J561333J871817
7878A128550M56883j014821j009786m1857N41649L73326j19379n93596p13968
7869i92999j49422O72222P14859j32543o21354N3286R52075P62336l11776j006059
$$ plain form
7936 -1081304 -1201565 -630494 821887 2046861 1931272 906360 372894 869735 1621131
7927 1621131 1834292 1623846 1418875 1158219 585757 -53391 -178013 367943 1105967 1428531
7917 1428531 1057628 139792 -792633 -1073323 -506868 280805 436285 -137481 -676493 -479902
7907 -479902 321159 1004539 1097904 894332 1129960 2064346 2967023 2894547 2010833 1516774
7897 1516774 1981519 2504957 2166842 1537471 1725226 2499190 2681071 2142189 1930713 2323983
7887 2323983 2260780 1137730 -227195 -1055256 -1697478 -2409849 -2304600 -743267 1128550
7878 1128550 1585433 570612 -439174 -481031 60618 433944 314565 -279031 -992999
7869 -992999 -1142421 -470199 244660 112117 -509237 -455951 496124 1258460 946684 -59375
7859e9375q14762l78855k96740l82080j49049M55465R25050P08217q3234o20559
7849f95922l44828K06989J49657l59211l11483N48013J222284Q19392l55923j330657
7839d51689j410816m43953J098746K097289J620871P1888j154545j279274p13792
7830e65275p2833M30542N62244J41552k86743J8064O02067K35709r69682j310287
7820a214642M4258J717899K040546J024960l59615j538269j996140j018429R26623
7811c72809J784157M22250j440678j431740J71982J097364M60615m16752m26193
7802a51804m3746M300j08974j8849J40734K50021M76287O53182K80487m70893
7792A010745o51079M2868N40216j65062j390370j457195J03483J808553J945671
$$ plain form
7859 -59375 -874137 -1252992 -1549732 -1931812 -2080861 -1625396 -700346 7871 -75363 -695922
7849 -695922 -1040750 -833761 -684104 -1043315 -1354798 -806785 415499 1234891 878968 -451689
7839 -451689 -1862505 -2306458 -1207712 889577 2510448 2582336 1427791 148517 -565275
7830 -565275 -638108 -207566 354678 496230 209487 227551 829618 1065327 95645 -1214642
7820 -1214642 -1170384 547515 2588061 3613021 3253406 1715137 -281003 -1299432 -372809
7811 -372809 1411348 1833598 392920 -1038820 -866838 230526 691141 274389 -151804
7802 -151804 -195550 -191250 -300224 -319073 -178339 71682 547969 1201151 1481638 1010745
7792 1010745 359666 402534 942750 777688 -612682 -2069877 -1966394 -157841 1787830
7783A787830N41742q63202j173217p78941m88462k23596M79017J199129R88386
7774A468686n3233o87867l00847K81151J77378l17602n02403l79614k49868L8521
7764e25698N87045Q14950K26667o39195q76113m69085r9700j9748P5770K74421
7754f50686L19680J72846P4717Q6534L6802j32366k77550j93620K73310R26370
7744F36037J028419O5511j185432j249943K7932J043286N84777n43529q32473
7735d25415j02260O95429R45553O78183O2827m90987l65373K88601L66608n08630
7725A144536j066599k68485R00673R47694K46790J59979N14438K724j222086j502064
7715a42400l72797O80598O04397J21659O8422K4555n18486r66457o10028J48724
$$ plain form
7783 1787830 2329572 1466370 293153 -485788 -974250 -1197846 -718829 480300 1468686
7774 1468686 1415453 727586 426739 707890 885268 567666 65263 -314351 -564219 -525698
7764 -525698 61347 876297 1102964 463769 -412344 -881429 -981129 -1000877 -925107 -650686
7754 -650686 -331006 -158160 -83443 3091 39893 -92473 -370023 -563643 -290333 636037
7744 636037 1664456 1729967 544535 -705408 -677476 365810 950587 407058 -425415
7735 -425415 -527675 167754 1113307 1791490 1854317 1363330 997957 1286558 1653166 1144536
7725 1144536 77937 -190548 710125 1657819 1904609 2064588 2579026 2581750 1359664 -142400
7715 -142400 -515197 165401 769798 891457 959879 984434 465948 -500509 -1110537 -961813
7705i61813M68312K68291N734j83982m65850p97316q99223n22836L44199J239166
7695a505318J394402O81853M2599K01913M22775l27753j401826j210995J84484
$$ plain form
7705 -961813 -493501 -225210 -219476 -403458 -869308 -1666624 -2565847 -3088683 -2744484 -1505318
7695 -1505318 -110916 570937 613536 815449 1238224 910471 -491355 -1702350 -1517866
$$ [...]
##END NTUPLES=NMR SPECTRUM
##END=
