##TITLE=31Pdec_DE2_k'
 CDCl3, 24 sc
 5.7.2023
##JCAMPDX= 6.0         $$ Bruker NMR JCAMP-DX V2.0
##DATA TYPE= NMR SPECTRUM
##DATA CLASS= NTUPLES
##ORIGIN= UXNMR, Bruker Analytische Messtechnik GmbH
##OWNER= root
$$ XWIN-NMR		Version 3.5
$$ Wed Jul  5 13:44:00 2023 Russian Standard Time (UT+4h)  she@DPX200
##.OBSERVE FREQUENCY= 81.013821
##.OBSERVE NUCLEUS= ^31P
##.ACQUISITION MODE= SIMULTANEOUS
##.ACQUISITION SCHEME= undefined
##.AVERAGES= 24
##.DIGITISER RES= 16
##SPECTROMETER/DATA SYSTEM= spect
##.PULSE SEQUENCE= zgpg30
##.SOLVENT NAME= CDCl3
##.SHIFT REFERENCE= (INTERNAL, CDCl3, 0, 248.564)
##AUDIT TRAIL= $$ (NUMBER, WHEN, WHO, WHERE, WHAT)
$$ ##TITLE= Audit trail, XWIN-NMR		Version 3.5
$$ ##JCAMPDX= 5.01
$$ ##ORIGIN= Bruker BioSpin GmbH
$$ ##OWNER= she
$$ F:/spectra/data/she/nmr/P31/1/pdata/1/auditp.txt
$$ ##AUDIT TRAIL=  $$ (NUMBER, WHEN, WHO, WHERE, WHAT)
(   1,<2023-07-05 13:42:52.04 +0400>,<she>,<DPX200>,
      <created by zg, POWCHK disabled, PULCHK disabled
       configuration hash MD5:
       00 E9 B6 7A A2 85 ED C7 34 08 36 98 17 FE 4E 26
       data hash MD5: 32K
       5A 76 47 5B 26 F2 D3 F5 6A DE 60 F8 BA 05 88 3D>)
(   2,<2023-07-05 13:43:05.93 +0400>,<she>,<DPX200>,
      <Start of raw data processing
       efp BC_mod = 2 LB = 1 FT_mod = 6 PKNL = 1 PHC0 = -10838.22 PHC1 = 439.4848 SI = 64K 
       data hash MD5: 64K
       B3 4E 78 2F 6D B6 C4 CF 21 D4 22 39 26 6D 5D E1>)
(   3,<2023-07-05 13:43:28.78 +0400>,<she>,<DPX200>,
      <pk PHC0 = 11.26027 PHC1 = 0 
       data hash MD5: 64K
       F7 8B 60 C7 B8 47 87 DB 00 A4 7B 79 85 5F 49 79>)
(   4,<2023-07-05 13:43:32.76 +0400>,<she>,<DPX200>,
      <abs ABSG = 5 
       data hash MD5: 64K
       76 3A FF FC 51 86 AC 28 41 61 85 12 8F 96 AA 0F>)
$$ ##END=
$$ 
$$ hash MD5
$$ 88 BB 79 C3 D9 5B EF 9E A5 39 19 34 78 CF 89 99
##$RELAX= 
##$RELAX= 
##$RELAX= 
##$RELAX= 
##$RELAX= 
##$RELAX= 
##$RELAX= 
##$RELAX= 
##$RELAX= 
$$ Bruker specific parameters
$$ --------------------------
##$DU= <F:/spectra>
##$EXPNO= 1
##$NAME= <P31>
##$PROCNO= 1
##$TYPE= <nmr>
##$USER= <she>
##$AMP= (0..31)
100 100 100 100 100 100 100 100 100 100 100 100 100 100 100 100 100 100 
100 100 100 100 100 100 100 100 100 100 100 100 100 100 
##$AQSEQ= 0
##$AQ_mod= 1
##$AUNM= <au_zg>
##$AUTOPOS= <>
##$BF1= 81.014009
##$BF2= 200.13
##$BF3= 200.13
##$BF4= 200.13
##$BF5= 200.13
##$BF6= 200.13
##$BF7= 200.13
##$BF8= 200.13
##$BYTORDA= 1
##$CFDGTYP= 0
##$CFRGTYP= 5
##$CHEMSTR= <none>
##$CNST= (0..31)
1 1 145 1 1 1 1 1 1 1 1 1 1 1 1 1 1 1 1 1 1 1 1 1 1 1 1 1 1 1 1 1 
##$CPDPRG= <waltz16>
##$CPDPRG1= <>
##$CPDPRG2= <waltz16>
##$CPDPRG3= <>
##$CPDPRG4= <mlev>
##$CPDPRG5= <mlev>
##$CPDPRG6= <mlev>
##$CPDPRG7= <mlev>
##$CPDPRG8= <mlev>
##$CPDPRGB= <>
##$CPDPRGT= <>
##$D= (0..31)
0 1 0 0 0 0 0 0 0 0 0 0.03 2e-05 3e-06 0 0 0 0 0 0 0 0 0 0 0 0 0 0 0 0 
0 0 
##$DATE= 1688550171
##$DBL= (0..7)
120 120 120 11 120 120 24 19 
##$DBP= (0..7)
150 150 150 150 150 150 150 150 
##$DBP07= 0
##$DBPNAM0= <>
##$DBPNAM1= <>
##$DBPNAM2= <>
$$ [...]
##$SUBNAM3= <"">
##$SUBNAM4= <"">
##$SUBNAM5= <"">
##$SUBNAM6= <"">
##$SUBNAM7= <"">
##$SUBNAM8= <"">
##$SUBNAM9= <"">
##$SW= 501.771253377433
##$SWIBOX= (0..15)
0 1 3 0 0 0 0 0 0 0 0 0 0 0 0 0 
##$SW_h= 40650.406504065
##$TD= 32768
##$TD0= 1
##$TE= 0
##$TE2= 300
##$TE3= 300
##$TEG= 300
##$TL= (0..7)
0 120 53 12 22 120 120 120 
##$TP= (0..7)
150 150 150 150 150 150 150 150 
##$TP07= 0
##$TPNAME0= <>
##$TPNAME1= <>
##$TPNAME2= <>
##$TPNAME3= <>
##$TPNAME4= <>
##$TPNAME5= <>
##$TPNAME6= <>
##$TPNAME7= <>
##$TPOAL= (0..7)
0.5 0.5 0.5 0.5 0.5 0.5 0.5 0.5 
##$TPOFFS= (0..7)
0 0 0 0 0 0 0 0 
##$TUNHIN= 0
##$TUNHOUT= 0
##$TUNXOUT= 0
##$USERA1= <user>
##$USERA2= <user>
##$USERA3= <user>
##$USERA4= <user>
##$USERA5= <user>
##$V9= 5
##$VALIST= <valist>
##$VCLIST= <CCCCCCCCCCCCCCC>
##$VD= 0
##$VDLIST= <DDDDDDDDDDDDDDD>
##$VPLIST= <PPPPPPPPPPPPPPP>
##$VTLIST= <TTTTTTTTTTTTTTT>
##$WBST= 1024
##$WBSW= 4
##$XGAIN= (0..3)
0 0 0 0 
##$XL= 0
##$YL= 0
##$YMAX_a= 4975
##$YMIN_a= -4946
##$ZGOPTNS= <>
##$ZL1= 120
##$ZL2= 120
##$ZL3= 120
##$ZL4= 120
##$ABSF1= 248.5645
##$ABSF2= -253.2056
##$ABSG= 5
##$ABSL= 3
##$ALPHA= 0
##$AQORDER= 0
##$ASSFAC= 0
##$ASSFACI= 0
##$ASSFACX= 0
##$ASSWID= 0
##$AUNMP= <proc_1d>
##$AZFE= 0.1
##$AZFW= 0.5
##$BCFW= 0
##$BC_mod= 2
##$BYTORDP= 0
##$COROFFS= 0
##$CY= -3
##$DATMOD= 1
##$DC= 0
##$DFILT= <>
##$DTYPP= 0
##$F1P= 0
##$F2P= 0
##$FCOR= 1
##$FTSIZE= 65536
##$FT_mod= 6
##$GAMMA= 0
##$GB= 0
##$INTBC= 1
##$INTSCL= 6.047779e-11
##$ISEN= 30
##$LB= 1
##$LEV0= 0
##$LPBIN= 0
##$MAXI= 10000
##$MC2= 0
##$MEAN= 0
##$ME_mod= 0
##$MI= 50
##$NCOEF= 0
##$NC_proc= -6
##$NLEV= 6
##$NOISF1= 182.463
##$NOISF2= 159.3651
##$NSP= 0
##$NTH_PI= 0
##$NZP= 0
##$OFFSET= 248.5645
##$PC= 4
##$PHC0= -10826.96
##$PHC1= 439.4848
##$PH_mod= 1
##$PKNL= yes
##$PPARMOD= 0
##$PSCAL= 0
##$PSIGN= 0
##$REVERSE= no
##$SF= 81.0140089999694
##$SI= 65536
##$SIGF1= 159.3651
##$SIGF2= -187.1042
##$SINO= 113.3802
##$SIOLD= 16384
##$SREGLST= <1H.CDCl3>
##$SSB= 0
##$STSI= 65536
##$STSR= 0
##$SW_p= 40650.406504065
##$SYMM= 0
##$S_DEV= 0
##$TDeff= 32768
##$TDoff= 0
##$TI= <>
##$TILT= no
##$TM1= 0
##$TM2= 0
##$TOPLEV= 0
##$USERP1= <user>
##$USERP2= <user>
##$USERP3= <user>
##$USERP4= <user>
##$USERP5= <user>
##$WDW= 1
##$XDIM= 65536
##$YMAX_p= 361601955
##$YMIN_p= -213251494
$$ End of Bruker specific parameters
$$ ---------------------------------
##NTUPLES= NMR SPECTRUM
##VAR_NAME=  FREQUENCY,     SPECTRUM/REAL,   SPECTRUM/IMAG
##SYMBOL=    X,             R,               I
##VAR_TYPE=  INDEPENDENT,   DEPENDENT,       DEPENDENT
##VAR_FORM=  AFFN,          ASDF,            ASDF
##VAR_DIM=   65536,         65536,           65536
##UNITS=     HZ,            ARBITRARY UNITS, ARBITRARY UNITS
##FACTOR=    0.620285442955139, 1,           1
##FIRST=     20137.2065510682, 0,            0
##LAST=      -20513.1999529968, 0,           0
##MIN=       -20513.1999529968, -213251494,  0
##MAX=       20137.2065510682, 361601955,    0
$$ Real data points
##PAGE= N=1
##DATA TABLE= (X++(R..R)), XYDATA
$$ [...]
##PAGE= N=2
##DATA TABLE= (X++(I..I)), XYDATA
13258B563211Q8716q37535q13691n34128o79283p07545l9369M61491k39806j238837
13248a976776p75878Q72048J683109J057331M53986O06669M86147l16059n62821
13239A527756K42893O75813j50040r95612p48152k74824n03428n80924L17672
13230d88846J132042P52310P2349K52310N30012j04957o14122K77477J332030
13221C140605N93936j069228j139072M11082J122273Q0068r68649q33327m71515
13212H66173o73937o42054J04246N14789r7348o89445k53565N04477M99751M6022
13202A79109j5764K9755n71598j332429r17925Q10724K286130K063162M81353
13193C012517q64582r72174l50038j02818m76628p17956l02502K86485L13700
$$ plain form
13258 2563211 2651927 1814392 1000701 466573 -212710 -920255 -959624 -498133 -737939 -1976776
13248 -1976776 -2752654 -1880606 -197497 859834 1313820 1920489 2406636 2090577 1527756
13239 1527756 1770649 2446462 2296422 1300810 552658 277834 -225594 -806518 -488846
13230 -488846 643196 1395506 1467855 1720165 2250177 2145220 1531098 1808575 3140605
13221 3140605 3734541 2665313 1526241 1937323 3059596 3139664 2171015 1337688 866173
13212 866173 192236 -449818 -345572 169217 71869 -617576 -871141 -366664 133087 179109
13202 179109 163345 193100 -378498 -1710927 -2628852 -1818128 468002 2531164 3012517
13193 3012517 2147935 1175761 825723 722905 246277 -471679 -774181 -487696 -173996
13184a73996j42540l77395o5223L97218M75052J10731k26565n2412M37371L87522
13174G69763n29124j239576n15560J008756J351319L222j203325p69708L38551
13165g85682L96906m12860n46109L89399J182582Q58054k24186j036252q45462
13156a023610K57405J181830O88530r55086j881861r43810P14318J313434P41781
13147I2931P4810k42747l37988J01192J137905J548957K81015j458712j457521
13138b60158K62178J336785M09880j156957j432353l27823Q06179R46576J62177
13129G46484o82197o62193K19442Q28457L31782m90314l29040O07334R20547K57068
13119A747370k44429O3324L35769k27392j003697q75783J69478J059246R25630
$$ plain form
13184 -173996 -316536 -693931 -759154 -361936 113116 223847 -2718 -55130 382241 769763
13174 769763 240639 -998937 -1514497 -505741 845578 848800 -354525 -1124233 -785682
13165 -785682 -388776 -801636 -1347745 -958346 224236 1082290 858104 -178148 -1023610
13156 -1023610 -766205 415625 1104155 149069 -1732792 -2676602 -1962284 -648850 92931
13147 92931 167741 -75006 -412994 -311802 826103 2375060 2656075 1197363 -260158
13138 -260158 2020 1338805 1748685 591728 -840625 -1168448 -362269 584307 746484
13129 746484 64287 -597906 -378464 449993 781775 291461 -37579 569755 1490302 1747370
13119 1747370 1502941 1566265 1902034 1674642 670945 -204838 -35360 1023886 1949516
13110A949516l2651q56008q75019m26356k46651k45775K83666J067129P73971
13101A391822p26671j517126l78159J003172M53279j182277j312369K67679J183784
13092h16866M06065l34276L14629J200086Q30524k58310o77576l43101j13969
13083B07206k07646j53850K15459N64646N12892p8174q75331j104605m18938M24779
13073i13562N55255L09718M70173O18013k10696j463600j492448j52075Q61949
13064a417273O14946O6474J22426L49956K76474K60139L61361p580o37867m52539
13054d63483M35665M87933n98718j047219M0728R76810K48622r64708q47905J83920
13044a548355O37335M81961M93263L59595m12878q27804J47945J388122J114256
$$ plain form
13110 1949516 1916865 1060857 185838 -240518 -487169 -732944 -449278 617851 1391822
13101 1391822 665151 -851975 -1230134 -226962 226317 -955960 -2268329 -2000650 -816866
13092 -816866 -410801 -745077 -430448 769638 1600162 1341852 664276 321175 207206
13083 207206 -440 -154290 61169 625815 1138707 1060533 185202 -919403 -1338341 -913562
13073 -913562 -358307 -48589 421584 1039597 828901 -634699 -2127147 -2279222 -1417273
13064 -1417273 -802327 -735853 -613427 -263471 13003 273142 634503 626923 -10944 -463483
13054 -463483 -27818 460115 -138603 -1185822 -1145094 -168284 80338 -884370 -1732275 -1548355
13044 -1548355 -911020 -429059 64204 423799 10921 -816883 -668938 719184 1833440
13035A833440j81899o09836J098K51809q6602l9740J53766o91642j956038j511522
13025b837166P12808K137256J379051J62750J77891M46249m63555j624262j273139
13016a182117K22458J050582P52337L63019L06156L6876m41020m56848j14166
13007E37277k70792q48627o44709O67640J656805J059299l77179r55782l50263
12998D73669J93513j86946q33868p12605L9887L95745P124l06432J08211O01915
12988b19787J35265r82162j220198J04956J749019K064375R69155k96371q77667
12979A426585q85820n49016J62829R35789J049309K97720o55936j157659j197332
12970e73531r04501j60881Q04673J166947N60351j75488r2316M88173N78269J31514
$$ plain form
13035 1833440 1651541 1041705 1042803 1294612 1208010 1168270 1322036 630394 -1325644 -2837166
13025 -2837166 -2124358 12898 1391949 1554699 1732590 2178839 1715284 91022 -1182117
13016 -1182117 -959659 90923 843260 1206279 1512435 1549311 1108291 651443 537277
13007 537277 266485 -582142 -1226851 -559211 1097594 2156893 1779714 823932 473669
12998 473669 667182 480236 -353632 -1066237 -1026350 -630605 -623481 -929913 -821702 -219787
12988 -219787 -84522 -1066684 -2286882 -2181926 -432907 1631468 2600623 2304252 1426585
12979 1426585 540765 -8251 154578 1090367 2139676 2437396 1781460 623801 -573531
12970 -573531 -1478032 -1638913 -834240 332707 893058 717570 625254 1113427 1691696 1823210
12960A823210k2088K82013K22970n61460j229557r09924J08187Q52590Q17033
12951A382974K26506m15413o96748n44522l06394k75295j53998M68824J154825
12942H40759R36856k22905j161244j070110n00618l07803l72495o6244N82040
12933a341764R21856N89331j37477o67205n25733J80257O31656K05702m64283
12924f07660k35747O28651N61824q00836j638372m91668J414838J780562L55756
12915I67348r87817q70296K44712J109158R83809k1314j034189j028840k1624
12906f59053P34436L90958l13307l13119J44486J96674o3487M269K27237L4238
12896C83332k79706r8615J72617k18244p76511m36743M55714N26998l56586q88377
$$ plain form
12960 1823210 1801122 2083135 2306105 1744645 515088 -394836 -286649 565941 1382974
12951 1382974 1609480 1194067 497319 -47203 -353597 -628892 -782890 -314066 840759
12942 840759 1777615 1554710 393466 -676644 -1177262 -1485065 -1857560 -1923804 -1341764
12933 -1341764 -419908 169423 31946 -635259 -1160992 -980735 -349079 -143377 -607660
12924 -607660 -843407 -214756 347068 -453768 -2092140 -2583808 -1168970 611592 967348
12915 967348 -20469 -890765 -646053 463105 1446914 1425600 391411 -637429 -659053
12906 -659053 75383 466341 153034 -160085 -15599 181075 117588 121857 349094 383332
12896 383332 103626 5011 177628 -40616 -817127 -1253870 -798156 -271158 -627744 -1516121
12886a516121m78169O060j06045l62097k38313J50275O23392J074740J002189
12877A55911J08220p25978m28790M44958M42090l58078m34313N73882J271598
12868A049500Q53479J56951j24557m23594q55420o17463L56113Q25166J96343
12859A416518n25970n62960n20771q40381p48617J80709R71092Q68806N51536
12850G89962O05292L30671o74858j260799n10673N43486N00072k97797o96390
12841f71034o22516n22356m2673J081035J815510J203793Q5459k20452q3252o19540
12831A403974j377285r80151L60531R77682K71839o59760q83369n27741J21465
12822a292815Q81963J077854K20982p42469m46913O38729P14646m20960q85532
$$ plain form
12886 -1516121 -1994290 -1988230 -2094275 -2456372 -2694685 -2544410 -1921018 -846278 155911
12877 155911 264131 -461847 -890637 -445679 -3589 -361667 -795980 -222098 1049500
12868 1049500 1902979 2059930 1935373 1511779 656359 38896 395009 1220175 1416518
12859 1416518 890548 327588 -193183 -1033564 -1782181 -1601472 -630380 238426 789962
12850 789962 1395254 1725925 1051067 -209732 -720405 -176919 323153 25356 -671034
12841 -671034 -1293550 -1815906 -1858579 -777544 1037966 2241759 2327218 2106766 2023514 1403974
12831 1403974 26689 -953462 -592931 384751 656590 -3170 -886539 -1414280 -1292815
12822 -1292815 -410852 667002 887984 145515 -301398 337331 1051977 631017 -254515
12813b54515K19990J162698K04169j615552j926767m11419R58931Q47475J31832
12804f83158J66655P36965P04867J8907j92924M31267P14186k12445j320033j115303
12794g51016K5193M68838l6442j33453N90251P86458k01381r60475k91060P69263
12784B66176P21985L2207L1027N14534L81086j53221l8390M27069K2098r95089
12774A209482j043360J10062Q88442M92631j5891J46889J45768o87922j347866
12765a01765p28771M53570O90486r1010n96700r8762P65048J041195N55070r2023
12755A796338k30395J58139L45530k54824j147612j276946n49617m5339l97145
12746a601871q10594l08773P41742J159875N90187j91751m21703r3589L59194
$$ plain form
12813 -254515 -34525 1128173 1332342 -283210 -2209977 -2621396 -1662465 -814990 -683158
12804 -683158 -516503 220462 925329 944236 751312 1182579 1896765 1684320 364287 -751016
12794 -751016 -725823 -256985 -293427 -426880 163371 949829 748448 -212027 -503087 266176
12784 266176 988161 1020368 1051395 1565929 1947015 1793794 1755404 2182473 2204571 1209482
12774 1209482 166122 276184 1164626 1657257 1641366 1788255 1934023 1246101 -101765
12765 -101765 -830536 -376966 313520 222510 -374190 -472952 292096 1333291 1888361 1796338
12755 1796338 1565943 1724082 2069612 1814788 667176 -609770 -1159387 -1204726 -1601871
12746 -1601871 -2412465 -2721238 -1979496 -819621 -229434 -421185 -842888 -936477 -577283
12737e77283N32085K20146l67207n76197J6722Q86099J013472J62933p63212q24599
12727b77041r2596O35785Q07653M78978J462k56859n0277M65584O70610J27493
12717B510792p06917q87926k28111L46677J29q38186r73348K5088J257554J533725
12707B039477O73480m09388q12444o03648m93063o62726m54644M44988J102410
12698H24442M73092q58137j236137l19370L87263j46964r42780o86333K19701
12689b285223N13881J34957L3761M42843O90812M70344R3819k93072o76455o57027
12679a531360n0110L79088n5570o31378k17196Q32014J234236Q30192M56795J31502
12669A378213p66416j651198j121511O00114J589525R73076q8450n58862p50034
$$ plain form
12737 -577283 -45198 174948 -192259 -768456 -751734 134365 1147837 1310770 547558 -277041
12727 -277041 -369637 266148 1073801 1552779 1554241 1297382 1247105 1712689 2383299 2510792
12717 2510792 1803875 915949 687838 1034515 1034644 196458 -776890 -751802 505752 2039477
12707 2039477 2712957 2303569 1491125 887477 394414 -268312 -722956 -277968 824442
12698 824442 1297534 439397 -796740 -1116110 -728847 -875811 -1818591 -2504924 -2285223
12689 -2285223 -1771342 -1636385 -1602624 -1159781 -468969 1375 95194 -197878 -874333 -1531360
12679 -1531360 -1581470 -1202382 -1257952 -1889330 -2106526 -1274512 -40276 789916 1246711 1378213
12669 1378213 611797 -1039401 -2160912 -1560798 28727 1001803 913353 354491 -395543
12660c95543q71380l42114O85426R68922J92492l84891q6194J63323k05016l15098
12650e90073L04223O72883K51675j6480K86742K3157j154983j515077l4182J454051
12640c18064R07103p77508j344457n01856L97377P21488N98891j72392j261154
12631a750572j126660P22804K134004J227106m69608l85556Q94471Q51675m63747
12622A633917n97434Q42233J349188k76433j947700j590506L2794J024907R36781
12613A407747M39974p1724m54347m95876m10314p08283j117416o71726P13360
12604a368605J794969J578647M83657m04898n47043k40050k37671r50848j591193
12595a483035p52024J436375K713026J461151q93705j810384j035468k20881M268
$$ plain form
12660 -395543 -1266923 -1609037 -923611 45311 237803 -147088 -233282 -69959 -274975 -590073
12650 -590073 -285850 387033 638708 622228 908970 932127 -222856 -1737933 -1772115 -318064
12640 -318064 589039 -188469 -1532926 -2034782 -1637405 -915917 -317026 -489418 -1750572
12631 -1750572 -2877232 -2154428 -20424 1206682 737074 351518 1245989 2097664 1633917
12622 1633917 1036483 1878716 3227904 2951471 1003771 -586735 -553941 470966 1407747
12613 1407747 1847721 1775997 1321650 825774 415460 -292823 -1410239 -2081965 -1368605
12604 -1368605 426364 2005011 2488668 2083770 1536727 1296677 1059006 108158 -1483035
12595 -1483035 -2235059 -798684 1914342 3375493 2481788 671404 -364064 -584945 -580677
12586e80677K97630M75499l16808j363508q71636R63499J812765O99020o72560
12577D43224p91105k82485k0758M84497J476618J663918J97256j482678j446039
12568B42448J7665R60612M12872p78880j345996q69902J12228O80233M10935j21683
12558b79468j12029L03253L52383l4639j87120N9705J96581J32922K59283L75443
12548A066314j36426r58129j039374l26170J52841J00305K50623O02334J74234
12539a13448r38561j171351j9698Q72452L04409n08287J686J164574J239977J55515
12529I87268o24117l67741K89249O38979N71712J70315l62798n79997l66123l04881
12519E1866p60892j080179n36353L81311N83241J3025k95980K48243J051852J257364
$$ plain form
12586 -580677 -283047 192452 -124356 -1487864 -2359500 -1396001 416764 1115784 443224
12577 443224 -347881 -630366 -651124 -166627 1309991 2973909 3171165 1688487 242448
12568 242448 260113 1220725 1633597 854717 -491279 -1361181 -1248953 -568720 -157785 -279468
12558 -279468 -391497 -88244 264139 229500 42380 102085 298666 431588 690871 1066314
12548 1066314 929888 -28241 -1067615 -1393785 -1240944 -1140639 -890016 -287682 -113448
12539 -113448 -1052009 -2223360 -2243058 -1370606 -1066197 -1574484 -1572798 -408224 831753 987268
12529 987268 363151 -4590 284659 923638 1495350 1665665 1302867 722870 356747 51866
12519 51866 -709026 -1789205 -2325558 -1944247 -1361006 -1347981 -1643961 -1395718 -343866 913498
12509I13498P54685J6994o10117j065147j184450o30851N12078J358604J049373
12500A114667R754l64843M03343J139555P50487k15688o48218o28201q50011r98279
12490b87434k44367R96848J372038N63411m27330q67263q38721m21465K28109
12481G3826K70226p17317j374597k44986J461012J199562p46916j266549P00589
12472f45150K227195R06684j338617j247254R04017K051196R03311q00520j247266
12463A713596n91663Q1620J83123l04224j013788j201998l98547P99430J212866
12454D80415M36059p32487j182957n28445N97743J090968M80491m50996n80900
12445c90109M6501L32556j70759n79775q8351P80283R50409K83409l12380m3848
$$ plain form
12509 913498 1668183 1685177 1075060 9913 -1174537 -1805388 -1293310 65294 1114667
12500 1114667 1124421 759578 1162921 2302476 3052963 2837275 2189057 1560856 710845 -287434
12490 -287434 -531801 465047 1837085 2400496 1973166 1105903 267182 -154283 73826
12481 73826 344052 -373265 -1747862 -1992848 -531836 667726 -79190 -1345739 -645150
12472 -645150 1582045 2488729 1150112 -97142 806875 2858071 3761382 2960862 1713596
12463 1713596 1121933 1203553 1386676 1082452 68664 -1133334 -1531881 -732451 480415
12454 480415 916474 183987 -998970 -1527415 -929672 161296 641787 190791 -390109
12445 -390109 -343608 -11052 -181811 -761586 -849937 -69654 880755 1164164 851784 807936
12435H07936Q35042J229896M35139p89722r45984O1299M91820o32469j675785
12426a82828p47097J070270J110053o92397j614949l78135J072001Q60344j38432
12417C58830k54609L08283L54403j81344n26693m94532l61334j30102J43848R7705
12407f85545j77482n3762M21854L79539k80515m88035J58329N88192R7797m40365
12397d79993j44454M41049M76486J82677J05016J25316L6296M0405P0469k09009
12387F44258l51785M03531J307118O91981j098590j676015l37693P02250N9726
12378C44781n51533L84202J283858L13851j139573p37776P94881R63211l90749
12369A265153j274379j055327q85367j023980m61965Q21162J565355J282701O62480
$$ plain form
12435 807936 1642978 2872874 3308013 2518291 1572307 1633606 2125426 1492957 -182828
12426 -182828 -929925 140345 1250398 558001 -1056948 -1435083 -363082 497262 358830
12417 358830 104221 412504 766907 585563 58870 -435662 -796996 -927098 -783250 -685545
12407 -685545 -863027 -916789 -494935 -115396 -395911 -883946 -725617 -137425 -39628 -479993
12397 -479993 -624447 -183398 293088 475765 580781 706097 742393 782798 853267 644258
12387 644258 292473 696004 2003122 2695103 1596513 -79502 -417195 285055 344781
12378 344781 -206752 177450 1461308 1775159 635586 -102190 692691 1655902 1265153
12369 1265153 -9226 -1064553 -1949920 -2973900 -3435865 -2614703 -1049348 233353 895833
12360H95833O154q87810j415767o23869J003105J859817J350474K96043n88868
12351A895112j190110j226919m85409L35413L41256k10279m61699m19825o17068
12342b039528q35779n14768P2097L48589N63568J080361J263254N14637l24552
12333A27879j56583N34766O31382L57829N38318O77645j92489j339725j153296
12324B5726J43022O75062k23315j219248j161410m29936P5455M2134k29443p9667
12314b381620Q58382J683369R88831o41531o80316J454071K746578R81245j466900
12305C542109j248142N40777L75776j608954j966611M0826J300657K56429p89052
12296D43815j6579J002319M42185q18958j189148p96194k94016N44396J547905
$$ plain form
12360 895833 901987 14177 -1401590 -2025459 -1022354 837463 2187937 2483980 1895112
12351 1895112 705002 -521917 -1007326 -671913 -330657 -540936 -1002635 -1422460 -2039528
12342 -2039528 -2875307 -3390075 -3317978 -2969389 -2405821 -1325460 -62206 452431 127879
12333 127879 -28704 506062 1137444 1495273 2033591 2711236 2518747 1179022 25726
12324 25726 168748 843810 620495 -598753 -1760163 -2190099 -2114644 -2072510 -2301953 -2381620
12314 -2381620 -1523238 160131 1148962 507431 -172885 1281186 4027764 5009009 3542109
12305 3542109 2293967 2834744 3210520 1601566 -365045 -324219 976438 1232867 443815
12296 443815 427236 1429555 1871740 1052782 -136366 -932560 -1226576 -682180 865725
12287H65725J482378L6139j323084j534856j171525p13549K53092J287161R19871
12278A01352o93948j333461j23262J022378O83837J25203N79484R05817J0452
12269A277852p24675J62452J320558O67435j098179j634309n75799L82113L28543
12260A05991p2248j83247l197M51001R61264Q21476r8702p51641m50618o215j98662
12249E75202l59603J78652N59933o4598p65552l82985L56266K07194k47548K14317
12239B71278R00005K47532j217419j473784k70179O52392N76145O10924J199095
12230A495989J195661J44958o15498j10647P13933O35209o9649n59337q99117
12221A931502j401161j469326m20819J091241J701158J151164M45040K37688P7901
$$ plain form
12287 865725 2348103 2384242 1061158 -473698 -1645223 -2358772 -2105680 -818519 101352
12278 101352 -592596 -1926057 -2049319 -1026941 -343104 -217901 361583 1267400 1277852
12269 1277852 553177 715629 2036187 2703622 1605443 -28866 -604665 -222552 105991
12260 105991 33743 -149504 -152701 298300 1259564 2081040 1982338 1230697 780079 773864 575202
12249 575202 215599 394251 954184 889586 124034 -258951 97315 304509 56961 271278
12239 271278 1171283 1418815 201396 -1272388 -1542567 -890175 -314030 296894 1495989
12230 1495989 2691650 2836608 2221110 2110463 2824396 3459605 3389956 2830619 1931502
12221 1931502 530341 -938985 -1359804 -268563 1432595 2583759 3028799 3266487 3344388
12212C344388m99101j025141q71794l83485l60325o38987k54968Q01364J185973
12203A297924K40255p30101l90520M21826J00421q67761o06260Q16484J239213
12194A521481l078q92569j35061P06490M9136r53971n35942O27203Q13632K75328
12184A472649L45135O11195l15522j855905k030940p56152P9154j20473N1375
12175b519484J051675J337019J32270j051822q32541L1351K78292J26810K93100
12166a153330M41123J0005n01338l67719J30068M10201O32133R66170P58055l75798
12156I49570j425936j222679j59160N13169N20452M74288M72697J07752m56157
12147b26004o55430n53549n64100m43112K34320Q94314O49617q602K41712J258037
$$ plain form
12212 3344388 2845287 1820146 948352 564867 204542 -434445 -689413 111951 1297924
12203 1297924 1538179 808078 417558 839384 939805 72044 -534216 282268 1521481
12194 1521481 1518403 625834 490773 1197263 1246399 292428 -243514 383689 1197321 1472649
12184 1472649 1817784 2428979 2113457 257552 -1773388 -2529540 -2450386 -2570859 -2519484
12175 -2519484 -1467809 -130790 1480 -1050342 -1882883 -1851532 -1573240 -1446430 -1153330
12166 -1153330 -712207 -702202 -1203540 -1571259 -1441191 -1030990 -398857 567313 1325368 949570
12156 949570 -476366 -1699045 -1858205 -1345036 -824584 -350296 122401 230153 -226004
12147 -226004 -881434 -1434983 -1999083 -2442195 -2207875 -1313561 -663944 -672546 -430834 827203
12137H27203J365874j1432j320273j224263m52317k65325m52248j98899J58917
12128a572763j38825n35146J11406J373834J592387M38537n21787k52492K92815
12119G87966p9654q67313q08354O0890N35889J31093k87628J11101R09817J005876
12109A499683L8732j117688j316625m27362N70056Q30486N81372M39479K56081
12100A354214n06288j422883j276484J10956J289732J067622Q9629k87858O5640
12091D84280K81503J10539R1473K80702M2634o83924r49729j32862R69864R99721
12081A494201k82025j625038j618263k17432J167749J223352K51483k91346J83575
12072B86256N97708p4206j077920r12998L29777R79482K30557p07225m63340N39435
$$ plain form
12137 827203 2193077 2181645 861372 -362891 -815208 -1080533 -1532781 -1731680 -1572763
12128 -1572763 -1711588 -2246734 -2135328 -761494 830893 1269430 747643 495151 787966
12119 787966 708312 -159001 -967355 -906465 -370576 -239483 -527111 -416010 493807 1499683
12109 1499683 1538415 420727 -895898 -1323260 -753204 77282 658654 1098133 1354214
12100 1354214 847926 -574957 -1851441 -1740485 -450753 616869 706498 418640 484280
12091 484280 765783 876322 967795 1248497 1291131 607207 -342522 -475384 494480 1494201
12081 1494201 1212176 -412862 -2031125 -2248557 -1080808 142544 394027 102681 286256
12072 286256 883964 809758 -268162 -1181160 -851383 128099 358656 -348569 -811909 -272474
12062b72474Q96967L31756r4811L05388R31922Q96325J73777o28141j090730j100844
12052C49135n93435K04380N63445M0962o22690k65564R27507J418477N00797n64432
12042A958582m16815L48980K04369r01403j599145j263471o11128j59740L93087
12033b046684J004489R55148J74673l53946o0226M39977M95356K37359j51936
12024F94210p72449j183384o00571N66543Q44703j0800m80284J55366N39598k75055
12014e22123r26938o256J396818J401399L31729j24111K08707J58640l95898m85283
12004A036684n9995m051l15609j68556L15936J92408m23595l70325N16837J008795
11994A728529L97247n72015r25562n01086L04307Q57596N66501k38422k58197
$$ plain form
12062 -272474 624493 956249 861438 1166826 2098748 2995073 3168850 2540709 1449979 349135
12052 349135 -244300 -39920 523525 564487 -58203 -323767 603740 2022217 2523014 1958582
12042 1958582 1541767 1890747 2095116 1193713 -405432 -1668903 -2280031 -2439771 -2046684
12033 -2046684 -1042195 -87047 87626 -266320 -326546 113431 608787 846146 694210
12024 694210 -78239 -1261623 -1862194 -1295651 -450948 -461748 -942032 -786666 -247068 -522123
12014 -522123 -1449061 -1455317 -58499 1342900 1674629 1550518 1759225 1917865 1521967 1036684
12004 1036684 976689 972638 657029 488473 804409 996817 573222 202897 719734 1728529
11994 1728529 2125776 1553761 628199 127113 431420 1289016 1855517 1617095 1358898
11985A358898Q33094J305612j73027j940538j366552J080355K262903Q41084j146702
11976C055127j574394q10370k18116l0249J94831L61487J04403m97990r97792
11967d13063q53970K33934J580344J696314K60083r57895n62943J63963n77121
11958E69646j753382r90491J247051K045438N51518r73945r32962k33307K04379
11949b66055Q28384J527797J147380j16430n25547J00440p7669j329376j435937
11940a47013K95896J348354J62643j138875m68975P22400L42713n70353l1592
11931E15198J070052O01474r19387j285824l84933L1359l78841l69553K27193
11922h93262K91223k89397m01004K36167O89830M53988o4091m53219m23090L93067
$$ plain form
11985 1358898 2191992 3497604 3324577 1384039 17487 1097842 3360745 4201829 3055127
11976 3055127 1480733 670363 452247 421998 616829 978316 1082719 584729 -413063
11967 -413063 -1267033 -1033099 547245 2243559 2503642 1545747 982804 1146767 569646
11958 569646 -1183736 -2174227 -927176 1118262 1669780 695835 -237127 -470434 -266055
11949 -266055 562329 2090126 3237506 3121076 2595529 2695969 2618300 1288924 -147013
11940 -147013 148883 1497237 1659880 521005 52030 774430 1117143 546790 515198
11931 515198 1585250 2186724 1267337 -18487 -403420 -372061 -750902 -1120455 -893262
11922 -893262 -602039 -891436 -1292440 -1056273 -366443 87545 23454 -429765 -852855 -459788
11912d59788J517702J434013k60125j608182q80046P64191J122424K90468j02136
11903A818521K6076n08226j408069j156860J27349O75326M7242k76111L67337
11894b87415P73960K01064l01670K00106R04812N93955n21054j179230o92887
11885c08359L63458Q06414J18753p71995m76919Q14493J283651J32725j036116
11876I26105o52564M20474N69248J62426M53087Q54482q7466j627072j539401
11867e20681J83075J140219L51825m48149p0986K09814p29640j600712p81275
11858b266510R32183J474736N03519l75255R059J007288J161646n0115j591735
11849H04816j942978r00658R8140m0156m29683L51858J749298J779967K3881j649895
$$ plain form
11912 -459788 1057914 2491927 2231802 623620 -256426 507765 1630189 1920657 1818521
11903 1818521 1844597 1336371 -71698 -1228558 -1101209 -425883 -378641 -654752 -287415
11894 -287415 486545 687609 385939 586045 1490857 2084812 1563758 384528 -308359
11885 -308359 55099 861513 980266 208271 -268648 545845 1829496 1962221 926105
11876 926105 273541 694015 1263263 1425689 1878776 2733258 2645792 1018720 -520681
11867 -520681 -337606 802613 1154438 706289 635303 845117 115477 -1485235 -2266510
11858 -2266510 -1334327 140409 643928 268673 277732 1285020 2446666 2396551 804816
11849 804816 -1138162 -2038820 -1940680 -1980836 -2410519 -2058661 -309363 1470604 1494485 -155410
11839a55410j692624o39430K90278Q63409J279575J220612N03331j76254j29844
11830A363643K59494J56341m80879r49911q06959k93164Q3408Q8474l4152J20700
11820d93005M81702M61541j33155o24153m52306q0391r6554l9298P33735J519907
11810A278023J073030k98084r95386n09947N4627K0872K4771M05393L74644m15216
11800A012727r47115m63074K31491J42698l11683k09138K75492L71958J27197
11791B30553J21936K65379J3221n22528p15372m80238k76510k05665N3999N01995
11781a013230P53207O53878L30463j97220p74768p50760K49917J319951J085568
11772A657006l44276j316208q90512q2141j46826o18142j92568J026836J564495
$$ plain form
11839 -155410 -1848034 -2487464 -2197186 -1333777 -54202 1166410 1669741 1493487 1363643
11830 1363643 1623137 1779478 1298599 348688 -458271 -751435 -668027 -579553 -613705 -493005
11820 -493005 -11303 450238 317083 -307070 -759376 -839767 -936321 -975619 -241884 1278023
11810 1278023 2351053 2052969 1057583 547636 602263 623135 647906 1053299 1427943 1012727
11800 1012727 65612 -397462 -165971 -23273 -334956 -544094 -268602 103356 230553
11791 230553 352489 617868 631089 108561 -606811 -1087049 -1363559 -1569224 -1515225 -1013230
11781 -1013230 -260023 393855 724318 527098 -247670 -998430 -748513 571438 1657006
11772 1657006 1312730 -3478 -893990 -976131 -1122957 -1741099 -1933667 -906831 657664
11763F57664Q00158j61033k20111K36554K54980j65844l48873j87111j91694n13652
11753A61038o97277l71771L43344J035049J219482O32167l04698o95128l12507
11744A009699j7251m51767r59359o27539K22808O31695N37422N21535M66064j78493
11734A154814j049844j182392n29407J15150N01746Q71405Q50156J6133p12367
11725C5394j13597J078647J019897j80130n71667K58682N27619m31518r31779
11716F91548r2490M35473n68255j641427j162655K9222M73112N60912J122053
11707a52507J379830N36958k42192K59638Q99184O0598j363833j396689k96149
11698c15162J18745l58932l85053K57536M98071J73815J46962M51124L48286l172
$$ plain form
11763 657664 1457822 1296789 1076678 1313232 1568212 1402368 1053495 866384 674690 161038
11753 161038 -536239 -908010 -564666 470383 1689865 2322032 2017334 1322206 1009699
11744 1009699 992448 540681 -418678 -1046217 -823409 -191714 345708 867243 1333307 1154814
11734 1154814 104970 -1077422 -1606829 -1491679 -989933 -118528 731628 747761 35394
11725 35394 -78203 1000444 2020341 1840211 1268544 1527226 2054845 1623327 691548
11716 691548 599058 1034531 466276 -1175151 -2337806 -2308584 -1835472 -1274560 -152507
11707 -152507 1227323 1764281 1522089 1781727 2680911 2741509 1377676 -19013 -315162
11698 -315162 -196417 -555349 -940402 -682866 -184795 -10980 135982 587106 935392 932220
11688I32220J79113O59681O04014K57015M53668R06789P11150L1805l89204p08283
11678C637968j236800j166079o84Q07304n4860j138271l73386J161806P54931
11669B391929j280233j928133m07002P50670P6520p43700j78579P60491P69455
11660B11418L30618J53899k32796r69732r44103K49543J188248P66118j08135
11651F45078j75420K61101K77927q5325l09133m10237n42227m97358k94620l61825
11641a492039o52996n43797O1178N30038N91063N20009K31870n12088j039861
11632b306623m48019O20965N61748o66071j316124m37361J017326J958751K312075
11623A296667K060640R11569n86909j197683p20457j45252N2131J76527n7692
$$ plain form
11688 932220 1111333 1771014 2375028 2632043 3085711 3992500 4703650 4735455 4346251 3637968
11678 3637968 2401168 1235089 1234405 2041709 1986849 848578 475192 1636998 2391929
11669 2391929 1111696 -816437 -1223439 -472769 -396249 -1139949 -1318528 -558037 211418
11660 211418 542036 695935 463139 -506593 -1450696 -1201153 -12905 753213 645078
11651 645078 469658 730759 1008686 923361 614228 203991 -338236 -835594 -1130214 -1492039
11641 -1492039 -2145035 -2688832 -2627654 -2097616 -1506553 -986544 -754674 -1266762 -2306623
11632 -2306623 -2754642 -2133677 -1571929 -2238000 -3554124 -3991485 -2974159 -1015408 1296667
11623 1296667 3357307 4268876 3681967 2484284 1763827 1618575 1670706 1847233 1789541
11614A789541j193053k263624j570494M67489J467690N37488o50602p42178l54634
11605b512377k02753J11729O37790N95111J04550K22486O66142n1556j600065
11596b028943j714315L0659J275943Q27353M07300J021676R56252n80525j204735
11587a009335N79337K178174R67579j177602j038868N44972M84847j001198r96353
11578d68447P50619J401194Q960j053630l27897N56539N4941q68913q49039k86713
11568a082386k6127K02069O59274N67285m25680j104023m10248P48295Q18861
11559e2680o2275m95793r9558J48704j84271k29846N08368R82042J69549j001476
11549c17236p76661O60384J287783M20714j42921Q11441J623824M01633j588999
$$ plain form
11614 1789541 596488 -1667136 -3237630 -2770141 -1302451 -764963 -1415565 -2157743 -2512377
11605 -2512377 -2715130 -2603401 -1965611 -1370500 -1265950 -1043464 -377322 -428878 -2028943
11596 -2028943 -3743258 -3712599 -2436656 -1609303 -1202003 -180327 775925 195400 -1009335
11587 -1009335 -429998 1748176 2715755 1538153 499285 1044257 1529104 527906 -468447
11578 -468447 282172 1683366 1692326 638696 310799 867338 922279 53366 -795673 -1082386
11568 -1082386 -1108513 -906444 -247170 320115 -105565 -1209588 -1619836 -871541 -52680
11559 -52680 -114955 -610748 -710306 -561602 -745873 -975719 -467351 514691 684240 -317236
11549 -317236 -1093897 -433513 854270 1274984 1132063 1943504 3567328 3968961 2379962
11540B379962j700186j44670M40513n92182r93399M40654J966472J919769R98931
11531D715864K73535o11620j719275j628613J63266J594290P98121j069941j703636
11522H11991r06000l1130M91041R80533R55316q7326j102329p49220L36676M15369
11512A114921o40512j304527q28342n1563J84535M4424K0928K34739M58211L10637
11502d56549k75699n41937L13355J553703J423970j81365j179619l60736P70350
11493A065473N30183l51508m05102j9277k70250n67783J69567J076565N77981
11484A805849o98946p97179K46226N12353m99610j188559o70353L5750R5620O2522
11474a096327L66504M10307r7521m13893o9984L44463K85618L1080q7843j49367
$$ plain form
11540 2379962 679776 535106 975619 383437 -609962 -169308 1797164 3716933 4715864
11531 4715864 4989399 4377779 2658504 1029891 1193157 2787447 3585568 2515627 811991
11522 811991 -94009 -125139 365902 1346435 2301751 2214425 1112096 362876 699552 1114921
11512 1114921 474409 -830118 -1658460 -1710023 -1525488 -1481064 -1460136 -1225397 -767186 -456549
11502 -456549 -732248 -1274185 -960830 592873 2016843 1835478 655859 295123 1065473
11493 1065473 1595656 1244148 839046 819769 549519 -18264 151303 1227868 1805849
11484 1805849 1106903 309724 555950 1068303 568693 -619866 -1290219 -1254469 -1158849 -1096327
11474 -1096327 -729823 -319516 -417037 -830930 -900914 -556451 -270833 -239753 -327596 -476963
11464d76963o175O64336J338757R20042m75795j242290n02293N10956K37917r11603
11454E6889j224261k29567O61728K47054p38960o99038N01230J294483O71634
11445E41192l40259k60640N64640N71755m69760j088496m64197M29875N93008
11436G7118M27604N68166O13810Q6682m52996l73448j20029l04842n26788k18291
11426b23014J58564p2133n29673m80358j15267K4785J98421Q22574J338775J000021
11416B122695K23380j30520k79937r29180j609572j183637J22792P34656R87q48639
11406a776975m93185O95741J267225N63647n80531r18122k26415N81919P56893
11397a29803N87980N59180L06999n71850j206411m40081J041129J309026R0431
$$ plain form
11464 -476963 -483138 181198 1519955 2439997 1964202 721912 219619 730575 968492 56889
11454 56889 -1167372 -1396939 -735211 -488157 -1227117 -1926155 -1424925 -130442 541192
11445 541192 200933 -59707 504933 1076688 606928 -481568 -945765 -515890 77118
11436 77118 504722 1072888 1686698 1773380 1320384 946936 826907 522065 -4723 -223014
11426 -223014 -64450 -136583 -666256 -1146614 -1261881 -1237096 -1038675 -216101 1122674 2122695
11416 2122695 2346075 2215555 1935618 1006438 -603134 -1786771 -1663979 -929323 -928336 -1776975
11406 -1776975 -2270160 -1574419 -307194 256453 -324078 -1242200 -1468615 -886696 -129803
11397 -129803 458177 1017357 1324356 752506 -453905 -893986 147143 1456169 1546600
11388A546600p99052l69607J87462j27075m12382K25478Q75603M58119l36865
11379A248281l31235J62794J74990j96797l15520k56866k65663j3339M60212K89341
11369I56198n92555p97162K89024J191240O94558j78763j88369r0650q54364j395671
11359i66514m25414R35033Q81107j4328l8898N34655K90399l74292l1054Q02788
11349A593482M55675o49045n79673N48507P10253l35045o30534L37659O84143
11340B135422m20724j225359m63644N66025L26155o47674j106562r94373p20425
11331b551159q7679Q06824R69233M2128p06161j09506J120372J468714P23497
11322A676263p6455l16613m17323q60102j326096j072643m779R40241Q42689Q9320
$$ plain form
11388 1546600 747548 377941 565403 438328 25946 251424 1127027 1585146 1248281
11379 1248281 917046 1079840 1254830 1058033 742513 485647 219984 206645 666857 956198
11369 956198 363643 -433519 -144495 1046745 1741303 1562540 1374171 1283521 429157 -966514
11359 -966514 -1391928 -456895 424212 409884 370986 905641 1196040 821748 790694 1593482
11349 1593482 2049157 1400112 820439 1368946 2079199 1744154 1113620 1451279 2135422
11340 2135422 1714698 489339 25695 591720 917875 270201 -836361 -1830734 -2551159
11331 -2551159 -2638838 -1832014 -862781 -820653 -1526814 -1636320 -515948 952766 1676263
11322 1676263 1599808 1283195 865872 5770 -1320326 -2392969 -2397748 -1457507 -614818 -525498
11312e25498j39933K75003K13226n94922p62641M72287J611364J024838m97510
11303A076214j075986o13953l80388n10753r6837O61915O02107j92959l79668
11294i10308L31122P26712K00475l88545k65982L17883R11732J279886R29958
11285C132933l89785j670914j513811j04408R60912Q26403J07186m16595n44830
11276C87091k51104J97301j2702j079324j663268o34858Q71282R97331J73276
11267a014975L30124J424143J365281l50065j591260r71140J42479J70845k40046
11258g34614J44281P66050L33188p87641r93827J65819J445565J671874R88402
11249B999097J98010l23392o44072o67561j79240M25232J95793r60676j556926
$$ plain form
11312 -525498 -665431 -390428 -177202 -772124 -1534765 -1062478 548886 1573724 1076214
11303 1076214 228 -613725 -994113 -1504866 -1601703 -939788 -337681 -530640 -910308
11294 -910308 -579186 147526 348001 -40544 -306526 11357 923089 2202975 3132933
11285 3132933 2743148 1072234 -441577 -545985 414927 1241330 1348516 931921 387091
11276 387091 135987 333288 320586 -758738 -2422006 -3056864 -2185582 -1188251 -1014975
11267 -1014975 -684851 739292 2104573 1754508 163248 -807892 -665413 -494568 -734614
11258 -734614 -590333 175717 508905 -278736 -1272563 -1106744 338821 2010695 2999097
11249 2999097 3197107 2873715 2229643 1562082 1382842 1808074 2003867 1043191 -513735
11240e13735l52841J484245J628254k6563j141976m79165M67851K48323l56528
11231I57865k75065j31715n52014m94362O72000J296647J2591j500111r32401
11222i46565Q70389J329944K43479l94117R3605N20229L03159p8286o03491j332698
11212E648j206971L47990J493870L55687j539754j214738J039316K145399J100632
11203B527079p872R5421K41640m42439j092162j053856q22314n70231O4521N73799
11193d86414J25885n98716l42172L49317J11236m67726J52233J290416R88200
11184A122259l60885o51843N7119j19707r59115l85612J342975J726196N37870
11175B309257J22242P65085J48157j819951k201440k89561Q92058k4265m29510
$$ plain form
11240 -513735 -866576 617669 2245923 2219360 1077384 598219 1066070 1314393 957865
11231 957865 682800 551085 -929 -495291 176709 1473356 1485947 -14164 -946565
11222 -946565 -76176 1253768 1497247 1103130 1196735 1716964 2020123 1941837 1338346 5648
11212 5648 -1201323 -853333 640537 996224 -543530 -1758268 -718952 1426447 2527079
11203 2527079 2519207 2614628 2856268 2413829 1321667 267811 -554503 -1124734 -1060213 -486414
11193 -486414 -360529 -959245 -1301417 -952100 -840864 -1308590 -1156357 134059 1122259
11184 1122259 761374 109531 166650 46943 -912172 -1297784 45191 1771387 2309257
11175 2309257 2431499 3196584 3344741 1524790 -676650 -966211 -74153 -98418 -527928
11166e27928J114151J921790P5811j890013j338585J02627r8935q79109m5555
11157a565746J406858J130889m10566j031154n33968l04989m97146l05376R6947
11148b014251J74132L75170R37559Q20053l28713q59656K74967J441433R25071
11139A745765k56990l86282l8698n68314j246424n80373P78323J037222K17734
11130G01963k59326j29535k44583o58993p11921m29464k06580K24453J075082
11121f38904J575720J085932K16343k95355o90158j093055p31854N07940J222343
11112A158952N18476n35639p46918n06340m10123L4090Q90073Q73190l99845j113526
11102b37610l4785J227500P51591o04438q03451J45145P59478O66472N17186L60131
$$ plain form
11166 -527928 586223 2508013 2583824 693811 -644774 -542147 -641082 -1520191 -1565746
11157 -1565746 -158888 972001 561435 -469719 -1003687 -1308676 -1805822 -2111198 -2014251
11148 -2014251 -1840119 -1464949 -527390 292663 -36050 -895706 -620739 820694 1745765
11139 1745765 1488775 1102493 1063795 495481 -750943 -1331316 -552993 484229 701963
11130 701963 442637 313102 68519 -590474 -1302395 -1731859 -1938439 -1713986 -638904
11121 -638904 936816 2022748 2239091 1943736 1253578 160523 -571331 -63391 1158952
11112 1158952 1677428 1141789 394871 -111469 -521592 -487502 402571 1275761 875916 -237610
11102 -237610 -272395 955105 1706696 1102258 298807 443952 1203430 1869902 2387088 2747219
11092B747219j3975r1290L42854L04806p21598j490025r19968N0545J34772k27446
11082A15894j10114R5201j58188j44107O08708R24352j0362q22698j26870J013478
11072A385294Q63348j92167p04876n99368n08013j27266O90246P31256n27239
11063A011215j266246n2155J432242R67332m94532o09644K59881l0290j325402
11054a07599j388591J50643J229717Q11136J04058L7534n555m58823o65699k44077
11044e37256K66012M99844P02080Q91937P12089J48645m36854p69782n79124K65433
11034A163024R91011M38358r66484j272088K4211Q87179n1129j203452p41755
11025g31125L74049L36025k79143J90409J292515J249585K7629q92220j059866
$$ plain form
11092 2747219 2733244 2641954 2984808 3289614 2568016 1077991 158023 208568 343340 115894
11082 115894 5780 100981 -57207 -201314 407394 1331746 1321384 498686 371816 1385294
11072 1385294 2248642 2056475 1351599 752231 244218 116952 807198 1538454 1011215
11063 1011215 -255031 -307186 1125056 2092388 1597856 988212 1248093 1217803 -107599
11054 -107599 -1496190 -1345547 -115830 695306 799364 836898 831343 372520 -293179 -537256
11044 -537256 -271244 228600 930680 1822617 2534706 2683351 2246497 1476715 897591 1163024
11034 1163024 2154035 2592393 1625909 353821 378032 1265211 1214082 10630 -731125
11025 -731125 -357076 -21051 -300194 -109785 1182730 2432315 2459944 1567724 507858
11016E07858j043218o33429N99815J626032J128666j72465n13671J51856M48021
11007B099465M3493k22299j48161j85602k02817L4128p7024p61978q28317L30991
10997H1879J092114J55072p99444K80750J990015J492720o59045j358176j11597
10988B164288M32581p04961j307866j57945P60748j44123j207075l45383J364523
10979H54787J300138p14962k233514j629121O2374R74486P79056M72720M96986
10970C62950K59400l45529k61373R16230J622322M99959j001929n40254J098809
10961B610585Q46692j568622k716275p18164J819058J882447J73804r49644j056250
10952C23631q35931l9276J321730J716286L83794r79642r01846m01474n41994
$$ plain form
11016 507858 -535360 -1168789 -568974 1057058 2185724 2013259 1499588 1651444 2099465
11007 2099465 2142958 1920659 1772498 1586896 1384079 1418207 1341183 579205 -249112 81879
10997 81879 1173993 1329065 529621 810371 2800386 4293106 3634061 2275885 2164288
10988 2164288 2596869 1891908 584042 426097 1186845 1042722 -164353 -509736 854787
10979 854787 2154925 1439963 -793551 -2422672 -2360298 -1385812 -606756 -134036 362950
10970 362950 622350 276821 15448 931678 2554000 3053959 2052030 1511776 2610585
10961 2610585 3457277 1888655 -827620 -1545784 273274 2155721 2329525 1379881 323631
10952 323631 -512300 -551576 770154 2486440 2870234 1890592 988746 587272 45278
10943D5278k40317J097477J487031k23648j567832l52232J303368N01135j347987
10934G02273j105105N88757Q56391j09781M7464R77330M23671j049841r19200
10925D11959L76846J88789j107653o26674J334347J302679j117337k146941j96815
10916a580800J539537O32231q78789n61484M87387L47084k82970K5129N95601
10907C22926K14883l77574J99715J554783K191867J524093J7139j570388k255864
10898A821580j387759J78612P10971j07588q43228n88924n8180k226o8128K19962
10888a24908O24112P93703O85448K38929m25982o72503k09542J64005k12841o05320
10878B55101j66553M15339J32788m16878j21011N33544L59329l70748o18132n44715
$$ plain form
10943 45278 -195039 902438 2389469 2165821 597989 245757 1549125 2050260 702273
10934 702273 -402832 185925 1042316 932535 979999 1957329 2381000 1331159 411959
10925 411959 788805 977594 -130059 -756733 577614 1880293 762956 -1383985 -1580800
10916 -1580800 -41263 590968 -287821 -849305 -361918 -14834 -297804 -272675 322926
10907 322926 537809 160235 359950 1914733 4106600 5630693 5647832 4077444 1821580
10898 1821580 433821 612433 1323404 1215816 372588 -216336 -274516 -276742 -344870 -124908
10888 -124908 499204 1292907 1978355 2217284 1791302 1118799 909257 1073262 860421 255101
10878 255101 88548 503887 636675 219797 98786 632330 991659 620911 2779 -541936
10868e41936p90916p83702J24956Q99411M31983k34338L41020J283936J029488
10859A759902L08070O14908J033111j54499j832356j573089O9000M44030o31326
10850C7751r25138l282L84902m0104J82053Q51891J92790j451840j681825j68820
10840b621622Q33477M98087L84413R44426P24580k89128j98264J034424R50402
10831B260795j075929k325927j051359Q19971R81290L9027k66626R2520J08436
10822d17802l38773n96837k25354P38811J548228R80812q93206j904757n50413
10813a659291J394478J309831k53641p27759K52684Q78251O62191O22525N54555
10804C033824m95217j540349r15388L02177j97980j568728r59209J275723J868515
$$ plain form
10868 -541936 -1332852 -2116554 -1991598 -1092187 -660204 -894542 -553522 730414 1759902
10859 1759902 2067972 2682880 3715991 3561492 1729136 156047 225047 669077 37751
10850 37751 -887387 -890669 -505767 -545871 -363818 488073 680863 -770977 -2452802 -2621622
10840 -2621622 -1788145 -1290058 -905645 38781 763361 474233 275969 1310393 2260795
10831 2260795 1184866 -1141061 -2192420 -1372449 -391159 -352132 -618758 -526238 -417802
10822 -417802 -756575 -1353412 -1578766 -839955 708273 1689085 795879 -1108878 -1659291
10813 -1659291 -264813 1045018 791377 63618 316302 1194553 1856744 2479269 3033824
10804 3033824 2538607 998258 82870 385047 187067 -1381661 -2340870 -1065147 803368
10795H03368K09045q15393L696N69359j98954o41113M9512M58456J52774M47591
10785A038341J144119M12216j253415j063720J100953J974266L48269j039634
10777B661395n12971l2626r39789j317324J43973J431321P90351l16838k00512
10768A706980J54544n09734j178695o61712J52755J03161l11206l51584l17212
10759a212703k55114M12402J148442O19750o30882n54606Q15893J156784j76098
10750A323868j177157q56239m98290n20809L46501J796492J537388o33453j906167
10741e87866r12920L50412L36442J74918O98040P08799k26744m99727N16738J177461
10731A735553N76228r4036j63657m22198p27269M0813J114000N22564r51026n20858
$$ plain form
10795 803368 1012413 197020 200716 770075 571121 -69992 -20480 437976 590750 1038341
10785 1038341 2182460 2594676 1341261 277541 1378494 3352760 3701029 2661395
10777 2661395 2148424 2115798 1176009 -141315 2658 1433979 2224330 1907492 1706980
10768 1706980 1861524 1351790 173095 -488617 -335862 -232701 -543907 -895491 -1212703
10759 -1212703 -1467817 -1055415 93027 712777 81895 -472711 343182 1499966 1323868
10750 1323868 146711 -709528 -1207818 -1728627 -1382126 414366 1951754 1318301 -587866
10741 -587866 -1500786 -1150374 -813932 -639014 59026 767825 541081 41354 558092 1735553
10731 1735553 2311781 2217745 2054088 1631890 904621 945434 2059434 2581998 1630972 1110114
10721A110114J473708J700174k29477r09881O19093J020779j147573k587825j044521
10712D591Q83958N18386o80278n81574j07324n53655p76332J65649Q30227L15140
10702A8788J39479J025982J163879k10950r74492J2035O84137l83944j356565
10693A18349n72757O70495Q69419O95022P58003J61147j039648j122610J10673
10684F48093O92470J33585J68772J002801P67653m61321m16869P96662N43312
10675C875158j152428j314985K26445L11943j294980j139802J088128J417235
10667B016714q99542j566813O98737J424148j227507k575024J44730K523940Q44390
10658A383773j470593n15985J180257J45858j288524P7276J601619m07567l215765
$$ plain form
10721 1110114 2583822 4283996 4054519 3144638 3763731 4784510 3636937 1049112 4591
10712 4591 888549 1406935 726657 145083 37759 -515896 -1292228 -1126579 -296352 18788
10702 18788 158267 1184249 2348128 2137178 1162686 1174721 1858858 1474914 118349
10693 118349 -454408 216087 1085506 1780528 2538531 2699678 1660030 537420 648093
10684 648093 1340563 1474148 1642920 2645721 3413374 2952053 2535184 3331846 3875158
10675 3875158 2722730 1407745 1634190 1946133 651153 -488649 599479 2016714
10667 2016714 1117172 -449641 249096 1673244 445737 -2129287 -1984557 539383 1383773
10658 1383773 -86820 -602805 577452 723310 -565214 -487938 1113681 706114 -2509651
10649b509651j666488L157720N480864L224866l76814k202119j978879o99407
10641B430092M14276L71228k03285K31934J172659O20146q94275p49426P34848
10632D128197M76485j420622j421060P07780J100262q40838j039459J362165J930235
10623D983145o95346j863109M77520J821432m64756k311960q07718N31855r97327
10614F73736k004280R2370J853506N66245n93944Q37342J663985k83285j409222
10605A396453N63331J741480m83387k182780m07047J203997k69900j399852M15763
10596E78058J595197k20264j073928J287209K270921p33663k617907R2763K538077
10587C716463O91509j353097r126P63141j855609k944856N42505K857029J8483
$$ plain form
10649 -2509651 -4176139 -1018419 4462445 7687311 7310497 5108378 3129499 2430092
10641 2430092 2844368 3215596 3012311 3244245 4416904 5037050 4142775 3393349 4128197
10632 4128197 4604682 3184060 1763000 2470780 3571042 2730204 1690745 3052910 4983145
10623 4983145 4287799 2424690 2902210 4723642 4258886 1946926 1139208 1671063 673736
10614 673736 -1330544 -1238174 615332 1181577 587633 1424975 3088960 2805675 1396453
10605 1396453 1959784 3701264 3217877 1035097 628050 1832047 1562147 162295 578058
10596 578058 2173255 1952991 879063 2166272 4437193 3703530 1085623 1178386 3716463
10587 3716463 4407972 3054875 3045749 3808890 1953281 -991575 -449070 2407959 2426442
10578B426442k229178O80824L145366K42526k454303L86505L253592L10613l182733
10569B579654q69488K655737J010185j881353k60567J871234p81668l608329j013967
10560b98562K287897M97761j859080O27083K990921k4489k725195M02583L018939
10551D917858p50805l720781Q29672M955536L82746n043634j469070M389769K055120
10542F546411l063061j012472L192460L70903l768280O84N107757J446150m248223
10533D572329j097095M346464R20715m632842q26495N079946R01318n552795j008244
10524B703301O356742J795577o704350k975810N810254K850828n245611j586668
10516C004263O826511K417680p213620l116439P104323L487983o118962r75646
$$ plain form
10578 2426442 197264 878088 4023454 4265980 1811677 2198182 5451774 5762387 2579654
10569 2579654 1710166 4365903 5376088 3494735 3234168 5105402 4323734 715405 -298562
10560 -298562 1989335 2487096 628016 1255099 4246020 4221531 1496336 1898919 4917858
10551 4917858 4167053 446272 1275944 6231480 6614226 1570592 101522 4491291 6546411
10542 6546411 3483350 2470878 5663338 6034241 2265961 2266645 7374402 8820552 4572329
10533 4572329 3475234 7821698 8742413 4109571 3283076 8363022 9264340 3711545 2703301
10524 2703301 9060043 10855620 4151270 1175460 6985714 9836542 4590931 3004263
10516 3004263 9830774 12248454 5034834 1918395 9022718 12510701 6391739 5416093
10508E416093R793152L519886r430688l431796J0707135M460745j0745622l098317
10500G190588J4807810O548895j4114383m629393K0267111J0293702j7950112
10493B2414218k263416L8666505K3111521k7435786J3429706J50095462J90649746
10486D08667956J6246521k04668348k27451838o7363440M9986658K2654171l1930323
10479c3858643j1321868K8444957J3226500j9031503q408145J7795063R546258
10472c607381j2629590o199825J2724169P377877r260273n232956Q551109M287721
10464c989149p936251l219063Q719104M713355o259289k596825P337175L246659
10456A5716o910014l634753N799329K753317o032164k627879O532537L621651
$$ plain form
10508 5416093 15209245 18729131 9298443 5866647 16573782 21034527 10288905 7190588
10500 7190588 21998398 28547293 14432910 9803517 30070628 40364330 22414218
10493 22414218 20150802 58817307 81928828 54493042 67922748 218018210 408667956
10486 408667956 424914477 220246129 -7205709 -74569149 -24582491 -1928320 -33858643
10479 -33858643 -45180511 -16735554 -3509054 -22540557 -30948702 -13153639 -3607381
10472 -3607381 -16236971 -22436796 -9712627 -2334750 -11595023 -16827979 -8276870 -3989149
10464 -3989149 -11925400 -15144463 -6425359 -1712004 -7971293 -10568118 -3230943 15716
10456 15716 -6894298 -10529051 -4729722 -1976405 -8008569 -10636448 -4103911 -482260
10448d82260n747535l789042N342234M564676l399710k855606M215246L474388
10440A322391l385435l163854K548521J696063l621207j773262M611697L419299
10432A654213l269107l243519K481834K534459k523014k228213K772505K445418
10424F24576k603530k609403K098848K216166k126235k170976J937036J813610
10416h19908k391621k505588J596523K240805r18406j113527J533328Q13121k246861
10407c812134j112424K763827K160498j810975j638488K149717K216231j344519
10399d28267j639836J315236J001143k358509k179282J410169J766711j332824
10391b445459j530022J503597J627439j493993j732891J449594J949403j210372
$$ plain form
10448 -482260 -6229795 -10018837 -4676603 -111927 -3511637 -6367243 -2151997 1322391
10440 1322391 -2063044 -5226898 -2678377 -982314 -4603521 -6376783 -1765086 1654213
10432 1654213 -1614894 -4858413 -2376579 157880 -2365134 -4593347 -1820842 624576
10424 624576 -1978954 -4588357 -2489509 -273343 -2399578 -4570554 -2633518 -819908
10416 -819908 -3211529 -5717117 -4120594 -1879789 -2798195 -3911722 -2378394 -1565273 -3812134
10407 -3812134 -4924558 -2160731 -233 -1811208 -3449696 -1299979 916252 -428267
10399 -428267 -2068103 -752867 248276 -2110233 -4289515 -2879346 -1112635 -2445459
10391 -2445459 -3975481 -2471884 -844445 -2338438 -4071329 -2621735 -672332 -1882704
10383a882704k159715P37723K449632R55561k15436J69951l55796j350609p8387
10374a729780J718503K21949k385131j084985K287939J903062j199696j055207
10366a323346J902128J878558j017757j268413R70496K09083l091189k652405
10358d392845J645218K901207m45940k065031N98929K322884K27936j608608m92880
10349a309130N46439m36558r55612L747k0034j132266l12126K000814J663696
10340D8970j458770k660354n69822R12244Q5412k01926J063429J264606m267j2159
10330a532637J182017N52443j409493r27242J678021J979946m08706j033754J057823
10321A138418J651552n79686j738920j55603R05697j28278n65729O03501O94884
$$ plain form
10383 -1882704 -4042419 -3304696 -855064 100497 -114939 55012 -300784 -1651393 -1729780
10374 -1729780 -11277 210672 -2174459 -3259444 -971505 931557 -268139 -1323346
10366 -1323346 578782 2457340 1439583 171170 1141666 1350749 -1740440 -4392845
10358 -4392845 -2747627 153580 -292360 -2357391 -1758462 564422 792358 -816250 -1309130
10349 -1309130 -762691 -1199249 -2154861 -2151114 -2171148 -3303414 -3615540 -1614726 48970
10340 48970 -1409800 -4070154 -4639976 -3727732 -3642320 -3844246 -2780817 -1516211 -1520478 -1532637
10330 -1532637 -350620 201823 -1207670 -2134912 -456891 1523055 1114349 80595 1138418
10321 1138418 2789970 2210284 471364 315761 1221458 1093180 527451 1130952 1825836
10312A825836q93510j180970M03319O94522r78059j392593K58222Q44168m85919
10303i04984p96237M99628L24508j689601j871810O77963K133277O52803q85063
10294a859516n98652k31408m83081M40609K112521J586509q01736j281851N04276
10285f12329P67175j124265j329172R20331J473689r30877k027204J64609J709944
10276i88099Q6038j334440K88506K216186J311629q14142j403640q41969l18424
10267a798355N93064J525937O84337j362538j558423L89166J264812J09390m00380
10258e52990M68991J84517j434564j275838Q01522J050661j016550j219806J392433
10249a601624K239926m49341k146939k62425J250820m33706j721408K73432J909635
$$ plain form
10312 1825836 932326 -248644 154675 849197 -128862 -1521455 -1263233 -419065 -904984
10303 -904984 -1701221 -1201593 -877085 -2566686 -4438496 -3760533 -1627256 -974453 -1859516
10294 -1859516 -2458168 -2689576 -3172657 -2732048 -619527 966982 165246 -1116605 -612329
10285 -612329 154846 -969419 -2298591 -1378260 95429 -835448 -2862652 -2698043 -988099
10276 -988099 -902061 -2236501 -1947995 268191 1579820 765678 -637962 -1479931 -1798355
10267 -1798355 -1205291 320646 1004983 -357555 -1915978 -1526812 -262000 -152610 -552990
10258 -552990 -83999 100518 -1334046 -2609884 -1808362 -757701 -1774251 -2994057 -1601624
10249 -1601624 638302 188961 -1957978 -2220403 -969583 -1403289 -3124697 -2851265 -941630
10240i41630k29246k703606j238504J737299J648408m11348m50570J283799J666862
10231C61464M80064k81068n85619j404622j743800n22233P54102N21964j8433
10222b438181M95786R38536L68408K42851J262537J378662l29892j411025m50819
10213E6863J65747j120635j787051M7680J752481P38939r93470o96820M18099
10204a418167J72255m05556K60559Q19646j02625q33931Q030N83462l77978o76457
10194a970762R31668J555920o40963k336289n40514J946845J380107n60126l75518
10185f09632Q86126K81989j173497p53371O17480M76290k77199L59134R74528
10176G81848m27588j779065l86301J604681O61437j672476j453587P08586J187924
$$ plain form
10240 -941630 -1170876 -3874482 -5112986 -3375687 -1727279 -2138627 -2589197 -1305398 361464
10231 361464 841528 560460 -25159 -1429781 -3173581 -3695814 -2941712 -2419748 -2438181
10222 -2438181 -1942395 -1003859 -635451 -392600 869937 2248599 1918707 507682 56863
10213 56863 222610 -898025 -2685076 -2637396 -884915 -145976 -1139446 -1836266 -1418167
10204 -1418167 -1245912 -1651468 -1390909 -571263 -673888 -1507819 -1499789 -916327 -1294305 -1970762
10194 -1970762 -1039094 516826 -124137 -2460426 -3000940 -1054095 326012 -234114 -609632
10185 -609632 276494 558483 -615014 -1368385 -750905 -274615 -551814 -192680 781848
10176 781848 354260 -1424805 -1811106 -206425 455012 -1217464 -2671051 -1962465 -774541
10167g74541l8248j45264P44160L24046o85329J64105J723612R34457j225524
10158A021474j243454M15121K15576j679256j629316O73208J620570J86848p52123
10149a171352j29381j32150j153523p49273J237730J712673r3663r71873O74056
10140g76756K113408J063325q66768j452788j019260n11774L53361J316637R20030
10131A139415p93743j602984m88826Q14458P91993J98267P3190R3263o3419J10840
10121B72454N33755L11013m11460l79759M64411O20412n26658j749121j871071
10112b736024j015904J39496Q89962N92742k97095p8788J633339K500501Q05026
10103B433255j352421j065876O57520O85255r06314j301083j49538r918j432703
$$ plain form
10167 -774541 -812789 -958053 -213893 110153 -575176 -411071 1312541 2246998 1021474
10158 1021474 -221980 193141 408717 -1270539 -2899855 -2226647 -606077 -419229 -1171352
10149 -1171352 -1300733 -1432883 -2586406 -3335679 -2097949 -385276 -478939 -1450812 -776756
10140 -776756 1336652 2399977 1533209 80421 -938839 -1450613 -1097252 219385 1139415
10131 1139415 345672 -1257312 -1746138 -931680 -139687 58580 131770 225033 161614 272454
10121 272454 806209 1117222 705762 326003 790414 1410826 884168 -864953 -2736024
10112 -2736024 -3751928 -3612432 -2722470 -2129728 -2426823 -2505611 -872272 1628229 2433255
10103 2433255 1080834 14958 672478 1357733 451419 -849664 -999202 -1009120 -2441823
10094b441823j793377J13828K009664J861019N95022j20847j92017j01754J80489
10085A10204M35693J76043k20453o5052J04068n55660j238825o78040L87634M06149
10075a138239j34126J81278O50302k58670j417225m95853J600619J674622m98462
10066A64246j821666j013344j19592l46076k83419P78947J364640P39167J35932
10057d01165R8197l76637j244318j000918L74199J031681M64758J34250L76142
10048e43811j37426j266127j048966P05061J676537P82249l59130m95153k93370
10039i80136j61426M50447R62317k2727j761409j884088l43177M46307j58306
10030c452198j85830R81519J445732L99903n91912o89098p79563q73834J2152
$$ plain form
10094 -2441823 -4235200 -4121372 -2111708 -250689 344333 223486 31469 -70285 110204
10085 110204 545897 721940 501487 436435 540503 -15157 -1253982 -1932022 -1544388 -1138239
10075 -1138239 -1272365 -1091087 -440785 -699455 -2116680 -2612533 -1011914 662708 164246
10066 164246 -1657420 -2670764 -2790356 -3136432 -3419851 -2640904 -1276264 -537097 -401165
10057 -401165 -302968 -679605 -1923923 -2924841 -2550642 -1518961 -1054203 -919953 -543811
10048 -543811 -681237 -1947364 -2996330 -2291269 -614732 167517 -191613 -686766 -980136
10039 -980136 -1141562 -691115 271202 248475 -1512934 -3397022 -3740199 -3293892 -3452198
10030 -3452198 -3638028 -2656509 -1210777 -810874 -1402786 -2091884 -2871447 -3745281 -3733129
10021c733129J063352M92290p25316o6719J606127J066836j206450j368580Q36863
10012b034726J363092p32370j427983P74061J887202k35871j824523j8467J976032
10003b73553P35371j482955j176940M75830O12573k27544k61112k29113j063547
9994b890990j111141O52299J939167J050616j3865M89114Q10581l71272r63529
9985d09020K10315N38329j243367j777821Q90595K889670Q78206j907413j252960
9976a183466Q56883L93163j458469j241314J34803j80745j047620J40028J838561
9967a748176J140430n33043k38439P51261k70508j754812q41334Q05236N7777
9958b631608j535901p34764J023654M34642j179375n12562J197578O85807q67893
$$ plain form
10021 -3733129 -2669777 -2177487 -2902803 -2969522 -1363395 -296559 -1503009 -2871589 -2034726
10012 -2034726 -671634 -1404004 -2831987 -2057926 -170724 -406595 -2231118 -2249585 -273553
10003 -273553 461818 -1021137 -2198077 -1722247 -1109674 -1337218 -1598330 -1827443 -2890990
9994 -2890990 -4002131 -3349832 -1410665 -360049 -373914 115200 925781 554509 -409020
9985 -409020 -198705 339624 -903743 -2681564 -1790969 1098701 1976907 69494 -1183466
9976 -1183466 -326583 66580 -1391889 -2633203 -2498400 -2679145 -3726765 -3586737 -1748176
9967 -1748176 -607746 -1140789 -1379228 -627967 -898475 -2653287 -3494621 -2689385 -2631608
9958 -2631608 -4167509 -4902273 -3878619 -3443977 -4623352 -5135914 -3938336 -3252529 -4120422
9949d120422l07079J183664P04340k16957J224405K775895R27655j959182j560772
9940a348453M56912j05429j811313p83193J225437K45510j730714n67255J521142
9931b897356K50610j783563o055K435494K41625l136972j471951J932826K96519
9922d138823l002345o04519L700865J331127l990478k375346K972741J269893
9914d836885m509294k425579M853610L952214l307075k833423L486264M61821
9906e158347q629855n003261P456375M024171j3050522j1850667Q224369K459850
9898b1527887m1385184o1298264o921317P1533524Q3299851K4087173k4508045
9891B3279851j6100988R362874O295571j0318793q138591M835484L933933n849586
$$ plain form
9949 -4120422 -4427501 -3243837 -2539497 -2756454 -1532049 1243846 2171501 212319 -1348453
9940 -1348453 -891541 -996970 -2808283 -3591476 -2366039 -2120529 -3851243 -4418498 -2897356
9931 -2897356 -2646746 -4430309 -4436364 -2000870 -1759245 -4896217 -6368168 -4435342 -4138823
9922 -4138823 -7141168 -7745687 -4044822 -2713695 -6704173 -9079519 -6106778 -4836885
9914 -4836885 -9346179 -11771758 -6918148 -2965934 -6273009 -9106432 -5620168 -5158347
9906 -5158347 -13788202 -18791463 -11335088 -7310917 -20361439 -32212106 -23987737 -21527887
9898 -21527887 -62913071 -124211335 -131132652 -59599128 23700723 47787896 23279851
9891 23279851 7178863 16541737 22837308 12518515 4379924 9215408 13149341 7299755
9883G299755m845336L358527K557561m186029k982962L224463J968195l838451
9875B555723k415430L646807K951894k579307k026028L403667L261885k082894
9867F716317k820123J560235K205805j996624l239582L509J205952r75130j045001
9858A615358J650713J845229q41582j289497Q11786O05578k004313k170948K36407
9849D58731N29745j358520q45489J922648J979258r74199j968997K246Q07860
9840E53283l86238K2068K188896K029662q40974k120242o31416K01646o33748
9831C82937m32879R41602N77854j116708o01452J712193J632578r64457j611234
9822E20434O31983J688019J62998n28938Q83802J292844m46317j389239l77662
$$ plain form
9883 7299755 2454419 5812946 8370507 4184478 1201516 4425979 6394174 2555723
9875 2555723 140293 3787100 6738994 4159687 2133659 5537326 8799211 6716317
9867 6716317 3896194 5456429 7662234 5665610 2426028 2429537 3635489 2660359 1615358
9858 1615358 3266071 5111300 4269718 2980221 3792007 4397585 2393272 222324 458731
9849 458731 988476 -370044 -1215533 707115 2686373 1712174 -256823 -254577 553283
9840 553283 167045 189113 2378009 4407671 3566697 1446455 815039 1016685 382937
9831 382937 -49942 891660 1469514 352806 -248646 1463547 3096125 2131668 520434
9822 520434 1152417 2840436 3003434 2474496 3358298 4651142 4204825 2815586 2437924
9813B437924Q4321p00725l39704J120685N54281j931605k290485K68568J632433
9804H35693Q6723r93634K57101J126983J13520l04354Q50690P47036j413247k067808
9794g61297K79231J936002M58139j204117l18482J048158N95972M8511J099951
9785C182068J605592l02042k282610j740970j25173K17797L3737O62293R14057
9776B164749k25592r43899J32685J063643O8648j149266o25434K96831k49169
9767E33196j123938o03011K83535l9320n44240K75188J305096P88286m73498n75104
9757a73810M54509J273895J291175M46696j182754k302317j283536P97405R39290
9748B60553q81608j210601J008615K259360M12501j498165n69806J019633J77260
$$ plain form
9813 2437924 2522245 1821520 1481816 2602501 3156782 1225177 -1065308 -796740 835693
9804 835693 922416 -71218 185883 1312866 1426386 1122032 1972722 2719758 1306511 -761297
9794 -761297 -482066 1453936 1912075 707958 389476 1437634 2033606 2082117 3182068
9785 3182068 4787660 4485618 2203008 462038 336865 554662 588399 1250692 2164749
9776 2164749 1939157 995258 1127943 2191586 2260234 1110968 485534 782365 533196
9767 533196 -590742 -1193753 -910218 -949538 -1493778 -1218590 86506 874792 401294 -173810
9757 -173810 280699 1554594 2845769 3292465 2109711 -192606 -1476142 -678737 260553
9748 260553 -621055 -1831656 -823041 1436319 1848820 350655 -219151 800482 977742
9739I77742j599024j199465N36878P54666j82115J03857J219066Q15140q58869
9730E67876j281924K2333J038885P88610K49588M8386j30276j65654J98751J92627
9720A529202p98538j606596q30060P64209J302427N01951m27912p57133n46235
9711h68685J00809P28950N17411l21823m71065K55334M28216k78348k29426J008129
9701H69502J331447k60371j453888l49777J216801P68005p61921r93697r6430
9692B69671K06248q0279J10050M12536j2346m12240P9818L93729m99109j210265
9682g42187k42367J031919O11821n60674l89234N45312K76391p09885m09773Q59471
9672B70794J011632m0909m69886O4300K41076k6769M15134J275215J024520l04074
$$ plain form
9739 977742 -621282 -1820747 -1283869 -529203 -711318 -607461 611605 1426745 567876
9730 567876 -714048 -691715 347170 1135780 1385368 1433754 1303478 1137824 1336575 1529202
9720 1529202 730664 -875932 -1705992 -941783 360644 862595 434683 -322450 -868685
9711 -868685 -767876 -38926 478485 156662 -314403 -59069 369147 90799 -138627 869502
9701 869502 2200949 1940578 486690 136913 1353714 2121719 1359798 366101 269671
9692 269671 475919 395640 505690 918226 905880 493640 573458 967187 468078 -742187
9682 -742187 -984554 47365 659186 98512 -290722 254590 530981 -178904 -588677 270794
9672 270794 1282426 1241517 771631 835931 1077007 1050238 1465372 2740587 3765107 3461033
9662C461033j195962j320558j478148j230684N05218K585671K366813l10087k534791
9653H48505k288385o43644N50437R76218J078891Q34919J95895m15156o14802
9644E22878l41841L12197Q44611M51604p13191j208213k99426P43481O04414m4579
9634H71935q565K12775m60588j475694j528272p06574J21579R92508J961662J768041
9624A748807l13872k345271j926500K55968J496894R73905J63400j920Q5544L15220
9614D52175Q75398J023550L8872j037020p60725J72778M58j060013j206435r1030
9604a591992Q68362R26885N97350J32881n32166p89082k60374J2678p15229j055580
9594b406267K96137J758425J146917l95386j34221J406380J158503j113121k123466
$$ plain form
9662 3461033 2265071 944513 -533635 -1764319 -1259101 1326570 3693383 3383296 848505
9653 848505 -1439880 -2083524 -1533087 -556869 522022 1356941 1552836 1137680 522878
9644 522878 181037 493234 1337845 1789449 1076258 -131955 -431381 312100 916514 871935
9634 871935 863370 1076145 615557 -860137 -2388409 -3094983 -2973404 -1980896 -19234 1748807
9624 1748807 1434935 -910336 -2836836 -2580868 -1083974 -110069 53331 51411 136955 452175
9614 452175 1327573 2351123 2389995 1352975 592250 765028 765486 -294527 -1500962 -1591992
9604 -1591992 -723630 203255 800605 933486 401320 -387762 -648136 -635458 -1350687 -2406267
9594 -2406267 -2110130 -351705 795212 399826 265605 1671985 2830488 1717367 -406099
9585d06099l26670J808027J847791N22363m64056r22570j098239n47764M86424
9576H99207O34019m02364j015444j65623R97640R99936N982r57285j348836r86186
9566a338954P8322R88161P05369l79078p84237j51891L35615N406l96939k31384
9556a169610R0919J45850J65801K57552J10872k06631j95869J77704M54580M90105
9546C21273M25345J52039k97742l45497K08867N88700L43272K10626N59957L58780
9536B525620q43541j499249m98695O39871K53277n03058J53220J130951L38781
9527A697177j290563j183243M00958R35931O5887k46601L23185J27753q73289
9518d2805r18909J4765J31942n06420L6333J538344J442890n81565j752418q33478
$$ plain form
9585 -406099 -732769 1075258 2923049 3445412 2981356 2058786 960547 412783 899207
9576 899207 1533226 1130862 115418 -50205 947435 1947371 1953353 996068 -352768 -1338954
9566 -1338954 -1260632 -272471 432898 53820 -730417 -882308 -546693 -541287 -938226 -1169610
9556 -1169610 -1078691 -932841 -767040 -509488 -398616 -605247 -801116 -623412 -168832 321273
9546 321273 746618 898657 600915 255418 464285 1052985 1396257 1606883 2166840 2525620
9536 2525620 1682079 182830 -315865 324006 577283 74225 227445 1358396 1697177
9527 1697177 406614 -776629 -375671 560260 626147 379546 702731 830484 -42805
9518 -42805 -961714 -946949 -815007 -1321427 -1285094 253250 1696140 1114575 -637843 -1471321
9508a471321O5184m26991p13170L77140J341225Q56269r5400m96667q47050j085232
9498b496013O5106K220485K791679R02550r93908r74347k51916l21562m34547
9489E07527K33861O50395R1234k56546L55039P14086P9491m02093j95927n16154
9479A260913j437042r69004J146763J994797R6667j771793j023622N90965L32053
9470B20697q80523o03220O92131Q83387Q0811j80359j17772q04254j415218n37225
9460b661545R06165J034217K36657J26447L96840k48405j043012k50946J366893
9451a36689J401407j93552j020229j77247O05950J04339p01602o55733p3511K84817
9441e62050L01128R0007k72434m21511j18166J38431j33447m36152j04123M94488
$$ plain form
9508 -1471321 -1406137 -1833128 -2546298 -2169158 -827933 28336 -67064 -563731 -1410781 -2496013
9498 -2496013 -2430907 -210422 2581257 3483807 2489899 1515552 1263636 942074 507527
9489 507527 741388 1391783 1483017 1226471 1581510 2295596 2375087 1972994 1777067 1260913
9479 1260913 -176129 -1145133 1630 1996427 2093094 321301 -702321 -111356 220697
9470 220697 -659826 -1263046 -570915 312472 393283 212924 95152 -709102 -2124320 -2661545
9460 -2661545 -1755380 -721163 -484506 -358059 38781 -209624 -1252636 -1503582 -136689
9451 -136689 1264718 1071166 50937 -126310 479640 583979 -117623 -773356 -846867 -562050
9441 -562050 -260922 -170915 -443349 -864860 -983026 -844595 -978042 -1414194 -1518317 -1023829
9431a023829O59255N78411O82581N53968k22890q90919n96264N6566o5329p53375
9421a021825q98000k69993M14812P34747P67688N67373L14562L39192L66570k31336
9411A083790r11646k85155J254394J313345p23445j984951k94909K034935J393683
9402B880041j642307l161558j527848R28227J734356J058003K90754O4166K87138
9393I10972O28192N42735j37060o79790m39985P4468J17035k6301J56464J95072
9383A341802l89154p92623j58223P27858N79741l11117p45251n80215m20134j92166
9373i39482L03687L48915m35534q09626J90426J197765N65153o40587k89852J057860
9363E48725J004143n36895j141124Q1906J225829Q87589L5332j94866j63950k68873
$$ plain form
9431 -1023829 -364574 213837 896418 1450386 1227496 336577 -259687 -203121 -268450 -1021825
9421 -1021825 -1919825 -2189818 -1775006 -1040259 -272571 294802 609364 948556 1315126 1083790
9411 1083790 172144 -113011 1141383 2454728 1731283 -253668 -548577 1486358 2880041
9402 2880041 1237734 -1923824 -3451672 -2523445 -789089 268914 559668 623834 910972
9393 910972 1539164 2081899 1944839 1265049 825064 899532 1016567 990266 1146730 1341802
9383 1341802 952648 160025 1802 729660 1309401 998284 253033 -327182 -747316 -939482
9373 -939482 -635795 -286880 -722414 -1532040 -1341614 -143849 421304 -219283 -509135 548725
9363 548725 1552868 1015973 -125151 -43245 1182584 2070173 2105505 1910639 1746689 1477816
9353A477816N0921Q15573Q42414l63251j563836j571258p69018p5943L68631P28477
9343e9474P77364M06876j1401k49133m61244n91145l43686J64521N30238P35001
9333H97917Q52379M53064o16606j336076p46725L45502M46156k46094l01017L88833
9323A37333N37064o4746j58936N43668O59093m30445j336505q25328L44110P55097
9313A60405K60376l35251m90163r8135O17922Q71496j6647j306244j362367L7967
9303a660641J176086P83099k84335n57774k4984K97786N4097j71713J57260R21880
9293F90761J456248J027920l26596j399460r76185N05121J314449O06414o80589
9284B218083j308888j131278o50654j55592K07636K67155J78236L19986N72111
$$ plain form
9353 1477816 1528737 2344310 3186724 2823473 1259637 -311621 -1080639 -1156582 -787951 -59474
9343 -59474 717890 1124766 1113365 864232 402988 -188157 -531843 -367322 162916 897917
9333 897917 1750296 2203360 1586754 250678 -496047 -150545 295611 49517 -251500 137333
9323 137333 674397 609651 450715 994383 1653476 1223031 -113474 -938802 -594692 160405
9313 160405 420781 85530 -404633 -502768 115154 986650 970003 -336241 -1698608 -1660641
9303 -1660641 -484555 298544 14209 -543565 -568549 -270763 -216666 -388379 -231119 690761
9293 690761 2147009 3174929 2848333 1448873 472688 977809 2292258 2898672 2218083
9284 2218083 909195 -222083 -872737 -1028329 -820693 -553538 -375302 -55316 516795
9275E16795L75127k81582o74317l67362K85742P93528R32603M82798n23458j239366
9265C00508p63141L82104O86185j57887p60888k07774N84263M46880k78766n69775
9255c38291l58238j95520k431N75282R90002L27083j001440j377139j88064J119725
9245d49031R37386k91547p93542r7713L67629l44704j073269m11589Q18699P04441
9235f33240n75372q44879M94387J271344J853j595975j300500J60982O20774J14638
9225b285988L30317J152277P43260r12707j533933l16458N93919k83216j161308
9216c673837M7180K077533K081637L751j363411n08184R30758R30101j81257q00286
9206d56015n35917k18671r6166M40256J294053J260107j33123j424760r65685
$$ plain form
9275 516795 891922 610340 -63977 -431339 -145597 647931 1580534 2063332 1539874 300508
9265 300508 -462633 -80529 605656 447769 -313119 -520893 63370 510250 231484 -338291
9255 -338291 -696529 -892049 -894480 -319198 670804 997887 -3553 -1380692 -1568756 -449031
9245 -449031 488355 196808 -596734 -694447 -326818 -671522 -1744791 -2156380 -1337681 -633240
9235 -633240 -1208612 -2053491 -1559104 -287760 -285907 -1881882 -3182382 -3021400 -2400626 -2285988
9225 -2285988 -1955671 -803394 -60134 -972841 -2506774 -2823232 -2229313 -2512529 -3673837
9216 -3673837 -3626657 -1549124 532513 536264 -827147 -1335331 -404573 525528 344271 -456015
9206 -456015 -991932 -1210603 -1306769 -866513 427540 1687647 1554524 129764 -835921
9197h35921O98691J448619M46544r27649j216598o94882m48145o85941p92121
9188c007403l81996M01928J145038J241721L53409q07136r48509P4256R28966
9179i99726P52938L40431N93395R36250M22940n05336o99045j44445J25828l64323
9169D58907j017121j003400M889J494282K131939J000777q11871j159416P8053
9160A177039N92208o95112j659896l75839J535337J395371k59207q01500O9479
9151I77880J89041j053407j631808l00634J447021J671737L87436j037929j493386
9142h44049p41714M37724P10156j77058p13550J76035J191900O88126m18760j42625
9132A66185J021780Q73221o17681j264052m66815N7471l40979k80539O00233P40765
$$ plain form
9197 -835921 -137230 1311389 1757933 830284 -386314 -1081196 -1529341 -2215282 -3007403
9188 -3007403 -3389399 -2987471 -1842433 -600712 -247303 -1054439 -2002948 -1928692 -999726
9179 -999726 -246788 93643 687038 1623288 2046228 1540892 841847 697402 823230 458907
9169 458907 -558214 -1561614 -1556725 -62443 2069496 3070273 2258402 1098986 1177039
9160 1177039 1769247 1074135 -585761 -961600 573737 1969108 1709901 908401 977880
9151 977880 1166921 113514 -1518294 -1818928 -371907 1299830 1687266 649337 -844049
9142 -844049 -1585763 -1148039 -437883 -614941 -1328491 -1152456 39444 727570 308810 166185
9132 166185 1187965 2061186 1443505 179453 -287362 -229891 -570870 -851409 -251176 489589
9122D89589k42574n61226M54304R69303n5130r92765n93136j59110q19169j234042
9112b743956j99697Q27523K35018p54398j78391J248972J458438M51008k04970
9103A39547k91027p83058j454272j089542K06160J035923Q99966N70962M65789
9094b99552K64859p379L0548K11320J18906m825K51178N45235M19185K21233K93300
9083B044008N8710q14863j276150m39649O20310L88145n52234m82941N04270P26051
9073G75657j42238o04198k7316L91946q6191m82010j598N02308J08892m78668
9063d3416j20259P90501Q68345j84347j181984j062533m7184R01766J185000R00680
9053B006569M25832N501k48442k26962M0949K03974j10545p55044j160716j041137
$$ plain form
9122 489589 247015 -314211 140093 1109396 1054266 61501 -531635 -690745 -1509914 -2743956
9112 -2743956 -2943653 -2116130 -1881112 -2635510 -2813901 -1564929 -106491 344517 139547
9103 139547 -151480 -934538 -2388810 -3478352 -3272192 -2236269 -1336303 -765341 -299552
9094 -299552 -34693 -42072 -11524 199796 318702 313877 565055 1110290 1529475 1750708 2044008
9083 2044008 2102718 1287855 11705 -427944 192366 580511 28277 -454664 49606 775657
9073 775657 633419 29221 1905 393851 307660 -174350 -175948 326360 435252 -43416
9063 -43416 -163675 626826 1495171 1310824 128840 -933693 -980877 -79111 1105889 2006569
9053 2006569 2432401 2437902 2189460 1962498 2003447 2207421 2096876 1341832 181116 -860021
9043h60021o09420p2296N27726Q69041M85007l75339p93824m88056k25542m16244
9033a958968l05968N68887J151885L91591p83081o46017N49986Q17904m20068
9024f33849j311901m15089J093519J283082L41314P88P16579J130066L73678o49559
9014A928628q30401m58209l91722n23489j82987M23920L88155l73385q74569n26526
9004a420585J22446M10952M18208L93197K20981j5413J92492P92275Q14719j70477
8994A758795j049779o52052M12233O00960k79090r11795m82049L26927M95727
8985B19877o9633o60905n90465J63315Q00023M72597m53663n70646N78782J551618
8975A440900R80827l77839q39138k96529k2572m24986o14928r5944N44588O62007
$$ plain form
9043 -860021 -1469441 -1541737 -1014011 -144970 340037 -35302 -829126 -1317182 -1542724 -1958968
9033 -1958968 -2264936 -1696049 -544164 -152573 -935654 -1581671 -1031685 -213781 -633849
9024 -633849 -1945750 -2360839 -1267320 15762 357076 357864 1074443 2204509 2578187 1928628
9014 1928628 1098227 640018 248296 -275193 -458180 -34260 353895 -19490 -894059 -1420585
9004 -1420585 -1298139 -887187 -468979 -75782 145199 129786 322278 1114553 1929272 1758795
8994 1758795 709016 56964 469197 1070157 791067 -120728 -602777 -275850 219877
8985 219877 150244 -510661 -1101126 -937811 -137788 334809 -118854 -689500 -110718 1440900
8975 1440900 2421727 2043888 1204750 908221 885649 460663 -154265 -250209 294379 956386
8965I56386J69270p10284j340734q24342O62313J451183O17132l82391k690O46329
8955A242172l10255j915582j633735L28428J235985L65522j24206O07688N85134
8946C81151j062099k062361p43869J069689J054467j06683m30774J47534M74719
8937a278226M60464N97026N67874J13339n9430K63770K2738r75421j057424M40828
8927i04462J412962K60241j169277n64322Q35841L83016j253100j079514J138358
8918i40257K370197J042518r26721j457471r38061n60984k83514L26227Q11345
8909e56721N75520p4067m32065k42214L66969J098795J397893Q05355m08269j441164
8899A090032j773840j422152o66021O3243M30943O91204J351754K080829J869398
$$ plain form
8965 956386 1125656 415372 -925362 -1749704 -1087391 363792 980924 598533 595843 1242172
8955 1242172 931917 -983665 -2617400 -2288972 -1052987 -687465 -811671 -203983 381151
8946 381151 -680948 -2743309 -3487178 -2417489 -1363022 -1469705 -1900479 -1752945 -1278226
8937 -1278226 -817762 -220736 347138 460477 401047 664817 687555 -287866 -1345290 -904462
8927 -904462 508500 768741 -400536 -964858 -129017 253999 -999101 -2078615 -940257
8918 -940257 1429940 2472458 1545737 88266 -849795 -1410779 -1694293 -1368066 -556721
8909 -556721 18799 -55268 -487333 -729547 -362578 736217 2134110 2939465 2531196 1090032
8899 1090032 -683808 -2105960 -2771981 -2708738 -2277795 -1586591 -234837 1845992 3715390
8890C715390O67627l11155m56757n45524r58013p78497K65373P36942j98869j131515
8880A005002p70766k12971q11025j488933o49057P15679O32288k75118J07903
8871a746998J460360J482700K1491n86685M14423R64066j78583j391605r77277
8862e38108L04351P93535K66624m32622p28137m37585K66926N63934j51599r88202
8852a080883n93699N75537Q24088M6162j80639M44762L63361p93236j149077J74241
8842a369383J172571R2065j544703j200204P77026J793317Q23560n52214p64309
8833g72274q4591M56684O18313P67312Q87362N00689m71120j243663r85241j2716
8823c39245M69286M8343l17352L9859K81284m45812j280757r08925J98309N60307
$$ plain form
8890 3715390 4383017 4071862 3615105 3069581 2111568 1333071 1598444 2335386 2136517 1005002
8880 1005002 234236 21265 -789760 -2278693 -2927750 -2212071 -1579783 -1854901 -1746998
8871 -1746998 -286638 1196062 1217553 630868 1045291 2009357 1830774 439169 -538108
8862 -538108 -233757 559778 826402 393780 -334357 -771942 -505016 58918 -92681 -1080883
8852 -1080883 -1674582 -1099045 -274957 -228795 -409434 35328 398689 -394547 -1543624 -1369383
8842 -1369383 -196812 -104747 -1649450 -2849654 -2072628 -279311 544249 -7965 -772274
8833 -772274 -856865 -400181 218132 985444 1872806 2373495 1902375 658712 -326529 -339245
8823 -339245 130041 178384 -138968 -99109 182175 -263637 -1544394 -2453319 -2255010 -1694703
8813a694703J74337K61636Q35340O87647j91208m29680J96015L07020m66680o94388
8803a014664K11406P80616L4314q15051n40951J08175P6610q3554L86938O97732
8793a58429k9449q37241l77031P39316R52422L47312K88241R27923R82937p8001
8783B758000j252614j572061j165449n40218J73872R58337J543049J554937Q01530
8774C259383m56840j405122j324337n30255k3129m6964R5885N74687O00884l4703
8764G09489l54657J02714L77221j13135l44115L96743Q16136l77890j947479j693213
8754b428186J91468J476361J194866M58654J14312k72317q60190r27907l40240
8745a393179N924k80728n23775l53316k06564q7511O16990J591856J513764K29684
$$ plain form
8813 -1694703 -1520366 -1258730 -423390 264257 73049 -356631 -160616 146404 -320276 -1014664
8803 -1014664 -803258 -22642 11672 -803379 -1344330 -1236155 -1159545 -1243099 -856161 -158429
8793 -158429 -187878 -1025119 -1402150 -662834 289588 636900 925141 1853064 2836001 2758000
8783 2758000 1505386 -66675 -1232124 -1772342 -1598470 -640133 902916 2457853 3259383
8774 3259383 2802543 1397421 73084 -457171 -480300 -527264 -431379 143308 744192 709489
8764 709489 354832 457546 834767 721632 377517 774260 1590396 1212506 -734973 -2428186
8754 -2428186 -2236718 -760357 434509 893163 1007475 735158 -125032 -1052939 -1393179
8745 -1393179 -1387255 -1667983 -2191758 -2545074 -2751638 -2839149 -2222159 -630303 883461 1113145
8735A113145o30971j49264M27772o7427o55589m2021Q73424M06964q81946r02704
8725e08617N23843J285989L37114p63438m92355L45421K53616m51903l77213N29220
8715F81677R30646K49856n43805m66083K12534N75673K48550l66939o48707l45352
8705E28050J78630L20782K5076j33868N0375p4251q31280j191287j17006J440916
8695A96137J434140k93203j554728r44003K19999J61728n75540k73723R49276
8686f79917J245657J36j156176p48134N54654J113400N02007l50430o14138l18775
8676d51716R9512L10459J48534l15897o21870k32287P00549J151279L12400j138323
8666c7360j519698k47270J225088J281163L41676M1325N98057N95124m71926j198884
$$ plain form
8735 1113145 482174 332910 760682 693255 37666 -4355 869069 1276033 394087 -508617
8725 -508617 15226 1301215 1638329 874891 382536 727957 981573 529670 152457 681677
8715 681677 1612323 1862179 1318374 852291 1064825 1640498 1889048 1522109 873402 528050
8705 528050 706680 1027462 1052538 918670 969045 894794 63514 -1127773 -1244779 196137
8695 196137 1630277 1337074 -217654 -1161657 -941658 -779930 -1355470 -1629193 -679917
8686 -679917 565740 565876 -590300 -1338434 -783780 329620 831627 481197 -132941 -451716
8676 -451716 -352204 -41745 106789 -209108 -830978 -1063265 -362716 788563 1100963 -37360
8666 -37360 -1557058 -1804328 -579240 701923 1043599 1084924 1682981 2278105 1806179 607295
8656F07295n81621K91023P4911o17411l84317N27064O65536k41808j006617r10721
8646a576666m56035j83832j7932J37880K12841L89545P86770R06795L71637j42681
8636D28322J17544M84446j81476j329847j275312M3458P57856k0783q27567k41137
8626b044496R51619J163836L70111k30571j27282J23846q743m95969j009828j081449
8616b388926l67965P31708J216805P46261J87093L14948N91242M8120j063578
8607A5708j488459p29897K97420N83325K91025K61045O62909P90461K28649m00639
8597E11547k96598L35907O40891M16254J84544L4127m77010j070775p51468L88768
8587h3813Q13035r5804q10172j14377P11783j692j312050j079078M62976J120615
$$ plain form
8656 607295 25674 316697 391608 -225803 -610120 -83056 582480 340672 -665945 -1576666
8646 -1576666 -2032701 -2216533 -2234465 -2096585 -1883744 -1494199 -707429 199366 571003 428322
8636 428322 545866 1030312 848836 -481011 -1756323 -1712865 -955009 -975792 -1803359 -2044496
8626 -2044496 -1092877 70959 441070 210499 83217 207063 198320 -297649 -1307477 -2388926
8616 -2388926 -2756891 -2025183 -808378 -62117 124976 439924 1031166 1079286 15708
8607 15708 -1472751 -2202648 -1905228 -1321903 -1030878 -769833 -106924 683537 912186 511547
8597 511547 214949 550856 1191747 1608001 1792545 1826672 1349662 278887 -472581 -83813
8587 -83813 729222 633418 -176754 -291131 420652 418960 -893090 -1972168 -1509192 -388577
8577c88577L44833k53428j8304j45616r76329j052314J77380J094740N70068k28705
8567h76252l4583M25520N2995n71276l88159K34283L72320J90806K56508K63141
8557g4697j45662k91556L70313R34623L65126o71987p49158K02060J064910J228338
8547B232310Q28519p9039j274136j832991j143065n1017J90737k80622l46506
8538a755810K72145P58385N32507j38140o77287o36627N1017P08130M32190n02398
8528i55888p20046J31358O33548k2410m37821O36522J788082R56854j043170j538938
8518e71909j16463Q78140J16426r13919n97514M43099P61805K71655j75516k78261
8508a82457k71366j75029P8844L00092L91167N27806O22046K36648o02673j162019
$$ plain form
8577 -388577 -43744 -297172 -315476 -461092 -1437421 -2489735 -2312355 -1217615 -647547 -876252
8567 -876252 -910835 -485315 -432320 -1003596 -1391755 -1157472 -785152 -594346 -337838 -74697
8557 -74697 -220359 -511915 -141602 793021 1158147 486160 -262998 -60938 1003972 2232310
8547 2232310 3060829 2981790 1707654 -125337 -1268402 -1319419 -1128682 -1409304 -1755810
8538 -1755810 -1483665 -725280 -192773 -330913 -1008200 -1644827 -1593810 -885680 -453490 -955888
8528 -955888 -1675934 -1544576 -911028 -933438 -1371259 -734737 1053345 2010199 967029 -571909
8518 -571909 -688372 189768 306194 -607725 -1205239 -762140 -335 271320 95804 -182457
8508 -182457 -453823 -628852 -550008 -249916 141251 669057 1291103 1527751 925078 -236941
8498b36941r55357l59416O0859K49571L50273K88931N8585n7756Q6462K24433
8488b90356R7994j64429k70657q2074L41587P10642O02038j1845m88983k84422
8478A59495K12475K52298r2673j62458M0807r8367m73833k02142P31122J019213
8468A385937k1575j137701q39269L70749P63907k4103o05946j33285M17019j03052
8458G2681j116696j123549R7318J185760J059881R6681p58085j124921r52009
8449b562939l6860J345273J975989R91835o29185j061657p4430P54438M20646
8440A123110k74749l71969k18902l54502j97372P81177J512468O53577j000056
8431A652782j260890K04378J164302N339j891051k074379l13475J378726J521089
$$ plain form
8498 -236941 -1192298 -1551714 -1490855 -1241284 -891011 -602080 -543495 -601251 -514789 -290356
8488 -290356 -192362 -356791 -627448 -709522 -367935 342707 944745 932900 443917 159495
8478 159495 371970 624268 531595 369137 409944 311577 -162256 -364398 366724 1385937
8468 1385937 1364362 226661 -612608 -241859 522048 497945 -108001 -241286 175733 72681
8458 72681 -1044015 -2167564 -2070246 -884486 175395 272076 -486009 -1610930 -2562939
8449 -2562939 -2599799 -1254526 721463 1713298 1084113 22456 -51974 702464 1123110
8440 1123110 848361 476392 257490 -97012 -294384 486793 1999261 2652838 1652782
8431 1652782 391892 596270 1760572 1765911 -125140 -2199519 -2512994 -1134268 386821
8422C86821O08896j98321n56751o45929l92397K14942O20949L85099L1298L04753
8412G59360P80503L24135r68283j545790o28181N42798N43980j92957l44339J65591
8402e63183L90335J42413L1876O1552k69672o34710k43473M94471L44034n76121
8392h22478p30749L31410J136635N75992n29508q88912l74100M76753J220747
8383C95790J202517n572j269415p13009J388470K405469J000061j002825j578948
8374A822538j214499j075955o43605O92893J550248N67662r19644p92343M22292
8365D09587O54028j48127l34407K34426J47269o90155q99738k82135k7994k57702
8355a194948R7873Q73884P39165r4497P5707J245437J314732l42479j618052j062164
$$ plain form
8422 386821 995717 797396 240645 -405284 -797681 -582739 38210 423309 454607 759360
8412 759360 1539863 1863998 895715 -650075 -1278256 -735458 -191478 -384435 -728774 -563183
8402 -563183 -172848 -30435 1441 62993 -206679 -841389 -1084862 -590391 -246357 -822478
8392 -822478 -1553227 -1221817 -85182 490810 -38698 -927610 -1301710 -824957 395790
8383 395790 1598307 1592735 323320 -389689 998781 3404250 4404311 3401486 1822538
8374 1822538 608039 -467916 -1111521 -418628 1131620 1699282 779638 -12705 409587
8365 409587 1063615 915488 581081 815507 962776 272621 -627117 -909252 -937246 -1194948
8355 -1194948 -1097075 -223191 515974 421477 497184 1742621 3057353 2714874 1096822 34658
8345C4658j0420J6793k91353J56333O65341J55636q00560j007513m94076M1225
8335a533936M65039P19133L43380m25135m33541M45118O94138l44758j092404
8326a162966l50085N08154r4975j017178k45800J527854J856183M43247n71515
8317H92919j61442K84531l58399j168752r34982m7250L55566M9567l00808j61208
8307a550258M09846Q50686M98592n68667j198470m30044J023474J495952N61871
8298A092982n07178o07400o8177K75332K74349J74254p8577n46057q10872m55779
8288a257123J94023L61286j70559p14949m80754M50962J160212R75921L07710
8279H26729N7114L51924M66276N5736k93562q8508K58035J85399j38822l66163
$$ plain form
8345 34658 24238 41031 -250322 -93989 571352 726988 -73572 -1081085 -1575161 -1533936
8335 -1533936 -1068897 -349764 -6384 -431519 -865060 -419942 274196 -70562 -1162966
8326 -1162966 -1513051 -1004897 -1099872 -2117050 -2362850 -834996 1021187 1464434 892919
8317 892919 731477 1016008 657609 -511143 -1446125 -1493375 -1137809 -1088242 -1389050 -1550258
8307 -1550258 -1140412 -289726 208866 -359801 -1558271 -1988315 -964841 531111 1092982
8298 1092982 585804 -21596 -89773 185559 459908 634162 555585 9528 -801344 -1257123
8288 -1257123 -1063100 -701814 -872373 -1587322 -2068076 -1617114 -456902 519019 826729
8279 826729 883843 1235767 1702043 1757779 1464217 1375709 1633744 1819143 1680321 1314158
8269A314158p02047j263704j357042m35402P19675R35222M06379K63393O10457
8260D91089M28304m89392r66798k67190P54935R66662M50061O472o2343q712l3577
8249A269511j72844l74607l79899J0870M24715L02587j46144k15968J6337j97723
8239E36835o90027k94676J077963J760381P01924q08425j046824l15548k4665
8230H96938l01520k28425K12775K37114p3270O4374M91765L06402m18759p69447
8220D17947p33181j035359j282515k75749J581907K266068J063759m34536q95691
8211F72650p84603o35162n765Q17732M15796j076400j269812O77829J999908M58835
8201A271008j751339j315891Q62008J311411k18005p15606O55666J282915r1718
$$ plain form
8269 1314158 612111 -651593 -2008635 -2444037 -1724362 -789140 -382761 -119368 491089
8260 491089 919393 430001 -536797 -803987 -49052 917610 1367671 1374143 1311800 1303088 1269511
8249 1269511 1096667 722060 342161 353031 777746 1080333 934189 718221 734558 536835
8239 536835 -153192 -447868 630095 2390476 3092400 2283975 1237151 921603 896938
8230 896938 595418 366993 579768 816882 743612 807986 1299751 1606153 1187394 417947
8220 417947 -315234 -1350593 -2633108 -2908857 -1326950 939118 2002877 1568341 672650
8211 672650 -111953 -747115 -752880 64852 480648 -595752 -1865564 -1187735 812173 1271008
8201 1271008 -480331 -1796222 -934214 377197 159192 -556414 99252 1382167 1290449
8192A290449j177100j62141J347370J239604O5548o34423r38260j497188j720596
8183b186737r41972O5987M17971N65847R49542P77744k45723o39476N44353J692447
8173I99983J012378m75681o71033R0880j10410j215287j295342o717P92340J64923
8163g13966n81095k96318L72098N54604O09503J034304J297390P49353k49971
8154B775902r07995r74446n89819J12362P40037O49675k24258j000726p93401
8145b12669K07708Q96983M48154p07520j201297l29189Q08597N46651q98510j414982
8135a856074L2268J762971J766962M72652l34857l18039m88466r67879q38995
8126g69457n1797L52634M554l81051m24831m27417k52476N95951J637050J661280
$$ plain form
8192 1290449 113349 -48792 1298578 2538182 2603730 1969307 1031047 -466141 -2186737
8183 -2186737 -3128709 -3062722 -2644751 -2078904 -1129362 -351618 -597341 -1236817 -692464 999983
8173 999983 2012361 1536680 865647 956527 846117 -369170 -1664512 -1671229 -878889 -713966
8163 -713966 -1295061 -1591379 -1219281 -664677 -55174 979130 2276520 3025873 2775902
8154 2775902 1867907 893461 303642 416004 1156041 1805716 1581458 580732 -212669
8145 -212669 -4961 892022 1340176 632656 -568641 -897830 -89233 457418 -441092 -1856074
8135 -1856074 -1823806 -60835 1706127 2178779 1843922 1525883 1037417 69538 -769457
8126 -769457 -821254 -468620 -464066 -845117 -1269948 -1697365 -1949841 -1353890 283160 1944440
8116A944440N52267n22879r09306j035347j061871n24371L87488P34898L95724
8107c8957K53629M89055K67067m51023n01158M26000J011190M41058k87861k01162
8097A407838N0566l73950q32308l47946O13231Q96093M13161p6848k84482l75563
8087A089792k49934J38389K87209j22602n61092m99442k44798j54405J35979P73362
8077E92458Q97004l8650r60630n63171N99771Q50412j64657j205914j412655j089995
8067b496027n39640M24052J487037J666373O84310m53357p92640n45443l48825
8058i14160j76006L08347Q23470P08458l5077n58246j67416P90957J232944N06077
8048B519348q08348j412344p44386K81059L58860m78660q39332P6754J175324
$$ plain form
8116 1944440 2496707 1973828 1064522 29175 -1032696 -1557067 -1169579 -434681 -38957
8107 -38957 214672 703727 970794 519771 18613 444613 1455803 1896861 1609000 1407838
8097 1407838 1458404 1084454 252146 -95800 517431 1413524 1826685 1749837 1465355 1089792
8087 1089792 839858 978247 1265456 1142854 581762 82320 -162478 -316883 -180904 592458
8077 592458 1489462 1450812 490182 -72989 526782 1377194 1212537 6623 -1406032 -2496027
8067 -2496027 -3035667 -2611615 -1124578 541795 1226105 772748 -19892 -565335 -914160
8058 -914160 -1090166 -781819 41651 750109 715032 156786 -10630 780327 2013271 2519348
8048 2519348 1711000 298656 -445730 -164671 194189 -284471 -1123803 -1047049 128275
8039A28275Q51006o85077j506582n65593Q75218J065210J49028l46890J04203
8030F8798M91758O5806o39991q83269o51113j01418P99801J533681J094299m23856
8020A354496j414780q92656J0464j88353j033506r92584J19109J062409J093392
8011h82009N94180R8880j02027K39279P78859L92118j182896k215575j093241
8002c372432J078911J866864J000676L20710M95382K76470p13538r96573J15754
7993G2224J130929P75177j19093l64167l31892p33919j010594m86917Q9072k28972
7983a208152p68590k70072R23163J314059N69952j03544P6160M14438P675q26443
7973A28646r88402j38817P67503O94064o0091k79056L06693N27660l10516j084684
$$ plain form
8039 128275 979281 294204 -1212378 -1777971 -902753 162457 311485 -35405 68798
8030 68798 560556 626362 -13629 -896898 -1548011 -1649429 -849628 684053 1778352 1354496
8020 1354496 -60284 -952940 -942476 -1130829 -2164335 -3156919 -3037810 -1975401 -882009
8011 -882009 -287829 -188949 -290976 -51697 727162 1119280 -63616 -2279191 -3372432
8002 -3372432 -2293521 -426657 574019 894729 1390111 1666581 953043 -43530 72224
7993 72224 1203153 1978330 1859237 1495070 1163178 429259 -581335 -1068252 -979180 -1208152
7983 -1208152 -1976742 -2246814 -1323651 -9592 560360 456816 532976 947414 955089 128646
7973 128646 -859756 -998573 -231070 462994 402903 123847 430540 958200 647684 -437000
7963d37000n37988N91924O57590k87151p25332k25726J33296j16571j92252K12771
7953i26439L77403J26077K22703P19084N88591m26421j166451q25496M9024P24742
7943e37183J008453O01252o06348j431141m77847J450984K054121Q62591l58172
7934B566710p10815j022909j260897k07247J467928J188184j132359k135842l03241
7925a550488J349789L06403j238288m31075J131470L44689j754497j702865M91734
7916c053128J585511N67733k72613K73662O67228j63665j107981j102086n57574
7907c162913K8729P74621J352483J117676M63608L43291N70684L04180j78635
7898A613724n7372K13516k87240r05689m26758M33314J5333j233761j326012j11207
$$ plain form
7963 -437000 -974988 -383064 274526 -12625 -737957 -963683 -830387 -946958 -1139210 -926439
7953 -926439 -549036 -422959 -200256 518828 1107419 680998 -485453 -1310949 -1261925 -537183
7943 -537183 471270 1072522 466174 -964967 -1442814 8170 2062291 2924882 2566710
7934 2566710 1855895 832986 -427911 -635158 832770 2020954 888595 -1247247 -1550488
7925 -1550488 -200699 105704 -1132584 -1563659 -432189 -87500 -1841997 -3544862 -3053128
7916 -3053128 -1467617 -899884 -1172497 -898835 -231607 -395272 -1503253 -2605339 -3162913
7907 -3162913 -3134184 -2359563 -1007080 110596 574204 917495 1488179 1792359 1613724
7898 1613724 1556352 1769868 1482628 576939 150181 583495 598828 -634933 -1960945 -2072152
7888b072152O02613K53780J22038N80961M88382l17635n51315j0187l3813q25152
7878a762480p94872O31637J852577J619351O74417L8662m17732r07315r89789
7869e5544o05235l12547j37645K74864L99892m08452j113669k42200J253805J065768
7859A19037n46651r43181M77327J353634N77747l5267N00132M21509j169668k077801
7849a323182o76565J065113P50082o90358j001248k49378J67341L36367J024383
7840e97445J553150R66833L5243j34733j29468p33057r59838P0004Q78338p9962
7830H69065j298395l69061J812372K156284J32621j677488j639137p80861l02471
7821a097071l3424K01855L148l25393Q1366Q48127O11941o04348j201099n73905
$$ plain form
7888 -2072152 -1469539 -1215759 -1093721 -512760 -24378 -342013 -893328 -903515 -937328 -1762480
7878 -1762480 -2557352 -1925715 -73138 1546213 2220630 2259292 1841560 934245 -55544
7869 -55544 -660779 -973326 -1110971 -836107 -436215 -844667 -1958336 -2200536 -946731 119037
7859 119037 -427614 -1370795 -893468 460166 1037913 1002646 1502778 1924287 754619 -1323182
7849 -1323182 -1999747 -934634 -184552 -874910 -1876158 -2125536 -1958195 -1621828 -597445
7840 -597445 955705 1922538 1957781 1823048 1693580 960523 685 70689 949027 869065
7830 869065 -429330 -798391 1013981 3170265 3302886 1625398 -13739 -794600 -1097071
7821 -1097071 -1130495 -928640 -925492 -1250885 -1169519 -321392 290549 -313799 -1514898 -2088803
7811b088803N7397o2683k020R72539J909205J554973M9163j534019k327933j836866
7801c309047q7858J772974K099078O64289q55896q95253K53091J155816R51449
7792A748643j21314j211297j409572m10643R68116J412407N53694o42460j071913
7783a84339n79844K34133P20951N34955j93215q38106p99366j33304N80205Q83508
7773B25578O95893K21353p2411J88895O00033K96633n90896p71929J43777O28767
7763A565693m10731j485616o56234J123761J271366k37973q05175M02222J031565
7754A798878l77035j766616r28894Q64717J058073o9786k47203Q38188J286104
7745B456426L54887o16110q24727j032322j415530p83125J011420J977155P98741
$$ plain form
7811 -2088803 -2031406 -2094089 -2096109 -1123570 785635 2340608 2389771 855752 -1472181 -3309047
7801 -3309047 -3396905 -1623931 475147 1139436 283540 -611713 -358622 797194 1748643
7792 1748643 1627329 416032 -993540 -1404183 -436067 976340 1530034 887574 -184339
7783 -184339 -764183 -530050 190901 725856 532641 -305465 -1104831 -1238135 -657930 225578
7773 225578 921471 1142824 1070413 1259308 1859341 2155974 1565078 793149 936926 1565693
7763 1565693 1154962 -330654 -986888 136873 1408239 1170266 365091 767313 1798878
7754 1798878 1421843 -344773 -1273667 -408950 649123 579337 332134 1170322 2456426
7745 2456426 2811313 2195203 1370476 338154 -1077376 -1860501 -849081 1128074 1926815
7736A926815q94653q03014O96831J351321M14698p29202j034784r37329q34962
7727h44279k18518J001408J675964Q52803q22996j906752j718639n71110Q33926
7718a718193J639624J210193j3801o62179j05294O94329O85100K29006J35914
7709B094699P2124o95444j579482j324538j45012M61229R6213l5339O37546J005156
7699E87152K07492q83025j118187p83601p04370o58209P114Q68948Q98148R7521
7689a481017n12737l92802M7519L76854N83763N79232J39710m84964o03824L5641
7679a712625Q65355J165186P93653J83214j39079j9601J65566p7651o85058j028774
7669d89814p42909j95480R5826J19202J54804L26518O72443J188985J472630Q94716
$$ plain form
7736 1926815 1032162 229148 925979 2277300 2691998 1962796 928012 -9317 -844279
7727 -844279 -1062797 -61389 1614575 2467378 1644382 -262370 -1981009 -2552119 -1718193
7718 -1718193 -78569 1131624 1117823 455644 350350 1044679 1729779 1958785 2094699
7709 2094699 2166823 1471379 -108103 -1432641 -1577653 -1116424 -1020211 -1055550 -418004 587152
7699 587152 794644 -88381 -1206568 -1990169 -2694539 -3352748 -3345634 -2476686 -1578538 -1481017
7689 -1481017 -1993754 -2386556 -2339037 -1962183 -1378420 -799188 -659478 -1144442 -1748266 -1712625
7679 -1712625 -847270 317916 1111569 1294783 1155704 1136103 1301669 1224018 538960 -489814
7669 -489814 -1232723 -1428203 -1332377 -1213175 -1058371 -731853 -59410 1129575 2602205 3496921
$$ [...]
##END NTUPLES=NMR SPECTRUM
##END=
