##TITLE=31Pdec_DE18rm
  24 sc
 25.9.2023
##JCAMPDX= 6.0         $$ Bruker NMR JCAMP-DX V2.0
##DATA TYPE= NMR SPECTRUM
##DATA CLASS= NTUPLES
##ORIGIN= UXNMR, Bruker Analytische Messtechnik GmbH
##OWNER= root
$$ XWIN-NMR		Version 3.5
$$ Mon Sep 25 15:47:39 2023 Russian Standard Time (UT+4h)  she@DPX200
##.OBSERVE FREQUENCY= 81.013821
##.OBSERVE NUCLEUS= ^31P
##.ACQUISITION MODE= SIMULTANEOUS
##.ACQUISITION SCHEME= undefined
##.AVERAGES= 24
##.DIGITISER RES= 16
##SPECTROMETER/DATA SYSTEM= spect
##.PULSE SEQUENCE= zgpg30
##.SOLVENT NAME= DMSO
##.SHIFT REFERENCE= (INTERNAL, DMSO, 0, 248.564)
##AUDIT TRAIL= $$ (NUMBER, WHEN, WHO, WHERE, WHAT)
$$ ##TITLE= Audit trail, XWIN-NMR		Version 3.5
$$ ##JCAMPDX= 5.01
$$ ##ORIGIN= Bruker BioSpin GmbH
$$ ##OWNER= she
$$ F:/spectra/data/she/nmr/P31/1/pdata/1/auditp.txt
$$ ##AUDIT TRAIL=  $$ (NUMBER, WHEN, WHO, WHERE, WHAT)
(   1,<2023-09-25 15:46:41.45 +0400>,<she>,<DPX200>,
      <created by zg, POWCHK disabled, PULCHK disabled
       configuration hash MD5:
       00 E9 B6 7A A2 85 ED C7 34 08 36 98 17 FE 4E 26
       data hash MD5: 32K
       AF B4 00 3D E7 A0 4F 0D 3C 10 40 B1 19 2F 07 78>)
(   2,<2023-09-25 15:46:43.95 +0400>,<she>,<DPX200>,
      <Start of raw data processing
       efp BC_mod = 2 LB = 5 FT_mod = 6 PKNL = 1 PHC0 = -10625.72 PHC1 = 25.68629 SI = 64K 
       data hash MD5: 64K
       7C C9 C9 BA B1 24 9F 7A AA 1F F7 AC 12 57 54 18>)
(   3,<2023-09-25 15:47:03.39 +0400>,<she>,<DPX200>,
      <pk PHC0 = -29.87696 PHC1 = 0 
       data hash MD5: 64K
       14 1F FC B1 23 05 83 25 DD 73 00 88 40 83 8E DA>)
(   4,<2023-09-25 15:47:05.85 +0400>,<she>,<DPX200>,
      <abs ABSG = 5 
       data hash MD5: 64K
       E3 30 D7 47 07 88 CA 6E D9 19 39 6D 9E DE 14 07>)
$$ ##END=
$$ 
$$ hash MD5
$$ 3E CB D8 AE 86 6B 4E 15 5C DC 84 1A A3 BD C0 70
##$RELAX= 
##$RELAX= 
##$RELAX= 
##$RELAX= 
##$RELAX= 
##$RELAX= 
##$RELAX= 
##$RELAX= 
##$RELAX= 
$$ Bruker specific parameters
$$ --------------------------
##$DU= <F:/spectra>
##$EXPNO= 1
##$NAME= <P31>
##$PROCNO= 1
##$TYPE= <nmr>
##$USER= <she>
##$AMP= (0..31)
100 100 100 100 100 100 100 100 100 100 100 100 100 100 100 100 100 100 
100 100 100 100 100 100 100 100 100 100 100 100 100 100 
##$AQSEQ= 0
##$AQ_mod= 1
##$AUNM= <au_zg>
##$AUTOPOS= <>
##$BF1= 81.014009
##$BF2= 200.13
##$BF3= 200.13
##$BF4= 200.13
##$BF5= 200.13
##$BF6= 200.13
##$BF7= 200.13
##$BF8= 200.13
##$BYTORDA= 1
##$CFDGTYP= 0
##$CFRGTYP= 5
##$CHEMSTR= <none>
##$CNST= (0..31)
1 1 145 1 1 1 1 1 1 1 1 1 1 1 1 1 1 1 1 1 1 1 1 1 1 1 1 1 1 1 1 1 
##$CPDPRG= <waltz16>
##$CPDPRG1= <>
##$CPDPRG2= <waltz16>
##$CPDPRG3= <>
##$CPDPRG4= <mlev>
##$CPDPRG5= <mlev>
##$CPDPRG6= <mlev>
##$CPDPRG7= <mlev>
##$CPDPRG8= <mlev>
##$CPDPRGB= <>
##$CPDPRGT= <>
##$D= (0..31)
0 1 0 0 0 0 0 0 0 0 0 0.03 2e-05 3e-06 0 0 0 0 0 0 0 0 0 0 0 0 0 0 0 0 
0 0 
##$DATE= 1695642400
##$DBL= (0..7)
120 120 120 11 120 120 24 19 
##$DBP= (0..7)
150 150 150 150 150 150 150 150 
##$DBP07= 0
##$DBPNAM0= <>
##$DBPNAM1= <>
##$DBPNAM2= <>
$$ [...]
##$SUBNAM3= <"">
##$SUBNAM4= <"">
##$SUBNAM5= <"">
##$SUBNAM6= <"">
##$SUBNAM7= <"">
##$SUBNAM8= <"">
##$SUBNAM9= <"">
##$SW= 501.771253377433
##$SWIBOX= (0..15)
0 1 3 0 0 0 0 0 0 0 0 0 0 0 0 0 
##$SW_h= 40650.406504065
##$TD= 32768
##$TD0= 1
##$TE= 0
##$TE2= 300
##$TE3= 300
##$TEG= 300
##$TL= (0..7)
0 120 53 12 22 120 120 120 
##$TP= (0..7)
150 150 150 150 150 150 150 150 
##$TP07= 0
##$TPNAME0= <>
##$TPNAME1= <>
##$TPNAME2= <>
##$TPNAME3= <>
##$TPNAME4= <>
##$TPNAME5= <>
##$TPNAME6= <>
##$TPNAME7= <>
##$TPOAL= (0..7)
0.5 0.5 0.5 0.5 0.5 0.5 0.5 0.5 
##$TPOFFS= (0..7)
0 0 0 0 0 0 0 0 
##$TUNHIN= 0
##$TUNHOUT= 0
##$TUNXOUT= 0
##$USERA1= <user>
##$USERA2= <user>
##$USERA3= <user>
##$USERA4= <user>
##$USERA5= <user>
##$V9= 5
##$VALIST= <valist>
##$VCLIST= <CCCCCCCCCCCCCCC>
##$VD= 0
##$VDLIST= <DDDDDDDDDDDDDDD>
##$VPLIST= <PPPPPPPPPPPPPPP>
##$VTLIST= <TTTTTTTTTTTTTTT>
##$WBST= 1024
##$WBSW= 4
##$XGAIN= (0..3)
0 0 0 0 
##$XL= 0
##$YL= 0
##$YMAX_a= 19141
##$YMIN_a= -24967
##$ZGOPTNS= <>
##$ZL1= 120
##$ZL2= 120
##$ZL3= 120
##$ZL4= 120
##$ABSF1= 248.5645
##$ABSF2= -253.2056
##$ABSG= 5
##$ABSL= 3
##$ALPHA= 0
##$AQORDER= 0
##$ASSFAC= 0
##$ASSFACI= 0
##$ASSFACX= 0
##$ASSWID= 0
##$AUNMP= <proc_1d>
##$AZFE= 0.1
##$AZFW= 0.5
##$BCFW= 0
##$BC_mod= 2
##$BYTORDP= 0
##$COROFFS= 0
##$CY= -3
##$DATMOD= 1
##$DC= 0
##$DFILT= <>
##$DTYPP= 0
##$F1P= 0
##$F2P= 0
##$FCOR= 1
##$FTSIZE= 65536
##$FT_mod= 6
##$GAMMA= 0
##$GB= 0
##$INTBC= 1
##$INTSCL= 6.047779e-11
##$ISEN= 30
##$LB= 5
##$LEV0= 0
##$LPBIN= 0
##$MAXI= 10000
##$MC2= 0
##$MEAN= 0
##$ME_mod= 0
##$MI= 50
##$NCOEF= 0
##$NC_proc= -8
##$NLEV= 6
##$NOISF1= 182.463
##$NOISF2= 159.3651
##$NSP= 0
##$NTH_PI= 0
##$NZP= 0
##$OFFSET= 248.5645
##$PC= 4
##$PHC0= -10655.6
##$PHC1= 25.68629
##$PH_mod= 1
##$PKNL= yes
##$PPARMOD= 0
##$PSCAL= 0
##$PSIGN= 0
##$REVERSE= no
##$SF= 81.0140089999694
##$SI= 65536
##$SIGF1= 159.3651
##$SIGF2= -187.1042
##$SINO= 113.3802
##$SIOLD= 16384
##$SREGLST= <1H.CDCl3>
##$SSB= 0
##$STSI= 65536
##$STSR= 0
##$SW_p= 40650.406504065
##$SYMM= 0
##$S_DEV= 0
##$TDeff= 32768
##$TDoff= 0
##$TI= <>
##$TILT= no
##$TM1= 0
##$TM2= 0
##$TOPLEV= 0
##$USERP1= <user>
##$USERP2= <user>
##$USERP3= <user>
##$USERP4= <user>
##$USERP5= <user>
##$WDW= 1
##$XDIM= 65536
##$YMAX_p= 465063814
##$YMIN_p= -13012050
$$ End of Bruker specific parameters
$$ ---------------------------------
##NTUPLES= NMR SPECTRUM
##VAR_NAME=  FREQUENCY,     SPECTRUM/REAL,   SPECTRUM/IMAG
##SYMBOL=    X,             R,               I
##VAR_TYPE=  INDEPENDENT,   DEPENDENT,       DEPENDENT
##VAR_FORM=  AFFN,          ASDF,            ASDF
##VAR_DIM=   65536,         65536,           65536
##UNITS=     HZ,            ARBITRARY UNITS, ARBITRARY UNITS
##FACTOR=    0.620285442955139, 1,           1
##FIRST=     20137.2065510682, 0,            0
##LAST=      -20513.1999529968, 0,           0
##MIN=       -20513.1999529968, -13012050,   0
##MAX=       20137.2065510682, 465063814,    0
$$ Real data points
##PAGE= N=1
##DATA TABLE= (X++(R..R)), XYDATA
$$ [...]
46585 -786905 -1926349 -2863023 -3467274 -3677357 -3498414 -3046115 -2526515 -2120853 -1877786
46576 -1877786 -1708122 -1470415 -1077986 -566935 -85598 194691 184521 -81127 -475152 -837512
46566 -837512 -1028889 -978469 -711803 -332246 32872 279168 349740 250907 54135 -132187
46556 -132187 -201951 -69435 318564 945192 1695012 2400137 2937531 3271900 3407574 3336228
46546 3336228 3055681 2615669 2107463 1600389 1100978 581447 49104 -415363 -704293
46537 -704293 -786263 -759258 -782535 -953358 -1253912 -1590511 -1847789 -1926155 -1794897 -1532422
46527 -1532422 -1271122 -1077317 -915944 -743923 -587253 -493143 -448221 -387662 -262529 -71069
46517 -71069 141283 277078 217908 -92222 -610985 -1264760 -1999938 -2725592 -3276463 -3531109
46507 -3531109 -3541810 -3455766 -3327304 -3120570 -2904858 -2910329 -3303061 -3969294 -4597581 -4938763
46497 -4938763 -4933518 -4637802 -4119689 -3442627 -2689188 -1956171 -1313490 -756124 -203251 411008
46487 411008 1014245 1388110 1326795 816543 67050 -604227 -919055 -747659 -164721 584588
46477 584588 1223302 1597132 1720969 1700046 1621036 1505840 1345002 1160288 1020164 979033
46467 979033 1013303 1049761 1054664 1052353 1049681 1001728 890436 788689 786457 876226 973680 1051739
46455 1051739 1202717 1553205 2145735 2905120 3687214 4356549 4853912 5207478 5457641
46446 5457641 5559034 5376122 4791548 3815754 2599292 1366257 336815 -340626 -652552
46437 -652552 -741824 -831930 -1071420 -1415708 -1664189 -1637013 -1331012 -908549 -548777 -322238
46427 -322238 -183568 -30112 247140 710474 1304258 1834437 2067060 1883393 1350841 659183
46417 659183 3557 -490307 -780260 -892513 -897784 -877330 -879582 -890972 -853366 -719964 -489230
46406 -489230 -182695 179775 552104 837368 950068 905216 793531 664227 495669 295673
46396 295673 145351 86473 33355 -119712 -337541 -470998 -428169 -246006 -6855 230497
46386 230497 408756 464270 374793 160049 -188117 -714235 -1397019 -2084895 -2582383 -2780448
46376 -2780448 -2674770 -2292686 -1656749 -818350 112584 991703 1694567 2155607 2367906
46367 2367906 2358201 2179873 1931983 1742168 1678389 1682333 1633457 1478605 1256214 1000576
46357 1000576 692923 334642 8015 -187667 -231325 -169001 -24825 244395 714636 1425510
46347 1425510 2315851 3210210 3908686 4326395 4520836 4559188 4402582 3969371 3282320 2496861
46337 2496861 1795213 1293423 1023465 931978 884814 728840 382847 -134396 -736212 -1280282
46327 -1280282 -1576173 -1476317 -1003546 -341384 338122 1001172 1681225 2332578 2812741 2992489
46317 2992489 2836655 2394384 1777132 1166746 789226 811330 1233763 1888912 2554489 3083854
46307 3083854 3444253 3649758 3680832 3485218 3048709 2439791 1777201 1171130 698270 395573
46297 395573 238661 136720 -6476 -204060 -371224 -410446 -306307 -136506 -6833 14473
46287 14473 -87435 -302256 -631367 -1092811 -1672746 -2255445 -2614499 -2520048 -1905933 -954838
46277 -954838 -8242 635365 862353 719687 297257 -323313 -1009483 -1536144 -1678299 -1363765
46267 -1363765 -708180 103327 933176 1683072 2229066 2435678 2251390 1773389 1217074
46258 1217074 816880 701286 794158 837658 579533 -15306 -744035 -1352062 -1707966 -1804320
46248 -1804320 -1666688 -1322704 -827028 -254242 327441 833914 1133586 1101226 722982 115626
46238 115626 -567087 -1219629 -1783354 -2215949 -2491310 -2599393 -2521194 -2228362 -1733144 -1120884
46228 -1120884 -510116 7130 373630 547225 512591 307998 10745 -307465 -593913 -790852
46218 -790852 -829337 -663523 -302270 203144 801629 1469445 2191140 2906612 3481625 3757299
46208 3757299 3656703 3246065 2678431 2072978 1451238 779931 56561 -650232 -1228087
46199 -1228087 -1576314 -1644196 -1439798 -1025225 -512033 -45465 241831 293906 164329 -19537
46189 -19537 -143050 -180197 -201983 -309474 -547047 -874008 -1212439 -1499383 -1672001 -1620789
46179 -1620789 -1210994 -390259 722091 1863192 2752676 3219235 3255786 2991216 2607355
46170 2607355 2253839 2006965 1871921 1798323 1707383 1547277 1343989 1184690 1144499 1243204
46160 1243204 1463018 1761909 2051505 2209366 2161175 1938474 1627124 1278454 902532 525042
46150 525042 203877 -2793 -44316 133452 545979 1099075 1605013 1902163 1948355 1797932
46140 1797932 1523376 1173512 774684 348169 -57317 -346079 -429013 -326113 -187249 -171714
46130 -171714 -310054 -497118 -594653 -511067 -209519 295481 916997 1491088 1831679 1833547
46120 1833547 1565121 1264381 1184269 1377385 1633383 1668051 1378346 890887 386942 -57186
46110 -57186 -457718 -835319 -1192359 -1533099 -1844593 -2070528 -2153953 -2107391 -2006927 -1917691
46100 -1917691 -1852070 -1789522 -1695004 -1517575 -1218780 -824130 -419333 -83219 149134 258596
46090 258596 238542 157852 177843 432989 890131 1365868 1685908 1804357 1792859 1773591
46080 1773591 1859648 2079934 2311084 2324327 1962162 1277779 486436 -204299 -700679 -996587
46070 -996587 -1098666 -994663 -683109 -230835 209103 481642 567655 607251 729835 867769
46060 867769 795128 363090 -346739 -1109748 -1742875 -2183611 -2458701 -2644650 -2827578 -3022919
46050 -3022919 -3124895 -2991871 -2603990 -2097390 -1618066 -1172788 -655518 -2889 711562
46041 711562 1339020 1788540 2091331 2344121 2601162 2830898 2980989 3065696 3152993 3256177
46031 3256177 3276742 3095814 2714740 2271086 1916313 1713504 1661102 1766048 2046046 2474779
46021 2474779 2971493 3454112 3872652 4180417 4306486 4190978 3843687 3347819 2805761
46012 2805761 2290280 1832808 1423408 1010857 534382 -9652 -539024 -959844 -1284407
46003 -1284407 -1648409 -2180601 -2862309 -3543008 -4093161 -4510622 -4870013 -5206673 -5478108
45994 -5478108 -5604430 -5494245 -5045671 -4198531 -3032749 -1789844 -753362 -91049 206077
45985 206077 277822 310006 439783 669669 867510 895900 756634 585627 511419 553481
45975 553481 647398 704113 628044 359488 -23092 -277711 -171455 286359 817619 1101191
45965 1101191 1014681 676718 314682 109237 104662 204288 256168 179730 16107 -151101
45955 -151101 -299852 -467941 -670284 -863707 -994236 -1038362 -986772 -827189 -573470 -292679
45945 -292679 -71652 47721 94471 139912 249441 442017 670242 838482 858981 707794
45935 707794 441585 173208 19560 32414 153417 260175 296166 352858 585192 1028506
45925 1028506 1519757 1818196 1797344 1516402 1130312 758864 434999 138503 -156142 -467248
45915 -467248 -814508 -1210695 -1633223 -2012413 -2262462 -2333743 -2243687 -2068675 -1908363 -1838618
45905 -1838618 -1871415 -1949188 -1986903 -1932525 -1795053 -1617635 -1417948 -1142686 -683741 31305
45895 31305 938707 1836617 2508548 2855860 2909673 2745452 2431496 2054803 1733721 1557726
45885 1557726 1525711 1564733 1594139 1554487 1405583 1149157 861141 660349 609520 643408
45875 643408 603113 351648 -121292 -681679 -1136350 -1364639 -1392986 -1347183 -1333517 -1372344
45865 -1372344 -1438920 -1537659 -1710279 -1978431 -2305355 -2623857 -2886669 -3078542 -3196309 -3245044
45855 -3245044 -3254999 -3272104 -3307525 -3306656 -3191913 -2939148 -2600391 -2259688 -1991695 -1861081 -1918777
45844 -1918777 -2162767 -2515771 -2875247 -3189417 -3466858 -3720259 -3937382 -4118814 -4307203
45835 -4307203 -4539393 -4773538 -4890189 -4766715 -4332693 -3567123 -2498798 -1246348 -25764
45826 -25764 940450 1535494 1751102 1600118 1092951 323160 -492182 -1134123 -1537541 -1778066
45816 -1778066 -1917410 -1929406 -1796095 -1611004 -1529375 -1632052 -1875919 -2169917 -2467905 -2786235
45806 -2786235 -3151660 -3534816 -3826111 -3890691 -3676744 -3281384 -2899324 -2692455 -2693621 -2815758
45796 -2815758 -2942394 -3019214 -3072707 -3144495 -3216193 -3218488 -3117378 -2963147 -2829539 -2714876
45786 -2714876 -2523523 -2142278 -1529213 -748133 61342 761268 1294408 1691094 1986116
45777 1986116 2142210 2083760 1801263 1385391 939434 476138 -77692 -771280 -1525658 -2139962
45767 -2139962 -2417161 -2307719 -1938653 -1500169 -1111038 -795245 -555963 -426735 -444342 -598890
45757 -598890 -815837 -963808 -884591 -467276 262593 1130169 1907739 2430962 2636243 2534114
45747 2534114 2194512 1752762 1377960 1190397 1200377 1337405 1542954 1826619 2222810 2699491
45737 2699491 3135259 3408405 3504150 3516021 3543060 3605497 3660895 3670326 3626411 3538783 3428568
45726 3428568 3336557 3303752 3328761 3365320 3379944 3395369 3451553 3532792 3568021 3512184 3398141
45715 3398141 3290972 3217834 3167369 3128668 3087295 3004335 2864632 2749747 2788099 2992397
45705 2992397 3205266 3267081 3200104 3157951 3218028 3309067 3346670 3347431 3360153 3344667 3183087
45694 3183087 2788794 2159840 1348468 431521 -494905 -1342230 -2062537 -2622599 -2943175
45685 -2943175 -2916269 -2522832 -1912592 -1322907 -908164 -666640 -529239 -474370 -516193 -596640
45675 -596640 -550121 -222160 373447 1028098 1470091 1532910 1234369 734281 217176 -216214
45665 -216214 -568913 -872464 -1110116 -1230196 -1215897 -1100650 -908554 -619608 -221640 224672
45655 224672 606202 847212 970976 1081743 1299610 1703208 2307122 3069615 3907666 4703749
45645 4703749 5321734 5657818 5703379 5555437 5352815 5194629 5105468 5049989 4962742 4776249
45635 4776249 4447405 3976452 3412111 2841055 2354286 1993524 1720165 1449866 1121001
45626 1121001 716698 230449 -347758 -993952 -1637360 -2222042 -2759599 -3278210 -3728168
45617 -3728168 -3985149 -3960801 -3680896 -3244105 -2734480 -2192292 -1640770 -1105514 -611114 -178014
45607 -178014 185128 505334 846366 1243544 1623603 1821941 1711611 1310575 748896 150238
45597 150238 -422000 -910573 -1206825 -1182159 -773561 -32042 898641 1844051 2665322 3295461
45587 3295461 3719528 3923001 3877448 3584354 3110402 2559805 2023096 1558001 1182563 851660
45577 851660 469216 -19030 -543348 -967823 -1244066 -1471322 -1786667 -2223147 -2690677 -3065969
45567 -3065969 -3275402 -3309922 -3195643 -2965501 -2658270 -2332927 -2052502 -1829508 -1613261 -1379744
45557 -1379744 -1226190 -1313497 -1689460 -2212666 -2679949 -2992610 -3170171 -3249086 -3229201 -3108505
45547 -3108505 -2919721 -2725338 -2603848 -2635139 -2859010 -3227038 -3605362 -3836795 -3814017 -3524665
45537 -3524665 -3055447 -2548638 -2130869 -1870505 -1791991 -1905609 -2206681 -2656700 -3174159 -3633593
45527 -3633593 -3883802 -3816573 -3448456 -2907238 -2308859 -1670315 -962960 -204583 551700 1281237
45517 1281237 1961992 2487766 2684856 2453609 1866020 1113880 393994 -156654 -474638
45508 -474638 -561921 -442941 -110915 454928 1201850 1975258 2622195 3111221 3522150 3934892
45498 3934892 4359867 4756308 5063504 5203853 5105272 4765589 4290749 3842560 3535520 3380931
45488 3380931 3318967 3290658 3282744 3324165 3455394 3699044 4048927 4478048 4946461 5391283
45478 5391283 5718822 5840493 5739328 5484402 5156434 4777277 4345678 3921301 3609492
45469 3609492 3446233 3348556 3206320 2984072 2711249 2429313 2196526 2088749 2108460 2105723
45459 2105723 1874260 1350662 673373 42202 -421597 -671965 -688084 -498836 -219121 11573
45449 11573 137385 206723 293840 429235 599501 778840 949899 1116085 1307613 1562285
45439 1562285 1879653 2186808 2359693 2299590 2004324 1564137 1089418 661230 356030 268555
45429 268555 445411 796482 1131972 1316066 1355423 1331468 1305486 1326957 1472555 1789132
45419 1789132 2200879 2541115 2695900 2676629 2549194 2355870 2140240 1989307 1976547 2068603
45409 2068603 2140071 2086449 1887287 1566773 1155868 719016 360068 143929 37564 -16769
45399 -16769 12305 214920 580603 927156 1024037 759416 174283 -613988 -1478488 -2313432
45389 -2313432 -3059549 -3694639 -4165766 -4355036 -4172489 -3691392 -3150365 -2802994 -2770140 -3007187
45379 -3007187 -3357392 -3634318 -3711754 -3572940 -3263367 -2800012 -2163842 -1386263 -593079 71479
45369 71479 547294 876622 1157169 1498306 1979269 2590947 3210442 3659091 3802178 3610638
45359 3610638 3168683 2651622 2267243 2156487 2317778 2633710 2978994 3298184 3584750
45350 3584750 3815380 3941318 3953922 3928509 3960752 4053414 4103119 4023279 3851532 3699809
45340 3699809 3614224 3521930 3307748 2906405 2326611 1629751 895852 184259 -470666 -1001159
45330 -1001159 -1271580 -1171943 -757329 -234046 221438 593152 971479 1434739 2012695 2693237
45320 2693237 3390819 3934997 4158914 4015171 3594789 3054548 2537349 2112694 1743379
45311 1743379 1331021 835043 330955 -75570 -355951 -535036 -597448 -492167 -234009 56078
45301 56078 233458 230936 82265 -122054 -297670 -407485 -446775 -393992 -214693 62375
45291 62375 317505 440875 441836 415244 423508 458327 483194 437002 210219 -287838 -1002871
45280 -1002871 -1729155 -2260197 -2525981 -2597523 -2616897 -2719548 -2939846 -3153026 -3170900 -2944758
45270 -2944758 -2638259 -2464289 -2485305 -2605577 -2714903 -2790806 -2890975 -3100513 -3469618 -3940906
45260 -3940906 -4321485 -4364256 -3915468 -3008988 -1843077 -671682 314055 1039859 1510389
45251 1510389 1741871 1756768 1627439 1462493 1314392 1130347 832589 443062 115935 55780
45241 55780 394157 1098385 1976088 2804305 3488541 4081178 4635986 5086245 5290362 5152325
45231 5152325 4663556 3884742 2958695 2106948 1514836 1189585 977248 736748 465771
45222 465771 254999 163006 147520 80719 -180830 -700291 -1405035 -2143390 -2809133 -3393489
45212 -3393489 -3919550 -4374235 -4734335 -5024153 -5294702 -5537224 -5640239 -5443398 -4832827
45203 -4832827 -3796846 -2420113 -854207 699421 2011714 2894253 3290909 3302378 3107620
45194 3107620 2871431 2730132 2810500 3181637 3768039 4359115 4751807 4897328 4919138 5001623
45184 5001623 5241323 5561504 5763863 5703439 5438008 5191421 5163011 5387674 5767078 6179944
45174 6179944 6533327 6745374 6727110 6392753 5698708 4707711 3621387 2699024 2101520
45165 2101520 1824813 1786433 1920334 2151235 2338848 2335786 2102411 1715607 1273098 838614
45155 838614 463958 186786 -13934 -196706 -355233 -385479 -207949 90126 273589 132221
45145 132221 -357096 -1010233 -1561877 -1844377 -1889295 -1873343 -1963800 -2203338 -2505703 -2716610
45135 -2716610 -2684925 -2340009 -1748080 -1077698 -478378 9199 429235 836574 1267133 1739930
45125 1739930 2232337 2652452 2874341 2823154 2534326 2151690 1877157 1878642 2182346 2634599
45115 2634599 2994608 3092411 2922231 2623722 2397858 2403786 2669699 3082380 3490448 3827585
45105 3827585 4114720 4350775 4456849 4362779 4115819 3845895 3605985 3275348 2656315 1682484
45095 1682484 527103 -501804 -1169679 -1418484 -1300200 -877889 -226285 518209 1183845
45086 1183845 1658432 1929944 2031738 1984098 1803155 1536099 1258093 1032520 873460 739872
45076 739872 579343 402723 309842 409798 711718 1120649 1540869 1948820 2361993 2784435
45066 2784435 3209093 3636265 4052461 4413938 4692568 4933768 5234125 5644953 6099290
45057 6099290 6432202 6479776 6185377 5631086 4964886 4295063 3656397 3052198 2483516 1938679
45047 1938679 1414453 982957 799218 995357 1571014 2396902 3294994 4104264 4732217
45038 4732217 5204673 5633052 6066144 6391254 6452581 6265768 6041347 5973318 6061549 6165985
45028 6165985 6172639 6055448 5818630 5453134 4963310 4404199 3879771 3510694 3390128 3541867
45018 3541867 3907703 4376096 4823923 5143432 5263967 5176737 4932952 4594833 4180866 3664068
45008 3664068 3020860 2274073 1492725 760288 139200 -351246 -732475 -1035497 -1261121
44999 -1261121 -1371315 -1329767 -1154293 -918771 -694900 -502583 -332733 -206389 -176760 -263816
44989 -263816 -420404 -589525 -771267 -993901 -1226070 -1363133 -1321038 -1119107 -845748 -553363
44979 -553363 -213479 216484 696309 1092619 1279890 1257210 1160598 1151296 1282279 1460620
44969 1460620 1528165 1383841 1049588 635747 247088 -76615 -336006 -521058 -616909 -645598
44959 -645598 -652643 -642561 -575975 -457959 -388251 -480659 -750015 -1105282 -1425008 -1605719 -1576381
44948 -1576381 -1334349 -963295 -556811 -113087 451672 1176523 1981809 2729049 3314541
44939 3314541 3695177 3870514 3871385 3743159 3519924 3232883 2948859 2761044 2713344 2759293
44929 2759293 2830301 2936815 3174845 3627961 4273672 4985596 5615762 6064722 6274088 6184647
44919 6184647 5761554 5085698 4366580 3791032 3354088 2884483 2242654 1456377 662985
44910 662985 -32240 -626162 -1189332 -1788593 -2411639 -2962312 -3361282 -3646513 -3923072 -4204713
44900 -4204713 -4359578 -4233481 -3780950 -3064083 -2193254 -1309118 -554597 12667 461394
44891 461394 889289 1295714 1579429 1633639 1411724 942662 339243 -233300 -657582 -931549
44881 -931549 -1103615 -1165723 -1059597 -769449 -352843 111189 555720 927003 1225408 1554825
44871 1554825 2064179 2801638 3650525 4417304 4952033 5187717 5123839 4810288 4324404 3741832
44861 3741832 3146117 2667225 2460405 2599839 2996779 3449282 3784730 3961127 4045639 4106755
44851 4106755 4130400 4043961 3812365 3476852 3082160 2606425 2015997 1374699 835639 508743
44841 508743 383020 401966 570417 937743 1481199 2041862 2400710 2433185 2200705 1888385
44831 1888385 1646990 1503589 1421502 1396953 1449312 1547769 1624733 1674650 1778193 1997608
44821 1997608 2286772 2528499 2623524 2521397 2214157 1751953 1246382 814192 517399 375643
44811 375643 416537 682295 1195236 1936056 2833145 3738418 4432933 4717803 4538107 4020813
44801 4020813 3393022 2858630 2513000 2321874 2172891 1982020 1769059 1614954 1544722 1485838
44791 1485838 1360414 1186518 1050487 994885 983961 990833 1072209 1317875 1744974 2276558
44781 2276558 2808844 3257157 3547916 3633728 3543739 3364101 3122247 2730639 2104916 1319687
44771 1319687 592580 126028 13482 264754 810265 1445068 1869407 1887712 1563943 1141744
44761 1141744 834189 722225 800758 1024244 1293843 1479676 1513531 1441141 1353611 1283416
44751 1283416 1197857 1089447 1037985 1154278 1453129 1787366 1922697 1699204 1143793 447921
44741 447921 -155806 -517277 -614596 -508131 -254371 133804 639266 1174587 1605413 1854861
44731 1854861 1957709 1993132 1990132 1924550 1782814 1584408 1343234 1043411 667360 235591
44721 235591 -180375 -476171 -569708 -479340 -343181 -309094 -376094 -370313 -110211 403524 961874
44710 961874 1288515 1211058 758776 160152 -269719 -323293 -44227 326202 567812 648007
44700 648007 682194 776992 946617 1142716 1286075 1251154 892783 168074 -760533 -1587315
44690 -1587315 -2062282 -2146118 -1995518 -1824078 -1770158 -1855900 -2031432 -2241770 -2453754 -2631527
44680 -2631527 -2708432 -2605816 -2292126 -1829169 -1361091 -1042371 -945935 -1024720 -1172694 -1329649
44670 -1329649 -1509853 -1724253 -1911905 -1983891 -1918350 -1774638 -1619446 -1474236 -1333068 -1190911
44660 -1190911 -1040779 -875405 -713449 -604165 -582105 -619814 -637383 -565431 -409150 -256876
44650 -256876 -208613 -273246 -341882 -281473 -50393 284695 612963 826650 842781 654521
44640 654521 371817 153851 76858 99950 159285 238946 336966 430742 518757 646576 841079
44629 841079 1050783 1197187 1262907 1291613 1324701 1376270 1447142 1517963 1536258 1445294 1225345
44618 1225345 893682 483066 33501 -426117 -906138 -1423471 -1914586 -2241416 -2347954
44609 -2347954 -2375219 -2546843 -2946459 -3456235 -3892473 -4139580 -4169424 -4011482 -3723252 -3336900
44599 -3336900 -2818953 -2120073 -1266224 -363193 478349 1176297 1661057 1909217 2003109 2080595
44589 2080595 2195729 2281151 2263682 2158356 2035559 1968737 2039218 2304596 2700218 3035250
44579 3035250 3158876 3096513 2971663 2843215 2687426 2495871 2301314 2118953 1941684 1793434
44569 1793434 1712127 1665885 1551801 1302046 939286 504215 -16376 -644884 -1326468 -1928998
44559 -1928998 -2318638 -2412815 -2183731 -1661280 -951874 -231383 316029 581646 573982 380316
44549 380316 80549 -300796 -756493 -1229371 -1611662 -1817595 -1839307 -1727398 -1542356 -1343231
44539 -1343231 -1197252 -1149273 -1160680 -1107288 -880066 -500990 -123471 94211 116384 49501
44529 49501 76443 383596 1091226 2167351 3388222 4441280 5124638 5454914 5583042
44520 5583042 5638406 5673085 5710992 5782302 5896539 6021446 6113047 6152006 6135971 6048849 5858333
44509 5858333 5550019 5159206 4764049 4443314 4234523 4120721 4040284 3905377 3638512 3229903
44499 3229903 2763142 2351873 2033377 1746543 1435572 1160059 1079407 1330019 1919529 2714098
44489 2714098 3505344 4115629 4491670 4716332 4909090 5096224 5178605 5027252 4607721 4020651
44479 4020651 3437591 2997747 2747964 2660002 2686107 2785200 2906728 2986303 2984499 2920592 2846869
44468 2846869 2790838 2734761 2646326 2514658 2356886 2197923 2041056 1856833 1618096 1361976
44458 1361976 1206381 1282555 1641094 2214265 2849065 3375851 3685921 3781581 3740217 3601912
44448 3601912 3306627 2779381 2075573 1403931 985502 892629 1012570 1143137 1132133 965171
44438 965171 745921 594423 567458 667851 882347 1166056 1419923 1556042 1596456 1648909
44428 1648909 1759526 1838991 1773516 1574780 1372348 1265940 1219638 1106696 846536 501673
44418 501673 244414 215450 411972 730579 1108642 1571325 2119073 2626363 2917131 2935086
44408 2935086 2803365 2728048 2876189 3318160 4006652 4775428 5401827 5725731 5727144 5499418
44398 5499418 5168991 4836477 4546730 4271451 3924666 3423666 2747945 1944741 1102316
44389 1102316 342902 -177615 -325075 -89887 371644 836150 1172973 1398137 1571281
44380 1571281 1672573 1616808 1384578 1103540 976837 1132510 1538615 2042429 2477689 2748571
44370 2748571 2839132 2766867 2548051 2216188 1850996 1550973 1371120 1316700 1406216 1699753
44360 1699753 2227859 2907188 3561967 4036383 4282008 4357003 4365485 4383817 4412672 4397045
44350 4397045 4306551 4181887 4078689 3986013 3843342 3627111 3360258 3023879 2530373 1846472
44340 1846472 1116621 597215 448775 615093 902992 1141825 1252487 1206649 979358 560339
44330 560339 -13162 -662275 -1306438 -1884823 -2341847 -2619988 -2692983 -2601543 -2433023 -2259039
44320 -2259039 -2105972 -1984235 -1911753 -1875043 -1774519 -1451421 -810505 69276 957783 1631688
44310 1631688 2031327 2269619 2489556 2724557 2907978 3001509 3073941 3232192 3493137 3752071
44300 3752071 3881050 3843417 3707613 3561623 3424752 3238609 2931187 2484189 1950395 1427139
44290 1427139 1015739 775738 683017 634782 528675 353896 194393 145585 254878 542339
44280 542339 1022655 1657332 2308795 2800454 3036063 3036855 2874637 2619426 2356454 2182237
44270 2182237 2123091 2082243 1929763 1658544 1419546 1388486 1611412 1978866 2322220 2522682
44260 2522682 2556016 2475400 2371144 2332209 2405164 2545633 2600692 2383515 1823067 1055215
44250 1055215 343524 -101478 -223525 -76905 251136 653226 998314 1188379 1229356 1220579
44240 1220579 1274607 1456800 1766074 2115206 2332000 2249017 1839420 1246199 655448 165272
44230 165272 -199198 -385186 -296504 111176 768709 1556612 2399603 3259181 4047136 4606559
44220 4606559 4819181 4715975 4443858 4120130 3751011 3300686 2797154 2333356 1990474
44211 1990474 1807308 1810595 2012598 2362356 2750586 3095480 3393593 3663992 3880978 3996689
44201 3996689 3995785 3883706 3650228 3304422 2937902 2692122 2641267 2733849 2853223 2910799
44191 2910799 2893179 2866488 2937615 3159356 3453849 3668308 3722963 3665858 3572367 3455386
44181 3455386 3322499 3272129 3453050 3919567 4564412 5195900 5655632 5878626 5894825 5795907
44171 5795907 5675904 5579018 5496565 5397517 5245140 5004715 4678459 4339944 4097505 3997285
44161 3997285 3969298 3874421 3591740 3065019 2309211 1420371 582459 19521 -115931 157426
44151 157426 659312 1176493 1600098 1946176 2260970 2536497 2727241 2821639 2872248 2964683
44141 2964683 3166523 3478788 3806027 3993857 3945814 3717552 3472111 3333315 3294453 3256372
44131 3256372 3114915 2804325 2298542 1608340 778400 -114088 -942976 -1525052 -1682471
44122 -1682471 -1359875 -674485 173977 1039359 1862154 2586479 3087313 3208267 2879059
44113 2879059 2202472 1429427 830276 552086 565127 728524 908008 1050530 1176680 1325153
44103 1325153 1511046 1728455 1970410 2220975 2431341 2543803 2565624 2585801 2669686 2751776
44093 2751776 2693816 2460192 2182879 2031140 2063076 2226713 2446048 2655018 2795836 2858727
44083 2858727 2908162 3004435 3102653 3087026 2902802 2593481 2208514 1756004 1280977 918094
44073 918094 798745 931737 1220997 1572731 1936615 2270136 2533883 2731286 2902176 3058049
44063 3058049 3152978 3125006 2935531 2569113 2045510 1453776 924996 523552 189107 -166366
44053 -166366 -518217 -743263 -786488 -761748 -844400 -1082427 -1354117 -1514591 -1550743 -1569983
44043 -1569983 -1649405 -1725655 -1653758 -1375324 -1012919 -777952 -775174 -900048 -928724 -700581
44033 -700581 -214237 424421 1104859 1749994 2289723 2655096 2831981 2906048 3009108 3183469
44023 3183469 3298115 3126865 2537926 1623251 657825 -54293 -314859 -84960 521884
44014 521884 1287529 1980580 2458748 2711247 2812718 2843456 2850836 2871565 2975009 3269907
44004 3269907 3842823 4662987 5549180 6260500 6645327 6711969 6574249 6357778 6154138 6014175
43994 6014175 5942560 5906806 5874791 5834372 5759231 5578271 5220868 4696187 4097123 3516474
43984 3516474 2981883 2480528 2018740 1631676 1343497 1139633 980923 835002 692321
43975 692321 560548 451783 376333 340437 338030 346256 348947 376352 502798 778717 1168667
43964 1168667 1577161 1927730 2183919 2293723 2169221 1771010 1198562 643773 228527
43955 228527 -96604 -476908 -986333 -1544844 -1984882 -2173384 -2074941 -1743308 -1292148 -855112
43945 -855112 -510009 -203382 226864 911394 1819457 2772780 3576539 4126943 4422774 4525690
43935 4525690 4520188 4469918 4376881 4188619 3861556 3415764 2925729 2468634 2083865 1767471
43925 1767471 1501173 1301412 1239396 1384978 1718747 2125272 2489021 2769261 2962927 3043459
43915 3043459 3002986 2941287 3026855 3319176 3667355 3843156 3777346 3630261 3621574 3818761
43905 3818761 4108917 4353184 4531171 4729846 5026624 5416726 5843682 6256422 6614881
43896 6614881 6869050 6970824 6900984 6652664 6194050 5498541 4637593 3797847 3143017 2659852
43886 2659852 2196635 1677737 1237304 1100476 1357155 1895749 2535066 3148645 3651724
43877 3651724 3960608 4050920 4027889 4050433 4162709 4250883 4183923 3946223 3604070 3198880
43867 3198880 2739313 2279274 1933211 1790081 1841790 2007807 2201888 2360703 2436788 2400367
43857 2400367 2259346 2074815 1953356 2009072 2307597 2831928 3497819 4189250 4772548 5114963
43847 5114963 5158236 4999833 4858721 4910837 5153135 5438046 5621151 5658300 5595290 5520428
43837 5520428 5527004 5661477 5864329 5975526 5831210 5371576 4669441 3879629 3166397 2644716
43827 2644716 2347975 2237536 2248149 2325226 2425381 2508297 2552617 2575094 2618374 2722151
43817 2722151 2911368 3191018 3522734 3811980 3954545 3918711 3780230 3675967 3723044 3956772
43807 3956772 4306749 4628265 4793842 4781646 4668936 4535375 4387471 4173457 3836491 3339400
43797 3339400 2677091 1908037 1169025 632123 436210 641621 1200730 1941962 2624713
43788 2624713 3078861 3309770 3452965 3640756 3933125 4335689 4808772 5252335 5552303
43779 5552303 5686118 5757975 5904675 6179244 6523680 6813091 6912712 6744749 6350540 5876782
43769 5876782 5471653 5197259 5044356 4994455 5038820 5165312 5363294 5623771 5900040 6084185
43759 6084185 6066455 5826192 5448097 5058099 4759198 4601627 4565876 4570339 4530793 4425494
43749 4425494 4287946 4143690 3984003 3802935 3629726 3511099 3474199 3507376 3562512 3580793
43739 3580793 3535605 3445303 3324373 3136467 2834506 2448629 2093514 1867885 1765971 1697060
43729 1697060 1572579 1373794 1169641 1083039 1204020 1503711 1849501 2129111 2343565 2550165
43719 2550165 2728208 2745032 2473440 1925265 1254448 641095 190378 -67761 -128239 -1953
43709 -1953 256416 565384 883072 1216753 1531189 1683599 1516268 1026223 406220 -99967
43699 -99967 -377587 -503331 -672106 -1048535 -1629024 -2230362 -2651138 -2853827 -2949600 -3005490
43689 -3005490 -2933002 -2596068 -1973037 -1175243 -360246 325356 778284 1008386 1176831 1498483
43679 1498483 2079422 2860389 3696004 4455124 5073926 5572371 6015864 6410926 6642477
43670 6642477 6569789 6193950 5683034 5218826 4858349 4552615 4249024 3946592 3682499 3489094
43660 3489094 3346224 3173331 2905500 2588312 2355640 2290547 2340555 2389747 2378348 2328203
43650 2328203 2292607 2320996 2441304 2625124 2775530 2784126 2599856 2227662 1685827 1003863
43640 1003863 252705 -463137 -1052107 -1459262 -1655108 -1630440 -1404324 -1020210 -537021 -32300
43630 -32300 409231 738774 962250 1093821 1120516 1062509 1049816 1262197 1759090 2405828
43620 2405828 2992314 3395360 3612512 3693301 3697000 3701153 3787852 3991362 4273697 4564539
43610 4564539 4821174 5051255 5288803 5551348 5813203 6016668 6110203 6074235 5910297 5614029
43600 5614029 5169228 4572946 3869143 3158067 2560879 2155174 1934975 1833108 1774829 1704013
43590 1704013 1584539 1425969 1321371 1414948 1783017 2342702 2897318 3278086 3451701 3527007
43580 3527007 3683652 4061201 4655220 5304490 5813928 6112305 6277514 6408026 6504892 6500854
43570 6500854 6374987 6197015 6059609 5996442 5974465 5945669 5892701 5831746 5777018 5693454 5481513
43559 5481513 5031835 4325821 3486166 2701781 2079043 1566432 1028749 380689 -362098
43550 -362098 -1129637 -1839054 -2384423 -2648908 -2585110 -2272356 -1853165 -1416303 -977866 -567679
43540 -567679 -267392 -117208 -8397 281650 921574 1878857 2917194 3737945 4166903
43531 4166903 4251415 4184752 4121980 4069082 3949304 3741302 3511349 3323571 3172495 3021354
43521 3021354 2866528 2733359 2633671 2563153 2528637 2542201 2590903 2648959 2728151 2880203 3127418
43510 3127418 3421537 3706409 3998565 4348474 4712410 4921241 4829348 4481958 4093173 3855289
43500 3855289 3796881 3820775 3828607 3778771 3659853 3463617 3192767 2865572 2502463 2130817
43490 2130817 1817128 1672823 1793629 2178189 2713508 3250753 3699356 4051545 4328496
43481 4328496 4518703 4571268 4436651 4108249 3638115 3121277 2642926 2212466 1759926 1235562
43471 1235562 718474 387634 362745 598982 958333 1352700 1780936 2250077 2716141 3113528
43461 3113528 3410513 3624443 3802327 3986964 4174267 4297698 4282808 4130320 3924087 3744760
43451 3744760 3593908 3411515 3143712 2779597 2351886 1935922 1637758 1547498 1691843 2044269
43441 2044269 2583291 3321854 4259978 5303490 6242823 6843192 6990555 6765876 6377040
43432 6377040 6019768 5796162 5722822 5760329 5831295 5865418 5865061 5905774 6048031 6267377 6488050
43421 6488050 6653642 6736029 6712594 6591487 6446695 6366926 6356567 6333276 6244416 6148563 6149920
43410 6149920 6267463 6391038 6361138 6087381 5610635 5071147 4614028 4314690 4183022 4206826
43400 4206826 4353864 4541626 4658193 4634370 4462597 4136113 3631466 3002242 2443022 2169577
43390 2169577 2215714 2397419 2496216 2444001 2323916 2248055 2270949 2376124 2481512 2462285
43380 2462285 2224690 1785859 1266776 799700 456218 261323 240981 425074 804965 1301116
43370 1301116 1778575 2108372 2242919 2246892 2237401 2271380 2294600 2215405 2023855 1823253 1747837
43359 1747837 1864338 2146419 2512787 2870394 3135661 3245072 3169163 2929660 2605328 2305694
43349 2305694 2116286 2062044 2128154 2302797 2568916 2850535 3009859 2942492 2678985 2371800
43339 2371800 2177862 2161188 2296719 2536473 2854517 3237875 3652856 4036692 4337088 4563250
43329 4563250 4779482 5029139 5271754 5412067 5382024 5173075 4804653 4312009 3781066 3346226
43319 3346226 3103198 3033658 3052253 3122141 3285469 3576018 3942948 4282594 4517370 4619251
43309 4619251 4584876 4434235 4235416 4094556 4102005 4292391 4643654 5081188 5479021 5698091
43299 5698091 5657922 5369463 4903071 4362790 3904979 3717915 3900557 4351355 4820451 5085040
43289 5085040 5061021 4783469 4363221 3980244 3834328 4022030 4465343 4985811 5428215 5701556
43279 5701556 5762042 5626963 5391414 5170343 5010255 4879649 4731837 4547414 4344045 4204406
43269 4204406 4287405 4740392 5560047 6553751 7443967 8006762 8156117 7970258 7642078 7338427
43259 7338427 7080874 6799060 6493824 6274749 6218548 6272793 6351926 6464972 6681393 7012229
43249 7012229 7391239 7742642 7999515 8078320 7916479 7549804 7107190 6725506 6503116 6510270
43239 6510270 6763914 7165864 7516617 7627749 7414175 6893541 6153431 5339274 4621143
43230 4621143 4112484 3805631 3589292 3331337 2971824 2578037 2312489 2308054 2549057 2878413
43220 2878413 3117453 3176148 3090406 3009469 3127503 3543501 4157200 4753769 5217701 5616602
43210 5616602 6050452 6479031 6752069 6773496 6579332 6269855 5913418 5514425 5046910 4528645
43200 4528645 4080669 3883476 4032295 4447864 4963812 5487574 6040524 6658125 7299890
43191 7299890 7860694 8237252 8384614 8341364 8206366 8072435 7982833 7950059 7967725 7960364
43181 7960364 7768390 7272849 6545494 5812516 5255846 4902398 4708625 4666398 4775241 4969934
43171 4969934 5144761 5233773 5229689 5148576 5017026 4875691 4757183 4673293 4650495 4747081 4985025
43160 4985025 5279384 5491046 5557618 5534018 5498207 5454349 5340684 5100689 4731665 4294049
43150 4294049 3901247 3687638 3752446 4106209 4651947 5217187 5634478 5828325 5832135 5712586
43140 5712586 5490513 5154528 4731966 4304720 3954282 3727623 3660741 3789355 4106541 4532419
43130 4532419 4951349 5270591 5439975 5453406 5371399 5331042 5488509 5919029 6561188 7256154
43120 7256154 7854455 8310271 8678925 9006505 9225361 9192201 8841791 8271071 7655675 7122324
43110 7122324 6728620 6511976 6481520 6566549 6636507 6591977 6408924 6105953 5725385 5353921
43100 5353921 5097779 5000560 5022617 5126335 5335231 5669199 6064071 6414064 6675580 6876393
43090 6876393 7033540 7117462 7099277 6983273 6782676 6509230 6204176 5939600 5766202 5691340
43080 5691340 5727187 5917646 6273704 6704880 7068245 7296633 7450337 7628355 7841107 7981357
43070 7981357 7921326 7639803 7250007 6890530 6593154 6285883 5932501 5623046 5479683 5493272
43060 5493272 5515085 5429631 5297400 5298253 5549216 5990045 6421089 6629950 6512934 6136551
43050 6136551 5709275 5463081 5507610 5760385 6009505 6061947 5864913 5514285 5158037 4886567
43040 4886567 4704484 4593229 4580413 4726537 5035089 5390578 5616108 5613072 5437509 5222922
43030 5222922 5036359 4838632 4589305 4352555 4265449 4411284 4748240 5155089 5523457 5813551
43020 5813551 6053845 6297306 6558211 6781725 6887065 6845328 6708968 6574546 6532010 6630832
43010 6630832 6852028 7105681 7290917 7374965 7396623 7401472 7419852 7509879 7746814 8115045
43000 8115045 8452944 8572369 8428383 8133490 7825961 7576327 7407584 7333794 7350286 7420746
42990 7420746 7491032 7494998 7359017 7058082 6684096 6403744 6306657 6322219 6322198 6290488 6366595
42979 6366595 6736337 7492440 8560362 9706629 10632043 11130001 11215501 11112292 11093908
42970 11093908 11300876 11668715 12005245 12145128 12061954 11865803 11716512 11735285 11954696 12299905
42960 12299905 12613956 12748546 12666344 12452414 12226600 12065191 11997238 12017780 12068652 12045054
42950 12045054 11876546 11605766 11368240 11302412 11482758 11894879 12424540 12881642 13082581
42941 13082581 12931487 12432260 11662856 10767199 9926814 9267615 8786816 8408226 8102758
42932 8102758 7918456 7912409 8109486 8512989 9075356 9639989 9988640 10002670 9755421 9428836
42922 9428836 9174188 9056393 9058043 9085680 9023969 8853745 8703948 8743122 9032063 9509549
42912 9509549 10083315 10677278 11209135 11589857 11766873 11751396 11620688 11520798 11626989 12027075
42902 12027075 12636913 13277744 13831781 14270265 14549770 14588696 14399722 14175554 14161536 14450549
42892 14450549 14938675 15455610 15892557 16227553 16495964 16753977 17025730 17255826 17332029
42883 17332029 17178531 16827271 16396771 16012255 15745162 15600640 15530221 15453501 15298545 15057553
42873 15057553 14810813 14668970 14662535 14693252 14624862 14435861 14269245 14323339 14703763 15376153
42863 15376153 16220665 17096838 17877018 18474501 18869149 19091128 19163753 19074850 18822647 18481282
42853 18481282 18189891 18054387 18063307 18115057 18127045 18098770 18060649 17988786 17806892 17473292
42843 17473292 17037211 16601531 16257654 16068392 16074278 16268451 16571391 16876258 17139593 17408184
42833 17408184 17747651 18169822 18646763 19165828 19727214 20288611 20754929 21047395 21163724
42824 21163724 21150020 21034191 20821199 20545185 20279395 20072409 19901686 19716343 19509804
42815 19509804 19324834 19198115 19126864 19086009 19055242 19032152 19038967 19109015 19240626 19369961
42805 19369961 19419192 19370195 19264290 19144642 19052567 19080288 19345795 19853022 20407379 20731339
42795 20731339 20677082 20319280 19866969 19508548 19306575 19188344 19034010 18795579 18523011
42786 18523011 18272598 18044438 17855866 17823012 18076905 18598242 19208172 19732269 20109216
42777 20109216 20334232 20388701 20278714 20079901 19875673 19676317 19445516 19181418 18927330
42768 18927330 18725250 18605141 18602818 18736631 18963904 19196746 19369994 19480670 19571866 19695726
42758 19695726 19874789 20076922 20248320 20397084 20617174 20987498 21461427 21897927 22195985
42749 22195985 22367748 22500861 22696296 23021493 23448830 23826420 23976997 23863677 23619033
42740 23619033 23384541 23167052 22893683 22567454 22303798 22214408 22304525 22502959 22762649 23099580
42730 23099580 23531747 24004098 24404092 24664103 24830011 25003862 25226391 25444127 25590645
42721 25590645 25666703 25728919 25826792 25969246 26137806 26320110 26540526 26856919 27301685 27815544
42711 27815544 28261767 28522901 28580199 28510260 28433394 28456305 28611499 28832735 29033767 29234324
42701 29234324 29554658 30035766 30503873 30682071 30433800 29850634 29112745 28329995 27539749
42692 27539749 26801559 26233419 25948035 25968255 26203684 26503799 26739434 26843631 26789757 26559298
42682 26559298 26157081 25655299 25198180 24942046 24973467 25266468 25713033 26209125 26718185
42673 26718185 27238875 27717051 28033824 28113775 28026331 27950765 28049524 28387320 28935306 29598794
42663 29598794 30239741 30717800 30944937 30921456 30748177 30605295 30655231 30894641 31105513 31002932
42653 31002932 30450340 29533878 28476410 27528534 26892472 26638207 26654109 26728968 26709688 26565147
42643 26565147 26337269 26116698 26057091 26287537 26739542 27128777 27178882 26830879 26204503 25439379
42633 25439379 24663260 24057505 23814251 23980165 24390207 24780463 24951755 24848803 24542781
42624 24542781 24154080 23757562 23345536 22888146 22407715 21963869 21589833 21293233 21109761
42615 21109761 21097695 21265538 21547796 21869988 22204686 22545253 22852581 23056256 23107814 23028947
42605 23028947 22910228 22852847 22897862 23017058 23172240 23348930 23509403 23556723 23406919 23090620
42595 23090620 22736783 22458658 22292389 22227285 22232692 22253864 22244242 22215933 22205841 22186272 22079265
42584 22079265 21885431 21729058 21728032 21868679 22053183 22219293 22357060 22453263 22496463 22525419
42574 22525419 22611559 22794942 23080554 23483377 24020209 24654372 25296275 25868569 26341462
42565 26341462 26714371 27007909 27265293 27499189 27624296 27505381 27111273 26584158 26119035
42556 26119035 25797158 25563670 25338122 25108254 24936165 24919426 25145501 25642672 26352407
42547 26352407 27152674 27902931 28460905 28690131 28513221 27985033 27288840 26633962 26158208
42538 26158208 25922715 25953830 26242566 26718531 27289922 27949502 28822230 30073731 31763952
42529 31763952 33789959 35947671 38029476 39894625 41511894 42965909 44402359 45948055
42521 45948055 47688002 49702411 52073711 54839750 57996912 61602690 65842360 70927610
42513 70927610 76937067 83821276 91564512 100251478 109908089 120291327 130833196 140693468
42505 140693468 148784040 153838747 154722181 150919924 142848646 131714066 119035563 106175991
42497 106175991 94087282 83271327 73887319 65932826 59384689 54202763 50242167 47225651
42489 47225651 44836950 42831930 41057947 39407221 37793151 36164709 34514167 32870583
42481 32870583 31303011 29914780 28789889 27923087 27219434 26580589 25989956 25514592 25240129
42472 25240129 25209819 25406940 25774331 26249909 26792393 27374966 27956591 28473185 28873255
42463 28873255 29169666 29455361 29858781 30462842 31245917 32097200 32897687 33591146 34186167
42454 34186167 34719103 35238464 35798972 36414840 37005476 37430337 37608113 37582755 37457471
42445 37457471 37296737 37124148 36987963 36978087 37172790 37588922 38167212 38763519 39155824 39116372
42435 39116372 38530261 37463637 36124312 34754130 33521965 32462669 31494936 30520089
42427 30520089 29529782 28627006 27950910 27584423 27507158 27600227 27702533 27705207 27607920 27464702
42417 27464702 27282449 27017163 26679244 26389872 26295371 26451513 26815426 27310150 27850631
42408 27850631 28337515 28698732 28959050 29240362 29686142 30398886 31420019 32700323 34069227
42399 34069227 35293687 36233495 36950402 37655973 38566425 39814432 41454198 43477379 45794849
42390 45794849 48243215 50673621 53072096 55598260 58505293 62029825 66354680 71631941
42382 71631941 77974492 85402348 93841812 103223843 113569457 124931407 137217134 150005968
42374 150005968 162400772 172945578 179787932 181250877 176598271 166437144 152429548
42367 152429548 136587213 120676288 105949457 93080806 82208228 73121097 65530538
42360 65530538 59221362 54017933 49720300 46127429 43067490 40360645 37807851 35284738
42352 35284738 32825293 30559819 28581704 26906749 25523283 24414934 23547175 22896634
42344 22896634 22493649 22375755 22492809 22715653 22948486 23173352 23371889 23483184 23493184
42335 23493184 23512618 23695133 24087450 24599565 25108482 25563917 26027436 26662987 27670899
42326 27670899 29157521 31030906 33033655 34885126 36402165 37532314 38321328 38830680
42318 38830680 39031287 38775219 37912468 36435150 34473781 32176530 29663907 27100067
42310 27100067 24710557 22665957 20986507 19600915 18457799 17538677 16809990 16229902
42302 16229902 15784557 15461559 15202131 14938839 14677143 14478946 14351920 14206879 13954478
42293 13954478 13620568 13351955 13325505 13640133 14240987 14917801 15410246 15558243 15360926
42284 15360926 14905843 14287704 13616536 13052260 12757675 12797056 13100030 13526594 13953472
42275 13953472 14311611 14582888 14788900 14980870 15228918 15606501 16154737 16828585 17478825
42266 17478825 17926871 18096887 18081517 18063123 18159992 18346500 18511574 18569752 18499965 18299177
42256 18299177 17951975 17481442 17011866 16733841 16782222 17152726 17734533 18398381 19039159
42247 19039159 19558396 19848166 19819664 19460394 18871073 18237894 17738593 17449194 17336706
42238 17336706 17336211 17412760 17542320 17672218 17748815 17781248 17830844 17909529 17908288 17659457 17082910
42227 17082910 16270173 15428711 14752475 14348683 14273680 14597773 15385166 16593688 18025764
42218 18025764 19418429 20590142 21497118 22178187 22695134 23130897 23590995 24158116 24849662
42209 24849662 25641389 26520506 27485294 28496807 29475639 30382628 31295365 32373354 33733218
42200 33733218 35368999 37196843 39144483 41159326 43143516 44943432 46435920 47586195
42192 47586195 48373637 48682478 48328791 47214489 45427336 43190711 40757550 38357435
42184 38357435 36177816 34328536 32822238 31612710 30645951 29866773 29212679 28643118 28162413
42175 28162413 27780615 27467331 27185955 26961527 26856979 26870106 26909070 26903214 26895240 26972470
42165 26972470 27128535 27258322 27309575 27394784 27707047 28324442 29118874 29859027 30383195 30665722
42155 30665722 30745317 30636625 30338712 29919730 29561848 29490555 29832069 30521437 31349088 32109488
42145 32109488 32718023 33203504 33625913 34033142 34475354 34997815 35592146 36193484 36761094
42136 36761094 37335852 37980541 38681274 39344613 39874172 40207826 40300186 40136423 39775469
42127 39775469 39322830 38837426 38315014 37795138 37435525 37421087 37800980 38434958 39079983
42118 39079983 39515496 39638206 39507018 39296210 39151629 39072487 38954314 38744023 38520378
42109 38520378 38422103 38532935 38840336 39257600 39652940 39884997 39858077 39561512 39055744 38429329
42099 38429329 37776257 37200229 36812920 36699667 36859667 37170691 37446220 37581507 37657815
42090 37657815 37867214 38309761 38883205 39385989 39699080 39844100 39905780 39961169 40077901 40307839
42080 40307839 40638196 40981154 41258853 41497250 41807257 42266502 42831993 43369414 43760099
42071 43760099 43985672 44120831 44239856 44322355 44264300 43998943 43589927 43173114 42819003 42502088
42061 42502088 42206459 41984843 41858826 41715553 41396983 40895395 40388965 40068148 39994281
42052 39994281 40150680 40537273 41120973 41731758 42118920 42143782 41869840 41458047 41038869
42043 41038869 40710024 40579718 40722836 41093957 41533193 41872804 42026443 41996710 41847193
42034 41847193 41685433 41640205 41813592 42234286 42849541 43560980 44277099 44940816 45507014
42025 45507014 45902989 46045058 45924610 45669412 45489604 45549864 45888099 46424159 47007816
42016 47007816 47477290 47743268 47855074 47954373 48131616 48345458 48499549 48558214 48542430 48443183
42006 48443183 48209327 47827698 47357288 46864088 46374002 45922693 45600927 45483113 45515226
41997 45515226 45525945 45372280 45065116 44757814 44628544 44753047 45042617 45292796 45331680 45154913
41987 45154913 44912373 44758776 44738553 44824321 45027390 45418967 46033995 46778123 47444781 47833108
41977 47833108 47882602 47736007 47672492 47926701 48514708 49220673 49776156 50080938 50263892 50531478
41967 50531478 50954975 51401957 51669539 51676677 51525492 51391677 51377727 51467854 51582340 51636129
41957 51636129 51557660 51304311 50893966 50410985 49961386 49625261 49457584 49507701 49794027 50249156
41947 50249156 50725950 51100379 51379884 51696876 52182958 52842099 53532822 54058852 54287068
41938 54287068 54222013 54012768 53890576 54050706 54533399 55193012 55801943 56223017 56507723
41929 56507723 56833512 57341753 58029125 58779541 59473916 60049830 60468777 60668044 60579992
41920 60579992 60204188 59653489 59130299 58851792 58958537 59437102 60105467 60704982 61061449
41911 61061449 61187848 61231317 61316610 61443609 61527671 61507304 61384445 61175074 60872453 60486343
41901 60486343 60082582 59732309 59431496 59130410 58858822 58758676 58936086 59309253 59662164
41892 59662164 59843133 59863246 59812249 59752393 59721322 59776602 59981655 60370475 60962399 61782438
41882 61782438 62813504 63932427 64939432 65669971 66070659 66185427 66108828 65956626 65836847
41873 65836847 65806746 65848060 65891447 65879355 65831320 65867042 66151406 66787358 67754837 68958126
41863 68958126 70313163 71764910 73244013 74665380 75987700 77235189 78434043 79555196
41855 79555196 80550093 81421480 82218349 82963552 83623359 84160402 84589954 84966551 85336276
41846 85336276 85725656 86156692 86625797 87060855 87352719 87480038 87589024 87903639 88554984
41837 88554984 89533343 90790958 92308793 94021375 95746545 97281835 98571302 99726648
41829 99726648 100894204 102158990 103568919 105161134 106914139 108728158 110520546 112331907
41821 112331907 114292051 116475297 118816569 121181092 123509464 125893018 128506824 131460053
41813 131460053 134709561 138126250 141635094 145266163 149076723 153063549 157157755 161257795
41805 161257795 165243948 169011265 172544012 175943339 179343507 182818244 186408137 190213075
41797 190213075 194386046 199018634 204076626 209461898 215096730 220939331 226985825 233321852
41789 233321852 240150495 247696414 256039118 265036782 274414107 283933263 293523628 303304917
41781 303304917 313501630 324293072 335685990 347493827 359427188 371213166 382658860
41774 382658860 393645325 404093588 413940865 423136210 431645530 439445185 446484706 452632758
41766 452632758 457669228 461378493 463702692 464821074 465063814 464731650 463992716 462933003
41758 462933003 461657273 460299950 458949937 457612629 456261406 454885128 453444493 451805355
41750 451805355 449779248 447254572 444253777 440836367 436978704 432590346 427627624 422133934
41742 422133934 416160009 409692397 402682932 395112114 386999211 378393344 369410705 360274030
41734 360274030 351269722 342653447 334617262 327339566 321014012 315780066 311606964 308243743
41726 308243743 305290389 302342604 299096271 295328930 290806030 285254678 278463908 270402660
41718 270402660 261238258 251291421 241015019 230956256 221615703 213277831 205985999 199668011
41710 199668011 194237164 189584120 185561636 182033326 178910219 176127809 173646026 171504883
41702 171504883 169821275 168675827 168037680 167843342 168104810 168881918 170186249 171983950
41694 171983950 174274061 177096787 180483333 184480541 189224114 194882932 201457520 208650346
41686 208650346 215954485 222839760 228838379 233496950 236303528 236695060 234189496 228604472
41678 228604472 220220586 209740735 198061797 186032154 174322270 163389943 153490453
41671 153490453 144730760 137140916 130690772 125257490 120647989 116706714 113390311 110721596
41663 110721596 108705126 107316609 106535172 106327674 106603548 107223931 108060708 109031992 110104555
41654 110104555 111308211 112744448 114525336 116665231 119035964 121432654 123672812 125644840
41646 125644840 127313614 128722866 129977680 131169704 132282586 133181478 133728319 133917479
41638 133917479 133876623 133721113 133432564 132909128 132117861 131159682 130196421 129365252 128759668
41629 128759668 128407230 128202641 127903927 127271678 126228331 124868267 123350515 121831531
41621 121831531 120460949 119334251 118408381 117521733 116542847 115476513 114414740 113441397
41613 113441397 112621785 112022280 111652362 111390030 111030368 110428606 109565013 108474539 107167933
41604 107167933 105640289 103902392 101955468 99760995 97289037 94598429 91825954 89073491
41596 89073491 86324506 83491358 80535113 77521290 74566842 71764572 69175333 66865588
41588 66865588 64902311 63292372 61956799 60797097 59777259 58912195 58181891 57492378
41580 57492378 56728980 55818308 54729028 53451015 52008315 50477446 48964416 47568087
41572 47568087 46373743 45447513 44793281 44326743 43937451 43578959 43259155 42941453 42511461
41563 42511461 41874195 41052537 40157594 39286516 38484323 37783866 37226534 36823001 36519003
41554 36519003 36225307 35886976 35525604 35218383 35035463 34998928 35108949 35396825 35910191
41545 35910191 36618208 37360220 37944701 38320819 38632897 39091510 39800833 40714995 41735374
41536 41735374 42812079 43936424 45059165 46064855 46860442 47476301 48041140 48652541 49313908
41527 49313908 50018168 50841302 51889606 53165456 54545975 55907442 57223362 58521972
41519 58521972 59801576 61039505 62260443 63535944 64903389 66321157 67722675 69091874
41511 69091874 70465254 71879713 73351887 74904795 76571738 78347813 80167618 81979872
41503 81979872 83843715 85900676 88222888 90718262 93214315 95607229 97887310 100041152
41495 100041152 101995186 103670865 105040500 106087697 106738514 106873796 106409395 105345388
41487 105345388 103747321 101707589 99324849 96688285 93853377 90828557 87594305 84146239
41479 84146239 80530531 76843381 73194250 69668058 66325333 63232000 60464229 58058676
41471 58058676 55956076 54015815 52112264 50232776 48485629 47006845 45845229 44922759
41463 44922759 44103644 43315799 42619968 42153873 41984121 41999986 41965994 41694515 41165445 40485308
41453 40485308 39773192 39122844 38641031 38442093 38571906 38970258 39524313 40123564 40653099
41444 40653099 41000997 41138161 41170286 41254531 41462641 41752406 42049220 42305378 42493365 42609612
41434 42609612 42710451 42906043 43292383 43901237 44711107 45668532 46687636 47667370 48539836
41425 48539836 49292920 49938068 50474245 50895750 51226198 51541716 51964647 52612659 53518510
41416 53518510 54600901 55744079 56906343 58124079 59417966 60733219 61964696 62990673
41408 62990673 63685118 63976333 63948894 63858336 63997214 64537475 65491404 66778878 68309035
41399 68309035 70035190 71967280 74113721 76392178 78626597 80662725 82474820 84151424
41391 84151424 85809731 87536224 89356799 91216684 93020838 94748830 96523139 98525293
41383 98525293 100845513 103435152 106190975 109060794 112083381 115350410 118908647 122669160
41375 122669160 126433260 130047205 133531321 137049859 140789487 144890786 149438766 154436832
41367 154436832 159789853 165368567 171097009 176943619 182849149 188729242 194550191 200339471
41359 200339471 206107576 211816976 217446390 223020345 228528753 233858997 238859664 243452217
41351 243452217 247638484 251416899 254744880 257588957 259961170 261866918 263229919 263908317
41343 263908317 263809436 262987034 261618396 259893351 257933885 255795838 253492866 250993279
41335 250993279 248234167 245197387 241988172 238825269 235948413 233522006 231578438 230006079
41327 230006079 228603470 227194708 225715010 224183604 222618926 221016708 219396952 217819403
41319 217819403 216336731 214963778 213702832 212562433 211524268 210509296 209402135 208109023
41311 208109023 206584685 204808903 202748910 200355599 197607142 194551617 191278433 187828121
41303 187828121 184146834 180150443 175820295 171218901 166433985 161537323 156582239 151604389
41295 151604389 146624157 141664335 136749259 131870666 126994384 122148881 117480782 113161117
41287 113161117 109240655 105644239 102289795 99144566 96166723 93272965 90399752 87553123
41279 87553123 84780844 82139594 79695708 77491931 75481710 73549018 71629006 69767252
41271 69767252 68029468 66396500 64783760 63129315 61438072 59785496 58308440 57136335
41263 57136335 56277406 55607701 55017718 54531938 54236342 54136202 54160293 54278552 54529592
41254 54529592 54927759 55418306 55950149 56536403 57202407 57901414 58522343 58987806 59334944
41245 59334944 59693450 60182905 60842742 61669638 62674515 63810004 64818255 65253384 64772418
41236 64772418 63418585 61584693 59728280 58165562 57069367 56513897 56460052 56765686 57270109
41227 57270109 57850115 58387991 58750213 58853496 58736129 58537890 58423760 58527010 58910028
41218 58910028 59532514 60279736 61064584 61899368 62849142 63933719 65102738 66288283 67446054
41209 67446054 68557158 69639128 70773994 72095991 73721417 75688636 77971664 80542823
41201 80542823 83408792 86584477 90040552 93685849 97410193 101157431 104971748 108980397
41193 108980397 113322228 118069960 123199333 128622158 134248672 140028828 145955606 152041225
41185 152041225 158262957 164473904 170332229 175338044 178981882 180884021 180819503 178673693
41177 178673693 174448382 168335850 160751802 152243508 143324434 134362075 125588068 117180243
41169 117180243 109306041 102081262 95520124 89572153 84215063 79481852 75397281 71935663
41161 71935663 69055805 66713502 64787565 63048476 61296826 59538606 57948083 56629293
41153 56629293 55469967 54270688 52983639 51781163 50898237 50430089 50271254 50226330 50177714
41144 50177714 50157903 50269674 50551751 50931285 51281649 51488074 51467760 51188878 50712319 50197251
41134 50197251 49828135 49714031 49838606 50088822 50344523 50572650 50834900 51179367 51541789
41125 51541789 51805207 51954222 52103968 52358327 52712009 53135548 53682277 54424773 55320381
41116 55320381 56235677 57111073 58027068 59087369 60296030 61576365 62859403 64119826
41108 64119826 65373613 66701794 68270719 70285514 72906626 76211188 80207073 84842541
41100 84842541 90000721 95530871 101330313 107403959 113828286 120651138 127840338 135341679
41092 135341679 143171757 151417151 160112600 169103649 178002864 186242405 193164055 198121104
41084 198121104 200594403 200293466 197197952 191538077 183742320 174358228 163948722 153009977
41076 153009977 141955102 131129714 120794518 111092991 102079871 93801759 86324928
41069 86324928 79672029 73768766 68492128 63763805 59572590 55915382 52745199 49976904
41061 49976904 47518172 45286520 43215557 41265161 39433010 37755047 36279010 35006497
41053 35006497 33846115 32650615 31337564 29973909 28721443 27709450 26989061 26588082
41045 26588082 26528511 26743743 27027071 27139156 26984641 26662311 26356731 26221155 26349526
41036 26349526 26777125 27447326 28204129 28877679 29396040 29801707 30167937 30521608 30839667
41027 30839667 31089763 31269653 31431667 31673720 32078000 32641600 33284410 33937288 34602349
41018 34602349 35310825 36047590 36752735 37389753 37974591 38529335 39039190 39474038 39824914
41009 39824914 40079725 40162094 39934298 39303662 38342267 37289340 36408849 35817329 35429241
41000 35429241 35052382 34527071 33789198 32846032 31738188 30529931 29302250 28128079 27056279
40991 27056279 26120860 25339724 24678835 24033793 23290472 22424650 21527990 20727025 20094356
40982 20094356 19650502 19421740 19444247 19691904 20027611 20265214 20297658 20164432 19992824 19874247
40972 19874247 19791815 19655803 19401494 19054933 18711146 18454683 18304420 18232700 18223608 18290357
40962 18290357 18426179 18556972 18573072 18415074 18105725 17684401 17143020 16480130 15827318
40953 15827318 15463811 15632986 16321834 17251220 18112686 18812494 19479846 20272000 21223831
40944 21223831 22283590 23412338 24570025 25627499 26390324 26755428 26790407 26608603 26217635
40935 26217635 25574830 24772910 24065947 23671170 23612046 23798195 24186391 24779488 25502363
40926 25502363 26178782 26656953 26915626 27048916 27199829 27502158 28000938 28581497 29028806
40917 29028806 29219350 29247743 29340373 29665792 30245431 30997289 31804057 32557822 33211349 33814059
40907 33814059 34472269 35264182 36208067 37297040 38523202 39869942 41326082 42910439
40899 42910439 44622358 46341481 47841948 48981346 49865574 50768087 51874787 53139894
40891 53139894 54382293 55459536 56317143 56915807 57171044 56968884 56219059 54906578 53128473
40882 53128473 51083607 48991727 46993055 45114031 43309133 41513884 39677503 37799532
40874 37799532 35959898 34283501 32846473 31628343 30567893 29642168 28873375 28290770
40866 28290770 27921964 27796252 27900986 28130747 28324454 28371972 28263223 28031713 27688681
40857 27688681 27235254 26715490 26228769 25887933 25764145 25854254 26091549 26399222 26742170
40848 26742170 27126788 27564026 28053168 28595022 29199949 29894770 30749322 31870986 33307272
40839 33307272 34944703 36569272 38061529 39484410 40942141 42399323 43686971 44643847
40831 44643847 45184182 45249682 44780733 43765925 42281934 40462326 38444779 36349591 34276267
40822 34276267 32296614 30449666 28738615 27129546 25575048 24061512 22618880 21262526
40814 21262526 19947715 18619853 17305080 16121996 15206603 14638074 14400222 14359277 14292768
40805 14292768 14014121 13508466 12930261 12464995 12214969 12199335 12398864 12775041 13285918
40796 13285918 13907694 14611361 15307473 15862698 16207896 16403344 16568896 16777662 17048404
40787 17048404 17406050 17886775 18475396 19077605 19575228 19898213 20042208 20042858 19959194 19879389
40777 19879389 19909790 20117775 20471272 20857075 21180968 21437703 21667213 21869384 21998201
40768 21998201 22017492 21911806 21660255 21277545 20896194 20723400 20849734 21133197 21324980
40759 21324980 21294451 21102197 20893444 20779928 20806936 20964033 21204399 21482380 21777165 22056876
40749 22056876 22236119 22223332 22023293 21749014 21508835 21316265 21140778 21015413 21038067 21253831
40739 21253831 21569499 21817347 21911395 21938234 22097759 22560590 23373929 24472668 25740233
40730 25740233 27040820 28215901 29099792 29587170 29708793 29630552 29548196 29565446 29679737
40721 29679737 29878869 30209365 30722562 31393498 32155768 33011352 34041565 35285271 36649622
40712 36649622 37966889 39107367 40025774 40758948 41431148 42222687 43259724 44524903 45909032
40703 45909032 47344122 48852601 50482247 52250012 54163699 56252496 58540422 61003280
40695 61003280 63578302 66225377 68982060 71960300 75277396 78976997 83025292 87395753
40687 87395753 92143195 97376147 103173248 109560197 116568678 124288277 132844846 142326685
40679 142326685 152713224 163850914 175504382 187450905 199512276 211463543 222912730
40672 222912730 233289556 241930833 248142073 251229084 250626395 246138202 238091958 227229691
40664 227229691 214426858 200480424 186071038 171796912 158153195 145457751 133813863
40657 133813863 123169475 113439036 104591597 96638718 89559079 83263107 77642494 72633944
40649 72633944 68208033 64300022 60784458 57541948 54543435 51845693 49496220 47457888
40641 47457888 45641365 43999949 42566516 41393685 40484072 39794886 39284261 38913924 38609210
40632 38609210 38263223 37818933 37340369 36966750 36769285 36654244 36428196 35977400 35384803
40623 35384803 34865476 34593880 34603995 34840111 35260605 35867903 36659916 37587636 38568588
40614 38568588 39536012 40484479 41483330 42643512 44056844 45753765 47695903 49775576
40606 49775576 51819726 53646282 55177989 56519619 57911999 59600452 61724308 64281215
40598 64281215 67164029 70261198 73565832 77175773 81150046 85384038 89685967 93988369
40590 93988369 98441608 103290604 108711894 114799232 121656606 129437457 138286829 148278512
40582 148278512 159413137 171643843 184875937 198945930 213623891 228648334 243737899
40575 243737899 258522321 272428814 284645576 294234944 300333318 302324662 299941139
40568 299941139 293291701 282806714 269122965 253006314 235351107 217134577 199219691
40561 199219691 182138744 166088158 151119562 137277193 124570542 112941689 102343299
40554 102343299 92795079 84294496 76718416 69900919 63797260 58490527 54019783 50256221
40546 50256221 46962601 43919576 40967391 37984007 34906156 31800608 28886918 26443012
40538 26443012 24642063 23446603 22647805 22011244 21399793 20791125 20225634 19755894 19407966
40529 19407966 19140423 18836054 18365325 17675699 16815955 15881915 14959817 14122939 13453274
40520 13453274 13031319 12883184 12933608 13031049 13055878 13020708 13042658 13195318 13404176 13512552
40510 13512552 13438561 13240994 13043771 12933523 12928475 12995810 13062721 13027385 12796832 12334333
40500 12334333 11678616 10928414 10209646 9636311 9273064 9118134 9123879 9248655 9504004 9950920
40490 9950920 10633648 11505875 12426131 13230119 13808326 14134369 14259995 14295880 14356208 14479805
40480 14479805 14614255 14698671 14737094 14752849 14693388 14441671 13935925 13243883 12515895 11903492
40470 11903492 11521726 11424066 11568075 11833179 12110598 12370024 12633419 12922299 13255810
40461 13255810 13655877 14098358 14474868 14660228 14632245 14498733 14401119 14404855 14465210 14460761
40451 14460761 14264720 13832945 13251976 12691706 12304386 12170631 12309198 12678366 13153728
40442 13153728 13558945 13772695 13812969 13809495 13898636 14131103 14438554 14672868 14717837 14603563
40432 14603563 14503101 14595322 14940864 15497780 16213220 17048954 17936254 18775022 19511273
40423 19511273 20193230 20926546 21773317 22691028 23555555 24245244 24724396 25060033 25359217
40414 25359217 25694007 26086980 26547712 27096395 27749340 28492981 29274999 30031666 30756182
40405 30756182 31550390 32565892 33857766 35329065 36861549 38463328 40226200 42173055
40397 42173055 44235260 46358526 48508482 50548186 52243979 53482455 54396833 55178768
40389 55178768 55820244 56135417 55977961 55306158 54059487 52139153 49585993 46688535 43836672
40380 43836672 41298647 39158108 37382991 35878963 34523995 33249093 32104825 31207826
40372 31207826 30611757 30245664 29956710 29574024 28948068 27999480 26778656 25465365 24270578
40363 24270578 23311850 22574565 21989804 21542518 21296783 21323704 21631770 22183307 22954203
40354 22954203 23941201 25117156 26420641 27804395 29269398 30841143 32538411 34380222
40346 34380222 36398115 38612487 40993267 43443984 45818765 47977443 49876434 51628047
40338 51628047 53434622 55424089 57549892 59656039 61610900 63354415 64844424 66004771
40330 66004771 66730456 66915201 66466444 65314962 63429015 60827124 57584541 53826806
40322 53826806 49701532 45348092 40908055 36571726 32587521 29187378 26484524 24436759
40314 24436759 22896110 21692885 20701850 19866221 19172693 18597156 18067237 17472614 16713118
40305 16713118 15756959 14677579 13628454 12748636 12077197 11570006 11191168 10955300 10882250
40296 10882250 10958386 11159208 11460076 11788684 12009559 12011671 11799882 11464013 11078648 10677688
40286 10677688 10307269 10038006 9908106 9892041 9937952 10009670 10094126 10208659 10408265 10737097
40276 10737097 11144028 11483472 11645242 11675814 11738114 11949849 12282826 12616495 12854038 12965487
40266 12965487 12944405 12769449 12423622 11928964 11351926 10802448 10441432 10433150 10812559 11398893
40256 11398893 11909764 12191704 12302975 12368748 12430725 12475938 12529586 12625828 12715569 12691180
40246 12691180 12511067 12251614 12046935 12024933 12269572 12755284 13310351 13726120 13932240
40237 13932240 14011797 14038851 13983492 13811130 13594324 13457875 13452448 13530267 13602821 13572738 13357019
40226 13357019 12953647 12468242 12012999 11589421 11125051 10612947 10152377 9851973 9751485
40217 9751485 9841689 10089797 10411020 10666500 10740695 10610968 10324867 9937969 9502261 9092144
40207 9092144 8802701 8720566 8909687 9404759 10175675 11083997 11901560 12414021 12543447 12393537
40197 12393537 12173805 12055106 12077511 12193734 12390033 12730128 13256334 13867416 14333506
40188 14333506 14442892 14123286 13435997 12504219 11475902 10516274 9765171 9271940 8997257
40179 8997257 8904595 9035303 9459886 10147697 10912808 11521153 11860374 11996465 12066060 12134408
40169 12134408 12171136 12139667 12065668 12005645 11981537 11973529 11956701 11908906 11788069 11539716 11141151
40158 11141151 10619551 10021788 9389759 8771627 8222822 7762191 7331346 6820015 6145030
40149 6145030 5317349 4448216 3684917 3113006 2712982 2431167 2283684 2337512 2568656 2800653
40139 2800653 2851436 2728559 2629398 2754077 3155397 3746683 4379489 4897705 5189639 5251465
40129 5251465 5190256 5134874 5143896 5197098 5242957 5236817 5162529 5044954 4926993 4819846 4701473
40118 4701473 4585176 4555737 4689976 4947268 5179219 5256854 5166381 4983031 4787025 4620362
40108 4620362 4495148 4407620 4339241 4258545 4130546 3931416 3673132 3433347 3356587 3596160
40098 3596160 4224498 5189589 6361352 7620388 8902620 10174210 11388558 12476203
40090 12476203 13365924 14014290 14431543 14683374 14845235 14938893 14926086 14771845 14490839 14118272
40080 14118272 13670537 13171395 12691466 12307290 12019704 11756586 11466141 11173005 10934526
40071 10934526 10778268 10698334 10685171 10745565 10915953 11255807 11785436 12415769 12983637 13384394
40061 13384394 13634906 13780684 13787973 13579691 13154003 12617961 12119947 11796069 11761865 12079522
40051 12079522 12704553 13505244 14359258 15207127 16006652 16686211 17183900 17509356 17726812
40042 17726812 17883959 17989570 18059279 18149408 18329496 18634941 19053097 19536776 20014846 20403833
40032 20403833 20641926 20731568 20747358 20794097 20949627 21234731 21621022 22064781 22547102 23086095
40022 23086095 23690035 24280606 24678043 24696829 24272449 23490812 22498043 21392477 20193470
40013 20193470 18886816 17495105 16128794 14980239 14240304 13981735 14102726 14376481 14560099
40004 14560099 14491019 14136551 13581008 12944212 12280930 11558417 10744213 9908171 9219260
39995 9219260 8835969 8799703 9023878 9373537 9758341 10163004 10600785 11048955 11438753 11705842
39985 11705842 11839537 11880739 11879252 11851825 11772387 11605125 11356657 11089018 10864032 10677268
39975 10677268 10464961 10177510 9835164 9521572 9341296 9365352 9578564 9883527 10197155
39966 10197155 10545936 11024108 11654133 12337061 12946015 13402871 13638937 13560165 13120085
39957 13120085 12380627 11428443 10261493 8836607 7220497 5622459 4270757 3304919
39949 3304919 2767207 2602229 2632184 2615990 2416131 2104695 1878444 1885099 2145607 2601676
39939 2601676 3181117 3814833 4433890 4984234 5450201 5856272 6237911 6613689 6999363
39930 6999363 7439533 7972317 8523059 8877218 8846551 8483109 8070225 7868335 7903880 8022577
39920 8022577 8086441 8062085 7957842 7761039 7459352 7085122 6721498 6481167 6469705 6728441
39910 6728441 7199095 7773298 8394197 9088289 9883004 10721986 11499253 12171268 12793566
39901 12793566 13419818 13978825 14285190 14192403 13734588 13109714 12524295 12060121 11683231
39892 11683231 11347694 11052455 10796945 10529764 10192284 9811002 9498107 9329280 9242781
39883 9242781 9092341 8792105 8383967 7976787 7662302 7490224 7468761 7548772 7627217 7601123
39873 7601123 7424713 7119065 6752630 6416420 6174041 6005792 5835672 5650976 5566349 5722291
39863 5722291 6134556 6682026 7219802 7656247 7952611 8137985 8336280 8690142 9205718
39854 9205718 9722246 10084927 10317588 10587985 11038176 11693371 12501617 13389552 14266306
39845 14266306 15015249 15507092 15623659 15295405 14555825 13562103 12534792 11663967 11065448
39836 11065448 10782301 10772214 10900608 11015739 11075916 11180473 11439391 11818820 12145418 12272183
39826 12272183 12225043 12172686 12250336 12415675 12478859 12273503 11802321 11231423 10759406 10478799
39816 10478799 10316624 10078978 9590273 8859118 8127648 7710283 7736801 8052174 8374724
39807 8374724 8529209 8513621 8391290 8198221 7975184 7834841 7940556 8406902 9217625 10214649
39797 10214649 11152252 11797347 12036563 11919899 11607897 11278725 11067096 11032910 11132191 11228844
39787 11228844 11193700 11020848 10828047 10734611 10761544 10854709 10970031 11115225 11331088 11648750
39777 11648750 12043151 12415648 12653052 12727431 12715503 12706794 12734227 12823762 13057623 13515765
39767 13515765 14167085 14878730 15529846 16061972 16424557 16546124 16385509 15953735 15251518
39758 15251518 14238037 12915601 11420760 9980537 8775143 7859469 7196492 6730456
39750 6730456 6431521 6301451 6348868 6553464 6856912 7191405 7505391 7758684 7916927 7970893
39740 7970893 7949235 7897166 7853244 7853593 7930923 8081772 8249926 8371312 8429893 8449075 8440154
39729 8440154 8386588 8270137 8081304 7811409 7479280 7179756 7063397 7224148 7605343 8032070
39719 8032070 8334462 8437691 8359726 8161482 7906449 7636016 7349088 6999658 6529870 5920479
39709 5920479 5216363 4507418 3885248 3409816 3104172 2971036 3006162 3185672 3441481 3674578
39699 3674578 3822293 3910878 4015504 4163109 4298166 4347557 4285365 4121638 3874821 3598646
39689 3598646 3402817 3378736 3495486 3616029 3634850 3570759 3513298 3510180 3528595 3508347 3435142
39678 3435142 3367922 3391903 3525168 3677289 3737790 3717473 3766470 4026445 4486437 5008526
39668 5008526 5477196 5892119 6314434 6743306 7059529 7099777 6795906 6238857 5602068 5025496
39658 5025496 4599147 4419472 4568813 5000290 5503105 5850965 5980146 5987554 5971622 5926851
39648 5926851 5803948 5626725 5497829 5471007 5440273 5206676 4692092 4065777 3608449 3447457
39638 3447457 3466845 3473852 3386745 3235275 3049855 2819025 2530475 2203312 1897207 1724752
39628 1724752 1819103 2227430 2841500 3476400 4013043 4438592 4782540 5070139 5315622 5487919
39618 5487919 5481069 5190697 4651452 4063146 3665985 3614168 3948092 4603104 5403774 6108107
39608 6108107 6527699 6611006 6401716 5955011 5335716 4674247 4159416 3938272 4022076 4292667
39598 4292667 4592984 4805587 4854278 4670629 4219989 3588895 3006508 2715462 2801545 3160883
39588 3160883 3612908 4006355 4235947 4237768 4019493 3676046 3350175 3183625 3292809 3730353
39578 3730353 4426124 5191301 5830029 6263895 6550264 6802390 7107248 7491943 7922920
39569 7922920 8321336 8593944 8670777 8537206 8251133 7924338 7657698 7480278 7364983 7305762
39559 7305762 7353174 7560784 7919780 8364975 8826065 9251319 9599079 9844846 10013944 10198903
39549 10198903 10527060 11084794 11845160 12664036 13365578 13843957 14085509 14120975 14005910
39540 14005910 13854246 13830523 14047891 14471413 14949403 15346117 15638866 15900645 16207372
39531 16207372 16556360 16861935 17039242 17106393 17194893 17441369 17869371 18382370 18856305 19218820
39521 19218820 19450307 19548445 19524132 19432504 19376666 19433849 19550906 19538479 19223732 18630119
39511 18630119 17979675 17498548 17235042 17070057 16866539 16587729 16316301 16213545 16437123
39502 16437123 17018776 17780898 18400313 18597511 18289801 17588933 16687586 15758133 14921468
39493 14921468 14254279 13791439 13523027 13407766 13398545 13445454 13465670 13327936 12900613 12132356
39483 12132356 11082958 9880879 8665465 7556304 6629191 5887861 5271325 4711882 4187711
39474 4187711 3723115 3362507 3151300 3105197 3165355 3204035 3113431 2891071 2620372 2377796
39464 2377796 2182053 2022829 1906115 1863574 1927890 2086731 2240988 2231786 1965793 1539978
39454 1539978 1217392 1245224 1677616 2357236 3047536 3584554 3932308 4128734 4204346 4164872
39444 4164872 4037290 3891875 3794780 3759544 3769779 3827627 3940899 4070533 4133880 4070352
39434 4070352 3876937 3576646 3188363 2744818 2311215 1956912 1713222 1570662 1510892 1531587
39424 1531587 1638332 1807267 1956801 1987396 1887119 1787477 1864899 2167656 2565841 2876615
39414 2876615 2999818 2922674 2658725 2247428 1791762 1428044 1240515 1236955 1408214 1759724
39404 1759724 2250561 2735105 3028889 3065021 2974300 2981746 3200408 3515039 3667101 3463708
39394 3463708 2927261 2273549 1760578 1534412 1566792 1700773 1759884 1649314 1388525 1062722
39384 1062722 736989 403695 13416 -429205 -804996 -952171 -825354 -558391 -330406
39375 -330406 -183046 -13753 262736 612973 957165 1267274 1541626 1739391 1821107 1836790
39365 1836790 1895284 2035045 2188742 2299351 2416901 2642198 3010715 3468142 3924323 4275739
39355 4275739 4392079 4158412 3578526 2820206 2126074 1668687 1480286 1484230 1556407 1568446
39345 1568446 1433016 1159079 861449 686442 719814 975458 1448251 2116319 2866065 3470044
39335 3470044 3716027 3579877 3251068 2987861 2960035 3197718 3616926 4063854 4384332 4511232
39325 4511232 4493349 4424168 4347387 4236197 4040672 3737620 3358223 2994176 2756463 2690173
39315 2690173 2732058 2774901 2759762 2673375 2476818 2105298 1567459 1008245 639620 614818
39305 614818 961956 1583657 2278719 2800272 2970035 2776774 2363069 1915965 1566463 1353867
39295 1353867 1230222 1087432 822874 422481 -10104 -314805 -379637 -210648 77984 350902
39285 350902 558984 771644 1088463 1516860 1955548 2298197 2523506 2674471 2787387 2871050
39275 2871050 2923052 2912940 2753669 2346870 1689432 914682 201459 -356775 -791417 -1186340
39265 -1186340 -1572853 -1872889 -1933901 -1652144 -1096798 -495950 -57395 200398 413394 680516
39255 680516 956025 1137801 1200370 1202230 1213783 1303946 1567826 2072325 2739677 3339056
39245 3339056 3641697 3575471 3222523 2711063 2146651 1617315 1206262 981492 983098 1208628
39235 1208628 1589278 1993504 2288380 2409036 2365261 2197988 1948742 1650644 1311529 909864
39225 909864 441475 -27737 -386090 -557933 -537081 -343238 16091 532163 1183393 1958760
39215 1958760 2862520 3869229 4893776 5832165 6626341 7283201 7852193 8394674 8940923
39206 8940923 9443491 9788145 9882240 9730070 9408961 8994871 8544874 8139330 7893604 7905072
39196 7905072 8197928 8722534 9395931 10140806 10897882 11613456 12233163 12734983 13172118
39187 13172118 13645035 14198425 14766894 15260288 15690927 16172792 16789803 17497874 18162079
39178 18162079 18658212 18932808 19009739 18979894 18980818 19161906 19648347 20507398 21711798 23131638
39168 23131638 24596717 25991698 27282661 28449297 29418822 30085353 30377916 30292243 29869746
39159 29869746 29167259 28249833 27209172 26187920 25363778 24867355 24700489 24759987 24947346
39150 24947346 25214452 25486498 25610251 25464931 25122182 24825304 24774698 24954739 25172974
39141 25172974 25224168 24997647 24479649 23720336 22808306 21839678 20880794 19946188 18996517
39132 18996517 17952221 16736406 15343917 13877462 12492643 11287106 10240708 9261231
39124 9261231 8279867 7309007 6436423 5783906 5452270 5460585 5709941 6017147 6215185 6242461
39114 6242461 6139884 5968100 5745538 5479359 5241713 5178739 5417124 5961290 6690570 7449189
39104 7449189 8124466 8650085 8977552 9076381 8947817 8608017 8066845 7369091 6676173 6264753
39094 6264753 6378037 7040815 8014703 8936006 9510416 9620220 9309991 8713244 7993419
39085 7993419 7324384 6876899 6761788 6944826 7230718 7381579 7285044 7008506 6697798 6449707
39075 6449707 6279645 6154182 5998876 5690162 5107808 4240991 3237714 2326703 1674770
39066 1674770 1306561 1148037 1136843 1279704 1592217 1994366 2305674 2374455 2203082 1929122
39056 1929122 1700188 1587634 1591323 1673560 1789652 1937043 2184333 2597880 3111527 3513493
39046 3513493 3606021 3365922 2940670 2534043 2318723 2382534 2662854 2945532 3013823 2823674
39036 2823674 2496644 2161253 1880934 1735768 1853642 2273583 2830596 3263358 3432063
39027 3432063 3386487 3248160 3094091 2949363 2814473 2656590 2403553 1983895 1381393 658308
39017 658308 -63421 -660304 -1078478 -1346564 -1495415 -1477713 -1208901 -691506 -55875 542738
39007 542738 1039237 1455163 1814196 2096496 2267833 2326506 2315317 2292167 2282988 2258203 2162820
38996 2162820 1973827 1721669 1459112 1226831 1052048 958076 957452 1040497 1177526 1331390
38986 1331390 1478379 1637010 1872456 2241162 2713274 3161964 3440449 3468095 3256884 2888953
38976 2888953 2476164 2108070 1814031 1585433 1438657 1432009 1610411 1956394 2400472 2841408
38966 2841408 3138727 3139012 2780377 2187439 1642280 1446937 1782620 2627862 3753754 4824923
38956 4824923 5580952 5957451 6029086 5854673 5415479 4698918 3793595 2875657 2115477 1601309
38946 1601309 1324899 1214973 1188231 1190490 1216221 1309710 1536941 1911866 2322547 2555450
38936 2555450 2430582 1917317 1123846 225357 -556308 -958068 -774905 -8564 1106503
38927 1106503 2246939 3169293 3777200 4108458 4298581 4513455 4853651 5296614 5719754
38918 5719754 5969822 5939044 5637044 5210683 4848812 4630682 4487673 4333674 4199485 4200938
38908 4200938 4394444 4707921 5014629 5241242 5392637 5496016 5550883 5548774 5535685 5620599
38898 5620599 5879866 6249590 6555981 6687883 6730161 6905792 7390355 8186970 9150320 10088511
38888 10088511 10839190 11295020 11414805 11238694 10872561 10406975 9824492 9017260 7938614
38879 7938614 6721016 5588609 4646839 3811060 2960684 2108554 1381146 882264 640411
38870 640411 668248 995870 1612249 2401363 3163574 3705935 3924206 3819215 3447361 2867262
38860 2867262 2148352 1410886 791971 331251 -71749 -533105 -1035637 -1456973 -1731495
38851 -1731495 -1914502 -2073350 -2184540 -2179192 -2036979 -1776260 -1386240 -850348 -246041 252951
38841 252951 527415 636182 736448 889408 1002824 985685 902714 911133 1053730 1177596
38831 1177596 1085267 731763 244184 -223240 -609269 -930468 -1196378 -1369132 -1397324 -1270854
38821 -1270854 -1033767 -740207 -401259 13170 518649 1084771 1678333 2318048 3042009
38812 3042009 3804762 4440992 4780693 4819208 4756197 4843793 5191514 5721166 6290578 6823290
38802 6823290 7312750 7749880 8098126 8336667 8498446 8668054 8957610 9450184 10101150
38793 10101150 10684050 10886604 10498829 9512907 8079700 6441450 4901204 3738519 3054378
38784 3054378 2717426 2515979 2346724 2228486 2192245 2239166 2381680 2634046 2944800 3198138
38774 3198138 3298952 3213970 2930457 2437634 1767586 993680 149208 -811130 -1922684
38765 -1922684 -3100661 -4154703 -4916611 -5349677 -5551595 -5665253 -5772995 -5861020 -5885487
38756 -5885487 -5865817 -5893754 -6045010 -6288088 -6470794 -6388391 -5899061 -5022721 -3928645 -2796675
38746 -2796675 -1702603 -674954 171567 654426 702108 447965 110994 -162965 -317516
38737 -317516 -331047 -228047 -98431 -10106 97047 361081 834752 1425322 1998982 2486399
38727 2486399 2872206 3146868 3320632 3457792 3642608 3891607 4106099 4120744 3819843 3234626
38717 3234626 2531985 1888500 1368006 934742 582101 416635 593067 1171535 2040935
38708 2040935 2964505 3693373 4068179 4065796 3790355 3431357 3206856 3289624 3723254 4378690
38698 4378690 5009674 5393654 5460683 5313548 5127213 5005029 4900440 4665722 4185017 3471367
38688 3471367 2649292 1869979 1258205 907044 856666 1046465 1323647 1555122 1751310 2065634
38678 2065634 2654717 3524924 4498943 5328356 5865539 6163450 6418032 6791676 7269308
38669 7269308 7676296 7828325 7656994 7205560 6542846 5709001 4731710 3662776 2586923
38660 2586923 1604171 804886 246135 -61231 -143580 -40362 214671 597959 1086713 1631455
38650 1631455 2126409 2430854 2463406 2287408 2078760 1997565 2103092 2376779 2767368 3185859
38640 3185859 3512309 3674894 3713843 3720346 3715460 3627296 3379953 2963211 2424429 1848450
38630 1848450 1351239 1032523 906884 922363 1062603 1371574 1838434 2314272 2614010 2688075
38620 2688075 2646309 2631418 2725701 2972957 3416398 4068648 4859759 5636969 6223552 6504879
38610 6504879 6493678 6306018 6037413 5664528 5109652 4402977 3722753 3240837 2966520 2784710
38600 2784710 2625119 2548678 2676526 3080690 3753205 4642228 5691528 6863918 8155026
38591 8155026 9583591 11149759 12797279 14427453 15959703 17380189 18734569 20081716
38583 20081716 21454477 22846097 24211209 25480842 26603354 27589183 28501929 29382922
38575 29382922 30186835 30808927 31172722 31268418 31102168 30636792 29807747 28592790 27054115
38566 27054115 25319333 23528746 21778716 20079793 18363448 16560014 14698057 12926769
38558 12926769 11427519 10296850 9506746 8954996 8534006 8163162 7794899 7422823 7087362
38549 7087362 6854724 6765859 6787046 6809605 6721587 6506748 6270759 6141380 6128873 6104444
38539 6104444 5935716 5629816 5316887 5093106 4902143 4580452 4009943 3223035 2368448
38530 2368448 1582365 893544 252784 -355533 -854630 -1135780 -1149622 -909279 -425756 303842
38520 303842 1226183 2187620 2994821 3517793 3734004 3705044 3539274 3358784 3257910 3267793
38510 3267793 3356191 3456837 3499396 3429438 3221491 2881637 2443851 1974032 1568724 1316454
38500 1316454 1241155 1299288 1441800 1652087 1907813 2148648 2331201 2492047 2691140 2890823
38490 2890823 2960549 2835652 2620691 2487658 2505208 2620531 2780867 2995097 3268265 3554576
38480 3554576 3823422 4122155 4512206 4967980 5402979 5788829 6182089 6620386 7051156
38471 7051156 7382455 7537296 7419266 6904442 5966488 4789022 3661151 2747759 2026702
38462 2026702 1450332 1073007 974147 1128301 1414348 1707567 1909297 1943910 1820591 1684207
38452 1684207 1712402 1934925 2208473 2386155 2454287 2475047 2457842 2357684 2187694 2071001
38442 2071001 2155704 2499093 3046030 3693614 4345443 4911213 5301638 5464417 5421290 5246207
38432 5246207 5014088 4799854 4716206 4891747 5374484 6080130 6858246 7585234 8180993 8594868
38422 8594868 8844602 9054918 9394597 9962613 10765872 11793098 13050449 14512542 16092201
38413 16092201 17692234 19265205 20809227 22334787 23854117 25377169 26891742 28348928
38405 28348928 29664097 30715813 31363382 31524297 31262128 30768048 30229076 29719983 29203868
38396 29203868 28569982 27641532 26218787 24213773 21769168 19216971 16907545 15066321
38388 15066321 13749628 12850842 12132821 11325122 10268761 9000954 7711006 6624073
38380 6624073 5911581 5654726 5826343 6281331 6791645 7141459 7226019 7070523 6757167 6345681
38370 6345681 5871555 5402275 5059519 4963224 5145810 5510165 5865341 6028667 5941583 5716095
38360 5716095 5563706 5657925 6034887 6584245 7110775 7432072 7469843 7267731 6914793 6467296
38350 6467296 5966990 5503348 5191660 5078089 5110185 5208106 5322950 5432269 5553315 5782620
38340 5782620 6241311 6924274 7658315 8265849 8718524 9068624 9293093 9312120 9141856 8918103
38330 8918103 8744164 8590740 8369107 8034040 7583557 7018407 6346211 5590632 4769469
38321 4769469 3902194 3062244 2369170 1876974 1493720 1058923 501371 -93516 -551615
38312 -551615 -726507 -581833 -204690 260197 712116 1135692 1541412 1881992 2037986 1878828
38302 1878828 1351970 552106 -297265 -992430 -1519912 -2044539 -2694680 -3397144 -3962980
38293 -3962980 -4288016 -4402914 -4363118 -4186423 -3905915 -3593049 -3282314 -2928552 -2488384 -2012758
38283 -2012758 -1617785 -1384208 -1317092 -1379088 -1514869 -1642162 -1661869 -1511851 -1217555 -877616
38273 -877616 -575517 -291022 79612 585796 1125688 1538659 1787354 1977241 2178008 2309312
38263 2309312 2262651 2067809 1847092 1640715 1382923 1051935 742344 554487 488027 484409
38253 484409 506778 529913 515639 467818 472535 615141 881359 1201573 1564789 2008593 2502201
38242 2502201 2924415 3181854 3285615 3284364 3183643 2975045 2697589 2412373 2132656 1820344
38232 1820344 1443341 1009315 557043 141531 -187292 -420526 -595093 -741168 -846160
38223 -846160 -902608 -965078 -1100859 -1281824 -1379559 -1289635 -1024094 -663282 -259817 172819
38213 172819 610375 1015556 1389763 1784176 2236557 2712538 3122752 3390056 3498172 3492989
38203 3492989 3446820 3402326 3327331 3129564 2740866 2196071 1616095 1107291 690691 335905
38193 335905 42205 -139304 -159123 -24444 196388 404003 507815 474434 361871 288913
38183 288913 343919 524816 781037 1102183 1536550 2112526 2754263 3284955 3518378 3368334
38173 3368334 2902853 2308064 1783786 1445654 1304121 1314680 1427753 1593097 1750137 1849558
38163 1849558 1887163 1895504 1897504 1894234 1918416 2074782 2474628 3108597 3813429 4395368 4774102
38152 4774102 4981751 5047141 4944357 4673673 4340180 4099116 4030025 4093697 4200436 4282594
38142 4282594 4302487 4239212 4103907 3953764 3859071 3848604 3898931 3978924 4088131 4234898
38132 4234898 4380288 4427718 4290108 3963621 3513671 2985381 2357226 1606853 801216 74968
38122 74968 -496624 -976129 -1490832 -2093518 -2720971 -3283560 -3756420 -4158451 -4466847 -4598233
38112 -4598233 -4487981 -4168651 -3763903 -3422164 -3244568 -3217274 -3178588 -2907986 -2332805 -1652047
38102 -1652047 -1193183 -1126379 -1358334 -1699849 -2054402 -2405356 -2704839 -2876797 -2918154 -2922738
38092 -2922738 -2991945 -3161444 -3414902 -3728096 -4091056 -4507705 -4960163 -5344233 -5468149 -5176042
38082 -5176042 -4477031 -3516488 -2442640 -1368379 -449086 113525 208730 -90351 -614207
38073 -614207 -1232662 -1865961 -2423296 -2813015 -3004904 -3029563 -2928849 -2757220 -2611911 -2580754
38063 -2580754 -2629904 -2591180 -2303826 -1766821 -1151647 -688422 -535855 -711205 -1102966 -1558884
38053 -1558884 -1992275 -2416779 -2880454 -3374125 -3805687 -4049829 -4016483 -3694620 -3166344 -2591698
38043 -2591698 -2154114 -1971173 -2013361 -2095466 -1974480 -1510116 -777590 -36350 439030 543641
38033 543641 394030 205238 113748 120426 188443 343915 632153 988715 1213461 1102080
38023 1102080 584290 -268512 -1317410 -2395600 -3317163 -3933084 -4214946 -4257944 -4182326
38014 -4182326 -4048001 -3872148 -3695133 -3587973 -3593849 -3690627 -3824693 -3964049 -4093611 -4156401
38004 -4156401 -4022664 -3546313 -2675126 -1526211 -366783 496206 861279 721302 222949
37995 222949 -470022 -1269769 -2122579 -2915679 -3480304 -3697161 -3575672 -3237401 -2854663 -2586598
37985 -2586598 -2503055 -2544307 -2606470 -2694114 -2933052 -3387251 -3912160 -4253913 -4272364 -4017601
37975 -4017601 -3622408 -3196990 -2821227 -2557672 -2440357 -2486006 -2711176 -3075140 -3397407 -3415610
37965 -3415610 -2990374 -2230592 -1384836 -636943 -30231 462690 868406 1207239 1504363
37956 1504363 1787646 2095834 2487342 3003339 3597640 4118962 4396449 4368013 4131980 3863103
37946 3863103 3662990 3488142 3225105 2825792 2360367 1956073 1710122 1645447 1699828 1741763
37936 1741763 1642251 1380852 1087662 964679 1149691 1623533 2206833 2652904 2813704 2771722
37926 2771722 2791173 3088732 3632390 4166154 4422283 4315503 3977343 3640485 3466993 3438931
37916 3438931 3401519 3223129 2910041 2572528 2327510 2267008 2469928 2960183 3642056 4329431
37906 4329431 4856694 5136274 5130025 4845689 4393852 3981460 3777340 3791393 3921434 4099463
37896 4099463 4342669 4660443 4962254 5094310 4961368 4594979 4103689 3578044 3066689
37887 3066689 2637485 2408456 2459759 2715285 2966736 3048260 2963345 2821052 2688556 2554559
37877 2554559 2414160 2321808 2340992 2482476 2714838 3004177 3313784 3586406 3767832 3856402
37867 3856402 3910619 3998598 4144195 4318589 4470575 4561220 4582718 4559110 4528801 4510679 4472295
37856 4472295 4337493 4053306 3669096 3333369 3178285 3201924 3293365 3385523 3547997 3893436
37846 3893436 4412652 4952865 5365070 5628080 5807630 5941089 6015892 6043495 6086841 6186677
37836 6186677 6302016 6370950 6421465 6572878 6898460 7303674 7575417 7567756 7334656 7083454
37826 7083454 7021110 7251684 7769404 8465348 9115114 9435375 9251276 8634617 7845077 7123789
37816 7123789 6559074 6126271 5783305 5496866 5236576 5014424 4921979 5076975 5521032 6192058
37806 6192058 6989173 7828390 8634857 9329901 9861753 10234769 10480676 10601261 10557847 10326530
37796 10326530 9960774 9595590 9390441 9469486 9905281 10716931 11828880 13026166 14016513
37787 14016513 14607801 14833142 14879837 14911970 14990049 15118928 15278774 15391932 15357580 15201587
37777 15201587 15149122 15450264 16109911 16840280 17304493 17380081 17180022 16873930 16542954 16187635
37767 16187635 15800532 15380693 14896963 14293553 13560058 12772747 12032870 11369585 10738071
37758 10738071 10120040 9590553 9262726 9193258 9371860 9773036 10350387 10957904 11330649
37749 11330649 11218161 10576512 9633064 8754753 8231659 8138302 8335670 8565183 8568686 8207478
37739 8207478 7550274 6860879 6448547 6468784 6835215 7307811 7660745 7792090 7729674 7569070
37729 7569070 7389804 7198499 6952009 6649349 6385406 6283260 6375068 6577856 6787667 6961567
37719 6961567 7089495 7120827 6968452 6597920 6091925 5610223 5284464 5146613 5140626 5187378
37709 5187378 5243754 5319776 5450020 5641063 5839306 5957037 5934130 5760861 5438926 4963932
37699 4963932 4397502 3939781 3848474 4227544 4906247 5552027 5900058 5887183 5629381 5324329
37689 5324329 5148201 5178949 5394386 5750794 6241942 6856771 7514260 8099861 8564857 8946432
37679 8946432 9297669 9649065 10032621 10472899 10929013 11299407 11517425 11606052 11617800 11565905
37669 11565905 11441901 11251308 10990427 10631048 10179934 9720594 9337014 9014131 8673836
37660 8673836 8305969 8008488 7886926 7951471 8117583 8269208 8313234 8212916 7994334 7704409
37650 7704409 7348800 6880639 6253445 5476200 4627272 3840327 3272613 3046603 3186760
37641 3186760 3598322 4097751 4471681 4558793 4339597 3957781 3611752 3393051 3229810 2981935
37631 2981935 2575586 2058980 1567575 1243899 1152959 1240956 1374944 1431699 1358956 1181717
37621 1181717 980384 846876 819959 867568 976160 1250410 1849400 2779728 3794338 4550920
37611 4550920 4865550 4791961 4485684 4040422 3451406 2692552 1809566 949289 297074 -36197
37601 -36197 -81989 22258 132762 178968 184016 230993 394087 681911 1050140 1466038 1930418
37590 1930418 2422564 2859688 3148048 3259546 3227231 3078567 2808405 2415952 1941344 1463436
37580 1463436 1071099 813393 646651 451423 152576 -175463 -371086 -372759 -313250 -407571
37570 -407571 -765812 -1319681 -1890286 -2294105 -2411980 -2216805 -1763920 -1140627 -403695 435853
37560 435853 1354180 2236920 2884531 3142051 3051360 2856146 2821030 3035114 3391435 3726963
37550 3726963 3944337 4014998 3932272 3701719 3354316 2936098 2487716 2045991 1653427 1351958
37540 1351958 1178992 1184251 1433276 1956950 2678542 3405048 3924435 4144358 4149416 4115280
37530 4115280 4158061 4269676 4391341 4514016 4680703 4915644 5196323 5495206 5813851 6171266
37520 6171266 6588870 7088326 7665647 8252945 8736708 9032837 9130239 9071665 8939899 8866216
37510 8866216 8975226 9257125 9521812 9536559 9209513 8617924 7891959 7124405 6374175 5684503
37500 5684503 5071021 4527398 4062147 3707831 3484395 3373247 3331866 3315944 3293807 3273042
37490 3273042 3319249 3514724 3876381 4322540 4721329 4959611 4983842 4823974 4594368 4433223
37480 4433223 4407100 4480449 4583640 4690870 4829496 5048870 5395570 5876576 6403198 6788951
37470 6788951 6853018 6551068 6008837 5437104 5006753 4760100 4599713 4371306 3990734 3497574
37460 3497574 2980361 2472908 1950731 1411083 918434 574808 476032 686246 1202449 1920098
37450 1920098 2660915 3261245 3637338 3787680 3782189 3762395 3894020 4251278 4736634 5142184
37440 5142184 5305774 5211061 4955052 4645846 4336989 4040687 3776606 3580840 3453446 3318865
37430 3318865 3084838 2758521 2469576 2342742 2362882 2400632 2363621 2285388 2263718 2351032
37420 2351032 2524297 2735117 2962916 3229345 3578162 4031008 4542732 5002552 5299495
37411 5299495 5403046 5388612 5388571 5508893 5770157 6115846 6484116 6876342 7346959 7926372
37401 7926372 8575868 9231615 9871536 10510256 11132740 11660034 11992981 12087917 11998575 11856134
37391 11856134 11793899 11858217 11979446 12042121 11991072 11866442 11747256 11684863 11691790 11768637 11926957
37380 11926957 12193940 12589890 13075241 13518226 13755049 13713389 13465526 13147990 12850887
37371 12850887 12595170 12368983 12133386 11817142 11377852 10886729 10506880 10362613 10456406
37362 10456406 10721348 11102835 11545744 11935060 12119583 12021946 11706372 11322827 10987746
37353 10987746 10717062 10461570 10195449 9961447 9822502 9779388 9764820 9727865 9690861 9692380
37343 9692380 9699462 9627837 9448521 9218245 8976596 8660455 8181058 7580143 7052118 6779427
37333 6779427 6765392 6850240 6874648 6805362 6722154 6729844 6892434 7208562 7614566 8030345 8439179
37322 8439179 8918692 9563157 10374168 11251383 12086990 12841550 13535592 14211344 14905377
37313 14905377 15600401 16176479 16467650 16425819 16203276 16019374 15956291 15921896 15780049 15453548
37303 15453548 14927343 14256572 13606941 13208373 13199742 13534744 14056644 14619431 15113564 15450193
37293 15450193 15607075 15671022 15758206 15878190 15918544 15768487 15422939 14966778 14496686 14063883
37283 14063883 13659296 13247713 12841883 12537046 12432989 12519786 12681823 12820538 12924564
37274 12924564 13000887 12992416 12816208 12466101 12037134 11647968 11350984 11093490 10734728 10117846
37264 10117846 9176164 7997544 6783019 5736959 4982199 4538123 4336807 4262489 4216871
37255 4216871 4180084 4216834 4421287 4844859 5451989 6130033 6760993 7312693 7854710 8452899
37245 8452899 9036884 9391784 9299148 8689449 7669183 6429328 5143506 3931467 2874935
37236 2874935 2032135 1423957 1016056 742013 570709 552720 777538 1267192 1918339 2561686
37226 2561686 3071962 3405605 3546551 3466636 3177789 2802081 2531592 2488749 2641873 2866626
37216 2866626 3058220 3163491 3154597 3049651 2964638 3072603 3458711 4029487 4583904 4952734
37206 4952734 5063194 4927968 4633714 4319198 4092692 3946574 3785607 3552912 3302828
37197 3302828 3144490 3147623 3317514 3625078 4025668 4460982 4871417 5206041 5410551 5429221
37187 5429221 5260070 5011751 4863117 4929094 5172535 5472753 5775668 6142403 6638909 7216380
37177 7216380 7742037 8134276 8422031 8670907 8904294 9118953 9322624 9500191 9570478 9444306
37167 9444306 9132499 8748201 8392692 8087768 7841708 7727662 7835530 8149830 8516185
37158 8516185 8744692 8739970 8542748 8276169 8060403 7947421 7895982 7797333 7552336 7162382
37148 7162382 6759284 6531923 6609401 7012595 7698549 8601848 9606033 10519492 11153479
37139 11153479 11447841 11496119 11441335 11367664 11281144 11140667 10883194 10462443 9912016 9362685
37129 9362685 8959708 8749625 8656173 8566122 8431905 8295929 8225728 8230245 8244484 8199711 8094779
$$ [...]
##END NTUPLES=NMR SPECTRUM
##END=
