##TITLE=31Pdec_DE-PH_Asp
D2O, 64 sc
 28.8.2025
##JCAMPDX= 6.0         $$ Bruker NMR JCAMP-DX V2.0
##DATA TYPE= NMR SPECTRUM
##DATA CLASS= NTUPLES
##ORIGIN= UXNMR, Bruker Analytische Messtechnik GmbH
##OWNER= root
$$ XWIN-NMR		Version 3.5
$$ Thu Aug 28 13:41:13 2025 Russian Standard Time (UT+4h)  she@DPX200
##.OBSERVE FREQUENCY= 81.013821
##.OBSERVE NUCLEUS= ^31P
##.ACQUISITION MODE= SIMULTANEOUS
##.ACQUISITION SCHEME= undefined
##.AVERAGES= 64
##.DIGITISER RES= 17
##SPECTROMETER/DATA SYSTEM= spect
##.PULSE SEQUENCE= zgpg30
##.SOLVENT NAME= D2O
##.SHIFT REFERENCE= (INTERNAL, D2O, 0, 198.062)
##AUDIT TRAIL= $$ (NUMBER, WHEN, WHO, WHERE, WHAT)
$$ ##TITLE= Audit trail, XWIN-NMR		Version 3.5
$$ ##JCAMPDX= 5.01
$$ ##ORIGIN= Bruker BioSpin GmbH
$$ ##OWNER= she
$$ F:/spectra/data/she/nmr/P31/2/pdata/1/auditp.txt
$$ ##AUDIT TRAIL=  $$ (NUMBER, WHEN, WHO, WHERE, WHAT)
(   1,<2025-08-28 13:40:02.54 +0400>,<she>,<DPX200>,
      <created by zg, POWCHK disabled, PULCHK disabled
       configuration hash MD5:
       00 E9 B6 7A A2 85 ED C7 34 08 36 98 17 FE 4E 26
       data hash MD5: 32K
       5D 4F C1 B1 97 0A 2E 7D 54 27 08 26 F1 3C FA FE>)
(   2,<2025-08-28 13:40:04.70 +0400>,<she>,<DPX200>,
      <Start of raw data processing
       efp BC_mod = 2 LB = 1.5 FT_mod = 6 PKNL = 1 PHC0 = 1597.002 PHC1 = -446.9 SI = 64K 
       data hash MD5: 64K
       65 DC DC D5 D9 66 AD D8 F6 60 1F F5 77 12 F3 50>)
(   3,<2025-08-28 13:40:22.65 +0400>,<she>,<DPX200>,
      <pk PHC0 = -5.215274 PHC1 = 0 
       data hash MD5: 64K
       F1 77 2D 44 D4 7F A3 72 93 D2 B2 63 8E 9D CA 65>)
(   4,<2025-08-28 13:40:30.29 +0400>,<she>,<DPX200>,
      <abs ABSG = 5 
       data hash MD5: 64K
       01 0C 91 B9 3A F5 B0 A0 EB 2A 40 8F C6 E8 3C 8D>)
$$ ##END=
$$ 
$$ hash MD5
$$ 4A 0E F4 5C 5E 04 67 26 41 1E 11 46 45 65 95 DE
##$RELAX= 
##$RELAX= 
##$RELAX= 
##$RELAX= 
##$RELAX= 
##$RELAX= 
##$RELAX= 
##$RELAX= 
$$ Bruker specific parameters
$$ --------------------------
##$DU= <F:/spectra>
##$EXPNO= 2
##$NAME= <P31>
##$PROCNO= 1
##$TYPE= <nmr>
##$USER= <she>
##$AMP= (0..31)
100 100 100 100 100 100 100 100 100 100 100 100 100 100 100 100 100 100 
100 100 100 100 100 100 100 100 100 100 100 100 100 100 
##$AQSEQ= 0
##$AQ_mod= 1
##$AUNM= <au_zg>
##$AUTOPOS= <>
##$BF1= 81.014009
##$BF2= 200.13
##$BF3= 200.13
##$BF4= 200.13
##$BF5= 200.13
##$BF6= 200.13
##$BF7= 200.13
##$BF8= 200.13
##$BYTORDA= 1
##$CFDGTYP= 0
##$CFRGTYP= 5
##$CHEMSTR= <none>
##$CNST= (0..31)
1 1 145 1 1 1 1 1 1 1 1 1 1 1 1 1 1 1 1 1 1 1 1 1 1 1 1 1 1 1 1 1 
##$CPDPRG= <waltz16>
##$CPDPRG1= <>
##$CPDPRG2= <waltz16>
##$CPDPRG3= <>
##$CPDPRG4= <mlev>
##$CPDPRG5= <mlev>
##$CPDPRG6= <mlev>
##$CPDPRG7= <mlev>
##$CPDPRG8= <mlev>
##$CPDPRGB= <>
##$CPDPRGT= <>
##$D= (0..31)
0 1 0 0 0 0 0 0 0 0.06 0 0.03 2e-05 3e-06 0 0 0.0002 0 0 0 0 0 0 0 0 0 
0 0 0 0 0 0 
##$DATE= 1756374001
##$DBL= (0..7)
120 120 120 11 120 120 24 19 
##$DBP= (0..7)
150 150 150 150 150 150 150 150 
##$DBP07= 0
##$DBPNAM0= <>
##$DBPNAM1= <>
##$DBPNAM2= <>
$$ [...]
##$SUBNAM3= <"">
##$SUBNAM4= <"">
##$SUBNAM5= <"">
##$SUBNAM6= <"">
##$SUBNAM7= <"">
##$SUBNAM8= <"">
##$SUBNAM9= <"">
##$SW= 400.765351723535
##$SWIBOX= (0..15)
0 1 3 0 0 0 0 0 0 0 0 0 0 0 0 0 
##$SW_h= 32467.5324675325
##$TD= 32768
##$TD0= 1
##$TE= 0
##$TE2= 300
##$TE3= 300
##$TEG= 300
##$TL= (0..7)
0 120 53 12 22 120 120 120 
##$TP= (0..7)
150 150 150 150 150 150 150 150 
##$TP07= 0
##$TPNAME0= <>
##$TPNAME1= <>
##$TPNAME2= <>
##$TPNAME3= <>
##$TPNAME4= <>
##$TPNAME5= <>
##$TPNAME6= <>
##$TPNAME7= <>
##$TPOAL= (0..7)
0.5 0.5 0.5 0.5 0.5 0.5 0.5 0.5 
##$TPOFFS= (0..7)
0 0 0 0 0 0 0 0 
##$TUNHIN= 0
##$TUNHOUT= 0
##$TUNXOUT= 0
##$USERA1= <user>
##$USERA2= <user>
##$USERA3= <user>
##$USERA4= <user>
##$USERA5= <user>
##$V9= 5
##$VALIST= <valist>
##$VCLIST= <CCCCCCCCCCCCCCC>
##$VD= 0
##$VDLIST= <DDDDDDDDDDDDDDD>
##$VPLIST= <PPPPPPPPPPPPPPP>
##$VTLIST= <TTTTTTTTTTTTTTT>
##$WBST= 1024
##$WBSW= 4
##$XGAIN= (0..3)
0 0 0 0 
##$XL= 0
##$YL= 0
##$YMAX_a= 15988
##$YMIN_a= -15384
##$ZGOPTNS= <>
##$ZL1= 120
##$ZL2= 120
##$ZL3= 120
##$ZL4= 120
##$ABSF1= 198.0616
##$ABSF2= -202.7028
##$ABSG= 5
##$ABSL= 3
##$ALPHA= 0
##$AQORDER= 0
##$ASSFAC= 0
##$ASSFACI= 0
##$ASSFACX= 0
##$ASSWID= 0
##$AUNMP= <proc_1d>
##$AZFE= 0.1
##$AZFW= 0.5
##$BCFW= 0
##$BC_mod= 2
##$BYTORDP= 0
##$COROFFS= 0
##$CY= -3
##$DATMOD= 1
##$DC= 0
##$DFILT= <>
##$DTYPP= 0
##$F1P= 0
##$F2P= 0
##$FCOR= 1
##$FTSIZE= 65536
##$FT_mod= 6
##$GAMMA= 0
##$GB= 0
##$INTBC= 1
##$INTSCL= 9.790993e-09
##$ISEN= 30
##$LB= 1.5
##$LEV0= 0
##$LPBIN= 0
##$MAXI= 10000
##$MC2= 0
##$MEAN= 0
##$ME_mod= 0
##$MI= 50
##$NCOEF= 0
##$NC_proc= -8
##$NLEV= 6
##$NOISF1= 182.463
##$NOISF2= 159.3651
##$NSP= 0
##$NTH_PI= 0
##$NZP= 0
##$OFFSET= 198.0616
##$PC= 4
##$PHC0= 1591.787
##$PHC1= -446.9
##$PH_mod= 1
##$PKNL= yes
##$PPARMOD= 0
##$PSCAL= 0
##$PSIGN= 0
##$REVERSE= no
##$SF= 81.0140089999434
##$SI= 65536
##$SIGF1= 159.3651
##$SIGF2= -187.1042
##$SINO= 113.3802
##$SIOLD= 16384
##$SREGLST= <1H.CDCl3>
##$SSB= 0
##$STSI= 65536
##$STSR= 0
##$SW_p= 32467.5324675325
##$SYMM= 0
##$S_DEV= 0
##$TDeff= 32768
##$TDoff= 0
##$TI= <>
##$TILT= no
##$TM1= 0
##$TM2= 0
##$TOPLEV= 0
##$USERP1= <user>
##$USERP2= <user>
##$USERP3= <user>
##$USERP4= <user>
##$USERP5= <user>
##$WDW= 1
##$XDIM= 65536
##$YMAX_p= 450821515
##$YMIN_p= -158348409
$$ End of Bruker specific parameters
$$ ---------------------------------
##NTUPLES= NMR SPECTRUM
##VAR_NAME=  FREQUENCY,     SPECTRUM/REAL,   SPECTRUM/IMAG
##SYMBOL=    X,             R,               I
##VAR_TYPE=  INDEPENDENT,   DEPENDENT,       DEPENDENT
##VAR_FORM=  AFFN,          ASDF,            ASDF
##VAR_DIM=   65536,         65536,           65536
##UNITS=     HZ,            ARBITRARY UNITS, ARBITRARY UNITS
##FACTOR=    0.49542278885378, 1,            1
##FIRST=     16045.7642231865, 0,            0
##LAST=      -16421.768244346, 0,            0
##MIN=       -16421.768244346, -158348409,   0
##MAX=       16045.7642231865, 450821515,    0
$$ Real data points
##PAGE= N=1
##DATA TABLE= (X++(R..R)), XYDATA
$$ [...]
40979B605815k909469l159007m67114K643401L167353P37195k105426k698748
40971b186000j060581N66868P32420K04688J19356J81820k50063n74470M562O57680
40961a603720j17453k116660l623985l782560l220332k441377j236060J86032
40953a7956115J035231J213806J428986J900738K341696L155051M760929N558531
40945C438853L043090j964646m658143j893292L212333M809912J454255k888121
40937D554241m476157l524437j867088J79018K851880M724691L812463M90043
40929F744654k434061k719950p32502J544671K535945J914675L09873j261485
40921E901820j983365j662635p03682J10123k08081k171826m690268n294966k658761
$$ plain form
40979 2605815 -303654 -3462661 -3929775 -1286374 1880979 2618174 512748 -2186000
40971 -2186000 -3246581 -2679713 -1947293 -1742605 -1623249 -1441429 -1691492 -2265962 -2261400 -1603720
40961 -1603720 -1721173 -3837833 -7461818 -11244378 -14464710 -16906087 -18142147 -17956115
40953 -17956115 -16920884 -15707078 -14278092 -12377354 -10035658 -6880607 -2119678 3438853
40945 3438853 6481943 4517297 -140846 -2034138 1178195 5988107 7442362 4554241
40937 4554241 78084 -3446353 -5313441 -5134423 -2282543 2442148 6254611 6744654
40929 6744654 4310593 1590643 858141 2402812 4938757 6853432 7163305 5901820
40921 5901820 3918455 2255820 1552138 1662261 1454180 -717646 -5407914 -10702880 -13361641
40912a3361641J408767L799629L817439L433249L718944L249080J143055n40553
40904F667969L41767K264848J920562p56942k416000j336816K67208l0847j511397
40895E410352k303032k486579k984949k996880j197283J319919K025865Q04368
40887b408219J90552J160744J189291j880850n762573n873384j239102L848907
40879a0774634M805078J971420m19810K25741K165118K478707J145363M21343
40871B018326J090456J440281J39369j751617k469168j807844o30659P11435K177580
40862I18159L096187K853962K076364J779914J597874K09970k393472m323200
40854E815758l893936j505208R70969K082976J717783O22448m43984j120167j406122
$$ plain form
40912 -13361641 -11952874 -8153245 -4335806 -902557 2816387 6065467 7208522 6667969
40904 6667969 7009736 9274584 11195146 10438204 8022204 6685388 6952596 6921749 5410352
40895 5410352 3107320 620741 -2364208 -5361088 -6558371 -5238452 -3212587 -2408219
40887 -2408219 -2217667 -1056923 132368 -1748482 -7511055 -13384439 -14623541 -10774634
40879 -10774634 -5969556 -3998136 -4417946 -4192205 -2027087 451620 1596983 2018326
40871 2018326 3108782 4549063 4688432 2936815 467647 -1340197 -1970856 -1259421 918159
40862 918159 4014346 6868308 8944672 10724586 12322460 12532430 10138958 5815758
40854 5815758 1921822 416614 1387583 3470559 5188342 5810790 5366806 4246639 2840517
40845B840517j577181k092811l016664l221918j062304L101219N813818L873003
40837D657679j237855m377681k856363N59006J831989P10224j91735M49445J774977
40828A319686K886196L470660K877417P82631j498349k258055j675230j194651
40820D710305j215696j209669j355884j846423j297991J456373M382769M069366
40812G693150P03515j777817j118600N73255N41773r58603k076938k110486j385760
40803H3489k99806L37194j89780q33670K15554K145697J907258q64296k505655
40794d015q15625J380529R22205m71742O03698L126300L147010L15532j545306
40785F658586m08117J408508J391783J02536r18973j658413k471924k576899j368458
$$ plain form
40845 2840517 1263336 -829475 -3846139 -7068057 -8130361 -5029142 784676 4657679
40837 4657679 3419824 -957857 -3814220 -3255214 -1423225 -713001 -904736 -455291 1319686
40828 1319686 4205882 7676542 10553959 11336590 9838241 7580186 5904956 4710305
40820 4710305 3494609 2284940 929056 -917367 -2215358 -758985 3623784 7693150
40812 7693150 8396665 6618848 5500248 6073503 6615276 5656673 3579735 1469249 83489
40803 83489 -216317 120877 -68903 -902573 -687019 1458678 3365936 2501640 -4015
40794 -4015 -819640 560889 1483094 1011352 1615050 4741350 7888360 8203892 6658586
40785 6658586 6250469 7658977 9050760 9153296 8234323 6575910 4103986 1527087 158629
40776A58629J55732O70695K74915l8754J26535L98612L32079k70925j206622j706914
40766a106018r38257J104103L500761N089981M993608L077101N00166r36481q60602
40757A4424362r21997k265134l442665k410984K52605K019506J731087K67501
40749I654281j605815l682253m655944k655255J725656M970757M358961Q56833
40741H967221k409733l369439k174212m01555L09374k89740p74008k3836R94561
40732H28633Q21074J46184O61815J725163J044012j134587j786401n3045R10131
40723C162979j049371l201356j856305J958630L913499K327500l25029j492677
40715C437870j425275j612846k312940k390353q00954J966645L698957K441886
$$ plain form
40776 158629 314361 985056 1259971 1221217 1347752 1746364 2078443 1807518 600896 -1106018
40766 -1106018 -2044275 -940172 2560589 7650570 12644178 15721279 16221445 15284964 14424362
40757 14424362 13502365 11237231 7794566 5383582 5636187 7655693 9386780 9654281
40749 9654281 8048466 4366213 -289731 -2944986 -1219330 3751427 8110388 8967221
40741 8967221 6557488 3188049 1013837 612282 921656 631916 -142092 -165928 828633
40732 828633 1649707 1795891 2457706 4182869 5226881 4092294 2305893 2252848 3162979
40723 3162979 2113608 -1087748 -2944053 -985423 2928076 5255576 4930547 3437870
40715 3437870 2012595 399749 -1913191 -4303544 -5104498 -3137853 561104 3002990
40707C002990q52399k906307k191675q43221j141920j944673r67207Q09178K70494
40698f764740k511581l450276r1824M405646M898151O97294l497356l107512J096480
40689h325718M032123K363495j508866k556615L43569L045431J906467j345012
40681b045126k369345j99453K067633J862063q1207j542067j365880J5761J054047
40672b603574J72684k112978k722261L08104M215553M288144K44285l170726k589747
40663c970516Q0383J461605J330154J269987J253547M20498l51389L69722J598876
40654C462867Q75154k011260m490553m451766k189424P59564K859522K730881
40646b455015J12504k957229l705502j878538J26276P47559J038118K204880L280887
$$ plain form
40707 3002990 2150591 -755716 -2947391 -3790612 -4932532 -6877205 -7844412 -7035234 -6764740
40698 -6764740 -9276321 -12726597 -12818421 -8412775 -3514624 -2817330 -6314686 -9422198 -8325718
40689 -8325718 -4293595 -1930100 -3438966 -5995581 -5652012 -2606581 -700114 -2045126
40681 -2045126 -4414471 -4613924 -2546291 -684228 -765435 -2307502 -3673382 -3657621 -2603574
40672 -2603574 -2430890 -4543868 -7266129 -6958025 -2742472 1545672 1789957 -1380769 -3970516
40663 -3970516 -3890133 -2428528 -1098374 171613 1425160 1845658 1494269 1863991 3462867
40654 3462867 4338021 2326761 -2163792 -6615558 -8804982 -8045418 -5185896 -2455015
40646 -2455015 -2342511 -5299740 -9005242 -10883780 -10757504 -10009945 -8971827 -6766947 -3486060
40637c486060K686760P70677q03450j319262j132263k34608J616157L615000M371630
40628F084581L718112K682792J588829l24912l010214m826582m461889k540298
40620a089581n19456J001810K015299K192069J410289M52863N5063n9534j60745
40611E298077M13911J640003J438357j656732n066266m450377J68889L641113
40603A426975K336689j249267k557704j170115j26255o89123j122951k48977Q20524
40594b580204Q79357K02643o40492j625613k318788j759927l6211J288231R26316
40585e664688q27858k659113l109386j182752K433560M908270L797850J70804
40577b133313k468492k344720n83033J523362L617764M339608J768441k627163
$$ plain form
40637 -3486060 -799300 -28623 -832073 -2151335 -3283598 -3518206 -1902049 1712951 6084581
40628 6084581 9802693 12485485 14074314 13749402 10739188 5912606 1450717 -1089581
40620 -1089581 -1609037 -607227 1408072 3600141 5010430 5463293 5518356 5458822 5298077
40611 5298077 5711988 7351991 8790348 7133616 2067350 -2383027 -2214138 1426975
40603 1426975 3763664 2514397 -43307 -1213422 -1339677 -2028800 -3151751 -3400728 -2580204
40594 -2580204 -1700847 -1498204 -2138696 -3764309 -6083097 -7843024 -7879235 -6591004 -5664688
40585 -5664688 -6492546 -9151659 -12261045 -13443797 -11010237 -6101967 -2304117 -2133313
40577 -2133313 -4601805 -6946525 -7529558 -6006196 -2388432 1951176 3719617 1092454
40569A092454l793466N21465N761196O071069J851622j692132k090712j572877
40561F148619j913715j760179j95478Q09558l66795j983731j548683L99605J511290
40552A100491J308041J120492J113256R9821j645690k111550r98879r65202l491854
40543d471074n371897k320523M376581Q157105N217971n96405l101370j660034
40535B30354n08121j526816j965730O9587J970489P49879k046100k525857k3220
40526e575535K361999K180024K45225j009268p5075K532084M421134L136037q77503
40517G339122l929546l192649k05740J425244P29615l82666o12692m14651j82270
40508E73767L9904o47937k731875m063809k074434J675756K707921J61788j624219
$$ plain form
40569 1092454 -2701012 -2179547 3581649 9652718 11504340 9812208 7721496 6148619
40561 6148619 4234904 2474725 2279247 3088805 2722010 738279 -810404 -410799 1100491
40552 1100491 2408532 3529024 4642280 4742101 3096411 984861 -14018 -979220 -4471074
40543 -4471074 -9842971 -12163494 -7786913 370192 5588163 4991758 1890388 230354
40535 230354 -277767 -1804583 -3770313 -3700726 -1730237 -980358 -3026458 -5552315 -5575535
40526 -5575535 -3213536 -1033512 -788287 -1797555 -1872630 659454 5080588 8216625 7339122
40517 7339122 3409576 216927 11187 1436431 2166046 1783380 1170688 756037 573767
40508 573767 613671 -34266 -2766141 -6829950 -8904384 -7228628 -4520707 -4358919 -5983138
40499e983138K85140K883827J999326j309367k612696o70117J433560J177491
40491b795974m56180j254635p20730K8311Q8721j60538M27798K115908L355889
40482F28570K527509N21902j60247P62346P45177j313349k819823j491278Q15517
40473B16324J108082K06960J195159L896060M673124J934330j465798k255190
40465I509051o53717Q62413Q03677m44589j651184j759512p30611K31064N939
40456F172531j005835j665022j815674j955995j803841q99857j67402q33325j969931
40447e944351j321466J209162L057464K520833Q62093J75184P71344J452953J159999
40438C943215j79089j520689j492624l19658k39004k357727m142109k601709Q24606
$$ plain form
40499 -5983138 -5697998 -2814171 -814845 -2124212 -4736908 -5407025 -3973465 -2795974
40491 -2795974 -3252154 -4506789 -5227519 -5199208 -5110487 -5271025 -4843227 -2727319 628570
40482 628570 3156079 3677981 3517734 4280080 5025257 3711908 892085 -599193 216324
40473 216324 1324406 1531366 2726525 6622585 11295709 13230039 11764241 9509051
40465 9509051 8855334 9717747 10521424 10076835 8425651 6666139 5935528 6166592 6172531
40456 6172531 5166696 3501674 1686000 -269995 -2073836 -2973693 -3141095 -3974420 -5944351
40447 -5944351 -7265817 -6056655 -2999191 -478358 383735 558919 1330263 2783216 3943215
40438 3943215 3764126 2243437 750813 431155 192151 -2165576 -6307685 -8909394 -8084788
40429h084788J902293p7115j424272n4902J669984J481468O40426P56478Q23932
40420b366496L2606J68211K148923L250270J322232r74131k35586J619208R5779
40411E061016m275937o056182k727389J949107L359093J374131r48324j376269
40403c640754k7616J317678P75573j435776k576869p74498K019232K734855J791837
40394A83662J805532K420570N76407l635164n675857k843840J701820L471767
40386a995103K333209J097537P22394n0371j428308j766509o6347K391215L198355
40377D436072J111116k514762m550442l224379l22567R97070K82657k08136O38343
40368c355028J525281J628847J763818J770904k9379l125667l800713l50684L479901
$$ plain form
40429 -8084788 -6182495 -6259610 -7683882 -7738784 -6068800 -4587332 -3946906 -3190428 -2366496
40420 -2366496 -2333890 -2165679 -16756 3233514 4555746 3581615 3346029 4965237 5061016
40411 5061016 785079 -5271103 -7998492 -6049385 -2690292 -1316161 -2264485 -3640754
40403 -3640754 -3668370 -2350692 -1575119 -3010895 -5587764 -6362262 -4343030 -1608175 183662
40394 183662 1989194 4409764 4986171 1351007 -4324850 -7168690 -5466870 -1995103
40386 -1995103 338106 1435643 2158037 2107666 679358 -1087151 -1153498 1237717 4436072
40377 4436072 5547188 3032426 -1518016 -4742395 -5064962 -4067892 -3785235 -3993371 -3355028
40368 -3355028 -1829747 -200900 1562918 3333822 3304443 178776 -3621937 -3972621 -492720
40359d92720L406282O75456l95905O98839M77992k236831m072289k198517J499691
40350b638002L076189J475478p63284q45636J328580L269829K587578l25472k628585
40341D536675k312833l10548J243980J623558J247390J27001j663103k870102
40333A622018k382747j137109q42751j320157j138739n04349j110897k931645
40325i746376l512232j297314K105157L946510L378162J678895M42456K67321
40317b737421O29155O27782K01701M15502J923861L604307L717006K073744j3148
40308A0442489j555373k487511k843701k646001k372510k410286k422324k188538
40300h483755k146652j930952P2051L721644N407876K390010k383318l524722
$$ plain form
40359 -492720 2913562 3589018 3193113 3891952 4369944 2133113 -1939176 -4137693 -2638002
40350 -2638002 438187 1913665 1150381 304745 1633325 4903154 7490732 7165260 4536675
40341 4536675 2223842 1913294 3157274 4780832 6028222 6155223 4492120 1622018
40333 1622018 -760729 -1897838 -2740589 -4060746 -5199485 -5703834 -6814731 -9746376
40325 -9746376 -13258608 -14555922 -12450765 -8504255 -5126093 -3447198 -3004742 -2737421
40317 -2737421 -2108266 -1480484 -1278783 -863281 1060580 4664887 8381893 10455637 10442489
40308 10442489 8887116 6399605 3555904 909903 -1462607 -3872893 -6295217 -8483755
40300 -8483755 -10630407 -12561359 -12489308 -8767664 -3359788 -969778 -3353096 -6877818
40292f877818o48022J691303J457550J528296L394753L774364N24717k547646
40284B297497j044333K956013L836795O41632k193443j509147J263848L321608
40276I570470L477018J759597r19357k455935j574435j75147j006343l257219
40268E418649l652833j854388r13049j687598j124753K009215L884653J371695
40260C451591k278461j796071K097187L789844J228651j555131j128445N66209
40252D375374K39711j407493j444934L12155J365068O30343n25706j141898j820590
40243E82030k646562k352534m82719J441521J946686J367483O93644J08146k91955
40234C65740K29757J693189K518555J501944k75134j015877q10446j044110j970465
$$ plain form
40292 -6877818 -7525840 -5834537 -4376987 -2848691 546062 4320426 4845143 2297497
40284 2297497 1253164 4209177 8045972 8687604 6494161 4985014 6248862 9570470
40276 9570470 13047488 14807085 13887728 11431793 9857358 9682211 8675868 5418649
40268 5418649 1765816 -88572 -1001621 -2689219 -3813972 -1804757 2079896 3451591
40260 3451591 1173130 -622941 1474246 5264090 6492741 4937610 3809165 4375374
40252 4375374 4615085 3207592 1762658 2074813 3439881 4070224 3544518 2402620 582030
40243 582030 -2064532 -4417066 -4899785 -3458264 -1511578 -144095 549549 657695 365740
40234 365740 595497 2288686 4807241 6309185 6034051 5018174 4207728 3163618 1193153
40225A193153k649864k731317k463897j422183P72931K750571K546400M70362
40217a533844j241809j687131j967192k380910j513125R54647K800825K004711
40209d563828o59096k853017l111991j358770J334865K844139J786991r7439L07922
40200f370224K575137K634662p37011k875117J25703M697556M298444r24506m146732
40191g22088j717566J997310J473632k340634m385248k920414q61431m94237m74368
40182a0445044R81067K602579J951638l96013j147845R57744L102560K475225
40174H1911M16236J31295J619136K035074O77656k9939Q21744P29546j779282
40165D703377m155210l727004j767471q06885l58385J340537L273087L022164
$$ plain form
40225 1193153 -1456711 -4188028 -6651925 -8074108 -7301177 -4550606 -2004206 -1533844
40217 -1533844 -2775653 -4462784 -6429976 -8810886 -10324011 -9369364 -6568539 -4563828
40209 -4563828 -5222924 -8075941 -11187932 -12546702 -11211837 -8367698 -6580707 -6678146 -6370224
40200 -6370224 -3795087 -1160425 -1897436 -4772553 -4646850 50706 4349150 3424644 -722088
40191 -722088 -2439654 -442344 1031288 -1309346 -5694594 -8615008 -9476439 -9970676 -10445044
40182 -10445044 -9463977 -6861398 -4909760 -5305773 -6453618 -5495874 -2393314 81911
40174 81911 498147 629442 2248578 4283652 4961308 4931369 5753113 6482659 4703377
40165 4703377 548167 -3178837 -4946308 -5753193 -6111578 -4771041 -1497954 1524210
40157A524210R82562l57649m70731o93908q92307J31944J410516Q03525r30116
40148A508046r54415O09026O03123j525327k309165j5363K217906J325182r95677
40139D63336j374207L9965N77102l83218q32188M67973K283524K669228J231511
40130E143026m19030k67072J594584K510284O03163k122344k217102J35123J401254
40121F361886Q6618j603123k136550k846334m177569l590947J76195L886739L861277
40112A8192Q96082j649076k385833j689804O04550L834405M813797J417042l316047
40103B543308m437026j742506M76007p7740j229830o04973J165067K430336K822960
40094A345603K358473N27742k347412m407341m093654j824449P34121K294965
$$ plain form
40157 1524210 2506772 2149123 1678392 984484 92177 224121 1634637 2438162 1508046
40148 1508046 553631 1162657 1765780 240453 -2068712 -2084075 133831 1459013 463336
40139 463336 -910871 -870906 -293804 -677022 -1509210 -1041237 1242287 3911515 5143026
40130 5143026 4723996 4456924 6051508 8561792 9164955 7042611 4825509 4960632 6361886
40121 6361886 6448504 4845381 2708831 -137503 -4315072 -7906019 -7729824 -3843085 18192
40112 18192 914274 -734802 -3120635 -4810439 -4205889 -371484 4442313 5859355 2543308
40103 2543308 -1893718 -3636224 -3160217 -3237957 -4467787 -5072760 -3907693 -1477357 1345603
40094 1345603 3704076 4231818 1884406 -2522935 -6616589 -8441038 -7706917 -5411952
40086e411952K627067K359329K219395K067222J115636n06716j409564q53934
40078B206483K12097Q69040J423778J839296R57511j129167k087659q08274L47578
40069C830683p44080k391539k314870j913725l226121l912551n26484M530984
40061f667703N272419J267812j489416K28569K827338K878328K180838K708364
40053I206549J967613k120038n842097m323847R38941L909138J976201j890735
40045C821725l974076l311058j031236R06647Q71920m16982k13131J990394K674519
40036A318722m15304l592117j903754L090433M923973J229902l417267m184013
40028b949425j386113J855857L672211L545981J375075j687291l514398l449447
$$ plain form
40086 -5411952 -2784885 -425556 1793839 3861061 4976697 4469981 3060417 2206483
40078 2206483 2418580 3287620 4711398 6550694 7508205 6379038 4291379 3483105 3830683
40069 3830683 3086603 695064 -1619806 -3533531 -6759652 -10672203 -11198687 -6667703
40061 -6667703 -1395284 -127472 -1616888 -1388319 1439019 4317347 6498185 9206549
40053 9206549 11174162 9054124 3212027 -1111820 -172879 3736259 5712460 3821725
40045 3821725 -152351 -3463409 -4494645 -3587998 -2716078 -3133060 -3346191 -1355797 1318722
40036 1318722 903418 -2688699 -4592453 -1502020 3421953 4651855 1234588 -2949425
40028 -2949425 -4335538 -2479681 1192530 4738511 6113586 4426295 911897 -2537550
40020b537550k687679j644799N61836L182984L380200L89956k483990k157037
40012c996079J45114J323074R26359O50068R30891R42218R48476J703252K025947
40003E599320m1832l613933n307784l764479j323910l57365k93181M28364J550509
39994g124291J959294J914532K262634K360407R47113j267179k056686j000134
39986b004310l31848j539484k756092j171028K755575N338269M115878P93071
39978E200031j061571l22270Q75769L84438j186474j608001k32689J046334K49398
39969C344965k013264l007225r65571K760843M893539L454418l48417l435359
39961D683929l887210k492905j326800j239550j282872m78440P05853J149510
$$ plain form
40020 -2537550 -5225229 -6870028 -6308192 -3125208 254992 644948 -1839042 -3996079
40012 -3996079 -3850965 -2527891 -1601532 -951464 -20573 921645 1870121 3573373 5599320
40003 5599320 5557488 1943555 -3364229 -7128708 -8452618 -8809983 -9103164 -8674800 -7124291
39994 -7124291 -5164997 -3250465 -987831 1372576 2319689 1052510 -1004176 -2004310
39986 -2004310 -2336158 -3875642 -6631734 -7802762 -5047187 291082 4406960 5200031
39978 5200031 4138460 3816190 4691959 5076397 3889923 2281922 2049233 3095567 3344965
39969 3344965 1331701 -1675524 -2641095 119748 5013287 8467705 8119288 4683929
39961 4683929 796719 -1696186 -3022986 -4262536 -5545408 -6023848 -5317995 -4168485
39953d168485P36448L54509M27602L92256j24862l91364N93657K663047M324090
39944D806898L997691J399402j998211l883819l061486p41390O31092J22130p31926
39935E40381k03417J096314J025474q87829k256242n64233L409751N820514L703358
39926A1684071j749605o302508o808546l655089O04411L764243M688297L086704
39918E311978J10506j712897j007160L64250l14617k361016k302671Q20871L510453
39909B419697K598349l72619j667010n11373P12295L56584r04008j955285k479644
39900a803014k290118j219959J27718P78681N10915l29587j566221k640724k194908
39891a0627217K68043L028413M051033L484806K596380J233651j398558m162512
$$ plain form
39953 -4168485 -3432037 -3077528 -2649926 -2257670 -2382532 -2773896 -2180239 482808 4806898
39944 4806898 8804589 10203991 8205780 4321961 1260475 519085 1150177 1272307 540381
39935 540381 336964 1433278 2458752 1570923 -685319 -1249552 2160199 7980713 11684071
39926 11684071 9934466 3631958 -3176588 -6831677 -6227266 -2463023 2225274 5311978
39918 5311978 5422484 3709587 2702427 3066677 2752060 391044 -1911627 -1090756 2419697
39909 2419697 5018046 4645427 2978417 2467044 3179339 3535923 2631915 676630 -1803014
39900 -1803014 -4093132 -5313091 -5185373 -4406692 -3895777 -4225364 -5791585 -8432309 -10627217
39891 -10627217 -10359174 -7330761 -3279728 205078 2801458 4035109 2636551 -1525961
39883a525961m768561k961451o33499J033853K237365K703447J835642O25747
39875a453418O45965J074402l13054k947323l551565j155409J306331J601350
39867d792721J123535J533118J620744j20201k242222k226165k1853K344778L369844
39858E88857K745037R49540m73258J17413J989318K362714L00531j905070k353579
39849D321503j885198j367832K53311L006408M087154J908686p21307p14144M20106
39840I308687n37580k779621k827917n10766O35933j136633l436642l363446r38335
39831e586320J557069K047676N22106o76851N64826K683567J965732j412277k537623
39822h72095O88491L443576J404082j929423r14188K690450K776148p32893k274681
$$ plain form
39883 -1525961 -6294522 -9255973 -9889472 -8855619 -6618254 -3914807 -2079165 -1453418
39875 -1453418 -807453 266949 -46105 -2993428 -6544993 -7700402 -6394071 -4792721
39867 -4792721 -3669186 -2136068 -515324 -635525 -2877747 -5103912 -5125765 -2780987 588857
39858 588857 3333894 4283434 3810176 3927589 5916907 8279621 8580152 6675082 4321503
39849 4321503 2436305 1068473 1321784 4328192 8415346 10324032 9602725 8888581 9308687
39840 9308687 8771107 5991486 3163569 2652803 3288736 2152103 -1284539 -4647985 -5586320
39831 -5586320 -4029251 -1981575 -1459469 -2136320 -1571494 1112073 3077805 1665528 -872095
39822 -872095 -183604 3259972 4664054 2734631 1820443 4510893 7287041 6554148 4279467
39813D279467o23505l73800k778540l155069M00786L142882J693025p21996p78823
39804A084427o21045k500195l461658n83698L034961K939069K99571j016681j028654
39795a853903j833411k160209L25258L369422K883872J19264L0940K919500L743276
39786G544009L65376l168796l168501j232282m13575m57105M07615J802450K099157
39777C778348J195107J40235p76053j764287k300340j697341l73829N49770N50597
39768f97793q7189r10206j518676j436023k97545J681798L430417L471500J318476
39759D954759j444494k350216p59070J450976K284389J584523R9422j808401l415145
39750E96743l181331p06068K012511K944181K576343K326235J649881p77487l657424
$$ plain form
39813 4279467 3655962 3282162 503622 -2651447 -2250661 892221 2585246 1863250 1084427
39804 1084427 463382 -2036813 -5498471 -6082169 -3047208 -108139 191432 -825249 -1853903
39795 -1853903 -3687314 -5847523 -5522265 -2152843 731029 850293 881233 3800733 7544009
39786 7544009 7909385 4740589 1572088 339806 -73769 -530874 -123259 1679191 3778348
39777 3778348 4973455 5113690 4337637 2573350 273010 -1424331 -1798160 -1248390 -697793
39768 -697793 -784982 -1695188 -3213864 -4649887 -4947432 -3265634 164783 3636283 4954759
39759 4954759 3510265 1160049 400979 1851955 4136344 5720867 5820289 4011888 596743
39750 596743 -2584588 -3290656 -1278145 1666036 4242379 6568614 8218495 7441008 3783584
39741C783584l763432n11290K567820K075275j081894l057005j799337Q35435
39733i50844J735001L72338r05713m02462N57954P9736p61656N42828L186511
39724C453693L265507k35675l127613j893827J071219J164362j646395l265573
39716a214302j527869J559453L214329K695174Q85073o34382l14779J669696K972310
39707I304703J904972l35276j880994k891700l907934l687160j608121k7874o18210
39698c747594n64793L018900O788959M984657j273959m763136k673049m3308j102445
39689F24232l290965k741277l85237R92674J485434K129667J847146j2046j194149
39680e44521j40870Q74164k61803j329566M23489K903842K006991j928054m728130
$$ plain form
39741 3783584 20152 -491138 2076682 4151957 3070063 13058 -1786279 -950844
39733 -950844 784157 1156495 250782 -151680 406274 486010 -275646 267182 3453693
39724 3453693 6719200 6483525 3355912 1462085 2533304 3697666 2051271 -1214302
39716 -1214302 -2742171 -1182718 2031611 4726785 5611858 4977476 4662697 6332393 9304703
39707 9304703 11209675 10874399 8993405 6101705 2193771 -1493389 -3101510 -3129384 -3747594
39698 -3747594 -4312387 -1293487 5495472 10480129 9206170 4443034 1769985 1726677 624232
39689 624232 -2666733 -5408010 -5793247 -4800573 -3315139 -1185472 661674 649628 -544521
39680 -544521 -685391 188773 -73030 -1402596 -979107 1924735 3931726 2003672 -2724458
39671b724458m224793j720521J087902K911580J974719j636248l925115j612167
39663i869101K211093J893394j908169k803806J265229M475645J993170k794737
39655e537282l615694p2665L187855L570248K379285Q86473j052118k456448j230421
39646c940767K168302M067766K292822o07314q42235J386770K514237Q50708j399768
39637F490521j802069r59524o70697o64794N51795K475043K794553R28069r04520
39628H238377q47457J90103K24900j198974l011822l914102k924255r2687K554149
39619g81768K499488K20268o84409J683934M455854L757765k9856l152978l492575
39610D475723k144098o67980N83204J395714J231963K51620p23443j317440j386938
$$ plain form
39671 -2724458 -6949251 -8669772 -7581870 -4670290 -2695571 -4331819 -8256934 -9869101
39663 -9869101 -7658008 -5764614 -7672783 -10476589 -9211360 -4735715 -2742545 -5537282
39655 -5537282 -9152976 -9225641 -6037786 -2467538 -88253 798220 -253898 -2710346 -3940767
39646 -3940767 -1772465 2295301 4588123 3980809 3138574 4525344 7039581 7890289 6490521
39637 6490521 4688452 3728928 3058231 2393437 2945232 5420275 8214828 9142897 8238377
39628 8238377 7390920 7581023 7805923 6606949 3595127 -318975 -3243230 -3335917 -781768
39619 -781768 1717720 1937988 1253579 2937513 7393367 11151132 11121276 7968298 4475723
39610 4475723 2331625 1663645 2246849 3642563 4874526 5126146 4402703 3085263 1698325
39601A698325j69688K609052N078974M623658J121508k704075m246049l129434
39593D882271p33971R84551O40291j106706j722093J06097K440686K896608K128159
39584A0515893J998929J630503j160968n091690o167221l585044q76228k14464
39576b950290L48410K328674L535703J951149n09529j200958r62446j826966k840030
39567b126283j856289J18134K49458j285948j529436L16836J623614N61739j254800
39558e182975j316972O10019K711712L107150J192920j775505l379458k473514
39550f506623o25166J24415J11158P43663J211013o73319m327469o066008l801290
39541a9809626L06775K908206L018735J518518o02476k041495j324383J014988
$$ plain form
39601 1698325 1528637 4137689 9216663 13840321 14961829 12257754 8011705 4882271
39593 4882271 4148300 5132851 5773142 4666436 2944343 3050440 5491126 8387734 10515893
39584 10515893 12514822 14145325 12984357 7892667 1725446 -1859598 -2735826 -2950290
39576 -2950290 -2601880 -273206 3262497 5213646 4704117 3503159 2540713 713747 -2126283
39567 -2126283 -3982572 -3864438 -3614980 -4900928 -6430364 -6113528 -4489914 -3928175 -5182975
39558 -5182975 -6499947 -5889928 -3178216 -71066 1121854 -653651 -4033109 -6506623
39550 -6506623 -7131789 -7007374 -6896216 -6152553 -4941540 -5614859 -9942328 -16008336 -19809626
39541 -19809626 -19502851 -16594645 -13575910 -12057392 -12659868 -14701363 -16025746 -15010758
39533a5010758K089497M11715j514030m86631K761976M650985L659440J606769
39525a831037L51502k01005n29978l21818L55047N66789O5651k28058l7706l75934
39515b186547j421524j462939N67640K878947K931159Q74279r34281j219318o59142
39506f31726J68693J496301K772371K554210Q81358j03691Q01676J723535K76100
39497I938827k802398m469671l327066q89346R44814J774507J722227M95693j518065
39488A869522k596127j544109M29939R86383m27367j958068j605987P21591L414124
39479g10099M635576L503046N91606k319080l483489k647139j143045l90000n63479
39470b526103q95726q17880k79297Q07720K596677M423391M566071J857988k347643
$$ plain form
39533 -15010758 -12921261 -12509546 -14023576 -14510207 -11748231 -7097246 -3437806 -1831037
39525 -1831037 -1479535 -1680540 -2210518 -2532336 -2177289 -1610500 -1544849 -1772907 -1810613 -2186547
39515 -2186547 -3608071 -5071010 -4503370 -1624423 1306736 2181015 1246734 27416 -631726
39506 -631726 -463033 1033268 3805639 6359849 7241207 7137516 7939192 9662727 9938827
39497 9938827 7136429 2666758 -660308 -1549654 -604840 1169667 2891894 3387587 1869522
39488 1869522 -726605 -2270714 -1840775 -854392 -1281759 -3239827 -4845814 -4124223 -710099
39479 -710099 3925477 7428523 8020129 5701049 2217560 -429579 -1572624 -1962624 -2526103
39470 -2526103 -3421829 -4239709 -4519006 -3711286 -1114609 3308782 7874853 9732841 7385198
39461G385198m695827l061484R87459L654445K864658J63507j411245o25468J207704
39452F468947K158585J565340J53230r68210j206437q08984n10343o58174p05370
39443E488584N4796J234536J449171P8988j546709j470694M43834K144755J805849
39434I683110L0081j002813l36966O49046J95392j495788k650508k424980j982589
39425F63985k559523l264031k025068J277252M000353L893493K005459R79333
39417D971253J083474J53304k164601k745018N14081M488345M236128m5620l006884
39408G484462j717892L55417r57194l975751l863009j29684K816517K488084J439433
39399C940383K258633L203488J499046j648706k718687j211855J34857J18855
$$ plain form
39461 7385198 2689371 -372113 615346 4269791 7134449 7297956 5886711 5261243 6468947
39452 6468947 8627532 10192872 10346102 9377892 8171455 7362471 6852128 6193954 5488584
39443 5488584 5543380 6777916 8227087 8306075 6759366 5288672 5732506 7877261 9683110
39434 9683110 9713191 8710378 8373412 9022458 9217850 7722062 5071554 2646574 663985
39425 663985 -1895538 -5159569 -7184637 -5907385 -1907032 1986461 3991920 4971253
39417 4971253 6054727 6208031 4043430 1298412 1812493 6300838 10536966 10491346 7484462
39408 7484462 5766570 6121987 5164793 1189042 -2673967 -2803651 12866 2500950 3940383
39399 3940383 6199016 9402504 10901550 9252844 6534157 5322302 5457159 5576014
39391E576014O04622K560431L658133J640946j984890l762120k637511n76424
39383E079201M07312o3248j552677l340570m115027k969091r92494j92487m82621
39374h221702L64575L037126N002908L919436R65089j094468j685539j965530
39366C21895j767161J5944K343943K589064P71675R0905J820560K626063o18594
39357H194294n531117o833015l248879J234314K829265J838727N08554m88203
39349a496060j864779l378259l417635r50485K874674N407262M923275K356959
39341D454952J16425q88562j923501l575118l907002j265729K296223L027967
39333a664345O03769j540541j334348n60383j023231j229550O67903K854278K157065
$$ plain form
39391 5576014 6180636 8741067 12399200 14040146 12055256 8293136 5655625 5079201
39383 5079201 5486513 5423265 3870588 530018 -3585009 -6554100 -7546594 -7739081 -8221702
39374 -8221702 -7857127 -4820001 182907 4102343 5067432 3972964 2287425 321895
39366 321895 -1445266 -1429322 914621 3503685 4275360 4366265 6186825 8812888 8194294
39357 8194294 2663177 -4169838 -7418717 -6184403 -3355138 -1516411 -1007857 -1496060
39349 -1496060 -3360839 -6739098 -10156733 -11107218 -8232544 -2825282 2097993 4454952
39341 4454952 4571377 3682815 1759314 -1815804 -5722806 -6988535 -4692312 -1664345
39333 -1664345 -1060576 -2601117 -3935465 -4495848 -5519079 -6748629 -6080726 -3226448 -1069383
39324a069383n73775j071480J872913L971924J399122l329474m453599r02765
39316d156517K343394J444603j050012m94596K599317L331752k7716l320146k702085
39307b032006l9147O05498p65283r86059N55227J195304j98953j623611j794480
39298e083510j925805k355999r84337K715092N201880L398832m10567j446704
39290h91118J069252L423512K808670K80559j666007j970768j097718j51639k41004
39281A563739j355028j972976j036102L26623O12619M84947J273680J977184Q41824
39272B716510o69153O05370L713802L738942n92588l869726j650186K648403K797607
39263I438981j103280l740154l279751l043765m391297m018100l60910K712962
$$ plain form
39324 -1069383 -1643158 -2714638 -841725 3130199 4529321 1199847 -3253752 -4156517
39316 -4156517 -1813123 -368520 -1418532 -1913128 686189 4017941 3990225 670079 -2032006
39307 -2032006 -2071153 -1465655 -2230938 -3216997 -2661770 -1466466 -1665419 -3289030 -5083510
39298 -5083510 -7009315 -9365314 -10349651 -7634559 -2432679 966153 555586 -891118
39290 -891118 178134 3601646 6410316 6690875 5024868 3054100 1956382 1804743 1563739
39281 1563739 208711 -1764265 -2800367 -2473744 -1861125 -1376178 -102498 1874686 2716510
39272 2716510 2047357 2652727 6366529 10105471 9512883 5643157 3992971 6641374 9438981
39263 9438981 8335701 4595547 1315796 -1727969 -6119266 -10137366 -10498276 -7785314
39255g785314K041790N91784K350209N239245M491938R36230k04542J769518J720457
39246A1151315k479243n857641m042552N4480J309924N9882k01570K83299j243575
39237i65681l506414k129850K586063M669411J099953l378927k838980K027487
39229b436938N745869N182328J869530j062760j622457K52962K520357K528483
39221A2977374J36046j896994j761588r25387j150223j594541j130761j140648
39213C513278k908188m169307j987840K109228L835005K483431J486510K453524
39205F815641K872670R43794j224183j416161j123965k649126m523846l195279
39197c500455J321392M451520K520364k456820m724590j306802M341859O019742
$$ plain form
39255 -7785314 -5743524 -5151740 -2801531 2437714 6929652 7865882 7661340 9430858 11151315
39246 11151315 8672072 2814431 -1228121 -1173641 136283 196165 -5405 277894 -965681
39237 -965681 -4472095 -6601945 -4015882 653529 1753482 -1625445 -4464425 -2436938
39229 -2436938 3308931 8491259 10360789 9298029 7675572 7928534 10448891 12977374
39221 12977374 13113420 11216426 9454838 8529451 7379228 5784687 4653926 3513278
39213 3513278 605090 -3564217 -5552057 -3442829 392176 2875607 4362117 6815641
39205 6815641 9688311 10632105 9407922 7991761 6867796 4218670 -305176 -3500455
39197 -3500455 -2179063 2272457 4792821 2336001 -2388589 -3695391 646468 6666210
39189F666210J982640k922403l185251P58950L693104K421086j044143k882533
39181E487660j576539J648800M179874L438721o54964m214165l114301J103174
39173F298260K323832j690990n600884l988263P89298K396102r8699j770027j50123
39164a491494J443099J94674j397467M9093K958286L220797P14824o00774J122529
39155F213567L026395K213542O344o16352J51728l74550k476987l031132l49706
39146D762849K662294K339390n14415k085593j479571j751383m336051n871254
39138f273734k938776K328712M629505K602259K05199O76270K286083J668761
39130E184279j032359k799305k277043r80176j14800J173820L381411M486477
$$ plain form
39189 6666210 8648850 5726447 2541196 3300146 6993250 9414336 8370193 5487660
39181 5487660 3911121 5559921 9739795 13178516 12523552 8309387 5195086 6298260
39173 6298260 8622092 6931102 1330218 -2658045 -1868747 527355 428656 -1341371 -1491494
39164 -1491494 -48395 146279 -1251188 -1202095 1756191 4976988 5691812 5091038 6213567
39155 6213567 9239962 11453504 11459848 10843496 10995224 10620674 8143687 5112555 4762849
39146 4762849 7425143 9764533 9250118 7164525 5684954 3933571 -402480 -6273734
39138 -6273734 -9212510 -6883798 -2254293 347966 553165 1229435 3515518 5184279
39130 5184279 4151920 1352615 -924428 -1904604 -2019404 -845584 2535827 7022304
39122G022304K092483l024718p173011p444235m013910R42818N110016O729097
39114B40844N244765K242411N56067J266408K311091J162810j727999l425332
39106G871065k218948L47513J386155j16671k286106k379509J25458K580559J954787
39097G264303j423639m062627l616125j505165l21761k84970K6424P59560Q82632
39088b281368N30248R30028K099140K655987J982670P68067n33184j881759k391192
39079A878637j045274J147244J897949Q96052J48870O27583Q95592j79012j622835
39070D644806k212778j962673q24919J681011M279245L975048K66957k875832
39062F970865j680427K335181M375299K385670j279728l445610l071412r51677
$$ plain form
39122 7022304 9114787 6090069 -1082942 -8527177 -12541087 -11598269 -6488253 240844
39114 240844 5485609 7728020 8284087 9550495 11861586 13024396 11296397 7871065
39106 7871065 5652117 5999630 7385785 7269114 4983008 2603499 2728957 5309516 7264303
39097 7264303 5840664 1778037 -1838088 -3343253 -3665014 -3949984 -3923560 -3164000 -2281368
39088 -2281368 -1751120 -821092 1278048 3934035 5916705 6684772 6151588 4269829 1878637
39079 1878637 833363 1980607 3878556 4774608 4923478 5551061 6446653 6267641 4644806
39070 4644806 2432028 469355 -355564 1325447 5604692 9579740 9846697 6970865
39062 6970865 5290438 7625619 12000918 14386588 13106860 9661250 6589838 5638161
39054E638161J429938K547147J816856K80470m54781P7458R92500J169795K76495
39045A3774039p62260l57048J663053K859386Q68391k843291m401282l021051
39037G779937j983706l084858l664369j338182J671539K055731N44627n9796K19132
39028B140055m30355j272743k1802K559602L216406J321335l10006m4314N27668
39019G685846k13595j637204k523853k584488j782185k52327Q72899N77248j44691
39010b350N07060K354929L648555L537954K050422j047201m621453n165650j219372
39001D2894K742808J515256k843351l701240p5027K219819L83810j278515N38800
38992d54746K494608Q32347k310611l258263k698364k459570p45073L865589P131833
$$ plain form
39054 5638161 7068099 9615246 11432102 11712572 11257791 11335249 12327749 13497544 13774039
39045 13774039 13011779 12654731 14317784 17177170 18045561 15202270 10800988 7779937
39037 7779937 5796231 2711373 -952996 -2291178 -619639 1436092 1980719 1920923 2140055
39028 2140055 1709700 436957 415155 2974757 6191163 7512498 7202492 7158178 7685846
39019 7685846 7472251 5835047 3311194 726706 -1055479 -1307806 -434907 142341 -2350
39010 -2350 504710 2859639 6508194 10046148 12096570 11049369 6427916 1262266 42894
39001 42894 2785702 4300958 1457607 -2243633 -2318660 -98841 284969 -993546 -454746
38992 -454746 2039862 2872209 561598 -2696665 -5395029 -7854599 -8599672 -4734083 2397750
38983B397750M080245k773163o034314l274257J037208K815495K408209J310011
38975A967184l21262j943555k179618j035761J72952J258525K814724L858099
38967D591288K986796J461150J579329K283436M21225l419077m753938k010771
38959C139438P20077k87546l202150l951987j881491O70258K379224L650099M415317
38950E651239L774562J694928m99440j437680r18292j26304p60677l154121n228579
38941a004364m465922j073942K061378K821560J999207J700166K744497L949451
38933H732031L210515m46619n015182o603057l866277k15684N13544o90966q6600
38924d468295K596015L994600K956059J999282K175080J181131j628694k999479
$$ plain form
38983 2397750 6477995 3704832 -2329482 -5603739 -4566531 -1751036 657173 1967184
38975 1967184 1645922 -297633 -2477251 -3513012 -3340060 -2081535 733189 4591288
38967 4591288 7578084 9039234 10618563 12901999 13323224 9904147 5150209 3139438
38959 3139438 3859515 3571969 369819 -3582168 -5463659 -4793401 -2414177 1235922 5651239
38950 5651239 9425801 11120729 10621289 9183609 8265317 8139013 7378336 4224215 -1004364
38941 -1004364 -5470286 -6544228 -4482850 -1661290 337917 2038083 4782580 8732031
38933 8732031 11942546 11495927 6480745 -122312 -3988589 -4204273 -3690729 -4381695 -4468295
38924 -4468295 -1872280 2122320 5078379 7077661 9252741 10433872 8805178 5805699
38916E805699j295252K0091j960704m244618k757687M82209L27860l030938m100713
38907a0754053l59926M498944O275313M873161K071448j358365m455211n156402
38899d365091k875751J5100J121840Q55741Q56946J204829R12018R3560k2311
38890b203119J188933L038081M159482L383469O88546k269517l393554k342579
38882B249742p02531K25261O23929P76682j8539k093464m006322l786985j265455
38873g997682J644111K801582J643566m38459j271792N943J880381K141665O07812
38864A017127q37289r43258l85998L4882P66060J980924K218954K48329k588034
38855A511697l701210k612848j303273j157683j186745Q3911K150517L040730
$$ plain form
38916 5805699 4510447 4530538 2569834 -1674784 -4432471 -3950262 -3622402 -6653340 -10754053
38907 -10754053 -11113979 -6615035 -339722 4533439 6604887 5246522 791311 -4365091
38899 -4365091 -7240842 -7225742 -6103902 -5248161 -4391215 -3186386 -2274368 -2180808 -2203119
38890 -2203119 -1014186 2023895 6183377 9566846 10255392 7985875 4592321 2249742
38882 2249742 1547211 1772472 2396401 3173083 3154544 1061080 -2945242 -6732227 -7997682
38873 -7997682 -6353571 -3551989 -1908423 -2346882 -3618674 -3612731 -1732350 409315 1017127
38864 1017127 179838 -763420 -1149418 -1114536 -348476 1632448 3851402 4099731 1511697
38855 1511697 -2189513 -4802361 -6105634 -7263317 -8450062 -8366151 -6215634 -3174904
38847c174904J932622L05035P5995R95208P39127j901504m624627l741784J125423
38838h269409N840370O125891K244842j706828k488322m70033J888630K810549
38830E975690K098005M10172j394468k377076j742809M25969K582256K586495
38822H564234K2009k685208k658262j26837J792930J223359k14360j39699J260873
38813G039039K110171J670845N28466r51456k365881k379202l39214J813736J660925
38804H787429o4862o18104J82566k77463k533594l458577j207543J430863J182577
38795C423292p24584r07140N69746O70678j096214j507362J201794M200328L920937
38786I751475Q79622j594496k166261k464638l430604l371471r92833J515820
$$ plain form
38847 -3174904 -1242282 -937247 -861252 133956 873083 -1028421 -5653048 -9394832 -8269409
38838 -8269409 -2429039 3696852 5941694 4234866 1746544 1276511 3165141 5975690
38830 5975690 8073695 8483867 7089399 4712323 2969514 3395483 5977739 8564234
38822 8564234 8586243 5901035 3242773 3115936 4908866 6132225 5917865 5778166 7039039
38813 7039039 9149210 10820055 11348521 10397065 8031184 5651982 5312768 7126504 8787429
38804 8787429 8722567 8104463 8287029 8009566 5475972 2017395 809852 2240715 3423292
38795 3423292 2698708 1791568 2361314 3031992 1935778 428416 1630210 5830538 9751475
38786 9751475 10631097 9036601 6870340 4405702 975098 -2396373 -3389206 -1873386
38778a873386Q93012k191951l359025n95120K566443K025442r09975j715093M35581
38769d724072J889272O54549q09007j73876J158168J132852M86839N48665L82084
38760E45474r77748j849109n99430J124807J183995Q70624K251178L503203J442745
38751G495739k521275l860223j823326J37648P00318J957533L752368K639442
38743H478224j593631m032116k144933O8021r30861k158058J42878L141765J943169
38734B914458j556693j215783L221691N477461K636762p82642n56964J072156
38726A1210446J43014k384098k733978n21483J106641M72425q10910q94288l2237
38717E555532N35933K97503m79936j236705j171169K98823K499584L507924K016097
$$ plain form
38778 -1873386 -980374 -3172325 -6531350 -7126470 -4560027 -2534585 -3444560 -5159653 -4724072
38769 -4724072 -2834800 -2180251 -2989258 -3163134 -2004966 -872114 -385275 163390 545474
38760 545474 -432274 -2281383 -2880813 -1756006 -572011 298613 2549791 6052994 7495739
38751 7495739 4974464 1114241 -709085 -571437 128881 2086414 5838782 8478224
38743 8478224 6884593 2852477 707544 775565 -155296 -2313354 -2170476 971289 2914458
38734 2914458 1357765 141982 3363673 8841134 11477896 10695254 10138290 11210446
38726 11210446 11353460 8969362 6235384 5713901 6820542 7292967 6482057 5587769 5555532
38717 5555532 6091465 6388968 5909032 4672327 3501158 3799981 6299565 9807489 11823586
38708A1823586q56565k368177j159572J089859J634840j75137k614852l997892
38700C376090l902072k146522J294435M558715M340005K0873m108988l203238
38692B29298K092283O184488N131401O72230k755899l198405k291853k194529
38684C869014k735454j946635R03128L599160L275481K33734k103468j609172
38676C485788p8223k04709j603416j783110L1779K198649L157902K665415J062205
38667H932280o81915o76380J916060M772302M479326Q14411l064288m739284m627211
38658G125301l741264j920148O91809K519225K405437J295930Q31616J177562
38650A0385468J252710M40202p42755j320920q47689K23l1522j132165j830242
$$ plain form
38708 11823586 10967021 8598844 7439272 8529131 10163971 9988834 7373982 3376090
38700 3376090 -525982 -2672504 -1378069 3180646 7520651 7541524 3432536 229298
38692 229298 2321581 8506069 13637470 14309700 11553801 8355396 6063543 3869014
38684 3869014 1133560 -813075 90053 3689213 6964694 7198428 5094960 3485788
38676 3485788 3407565 3202856 1599440 -183670 -151891 2046758 5204660 7870075 8932280
38667 8932280 8250365 7573985 9490045 14262347 18741673 19556084 16491796 11752512 7125301
38658 7125301 3384037 1463889 2155698 4674923 7080360 8376290 9207906 10385468
38650 10385468 11638178 12078380 11335625 10014705 9167016 9167239 9135717 8003552 6173310
38641F173310r03535P44428J316036O02063k27691p06628j159585j122058L07014
38632E023354K541467L794529L423142K403311J561248R70895Q67047J331621
38624B1916614J304187j94740k144930k816137k546031l015187m220088m624496
38616C659192l887131k860867j483208M60451J322002j87019j653317k2891K831268
38607a821520K741621R20603K500790O743177O330427p76279o390133l849762
38599F398924J987572K837744m59057j071470K017200L657005K171276J328050
38591A8867244K795440L638496K114271N6218j372154k944799l663646j197796
38583A8293274K876296L670389M82203j487056Q38678L583393K211246j498957
$$ plain form
38641 6173310 5269775 6014203 7330239 7932302 7704611 6997983 5838398 4716340 5023354
38632 5023354 7564821 11359350 14782492 17185803 18747051 19717946 20584993 21916614
38624 21916614 23220801 23026061 20881131 18064994 15518963 12503776 8283688 3659192
38616 3659192 -227939 -3088806 -4572014 -4111563 -2789561 -2976580 -4629897 -4652788 -1821520
38607 -1821520 920101 1840704 4341494 11084671 17415098 16638819 10248686 6398924
38599 6398924 8386496 11224240 10765183 9693713 11710913 15367918 17539194 18867244
38591 18867244 21662684 25301180 27415451 27471669 26099515 23154716 19491070 18293274
38583 18293274 21169570 24839959 25322162 23835106 24673784 28257177 30468423 28969466
38575B8969466k529153J56116L111518L456146J424746j091876k308273j545172
38567B9643518J34981J095807J526310L119845N777162O801492M593722J203868
38559E3896705k49232Q13834K616773L431578K796325J581575J408832K635420
38551F8931810K985215M09681k770926j891454L081196O362716M144208N492n28646
38542H0729292K088474K955593M61327j924934j467205J49727J09788j296208
38534H1805854j507624N05080K811838K762030l0788l186529m069423k551798
38526G6538640q17121o67986j910165l286934l798473k935013r15074R41654J325051
38517F4474579P24893P57541J502362J276669m46717j914314j835829j294336
$$ plain form
38575 28969466 26440313 26596429 29707947 33164093 34588839 33496963 31188690 29643518
38567 29643518 29778499 30874306 32400616 35520461 41297623 48099115 52692837 53896705
38559 53896705 53647473 54461307 57078080 60509658 63305983 64887558 66296390 68931810
38551 68931810 71917025 72326706 69555780 67664326 70745522 77108238 81252446 81257938 80729292
38542 80729292 82817766 85773359 86234686 84309752 82842547 82992274 83102062 81805854
38534 81805854 80298230 80803310 83615148 86377178 86346390 83159861 79090438 76538640
38526 76538640 75721519 75053533 73143368 69856434 66057961 63122948 62207874 63149528 64474579
38517 64474579 65199472 65957013 67459375 68736044 68289327 66375013 64539184 63244848
38509F3244848j582777j896786q53113J027880K060750J696382O70720l01405
38501F4066499p54226k85629O64618P04006p22080k216709k067256k01277K172579
38492F1360525L781696L526855J035209k006158k591245K04814L735540M781412
38484G3828648K845937l31499k861790l277361j012257K170835L061851R59655
38476G5384019j015806j99956K025334K812813J852360M79962r78875k104937
38468G8254914p42658L971160Q466159Q517095N254213L478570M560532N272516
38460A17032501L796208K440689L228639M783005N524407O649625R474555J2219760
38452A65149389J2117904R475341P482570Q528436J2041981J5517390J6828805
$$ plain form
38509 63244848 61662071 59765285 58912172 59940052 62000802 63697184 64367904 64066499
38501 64066499 63312273 63026644 63691262 64395268 63673188 61456479 59389223 59187946 61360525
38492 61360525 65142221 68669076 69704285 67698127 65106882 65311696 69047236 73828648
38484 73828648 76674585 76343086 73481296 70203935 69191678 71362513 74424364 75384019
38476 75384019 74368213 74168257 76193591 79006404 80858764 81338726 80359851 78254914
38468 78254914 77512256 81483416 89949575 98466670 103720883 107199453 111759985 117032501
38460 117032501 120828709 123269398 126498037 131281042 136805449 143455074 152929629 165149389
38452 165149389 177267293 186742634 194225204 202753640 214795621 230313011 247141816
38445B47141816J5993310J5063816J5770185J7362946J7667923J5906601J3133285
38438C58039882J0298249P717500O286331P020253R032288R973840Q981297P361656
38430D24711296O062621M600542K988683K385888K923235L056214K083755J175103
38422D49987337Q34178l39475k975685n351541o207120o852432q350817q876400
38414D11868045o720139m131138m647558p404434p782734m038442J5248J14886
38406C77273734l262075o454861p428301o966833o167431n036703l625300k695875
38398C35636355k456617j815669k883J782267J729875J77486o66745r8436q2856
38389C34202777j822877k982261n83392M311456P404107O445488L298640O96629
$$ plain form
38445 247141816 263135126 278198942 293969127 311332073 328999996 344906597 358039882
38438 358039882 368338131 376055631 382341962 389362215 398394503 408368343 417349640 424711296
38430 424711296 430773917 435374459 438363142 440749030 443672265 446728479 448812234 449987337
38422 449987337 450821515 450482040 447506355 442154814 435947694 429095262 420744445 411868045
38414 411868045 405147906 401016768 396369210 388964776 381182042 377143600 377158848 377273734
38406 377273734 374011659 367556798 360128497 353161664 346994233 341957530 338332230 335636355
38398 335636355 333179738 331364069 331361186 333143453 334873328 335050814 334384069 334285633 334202777
38389 334202777 332379900 329397639 328814247 333125703 340529810 346975298 350273938 350970567
38381C50970567m69432k71471R39488J311893j470594o163124p712709l596038
38373C33538580J775717K132017k577172o631929o519885m824059n516587q596151
38365C02780531j1144280j1614414j0948073j0324411r675112q495229o965359
38358B33613653n775703n212859m842891m206043l590385l731264m777489o051516
38350A95425503o894284p176563o964841o507347o582488p636938q309578o484699
38342A38868765k713920q01772l281338p658761r277780p045873l997409k686307
38334A01405605k677444k777760l022737l404418k885747j268775m65346k157498
38326H2745880n137254o584626n413343k890895l96036J747535L111505K560560
$$ plain form
38381 350970567 350501135 350229664 351169152 352481045 351010451 344847327 337134618 333538580
38373 333538580 335314297 337446314 334869142 328237213 321717328 316893269 311376682 302780531
38365 302780531 291636251 280021837 269073764 258749353 249074241 240579012 233613653
38358 233613653 227837950 222625091 217782200 213576157 209985772 206254508 201477019 195425503
38350 195425503 188531219 181354656 174389815 167882468 161299980 153663042 145353464 138868765
38342 138868765 136154845 135353073 132071735 124412974 115135194 108089321 104091912 101405605
38334 101405605 98728161 95950401 92927664 89523246 86637499 85368724 84903378 82745880
38326 82745880 77608626 71024000 65610657 62719762 62323726 64071261 67182766 69743326
38318F9743326j76531l243132m224610k867929j187024o19224k06486J451508
38310E8669898L315650K757908o04657l780421m045967k194542p73971m35831
38302E2908067k8087N23285j12034k069342l599182l511857k466263j303454k1066
38293D0320067R03231L10996j324748j506030O24927K113499l0592m299533o543629
38284C0568188n454019l396106k245509j481757o64400o69812j405652j046781
38276A4204152R07775K172966J109764m53799k45J835357K683201K272990K004208
38267B6736369J671381j24453k554330k968457j272638o00464k347415l619988
38259A4920005j680694J686151K981841K236203K153693K992734J963488j801151
$$ plain form
38318 69743326 69566795 66323663 62099053 59231124 58044100 57424876 57218390 58669898
38310 58669898 61985548 64743456 64138799 60358378 56312411 54117869 53343898 52908067
38302 52908067 52879980 53403265 53291231 51221889 47622707 44110850 41644587 40341133 40320067
38293 40320067 41223298 41534294 40209546 38703516 39328443 41441942 41411350 37111817 30568188
38284 30568188 25114169 21718063 19472554 17990797 17326397 16656585 15250933 14204152
38276 14204152 15111927 17284893 18394657 17940858 17940613 19775970 22459171 24732161 26736369
38267 26736369 28407750 28283297 25728967 22760510 21487872 20887408 18539993 14920005
38259 14920005 13239311 14925462 17907303 20143506 22297199 25289933 27253421 25452270
38251B5452270m886481l895902j09207K196996J162234q97763j092127M61269
38243A8391289J563157J319321R30231J118607O65359j250381k718903j343372
38235A8675308J748060K815861P82232j200137o09728P90033K47048j380150j183073
38226B0685454J123671L106940L410178K871315K381639K218674K949112M383215
38218D3130198M414906J947842O8424K347938O409957O069303O39411l156083
38210F1871896p50585L783465M293027J285190m60598J77148M36091l47810R2103
38201G0379927K105889L176180K303433J347805J231675M18082j741936l400699
38193G5820356l346239k929795l297746l163264j175944J381920K153755P39496
$$ plain form
38251 25452270 20565789 16669887 16560680 18757676 19919910 19022147 17930020 18391289
38243 18391289 19954446 21273767 22203998 23322605 23987964 22737583 20018680 18675308
38235 18675308 20423368 23239229 24021461 22821324 22211596 23001629 23248677 21868527 20685454
38226 20685454 21809125 24916065 28326243 31197558 33579197 35797871 38746983 43130198
38218 43130198 47545104 49492946 49561370 51909308 58319265 64388568 65027979 61871896
38210 61871896 61121311 64904776 69197803 70482993 70022395 70199543 70635634 70287824 70379927
38201 70379927 72485816 75661996 77965429 79313234 80544909 80962991 79221055 75820356
38193 75820356 72474117 69544322 66246576 63083312 61907368 63289288 65443043 66182539
38185F6182539j308407k556247k650875k099760j877923k373505k436408q74962
38177E0004452R45663K30172k732669l839467p66135L165281L441579P78544m72497
38168E0754923O24110M13893k774890n042714k444515K721830M609595J559759
38160E0421991k383030l613670l091225l088791k992604j047042J607820K028285
38152C7841734J33286j016045j35075K26662j928589m320412l542917j95474J980157
38143B9043327J262219n10317j314427j167743o52625K68832J089859N21229j399525
38134B7140829k637339j829187j73266O22924Q27947J448829J709927o538l057456
38125B4046670m602482l266455j013081m28063j369294j578419J8615K011872
$$ plain form
38185 66182539 64874132 62317885 59667010 57567250 55689327 53315822 50879414 50004452
38177 50004452 50950115 51180287 48447618 44608151 43842016 47007297 50448876 51227420 50754923
38168 50754923 51379033 51792926 49018036 43975322 41530807 44252637 48862232 50421991
38160 50421991 48038961 44425291 41334066 38245275 35252671 34205629 35813449 37841734
38152 37841734 37975020 36958975 36823900 37050562 35121973 30801561 27258644 27063170 29043327
38143 29043327 30305546 29795229 28480802 27313059 26660434 26929266 28019125 28540354 27140829
38134 27140829 24503490 22674303 22501037 23123961 23951908 25400737 27110664 27104126 24046670
38125 24046670 19444188 16177733 15164652 14736589 13367295 11788876 11807491 13819363
38117A3819363K539525J458506r129r71939j425794j528849j170421k64847J057689
38108A3504104K468207L225467K380545J2691k164533k620567k130504k517855
38100A2157555l405412k407418Q10581L027313J551716k084387m389030m260470
38092A000448k965721j266299P67364J977666J021874j141391k120716j318275
38084d045050l5845J230991K927179M126020L205415J080620M91524J383593M64403
38075A0828850l298176o181870m827432q93270J878075K609833K449713J162695
38067C728418j801182m218737k948893J224242L801553K151068j499454l261282
38059b824267j919727N94042J771588J007423J21038J303104M141829N623789
$$ plain form
38117 13819363 16358888 17817394 17808265 16836326 15410532 13881683 12711262 12446415 13504104
38108 13504104 15972311 19197778 21578323 21591014 19426481 16805914 14675410 12157555
38100 12157555 8752143 6344725 7155306 10182619 11734335 9649948 5260918 1000448
38092 1000448 -1965273 -3231572 -2464208 -486542 535332 -606059 -2726775 -4045050
38084 -4045050 -4080895 -2849904 77275 4203295 7408710 8489330 8980854 10364447 10828850
38075 10828850 7530674 1348804 -3478628 -4371898 -2493823 116010 2565723 3728418
38067 3728418 1927236 -2291501 -5240394 -4016152 -214599 1936469 437015 -2824267
38059 -2824267 -4743994 -4149952 -2378364 -1370941 -1249903 53201 4195030 9818819
38051I818819L936180R38405n56908n00895n89635r06658l32060M74399l83736
38042A1897911k517603l273495j787949k43682k41412n80536R4435Q61593M11732
38033D620994n57249o53071m2563L47922O91235J558613K225638J401143p63117
38024H829545k708324l208497k183916l57615J036445R27853k86082q68168l3137
38015A148104Q85369N66235k74876m60353o37121j893535l041066j875292J089028
38006d493507K781084J793139m1675q80073j088913j154667m7966K429115L966899
37997C263436K939254J469353K270595L707648J794428l028171n242762j810871
37989E362910L139713L738442k8588l296418l364269k137578j767889j458904
$$ plain form
38051 9818819 13754999 14693404 14136496 13635601 13045966 12139308 11807248 12281647 11897911
38042 11897911 9380308 6106813 4318864 4075182 3833770 3253234 3347669 4209262 4620994
38033 4620994 4063745 3410674 3368111 3716033 4407268 5965881 8191519 9592662 8829545
38024 8829545 6121221 2912724 728808 371193 1407638 2335491 2049409 1181241 1148104
38015 1148104 2033473 2599708 2324832 1864479 1227358 -666177 -3707243 -5582535 -4493507
38006 -4493507 -1712423 80716 39041 -841032 -1929945 -3084612 -3132578 -703463 3263436
37997 3263436 6202690 7672043 9942638 13650286 15444714 12416543 7173781 5362910
37989 5362910 8502623 12241065 12212477 8916059 5551790 3414212 1646323 187419
37981A87419J27477J941397K066094P54883l9984M30991J014488P40346N9683
37972G282794l89333r96477k246073l220204k220805R09313L922909M286341J846017
37963I174482j247362l047232l374434k872510j734451j40965R20416M68968j075348
37954b928436k262217k288591j505346l57641J254589L323699N072485N321970
37946E630512L507463N37438j380045n92606J838869K784605O96075k343742l345488
37937G333081k155156r22218q20220j377070k357609l708994l801498p18196L993493
37928d534387N750508K648837j571124k220659M04255J982298Q1759l027222l438012
37919c923747j78674L581927L733145j22114l734032l112272L28046J772543j85479
$$ plain form
37981 187419 314896 2256293 4322387 5077270 5037286 5468277 6482765 7223111 7282794
37972 7282794 6893461 5896984 3650911 430707 -1790098 -880785 3042124 7328465 9174482
37963 9174482 7927120 4879888 1505454 -1367056 -3101507 -3242472 -2322056 -1853088 -2928436
37954 -2928436 -5190653 -7479244 -8984590 -9342231 -8087642 -4763943 308542 5630512
37946 5630512 9137975 9675413 8295368 7702762 9541631 12326236 13022311 10678569 7333081
37937 7333081 5177925 4255707 3435487 2058417 -299192 -4008186 -7809684 -8527880 -4534387
37928 -4534387 1216121 3864958 2293834 73175 477430 2459728 2541487 -485735 -3923747
37919 -3923747 -4102421 -520494 3212651 3090537 -643495 -3755767 -3427721 -1655178 -1840657
37910a840657k027830j263331o0882q58274j890533l51656K628520L866868L108446
37901A310671K341155J603237m09183k377374j326620K368735M862479M174942
37893A2548042K079250J96838j941692l896708l274997L20274L391103K840366
37885A2262476j90155k714621l808465m020157l088729q04765J353865J852055
37877H41504J291964R54567L47957j565940l695133l829133j880065J44471J210638
37868f179170K121015L232604L492170K366211R42339K38582j21105n33637r5764
37859E463245J770548L203316J503539k869581n811585m290398k37823J981897
37851G13158J127744j84813p2827K43065l40716k13096J952038L816794K192428
$$ plain form
37910 -1840657 -3868487 -5131818 -5192700 -6050974 -7941507 -8293163 -5664643 -1797775 1310671
37901 1310671 3651826 5255063 4845880 2468506 1141886 3510621 8373100 12548042
37893 12548042 14627292 14824130 12882438 8985730 5710733 6031007 9422110 12262476
37885 12262476 12072321 9357700 5549235 1529078 -1559651 -2364416 -1010551 841504
37877 841504 2133468 3088035 3435992 1870052 -1825081 -5654214 -7534279 -7389808 -6179170
37868 -6179170 -4058155 -825551 2666619 5032830 5975169 6213751 6092646 5559009 5463245
37859 5463245 7233793 10437109 11940648 9071067 3259482 -1030916 -1268739 713158
37851 713158 1840902 1656089 1583262 1826327 1485611 1272515 3224553 7041347 9233775
37842I233775j890339m174424k848864j65994J492266J943826J250652j188261
37834C652637m406178n642788l914407j443775q1622J273410L893559O150097
37826e19067N586111K597262j47667j041366o00130q9151n37755k252921m124321
37817a129005m381067k952373j757192j789908j704843m29618R45750J507300
37809a1690956K482023M643745N864636M066729R64436k69368J28569o45989k943192
37800B600633m068717k799144j077274m59251P9200J489131K342281J032152j281241
37791b142230j810235K81259K694549K492361o16299l681401l545997m44100K375793
37782d396300K839760K221673K237030K073649L53902j692278j783013k29489
$$ plain form
37842 9233775 7343436 3169012 320148 154154 1646420 3590246 4840898 3652637
37834 3652637 -753541 -6396329 -10310736 -11754511 -11836133 -10562723 -6669164 -519067
37826 -519067 5067044 7664306 7516639 6475273 5875143 5785992 5248237 2995316 -1129005
37817 -1129005 -5510072 -8462445 -10219637 -12009545 -13714388 -14144006 -13198256 -11690956
37809 -11690956 -9208933 -4565188 1299448 5366177 6330613 6061245 6189814 5543825 2600633
37800 2600633 -1468084 -4267228 -5344502 -5803753 -5724553 -4235422 -1893141 -860989 -2142230
37791 -2142230 -3952465 -3671206 -976657 1515704 899405 -2781996 -6327993 -6772093 -4396300
37782 -4396300 -1556540 665133 2902163 4975812 5329714 3637436 1854423 1624934
37774A624934Q70196J244645K056946K525282P73343j823591j362379K339914
37766H249290M320802J459984k769710l546090j642699j277865l066291l646232
37758a918811j863843q42105k659480m484106k411115K792886O348356N240367
37750B02149J208120k093116k996920k102388k84144J807698K909528J926090
37742E77017n0947l89173J431252K550441P23687j931581j600938J559891L298387
37733F168036J164668k161092k786894q24949L44079r32742k520225j784285O04515
37724b728889J483879m42351k570560j784325J156572K691445J714006R05746
37716D25523J830436J920812j059976m265193l336681Q13031L111828J679321
$$ plain form
37774 1624934 2495130 3739775 5796721 8322003 9095346 7271755 5909376 8249290
37766 8249290 12570092 14030076 11260366 7714276 6071577 4793712 1727421 -1918811
37758 -1918811 -3782654 -4624759 -7284239 -11768345 -14179460 -11386574 -5038218 202149
37750 202149 1410269 -682847 -3679767 -5782155 -6066299 -4258601 -1349073 577017
37742 577017 526070 136897 1568149 4118590 4842277 2910696 1309758 2869649 6168036
37733 6168036 7332704 5171612 2384718 1559769 1903848 971106 -1549119 -3333404 -2728889
37724 -2728889 -1245010 -1687361 -4257921 -6042246 -4885674 -2194229 -480223 425523
37716 425523 2255959 4176771 3116795 -1148398 -4485079 -3672048 -560220 1119101
37708A119101l73194p10348p23660j524050j408477N58365K217046K043894J869389
37699C068066L197318L961742K040576p86032j752505j506632j983070k183440
37691D056023k82130J773796M70097l195335m467540j758868J474515K378945
37683D49503K169064K768031L604772L442429K545816J442069n3894j315798r36338
37674A4115654M59035J73910k214219l367284j193615J478520J123137r96751
37666I578387j198225M09173L73654j800512k260537J060341M642496M138617
37658A4943394M86326j646401l71289J371677L35245k868271n074576m503059
37650B673046k124654R7921J052343P72924k312l54264M7998N21561K63180l29336
$$ plain form
37708 1119101 745907 35559 -688101 -2212151 -3620628 -3062263 -845217 1198677 3068066
37699 3068066 6265384 10227126 12267702 11481670 9729165 8222533 6239463 4056023
37691 4056023 3773893 5547689 6017786 2822451 -1645089 -3403957 -1929442 449503
37683 449503 2618567 5386598 8991370 12433799 14979615 16421684 16367790 15051992 14115654
37674 14115654 14574689 14748599 12534380 9167096 7973481 9452001 10575138 9578387
37666 9578387 8380162 8789335 9162989 7362477 5101940 6162281 10804777 14943394
37658 14943394 15429720 13783319 13412030 14783707 15118952 12250681 7176105 2673046
37650 2673046 548392 646313 1698656 2471580 2469268 2115004 2163002 2684563 2947743 2618407
37640B618407n7389J150976J747645O83071q59964r26968M74762J277533j9409
37631F088664k551330m068438l077942j7133L040415L889037K168509r0179o21468
37622D760135L50287M84176j311839l002492j893516J531878L537862J447565
37614E904056k643836l639163O28768O222148P260539K976684j385044j431604
37606A3892548Q52958N15243l055205n414416l487018N65946K964430L030778
37598I865264K403059J606506l6349j983501k404417o42650J802424K912504J821672
37589A5344512q31547l157107l081295m69412K174244K504102J389800J410884
37581A5284181K607903K193593q68582l486130k326419J629083M467607M247507
$$ plain form
37640 2618407 2561018 3711994 5459639 6142710 5282746 4355778 4830540 6108073 6088664
37631 6088664 3537334 -531104 -3609046 -3626179 -585764 3303273 5471782 5381603 4760135
37622 4760135 5110422 5594598 4282759 1280267 -613249 918629 4456491 5904056
37614 5904056 3260220 -378943 249825 6471973 13732512 16709196 15324152 13892548
37606 13892548 14745506 15260749 12205544 6791128 3304110 3870056 6834486 9865264
37598 9865264 12268323 13874829 13838480 11854979 9450562 8807912 10610336 13522840 15344512
37589 15344512 14512965 11355858 8274563 7805151 9979395 12483497 13873297 15284181
37581 15284181 17892084 20085677 19217095 15730965 13404546 15033629 19501236 23748743
37573B3748743K395399P66603l79348j262312j502318r75656l26196J76965J098063
37564B3739943K394216K794511J696073N20776P34607J407518N83377j338915
37556C2532106j780700M6050J462738l0994k923645l455586o79515K281990K421718
37547B9874162N52236l37023O67882J476672J98721k313517l811771l474657k378571
37538B0454134j763263j901947k349139k204237l99281K918264N354098M294889
37530B4403518L67921k853456l274164k417329k031029j075046J468357K938525
37522A7527297l4162n627448p993356m884236l44667J475128J466446K261081
37514C846083L138587J704911j364621k970594k185095j006387q27899j013781
$$ plain form
37573 23748743 26144142 26910745 26531397 25269085 23766767 22791111 22464915 22641880 23739943
37564 23739943 26134159 28928670 30624743 31145519 31880126 33287644 33871021 32532106
37556 32532106 30751406 30797456 32260194 32229200 29305555 25849969 25170454 27452444 29874162
37547 29874162 30426398 30089375 30757257 32233929 32432650 30119133 26307362 22832705 20454134
37538 20454134 18690871 16788924 14439785 12235548 11836267 14754531 20108629 24403518
37530 24403518 24771439 21917983 18643819 16226490 14195461 13120415 14588772 17527297
37522 17527297 17493135 11865687 3872331 -1011905 -1356572 118556 1585002 3846083
37514 3846083 6984670 8689581 7324960 4354366 2169271 1162884 334985 -678796
37506f78796r91420j125468j218522m68104P16640R98270N47769R91710K394371
37497A166450K524132O7303l272161m824673l565079j09834L994498O269400M796376
37488G046412R62329j263334j83814J457659P06711j425975k231251j677244j550569
37479A840924j696960o13305Q38946K1731k848607m132362j893160J445314L008950
37470d028529L160284L256310K386487o66350l890493l884522p76592J780173
37462b663232J767530J134535K075652L450544K605835p29054m110411n239968
37454a708569l841046j193796J017545J658119R24453J40171K79262J020503J611521
37445i1837J882571J742837O41125j366078k857097k731132j915410j770377j556032
$$ plain form
37506 -678796 -1670216 -2795684 -4014206 -4482310 -3765670 -2767400 -2219631 -1227921 1166450
37497 1166450 3690582 3757885 485724 -4338949 -7904028 -8013862 -4019364 2250036 7046412
37488 7046412 8008741 6745407 6561593 8019252 8725963 7299988 5068737 3391493 1840924
37479 1840924 143964 -469341 369605 391336 -2457271 -6589633 -8482793 -7037479 -4028529
37470 -4028529 -868245 2388065 4774552 4108202 217709 -3666813 -4443405 -2663232
37462 -2663232 -895702 238833 2314485 5765029 8370864 7641810 3531399 -1708569
37454 -1708569 -5549615 -6743411 -5725866 -4067747 -3143294 -3003123 -2723861 -1703358 -91837
37445 -91837 1790734 3533571 4174696 2808618 -48479 -2779611 -4695021 -6465398 -8021430
37436h021430K53094K481010J998963j357631l536104j592507K177820L723678
37428c873107K873222K556154L616540L816310J952914k53929j225144j746043
37420G716917k741926l083291j528222O74845J256179K10208m11455K70183Q69908
37411C233346K01635q03012n09122J110394K576832K790808J866839L21497j533427
37402I255790l115689l356070j753847N53433J467080n4022k774298m030409j961700
37393e769732K575736O155863N654040J641719j858019j992421n57376j205496
37385D644314l932024m972889k457477P86130J489923L84195J00739O93700K10185
37376c053204j405009k091167j097413J25171N51894O27771M99790k94039r63406
$$ plain form
37436 -8021430 -7768336 -5287326 -3288363 -4645994 -8182098 -9774605 -7596785 -3873107
37428 -3873107 -999885 1556269 5172809 8989119 10942033 10688104 9462960 7716917
37420 7716917 4974991 1891700 363478 1038323 2294502 2504710 2093255 2363438 3233346
37411 3233346 3434981 2631969 2122847 3233241 5810073 8600881 10467720 10789217 9255790
37402 9255790 6140101 2784031 1030184 1583617 3050697 2996675 222377 -3808032 -5769732
37393 -5769732 -3193996 2961867 8615907 10257626 8399607 6407186 5849810 4644314
37385 4644314 712290 -4260599 -6718076 -5931946 -4442023 -4057828 -3957089 -3263389 -3053204
37376 -3053204 -4458213 -6549380 -7646793 -7521622 -6969728 -6341957 -5842167 -6136206 -7099612
37367g099612J37356K472157L208184J332472m87378K09137K001033J876785k91158
37358C358976j822538j002411J206199K817165K529716J30011l151171m735510
37350f69563k754025J530487M429542L544116K12829k171598j896390m24290r5915
37341A705193r36721o94891J752419M270098L915409P56620k302420l157977k305039
37332C002691j179664o15101j100905k560949l434344k051904M31131P44218j815615
37323h580442l757301k059042J643819L546654K641568R93748L71502Q30907J712326
37314b656261K024087P03912j671582k561772q65487O77923r16158l972076m008306
37305a3245720j27839L710660M168372K263613P69327N52757Q73517J292092J743675
$$ plain form
37367 -7099612 -6962256 -4490099 -1281915 50557 -436821 -227684 1773349 3650134 3358976
37358 3358976 1536438 534027 1740226 4557391 7087107 7217118 4065947 -669563
37350 -669563 -3423588 -1893101 2536441 6080557 6293386 4121788 2225398 1801108 1705193
37341 1705193 768472 73581 1826000 6096098 10011507 10768127 8465707 5307730 3002691
37332 3002691 1823027 1207926 107021 -2453928 -5888272 -7940176 -7509045 -6764827 -8580442
37323 -8580442 -12337743 -14396785 -12752966 -9206312 -6564744 -5570996 -5199494 -4368587 -2656261
37314 -2656261 -632174 71738 -1599844 -4161616 -5027103 -4349180 -5265338 -9237414 -13245720
37305 -13245720 -13373559 -9662899 -5494527 -3230914 -2461587 -1908830 -1035313 256779 2000454
37296B000454J959831J934898K056475K178080J575694J69020j357544k775662
37288G741246m226094m875275l570372j225125m00230j597780k092748J14461
37280a0131917L058989L477008J420065k2761Q70589K419914K204436K24636j402216
37271B118743j223372q5720J52859r07793j737298j027741N85705J651156J792706
37262A319245J333316R0521j628193j788818Q99364L604645J867736l758881p117756
37253e178821m375399P54730K608725J508617J936290M430654M420845k97254
37245E808387n406792n562931j108726L158777M031209K220115j56834j791193
37237A192012k044540p85908J029070J906785J475816P62848N80142N79731K28181
$$ plain form
37296 2000454 3960285 5895183 7951658 10129738 11705432 11874452 10516908 7741246
37288 7741246 3515152 -1360123 -4930495 -6155620 -6555850 -8153630 -10246378 -10131917
37280 -10131917 -7072928 -3595920 -2175855 -2198616 -1328027 1091887 3296323 3520959 2118743
37271 2118743 895371 809651 962510 54717 -1682581 -2710322 -2124617 -473461 1319245
37262 1319245 2652561 2743082 1114889 -673929 225435 3830080 5697816 1938935 -5178821
37253 -5178821 -9554220 -8799490 -6190765 -4682148 -2745858 1684796 6105641 5808387
37245 5808387 401595 -5161336 -6270062 -3111285 919924 3140039 2983205 1192012
37237 1192012 -852528 -1638436 -609366 1297419 2773235 3536083 4116225 4695956 4924137
37228D924137l10665q64221j850719l275008l896780k604037j95914J477720J944504
37219d650983K304651L075190L500868L279455L021884K191695j165106o769229
37211D788425j0059518o723072J272093P009701O322053J795744j486528j797225
37203A121673j007144q84190j218064j056852k13967O57707Q73905N12608M08334
37194h05990J039510J666848J307821K60095m97218j211277l013117n331304n412154
37185a1996786j544448M240203P714006O298559J133228l899763n134591k233731
37177e423323J442232K562434J583568J179749J578226M14890k484370l807399
37169b953993j857098M80345M35811q7267J818685M335022L313227q67249l541330
$$ plain form
37228 4924137 4613472 3749251 1898532 -1376476 -5273256 -7877293 -8073207 -6595487 -4650983
37219 -4650983 -2346332 728858 4229726 7509181 10531065 12722760 11557654 4788425
37211 4788425 -5271093 -11994165 -10722072 -3712371 2609682 4405426 2918898 1121673
37203 1121673 114529 -769661 -1987725 -3044577 -3258544 -2600837 -1726932 -1214324 -805990
37194 -805990 233520 1900368 3208189 3468284 2971066 1759789 -1253328 -6584632 -11996786
37185 -11996786 -13541234 -9301031 -1587025 4711534 5844762 1944999 -3189592 -5423323
37177 -5423323 -3981091 -1418657 164911 1344660 2922886 3337776 853406 -2953993
37169 -2953993 -4811091 -4330746 -3894935 -3982202 -2163517 2171505 5484732 4617483 1076153
37160A076153k732241j334417j562220j602053L53094K459238K280583Q10709
37152b51154N61121J477302J644794Q90086P75576J412972R86794j141487k962513
37143C393491k382639j3690J532373N84295j963801l736541l214120r36823J535804
37134e201651L454771M970293N522332L603491q15218m705186m728496j541164
37126E59172N12207j230850m239015m036938J03252M614091O349002N548915L633117
37117A1812953N57309l746022p035451o613779l068443L39397K015033L194367
37109b544636M423759L920135R27635j987388k291709j090791p77593q24096Q41520
37100E96836L299543L182112k05273l739839n047353m884626l939609r13423L886904
$$ plain form
37160 1076153 -1656088 -2990505 -4552725 -6154778 -5801684 -3342446 -1061863 -251154
37152 -251154 309967 1787269 3432063 4322149 5097725 6510697 7497491 6356004 3393491
37143 3393491 1010852 997162 2529535 3113830 1150029 -2586512 -5800632 -6737455 -5201651
37134 -5201651 -1746880 3223413 8745745 12349236 11534018 6828832 2100336 559172
37126 559172 1071379 -159471 -4398486 -8435424 -8332172 -3718081 2630921 8179836 11812953
37117 11812953 12370262 8624240 1588789 -5024990 -8093433 -7754036 -5739003 -2544636
37109 -2544636 1879123 5799258 6726893 4739505 2447796 1357005 579412 -244684 596836
37100 596836 3896379 7078491 6873218 3133379 -1913974 -6798600 -10738209 -11651632 -7764728
37091g764728O216767K831105k841360l899610J227679O608199O313711J273440
37083I965203k994973l358180j450379j36227j50543n26376m20466L98121J630053
37074B956233K063694K20447l343724n343554l242758R53694K620805N73254j218111
37065c760020P35156M277370M396815n1280m996987o240208l588296K40184K713444
37056f273822K806259R12641j461845k641220j991914L1636K573368M294347L556063
37047A805513M49842k014862j118489J371594J047248k663836n081828k768620
37039h973438J666255L669736L033834K770394L440512K614208k92819k479520
37031E449162k025509o65416p28259j610690j287921J71218P84385k28034j379658
$$ plain form
37091 -7764728 -1547961 1283144 -1558216 -5457826 -4230147 2378052 8691763 9965203
37083 9965203 6970230 3612050 2161671 2025444 1874901 1348525 928059 1326180 2956233
37074 2956233 5019927 5240374 1896650 -3446904 -6689662 -5735968 -3115163 -2541909 -3760020
37065 -3760020 -3024864 1252506 5649321 5598041 601054 -5639154 -9227450 -8987266 -6273822
37056 -6273822 -3467563 -2554922 -4016767 -6657987 -8649901 -8618265 -6044897 -1750550 1805513
37047 1805513 2255355 240493 -877996 493598 1540846 -1122990 -6204818 -8973438
37039 -8973438 -7307183 -3637447 -603613 2166781 5607293 8221501 7928682 5449162
37031 5449162 3423653 2758237 2029978 419288 -868633 -697415 86970 -141064 -1520722
37022a520722j029575P46512K602681L315536K556689J009575j80739p02733j646482
37013E150742l756010n265228l279963J855675N443735L662930j206080l340236
37005g34435q27743K358095K396657M81309j63584N92339N48256n78173r47408
36996C125313j26869J71897r59082k412136l093850k976608j872917N93620L303308
36987d247324M020244K119403p52292l002019m254089m233172k819666j314790
36979a4483705j025677n01963K586391O479030O345675J634132k032364q30589
36971a829070J709450P91176j952908j827491P14959J100359j388411k596149
36963e278085o35554J412943J154684M45436J330424K420946J821131N79416N42347
$$ plain form
37022 -1520722 -2550297 -1803785 798896 4114432 6671121 7680696 7499957 6797224 5150742
37013 5150742 1394732 -3870496 -7150459 -5294784 148951 3811881 2605801 -734435
37005 -734435 -1562178 795917 3192574 3673883 3510299 4102638 4650894 4072721 3125313
36996 3125313 2998444 3170341 2211259 -200877 -3294727 -6271335 -8144252 -7550632 -4247324
36987 -4247324 -227080 1892323 1140031 -1861988 -6116077 -10349249 -13168915 -14483705
36979 -14483705 -15509382 -16011345 -13424954 -6945924 -600249 1033883 -998481 -1829070
36971 -1829070 -119620 671556 -1281352 -3108843 -2393884 -1293525 -2681936 -5278085
36963 -5278085 -5913639 -4500696 -3346012 -2900576 -1570152 850794 2671925 3251341 3793688
36954C793688J010499J58625j678361k461677j345502O28017K063474K089068
36946D257831L66805k465951m656658m595287k278104O85726K384974K169831
36938d130833J296871J450537K145179Q88880k887892n788425m588884r42754
36930a2557321J090048J070154J866246L817372L887540J420981k9237J412076
36922A977859K574418N38530k517977l141395j978477j470655r52871J473946
36914c496622M107833L540912N49775o70656P73131J109528j658707m073580k258492
36905b076878K152658L880185O65595m150228n745244l219683j51287Q1586j565649
36896a0128945j650370M74982J897057J150229O31672K059677K889873O14963
$$ plain form
36954 3793688 4804187 4962812 3284451 822774 -522728 105289 2168763 4257831
36946 4257831 4624636 2158685 -2497973 -7093260 -9371364 -8685638 -6300664 -4130833
36938 -4130833 -2833962 -1383425 761754 1650634 -1237258 -7025683 -11614567 -12557321
36930 -12557321 -11467273 -10397119 -8530873 -4713501 -825961 595020 565783 1977859
36922 1977859 4552277 5090807 2572830 -568565 -2547042 -4017697 -4970568 -3496622
36914 -3496622 611211 4152123 4701898 4031242 4804373 5913901 4255194 181614 -2076878
36905 -2076878 75780 3955965 4621560 471332 -5273912 -8493595 -8644882 -8563296 -10128945
36896 -10128945 -11779315 -11304333 -9407276 -8257047 -7625375 -5565698 -2675825 -2060862
36888b060862k171797j450774J395345J552220j344499k861189j449252o61069
36880i051877k259781k762380L61966L862731L684736J008818m95454l77138l50733
36871f379112l655K118160M589797M321009J037299k691668n153870o225370n333392
36862a3720802j996929K020867M070732L818397K613163O57924k159656l721509
36854h417813j804905J717736K815711J329446P85233J945315J457428j742576
36846a914425l690025j600409J616664K356863J927885L133419M557520L145326
36838I532818K98658M6607K015998J576770k606749o118337n381050k533524j472155
36829d640964k318373k582326j542654n44779j90074J69781O82895Q09350O00247
$$ plain form
36888 -2060862 -4232659 -5683433 -4288088 -2735868 -4080367 -6941556 -8390808 -9051877
36880 -9051877 -11311658 -14074038 -13712072 -9849341 -6164605 -5155787 -5651241 -6028379 -6379112
36871 -6379112 -6382767 -4264607 325190 4646199 5683498 2991830 -2162040 -8387410 -13720802
36862 -13720802 -15717731 -13696864 -9626132 -5807735 -3194572 -2536648 -4696304 -8417813
36854 -8417813 -10222718 -8504982 -5689271 -4359825 -3574592 -1629277 -171849 -1914425
36846 -1914425 -5604450 -7204859 -5588195 -3231332 -1303447 1829972 6387492 9532818
36838 9532818 9831476 9878083 11894081 13470851 10864102 4745765 -635285 -3168809 -4640964
36829 -4640964 -6959337 -9541663 -11084317 -11629096 -11819170 -11649389 -10966494 -10157144 -9556897
36820i556897N20611L13378l77396n56540J093297L549941L731749M33498l352491
36811d200850l504774L22857M210588M455383J412034j587223k151969p25631
36803a769585Q35306J226123J53371j875617l573933l599294k038276m82541R7297
36794a1027149P13989K561540M670280M914389L042108J048752M19654N83144
36786F926707N09798K90382K85441j6675j128831k315820k369656j350871o77243
36777A53232j438672l026172l509769j525203J915905L918422K811671L38062
36769c62524n46655K75803J53093k040475m038274l670890j958419r43392l69812
36760a3501545J103056K760197K689570J179255N45304J598039K700507K540655
$$ plain form
36820 -9556897 -9036286 -8722908 -9100304 -9656844 -8563547 -5013606 -1281857 -848359 -4200850
36811 -4200850 -7705624 -7382767 -3172179 1283204 2695238 1108015 -1043954 -1769585
36803 -1769585 -934279 291844 445215 -1430402 -5004335 -8603629 -10641905 -11124446 -11027149
36794 -11027149 -10313160 -7751620 -3081340 1833049 4875157 5923909 6343563 6926707
36786 6926707 7436505 7726887 8012328 7995653 6866822 4551002 2181346 830475 153232
36777 153232 -1285440 -4311612 -7821381 -9346584 -7430679 -3512257 -700586 -362524
36769 -362524 -909179 -633376 -480283 -2520758 -6559032 -10229922 -12188341 -13131733 -13501545
36760 -13501545 -12398489 -9638292 -6948722 -5769467 -5224163 -3626124 -925617 1615038
36752A615038J570963L74515j118103k260868j850118m31180j39158j195664j003406
36743d437981J669398L981481K858557k81538j527329j48927Q60972k28937j454380
36734A291316n64380J621445K746836K143134Q96945k45163j335395k007600j430437
36725C116701K08853J277481M24508j723384l151871k592405o29142J278058K324436
36716E33235K583080K119195O37915j784467m128538n058658m072123j855623
36708a1025984L77249J720769J860094Q77848q13582k189101j804027P46631L484043
36699f766060L478704M75039k151753j530506O74101N39781k377357m401174l142437
36690a5201662n18719Q56594J345632K215864K507995R78680o40423K53022K757461
$$ plain form
36752 1615038 3186001 3560516 2442413 181545 -1668573 -2099753 -2238911 -3434575 -4437981
36743 -4437981 -2768583 1212898 4071455 3789917 2262588 2113661 2974633 2745696 1291316
36734 1291316 726936 2348381 5095217 7238351 8135296 7890133 6554738 4547138 3116701
36725 3116701 3325554 4603035 5027543 3304159 152288 -2440117 -3069259 -1791201 533235
36716 533235 3116315 5235510 5873425 4088958 -39580 -5098238 -9170361 -11025984
36708 -11025984 -10648735 -8927966 -7067872 -6190024 -7003606 -9192707 -10996734 -10250103 -6766060
36699 -6766060 -3287356 -2812317 -4964070 -6494576 -5820475 -5280694 -7658051 -12059225 -15201662
36690 -15201662 -15720381 -14863787 -13518155 -11302291 -8794296 -7815616 -8456039 -8203017 -5445556
36681e445556L595885K064721L75480o65678k382158m219755l292198N54843L242871
36672f171545K363828R28170K141632L744771J668024k941680m975762k636142
36664e878704R10754K791458L126286K395134M24343j217993k4896K878877L055489
36655H460748m54725k814205o35099K498406J734251j210974j106066J958880
36647H431216K689727p53145l964850l380787j066476j68276N5909J475393K736499
36638F055210J502271j056555j822247o23862L8851l74213K61099K399832L151991
36629I532377M58070l383409m383173j969382M46953m0307k184370k337473N27461
36620c333253L023573J759748j540838j924753J615835M149771J783266k558667
$$ plain form
36681 -5445556 -1849671 215050 590530 -75148 -2457306 -6677061 -9969259 -9414416 -6171545
36672 -6171545 -3807717 -2879547 -737915 3006856 4674880 1733200 -3242562 -5878704
36664 -5878704 -4967950 -2176492 949794 3344928 3769271 2551278 2526382 5405259 8460748
36655 8460748 8006023 5191818 4556719 7055125 8789376 7578402 6472336 8431216
36647 8431216 11120943 10367798 6402948 3022161 1955685 1787409 1843318 3318711 6055210
36638 6055210 7557481 6500926 4678679 4054817 4093668 3719455 3980554 6380386 9532377
36629 9532377 9990447 6607038 2223865 254483 701436 661129 -1523241 -3860714 -3333253
36620 -3333253 -309680 1450068 -90770 -2015523 -399688 3750083 5533349 2974682
36612B974682l647723j790423j523441l569439l508581O87658M849494M679883
36604h47890J672920m648M68362Q85929J45388j139051k595583l754571l095541
36595h264685k71519J932750Q14931k018399k616802j75314K431830L083678K245626
36586b837904N57963k140533m903528n641902l819333j082557J134691K570597
36578a6162506K778468J333931m98483q92373l22582n75982j099006K01334K423688
36569a2813511K177816m57990j089541J960847M384646K607411m89616m72288
36561d192226J635705J890216K60754j50602R39690Q81493q16715j900946j575857
36552c028488j085663l52484J753029L862309L146273J69879j539993j193108
$$ plain form
36612 2974682 -673041 -2463464 -3986905 -7556344 -11064925 -10377267 -5527773 -847890
36604 -847890 825030 820382 1288744 2174673 2320061 1181010 -1414573 -5169144 -8264685
36595 -8264685 -8536204 -6603454 -5788523 -7806922 -10423724 -10599038 -8167208 -5083530 -2837904
36586 -2837904 -2279941 -4420474 -9324002 -14965904 -18785237 -19867794 -18733103 -16162506
36578 -16162506 -13384038 -12050107 -12548590 -13440963 -13763545 -14339527 -15438533 -15237199 -12813511
36569 -12813511 -10635695 -11093685 -12183226 -10222379 -5837733 -3230322 -3719938 -4192226
36561 -4192226 -2556521 -666305 -405551 -556153 383537 1265030 448315 -1452631 -3028488
36552 -3028488 -4114151 -4466635 -2713606 1148703 4294976 4464855 2924862 1731754
36544A731754j556575l332749l473665o74634J942121J756177K65255m02613p02445
36535d447374j094020k04929J838099K249617O04506O65849L705019M750845L31282
36526H398894m572086l636994L30194l31248n446373p066427k220257K841509
36518a1702788L101379J709349K867712M400773K371802j698562l513150k697724
36510e161209j949181j781861o89011R59379J305339L89470k70890o08095j399301
36501i205360j671908J55688L190997M958429M742660L509708J505307j248003
36493E937518l106661k607082j272117j414162k087766q80407J180529R52278
36485c297870r19898m84374K508867L467097N92480j739020l06705J284770j217446
$$ plain form
36544 1731754 175179 -3157570 -6631235 -7305869 -5363748 -3607571 -3342316 -3744929 -4447374
36535 -4447374 -5541394 -5746323 -3908224 -1658607 -1054101 -388252 3316767 8067612 8398894
36526 8398894 3826808 189814 520008 188760 -5257613 -12324040 -14544297 -11702788
36518 -11702788 -8601409 -6892060 -4024348 376425 2748227 1049665 -2463485 -5161209
36510 -5161209 -7110390 -8892251 -9581262 -8621883 -7316544 -6927074 -7197964 -7806059 -9205360
36501 -9205360 -10877268 -10721580 -7530583 -2572154 2170506 5680214 7185521 5937518
36493 5937518 2830857 223775 -1048342 -2462504 -4550270 -5430677 -4250148 -3297870
36485 -3297870 -4217768 -4702142 -2193275 1273822 1866302 127282 -179423 1105347 -112099
36476a12099m882625l698103J736128M728476K321953j063613q79973J476222
36468c73634K022420M3300k138870k999632k782142j841349k63275J272800J777735
36459e282647R96197n67381k213834l098549k485341p06538P99310J167699J188249
36450a0202835J936497L048747L423349L102437L063767L153996J736289j773819
36442G488428n010799m753433j016179K224570J345290k527912m771032k854156
36434i875223R31258L005731K990283K876364K966231J480788j648161l521029
36426g93758k274739j08518j15344j596091j253793J535522L604481K622791J89247
36417A809798r79361p84444p93481j099679m62281J090801K069641J848866J127490
$$ plain form
36476 -112099 -4994724 -8692827 -6956699 -2228223 93730 -969883 -1849856 -373634
36468 -373634 1648786 1692086 -446784 -3446416 -6228558 -8069907 -8333182 -7060382 -5282647
36459 -5282647 -4286450 -4853831 -7067665 -10166214 -12651555 -13358093 -12558783 -11391084 -10202835
36450 -10202835 -8266338 -5217591 -1794242 1308195 4371962 7525958 9262247 7488428
36442 7488428 2477629 -2275804 -3291983 -1067413 277877 -2250035 -7021067 -9875223
36434 -9875223 -8943965 -5938234 -2947951 -71587 2894644 4375432 2727271 -793758
36426 -793758 -3068497 -3177015 -3292359 -4888450 -6142243 -4606721 -1002240 1620551 1809798
36417 1809798 830437 45993 -747488 -1847167 -2309448 -1218647 850994 2699860 3827350
36408C827350q2378k647547n678600n998606k155079K443101K801208j473576
36400h964127n366977m393489K86867L830793L804650K582070L364870N430832
36392E75489N188653J695382j382092p99888J390319R13882j988110k927614o62240
36383B003781O81233j350296k912310j11061L888186L279213j181037l389878
36375I07831j436095L74442n15798j289031N0355Q79247n17009r70100J906693
36366f09465M582584K979304n89233j181519O82614M13792k639464m340193k688648
36357c390228l63938K61316J08980L02257o1875j564276k764764k185074o2108
36348i719710K346308L521152K252103m39007j087755J675202L918135J589660
$$ plain form
36408 3827350 3744972 1097425 -4581175 -10579781 -12734860 -10291759 -7490551 -8964127
36400 -8964127 -14331104 -18724593 -18437726 -14606933 -10802283 -8220213 -4855343 575489
36392 575489 5764142 7459524 6077432 5277544 6667863 7581745 5593635 2666021 2003781
36383 2003781 2685014 1334718 -1577592 -1688653 2199533 5478746 4297709 907831
36375 907831 -528264 -153822 -669620 -1958651 -1908296 -1029049 -1546058 -2516158 -609465
36366 -609465 3973119 6952423 6363190 5181671 5864285 6278077 3638613 -701580 -3390228
36357 -3390228 -3754166 -3492850 -3383870 -3081613 -3143488 -4707764 -7472528 -9657602 -9719710
36348 -9719710 -7373402 -3852250 -1600147 -2039154 -3126909 -1451707 2466428 4056088
36340D056088k636661k805795R31261K586090K78129j025781J382033L142615
36332E907979P77202j954754p19459J661804K08082l445566l856709q47765Q43561
36323a425625k54802q41319O47437J817630J308313R00057J370684O59014k087017
36314B094372m172838l005373M22193L156848L427872J326771j650452l138072
36306a538679j969765j16287n33737k931977m044081k333665K31490J677186K533615
36297i025900L760200M626277M129029K672272J003260r79703l159427m241725
36289a215717l016287J36142L427821M695090K715022j076177k840878m99059
36281B325957K811893K174683k276440n188068l238783Q76255L034227K828961
$$ plain form
36340 4056088 1419427 -1386368 -455107 2130983 2409112 1383331 2765364 5907979
36332 5907979 6685181 4730427 4010968 5672772 5880854 2435288 -1421421 -2269186 -1425625
36323 -1425625 -1680427 -2521746 -1874309 -56679 1251634 2151691 3522375 4181389 2094372
36314 2094372 -2078466 -5083839 -4661646 -1504798 1923074 3249845 1599393 -1538679
36306 -1538679 -3508444 -3624731 -4158468 -7090445 -11134526 -13468191 -13236701 -11559515 -9025900
36297 -9025900 -5265700 -639423 3489606 6161878 7165138 6185435 3026008 -1215717
36289 -1215717 -4232004 -4095862 -668041 4027049 6742071 5665894 2825016 2325957
36281 2325957 5137850 7312533 5036093 -151975 -3390758 -2514503 519724 3348685
36273C348685J941265M37247k170655m120285l014936M44010K940356K460753
36265B266440j75931l134152m914835m319501j249618K191583L149015J259787
36257d927212o38277K32501L236536N041334L638924P74660m70243O6115l10761
36248F643577k412485l130738k67887K893690J452190l793054p001557n162984
36240a0779248j059801K145295M582197O321770N095897L54211m190301n387936
36232b917916m764151m475348k749972K119899O238342M277233k108620n637185
36224a0017718l091438J387510L211828K700714K105058J545611K41328j152881
36216c069988j696919j763153j900465j680662p86271K36027J062093J945539
$$ plain form
36273 3348685 5289950 5727197 3556542 -563743 -3578679 -3134669 -194313 2266440
36265 2266440 2090509 -1043643 -5958478 -10277979 -11527597 -9336014 -6186999 -4927212
36257 -4927212 -5565489 -5332988 -2096452 2944882 6583806 7358466 6888223 6954338 6643577
36248 6643577 4231092 1100354 832467 3726157 5178347 1385293 -5616264 -10779248
36240 -10779248 -11839049 -9693754 -5111557 1210213 6306110 6660321 2470020 -2917916
36232 -2917916 -7682067 -12157415 -14907387 -12787488 -6549146 -2271913 -4380533 -10017718
36224 -10017718 -13109156 -11721646 -8509818 -5809104 -3704046 -2158435 -1917107 -3069988
36216 -3069988 -4766907 -6530060 -8430525 -10111187 -10897458 -10661431 -9599338 -7653799
36208g653799K570246K195245J164478M72063j03848j197984j439858J088463
36200b904994M704749N021956J096538k879164l638833k841716k632407j193321
36192e267192L293400P289697N678800l39749m245594l147429r34033j400312
36184I27588k835307k019276K3473K8854j696410j547943J499260L915476K704578
36175A000293j97960o64052J971158M332798L724911J238228m12995m38340j35162
36166A0418879m52152q12482l44072N80004L94331j979450n289769o294446l157035
36157f936192J573615L211682P64127j653430o09198J844440J737099m94294j044192
36148a606343Q04613J694908J88420o46114J473428L892108K997751l91271k785892
$$ plain form
36208 -7653799 -5083553 -2888308 -1723830 -1251767 -1355615 -2553599 -3993457 -2904994
36200 -2904994 1799755 6821711 7918249 5039085 1400252 -1441464 -4073871 -5267192
36192 -5267192 -1973792 5315905 10994705 10654956 6409362 3261933 2327900 927588
36184 927588 -1907719 -3926995 -3903522 -3874668 -5571078 -7119021 -5619761 -1704285 1000293
36175 1000293 802333 138281 2109439 6442237 10167148 11405376 10992381 10554041 10418879
36166 10418879 9966727 9154245 8810173 9390177 9784508 7805058 2515289 -3779157 -6936192
36157 -6936192 -5362577 -2150895 -1386768 -3040198 -3649396 -1804956 -67857 -562151 -1606343
36148 -1606343 -801730 893178 1081598 435484 1908912 5801020 8798771 8407500 5621608
36139E621608l173927l030872k585708q36610J115465N40813k373674l671536
36131h394441q49570L463165M925068K873171K02624j025713j401850j746548
36123a954094j392919J5056Q52386m15811k383180k252972k16447L91193j597363
36114h954151k486024J047260O007623O226255R80069l666330l073209L08191
36106c610316J549097J06656j079749r01129o67304n99042M22026J788479J388359
36097a602923n82585j185574Q15389K846150K416460P59827M84816J306336O81445
36088E939341j997063m367944m514924l311486k410136j504357P19323L575475
36080g871771M370975J987885j087091j649256J97994J550047Q57449l92059n06565
$$ plain form
36139 5621608 2447681 -583191 -3168899 -4005509 -2890044 -2349231 -4722905 -8394441
36131 -8394441 -9244011 -5780846 -855778 2017393 2220017 1194304 -207546 -1954094
36123 -1954094 -3347013 -3331957 -2479571 -2895382 -5278562 -7531534 -7747981 -7356788 -8954151
36114 -8954151 -11440175 -10392915 -4385292 1840963 2821032 -845298 -3918507 -3610316
36106 -3610316 -2061219 -1954563 -3034312 -3935441 -4602745 -5201787 -4779761 -2991282 -1602923
36097 -1602923 -2185508 -3371082 -2555693 290457 2706917 3466744 3951560 5257896 5939341
36088 5939341 3942278 -425666 -4940590 -8252076 -10662212 -12166569 -11447246 -7871771
36080 -7871771 -3500796 -1512911 -2600002 -4249258 -4051264 -2501217 -1643768 -2035827 -2542392
36071b542392j07958n84662j466169j064742Q25027K414308K179166O59913k60043
36062E2448M74836J761897J437467q97213k812543k057302M1718L96515q67651
36053b469828m47756K345688L679213J409441n60021J875692N673055M439752
36045A5945236j636846n413884k865833J811095K943822N78906j756828k668047
36037F937621k847915k096758o597J831196J418559o66927k300044k921529l344334
36028c996728l388535k215949m94244K09335L3328O17792K275181L437185L189519
36019c33116K473907K259008K137882J457323N61702N3239l73844j524727l383979
36010C327395m685913l973953j297874J231931J344948o21902j826559m55143
$$ plain form
36071 -2542392 -2650350 -3235012 -4701181 -5765923 -4940896 -2526588 -347422 312491 52448
36062 52448 527284 2289181 3726648 2829435 16892 -2040410 -1998692 -1602177 -2469828
36053 -2469828 -2917584 -571896 3107317 4516758 3956737 5832429 11505484 15945236
36045 15945236 14308390 8894506 6028673 7839768 10783590 11362496 9605668 6937621
36037 6937621 4089706 1992948 1986351 3817547 5236106 4569179 2269135 -652394 -3996728
36028 -3996728 -7385263 -9601212 -10095456 -9886121 -9852793 -9235001 -6959820 -3522635 -333116
36019 -333116 2140791 4399799 6537681 7995004 8556706 8609945 8236101 6711374 3327395
36010 3327395 -1358518 -5332471 -6630345 -5398414 -4053466 -4675368 -6501927 -6957070
36002f957070J949597K779473J868436J069547J104847R09918J1286n02893J11719
35993B344860J044823J342041J175596R33597K75241q94748j477731m85332J112895
35984E371242J082948j299005l921401l849865n99189K997699L570012Q42669
35976D195110j998988j821168J117123L814762L971477J960556l38924j650087
35968I249861k017199k134660k419453k630852k325498j609954j037409o68514
35960e593678M1197J034583J266008L58641k21292J082640L506630M703042L675755
35951I853526J631848j1435j039276j671458j734307j086472N2073J447635K670038
35942A0112172K629095N67027k318099l638407k677589j235283j083290j822603
$$ plain form
36002 -6957070 -5007473 -2228000 -359564 709983 1814830 2724748 2736034 2233141 2344860
35993 2344860 3389683 4731724 5907320 6840917 7116158 6221410 4743679 4258347 5371242
35984 5371242 6454190 5155185 1233784 -2616081 -3215270 -217571 3352441 4195110
35976 4195110 2196122 374954 1492077 5306839 9278316 11238872 10899948 9249861
35968 9249861 7232662 5098002 2678549 47697 -2277801 -3887755 -4925164 -5593678
35960 -5593678 -5552481 -4517898 -3251890 -2893249 -3114541 -2031901 1474729 6177771 9853526
35951 9853526 11485374 11473939 10434663 8763205 7028898 5942426 5994499 7442134 10112172
35942 10112172 12741267 13308294 10990195 7351788 4674199 3438916 2355626 533023
35934E33023j948430r02343O79029J738793J212373j105283l350435k702603J032512
35925d813364M213221L394836k83036k618805j863726o37267j899645m786379
35917i294165n744923l091640R34317K937798K287697J328355J885180K967124
35909e790257K764906J607835J135825J285374N26241r30377r79975M95856N56436
35900F71864k174913m511462l052864N45508K023292R11462N98425K292350L002777
35891C06439O32998k386452k639521n80874M90439q93212k765241k437817N27543
35882i745698M044381N567211M449465K247717N20274q89615k461957l071476
35874F60302j521462O90778Q94538m91196l20064K020769L115884Q65571j949924
$$ plain form
35934 533023 -1415407 -2317750 -1638721 100072 1312445 207162 -3143273 -5845876 -4813364
35925 -4813364 -600143 2794693 2511657 -107148 -1970874 -2608141 -4507786 -9294165
35917 -9294165 -15039088 -18130728 -17196411 -14258613 -11970916 -10642561 -8757381 -5790257
35909 -5790257 -3025351 -1417516 -281691 1003683 1529924 599547 -380428 115428 671864
35900 671864 -1503049 -6014511 -9067375 -8521867 -6498575 -5587113 -4988688 -2696338 306439
35891 306439 939437 -1447015 -4086536 -4667410 -4176971 -5070183 -7835424 -10273241 -9745698
35882 -9745698 -5701317 -134106 4315359 6563076 7083350 6193735 3731778 660302
35874 660302 -861160 -170382 724156 232960 -87104 1933665 5049549 5915120 3965196
$$ [...]
##END NTUPLES=NMR SPECTRUM
##END=
