##TITLE=31Pdec_DE-PHGlu
 D2O, 64 sc
 21.1.2025
##JCAMPDX= 6.0         $$ Bruker NMR JCAMP-DX V2.0
##DATA TYPE= NMR SPECTRUM
##DATA CLASS= NTUPLES
##ORIGIN= UXNMR, Bruker Analytische Messtechnik GmbH
##OWNER= root
$$ XWIN-NMR		Version 3.5
$$ Tue Jan 21 17:29:20 2025 Russian Standard Time (UT+4h)  she@DPX200
##.OBSERVE FREQUENCY= 81.013821
##.OBSERVE NUCLEUS= ^31P
##.ACQUISITION MODE= SIMULTANEOUS
##.ACQUISITION SCHEME= undefined
##.AVERAGES= 64
##.DIGITISER RES= 17
##SPECTROMETER/DATA SYSTEM= spect
##.PULSE SEQUENCE= zgpg30
##.SOLVENT NAME= CDCl3
##.SHIFT REFERENCE= (INTERNAL, CDCl3, 0, 198.062)
##AUDIT TRAIL= $$ (NUMBER, WHEN, WHO, WHERE, WHAT)
$$ ##TITLE= Audit trail, XWIN-NMR		Version 3.5
$$ ##JCAMPDX= 5.01
$$ ##ORIGIN= Bruker BioSpin GmbH
$$ ##OWNER= she
$$ F:/spectra/data/she/nmr/P31/2/pdata/1/auditp.txt
$$ ##AUDIT TRAIL=  $$ (NUMBER, WHEN, WHO, WHERE, WHAT)
(   1,<2025-01-21 17:28:02.56 +0400>,<she>,<DPX200>,
      <created by zg, POWCHK disabled, PULCHK disabled
       configuration hash MD5:
       00 E9 B6 7A A2 85 ED C7 34 08 36 98 17 FE 4E 26
       data hash MD5: 32K
       59 5A DB 5F 69 6F D4 3C 6C 23 81 9E BB DE 14 D6>)
(   2,<2025-01-21 17:28:19.70 +0400>,<she>,<DPX200>,
      <Start of raw data processing
       efp BC_mod = 2 LB = 1.5 FT_mod = 6 PKNL = 1 PHC0 = 1739.566 PHC1 = 156.4863 SI = 64K 
       data hash MD5: 64K
       75 E8 4C B9 99 1E 7E 7D D6 EF F2 E2 74 00 C0 A0>)
(   3,<2025-01-21 17:28:38.75 +0400>,<she>,<DPX200>,
      <pk PHC0 = -77.12423 PHC1 = 123.4 
       data hash MD5: 64K
       61 5A 85 95 3F 12 8A 25 0B FA DC D7 85 78 A6 A3>)
(   4,<2025-01-21 17:28:42.03 +0400>,<she>,<DPX200>,
      <abs ABSG = 5 
       data hash MD5: 64K
       D8 2F 75 45 12 8F 11 42 46 83 A4 7D 9C 22 61 20>)
$$ ##END=
$$ 
$$ hash MD5
$$ D5 59 4F 46 45 20 0E 4B 7B 39 1D 62 9E F8 31 8A
##$RELAX= 
##$RELAX= 
##$RELAX= 
##$RELAX= 
##$RELAX= 
##$RELAX= 
##$RELAX= 
##$RELAX= 
$$ Bruker specific parameters
$$ --------------------------
##$DU= <F:/spectra>
##$EXPNO= 2
##$NAME= <P31>
##$PROCNO= 1
##$TYPE= <nmr>
##$USER= <she>
##$AMP= (0..31)
100 100 100 100 100 100 100 100 100 100 100 100 100 100 100 100 100 100 
100 100 100 100 100 100 100 100 100 100 100 100 100 100 
##$AQSEQ= 0
##$AQ_mod= 1
##$AUNM= <au_zg>
##$AUTOPOS= <>
##$BF1= 81.014009
##$BF2= 200.13
##$BF3= 200.13
##$BF4= 200.13
##$BF5= 200.13
##$BF6= 200.13
##$BF7= 200.13
##$BF8= 200.13
##$BYTORDA= 1
##$CFDGTYP= 0
##$CFRGTYP= 5
##$CHEMSTR= <none>
##$CNST= (0..31)
1 1 145 1 1 1 1 1 1 1 1 1 1 1 1 1 1 1 1 1 1 1 1 1 1 1 1 1 1 1 1 1 
##$CPDPRG= <waltz16>
##$CPDPRG1= <>
##$CPDPRG2= <waltz16>
##$CPDPRG3= <>
##$CPDPRG4= <mlev>
##$CPDPRG5= <mlev>
##$CPDPRG6= <mlev>
##$CPDPRG7= <mlev>
##$CPDPRG8= <mlev>
##$CPDPRGB= <>
##$CPDPRGT= <>
##$D= (0..31)
0 1 0 0 0 0 0 0 0 0.06 0 0.03 2e-05 3e-06 0 0 0.0002 0 0 0 0 0 0 0 0 0 
0 0 0 0 0 0 
##$DATE= 1737466081
##$DBL= (0..7)
120 120 120 11 120 120 24 19 
##$DBP= (0..7)
150 150 150 150 150 150 150 150 
##$DBP07= 0
##$DBPNAM0= <>
##$DBPNAM1= <>
$$ [...]
##$SUBNAM3= <"">
##$SUBNAM4= <"">
##$SUBNAM5= <"">
##$SUBNAM6= <"">
##$SUBNAM7= <"">
##$SUBNAM8= <"">
##$SUBNAM9= <"">
##$SW= 400.765351723535
##$SWIBOX= (0..15)
0 1 3 0 0 0 0 0 0 0 0 0 0 0 0 0 
##$SW_h= 32467.5324675325
##$TD= 32768
##$TD0= 1
##$TE= 0
##$TE2= 300
##$TE3= 300
##$TEG= 300
##$TL= (0..7)
0 120 53 12 22 120 120 120 
##$TP= (0..7)
150 150 150 150 150 150 150 150 
##$TP07= 0
##$TPNAME0= <>
##$TPNAME1= <>
##$TPNAME2= <>
##$TPNAME3= <>
##$TPNAME4= <>
##$TPNAME5= <>
##$TPNAME6= <>
##$TPNAME7= <>
##$TPOAL= (0..7)
0.5 0.5 0.5 0.5 0.5 0.5 0.5 0.5 
##$TPOFFS= (0..7)
0 0 0 0 0 0 0 0 
##$TUNHIN= 0
##$TUNHOUT= 0
##$TUNXOUT= 0
##$USERA1= <user>
##$USERA2= <user>
##$USERA3= <user>
##$USERA4= <user>
##$USERA5= <user>
##$V9= 5
##$VALIST= <valist>
##$VCLIST= <CCCCCCCCCCCCCCC>
##$VD= 0
##$VDLIST= <DDDDDDDDDDDDDDD>
##$VPLIST= <PPPPPPPPPPPPPPP>
##$VTLIST= <TTTTTTTTTTTTTTT>
##$WBST= 1024
##$WBSW= 4
##$XGAIN= (0..3)
0 0 0 0 
##$XL= 0
##$YL= 0
##$YMAX_a= 15822
##$YMIN_a= -17224
##$ZGOPTNS= <>
##$ZL1= 120
##$ZL2= 120
##$ZL3= 120
##$ZL4= 120
##$ABSF1= 198.0616
##$ABSF2= -202.7028
##$ABSG= 5
##$ABSL= 3
##$ALPHA= 0
##$AQORDER= 0
##$ASSFAC= 0
##$ASSFACI= 0
##$ASSFACX= 0
##$ASSWID= 0
##$AUNMP= <proc_1d>
##$AZFE= 0.1
##$AZFW= 0.5
##$BCFW= 0
##$BC_mod= 2
##$BYTORDP= 0
##$COROFFS= 0
##$CY= -3
##$DATMOD= 1
##$DC= 0
##$DFILT= <>
##$DTYPP= 0
##$F1P= 0
##$F2P= 0
##$FCOR= 1
##$FTSIZE= 65536
##$FT_mod= 6
##$GAMMA= 0
##$GB= 0
##$INTBC= 1
##$INTSCL= 9.790993e-09
##$ISEN= 30
##$LB= 1.5
##$LEV0= 0
##$LPBIN= 0
##$MAXI= 10000
##$MC2= 0
##$MEAN= 0
##$ME_mod= 0
##$MI= 50
##$NCOEF= 0
##$NC_proc= -6
##$NLEV= 6
##$NOISF1= 182.463
##$NOISF2= 159.3651
##$NSP= 0
##$NTH_PI= 0
##$NZP= 0
##$OFFSET= 198.0616
##$PC= 4
##$PHC0= 1662.442
##$PHC1= 279.8863
##$PH_mod= 1
##$PKNL= yes
##$PPARMOD= 0
##$PSCAL= 0
##$PSIGN= 0
##$REVERSE= no
##$SF= 81.0140089999434
##$SI= 65536
##$SIGF1= 159.3651
##$SIGF2= -187.1042
##$SINO= 113.3802
##$SIOLD= 16384
##$SREGLST= <1H.CDCl3>
##$SSB= 0
##$STSI= 65536
##$STSR= 0
##$SW_p= 32467.5324675325
##$SYMM= 0
##$S_DEV= 0
##$TDeff= 32768
##$TDoff= 0
##$TI= <>
##$TILT= no
##$TM1= 0
##$TM2= 0
##$TOPLEV= 0
##$USERP1= <user>
##$USERP2= <user>
##$USERP3= <user>
##$USERP4= <user>
##$USERP5= <user>
##$WDW= 1
##$XDIM= 65536
##$YMAX_p= 498850110
##$YMIN_p= -20271301
$$ End of Bruker specific parameters
$$ ---------------------------------
##NTUPLES= NMR SPECTRUM
##VAR_NAME=  FREQUENCY,     SPECTRUM/REAL,   SPECTRUM/IMAG
##SYMBOL=    X,             R,               I
##VAR_TYPE=  INDEPENDENT,   DEPENDENT,       DEPENDENT
##VAR_FORM=  AFFN,          ASDF,            ASDF
##VAR_DIM=   65536,         65536,           65536
##UNITS=     HZ,            ARBITRARY UNITS, ARBITRARY UNITS
##FACTOR=    0.49542278885378, 1,            1
##FIRST=     16045.7642231865, 0,            0
##LAST=      -16421.768244346, 0,            0
##MIN=       -16421.768244346, -20271301,    0
##MAX=       16045.7642231865, 498850110,    0
$$ Real data points
##PAGE= N=1
##DATA TABLE= (X++(R..R)), XYDATA
$$ [...]
41288A780243j80256K54763J82001m33539q81338n37447K30931M28776k37579
$$ 1780243 1599987 1854750 2036751 1603212 721874 184427 415358 844134 606555
41279F06555q76471n64646L79854P85509J72942o44762o57920J13337Q33204R62872
$$ 606555 -269916 -834562 -454708 330801 503743 -141019 -798939 -685602 147602 1110474
41269A110474O66867K34355l26323r50298j240240q85425j29310M87459O97422
$$ 1110474 1777341 2011696 1685373 735075 -505165 -1390590 -1519900 -1032441 -335019
41260c35019N71322K19974k27858n03688m54448l44610n04664p38850n47998N9055
$$ -335019 236303 456277 228419 -275269 -729717 -1074327 -1578991 -2317841 -2865839 -2806784
41250b806784N08918N14854M13743M53607L69147L5711p8939L08928O02666J55436
$$ -2806784 -2297866 -1783012 -1369269 -915662 -546515 -510804 -589743 -280815 321851 477287
41240D77287n84363o42980m1025K47710j05085k80738K42046P43447M38718j90918
$$ 477287 -107076 -750056 -791081 -543371 -648456 -929194 -687148 56299 495017 304099
41230C04099j58671M12629M62972l35128j062673r13460k55072R4130N4178J61831
$$ 304099 145428 558057 1021029 685901 -376772 -1290232 -1545304 -1451174 -1396996 -1235165
41220a235165N56388P15960K61134m23931o24445j61424M36016N98176K97906
$$ -1235165 -678777 37183 298317 -125614 -750059 -911483 -475467 122709 420615
41211D20615j39215n28207p96889o46300J91905J249262J485649N61467n55344
$$ 420615 281400 -246807 -1043696 -1689996 -1498091 -248829 1236820 1798287 1242943
41202A242943q07166m21990l07097m31769P4514J184370J591123O12532o00070
$$ 1242943 435777 13787 -293310 -725079 -650565 533805 2124928 2737460 2137390
41193B137390o57015P0786J83978n22172q98642m17356N1292k11885o20889l52463
$$ 2137390 1480375 1551161 1735139 1212967 314325 -103031 -51739 -263624 -884513 -1236976
41183a236976L16401N70261L52006K11840K25274k8614n18605o38540j58886L63261
$$ -1236976 -920575 -350314 1692 213532 438806 410192 -108413 -746953 -905839 -542578
41173e42578L56391o0253l70101l03783L684K39410J71032j18477k47996k7054
$$ -542578 -186187 -246440 -616541 -920324 -916640 -677230 -506198 -624675 -872671 -899725
41163h99725J84356q333k96450m7963N82641O86905k2680o68058n13157n5030
$$ -899725 -715369 -723702 -1020152 -1068115 -485474 201431 178751 -489307 -1002464 -1057494
41153a057494p7076k72730J48290Q59303O84138m63500j156792m81613N58460
$$ -1057494 -1134570 -1407300 -1259010 -399707 284431 -179069 -1335861 -1817474 -1259014
41144a259014N08697l99800o79383J31534P84114J70754j060867j371982l30284
$$ -1259014 -750317 -1150117 -1829500 -1697966 -913852 -743098 -1803965 -3175947 -3506231
41135c506231R49339J248338N34305l10210n71097k07372M26212R33198J011656
$$ -3506231 -2556892 -1308554 -774249 -1084459 -1655556 -1862928 -1436716 -503518 508138
41126E08138O17574Q0865j96936k18531k99489m72864l86691M2039L34104J62793
$$ 508138 1125712 1206577 1009641 791110 491621 18757 -367934 -325895 8209 171002
41116A71002n8727J72878N35943K91349n33221j090511q89670l38975L7142K54429
$$ 171002 112275 285153 821096 1112445 579224 -511287 -1400957 -1739932 -1702790 -1448361
41106a448361M79008O07645O03789P10846R32990Q17617K00723l40055l17306
$$ -1448361 -969353 -361708 242081 952927 1885917 2703534 2904257 2564202 2246896
41097B246896j46835m65295r99624q94930k6362P51404O95047n8306q45626j117184
$$ 2246896 2100061 1634766 635142 -259788 -286150 465254 1160301 1101995 256369 -860815
41087h60815p24303l2824K59012j57760p19618o53459J0247N90522P52073P09374
$$ -860815 -1585118 -1617942 -1358930 -1516690 -2236308 -2889767 -2879520 -2288998 -1536925 -827551
41077h27551N51410J27662l58578m24511j24293m1355k75589k32450K85903O12163
$$ -827551 -276141 -148479 -507057 -931568 -1055861 -1097216 -1372805 -1605255 -1319352 -707189
41067g07189L03079p3554J38347O08786N80858M2312l69853l23422k5085K43613
$$ -707189 -404110 -477664 -339317 269469 850327 892639 522786 199364 174279 417892
41057D17892K76401j08175p39768r82018m66554L05604N76665K59885k04368n29148
$$ 417892 694293 586118 -153650 -1135668 -1602222 -1296618 -719953 -460068 -664436 -1193584
41047a193584n76392j40183N60313O30980l68466j415247j184724J0705O25977
$$ -1193584 -1769976 -1910159 -1349846 -718866 -1087332 -2502579 -3687303 -3676598 -3050621
41038c050621J84010j51074M23145J117258R94963M94889N28155Q81630O65594
$$ -3050621 -2866611 -3017685 -2594540 -1477282 -482319 12570 540725 1422355 2087949
41029B087949q6537m08381Q8063O68806N99867M0672m51978o90086p47953n61269
$$ 2087949 2001412 1593031 1681094 2349900 2949767 2990439 2538461 1848375 1100422 539153
41019E39153j27245J60243n9249l88267N061J087653J591542N87259r57590j168171
$$ 539153 411908 572151 512902 124635 129696 1217349 2808891 3396150 2438560 1270389
41009A270389J77467J214330N80099p13679r52076k62420n6651n43279n64838
$$ 1270389 1447856 2662186 3242285 2528606 1576530 1314110 1257459 714180 149342
41000A49342J55195M61297q2569k44600P52453J667035J079180l45969r13255
$$ 149342 304537 765834 683265 438665 1191118 2858153 3937333 3591364 2678109
40991B678109m44558j99261o47559r03887m04139K38467L64756J71654P3191p258
$$ 2678109 2233551 2034290 1386731 482844 78705 317172 681928 853582 926773 919515
40981I19515k72372n75009o67231n11141j57734K81908M68135J01921n41887p96020
$$ 919515 647143 72134 -595097 -1106238 -1263972 -982064 -513929 -412008 -953895 -1749915
40971a749915m14893J75902M75818L74593M4829k29114j59657K25998M96894M18817
$$ -1749915 -2164808 -1988906 -1513088 -1138495 -1093666 -1322780 -1482437 -1256439 -759545 -340728
40961c40728L58301N89224O26235K3639n80168k95364L91190J47068r91652j389977
$$ -340728 17573 606797 1233032 1256671 676503 381139 772329 919397 -72255 -1462232
40951a462232k36953J186264J418452P81430M41909N25988L70038l9620j32327
$$ -1462232 -1699185 -512921 905531 1686961 2128870 2654858 3024896 2985276 2852949
40942B852949J01477J39210j03689l00204n39285j187290j989353k165907j418703
$$ 2852949 2954426 3093636 2989947 2689743 2150458 963168 -1026185 -3192092 -4610795
40933d610795j55843J156734K125131K124883Q61001p41986j202313k72333P73918
$$ -4610795 -4766638 -3609904 -1484773 640110 1501111 759125 -443188 -715521 58397
40924E8397Q90911M36048K18792K30627m4390o42304j118201j205245r47116m28362
$$ 58397 949308 1385356 1604148 1834775 1790385 1148081 29880 -1175365 -2122481 -2550843
40914b550843J91127O06934P15099P89470R73052Q93892K28716n98218q13343
$$ -2550843 -2359716 -1752782 -1037683 -248213 724839 1618731 1847447 1249229 435886
40905D35886l10230K23753K32794p5799j60442J02416L06982N2926n41654q92657
$$ 435886 125656 349409 582203 506404 345962 448378 755360 808286 266632 -626025
40895f26025n64396J71968N67654K78015k11703k57907O9220J54827k30915o36804
$$ -626025 -1190421 -1018453 -450799 -172784 -384487 -642394 -573174 -418347 -649262 -1286066
40885a286066o35162l73211j94156q9531J17124L23537L37717L42901O30392R00405
$$ -1286066 -1921228 -2294439 -2488595 -2578126 -2461002 -2137465 -1799748 -1456847 -826455 73950
40875G3950M83214n26496j024749l13110P49379P59098l29688j180106r41609
$$ 73950 557164 30668 -994081 -1307191 -557812 201286 -128402 -1308508 -2250117
40866b250117k19564J08087J45009M20782P59009N58359j14818n51591m50871
$$ -2250117 -2469681 -2361594 -2216585 -1795803 -1036794 -478435 -593253 -1144844 -1595715
40857a595715k32136k56272l64886l23920j78518J2230L14822N85378M31754k06219
$$ -1595715 -1827851 -2084123 -2449009 -2772929 -2951447 -2939217 -2624395 -2039017 -1607263 -1813482
40847a813482p67682o62077M6317P56371R62189O10935J4200m22778m98918l60156
$$ -1813482 -2581164 -3243241 -3196924 -2440553 -1478364 -867429 -853229 -1276007 -1774925 -2135081
40837b135081k69121k36980m8885L56235P50321Q82594O85979K41765k28814l92350
$$ -2135081 -2404202 -2641182 -2690067 -2333832 -1583511 -700917 -14938 226827 -1987 -394337
40827c94337j26843K17712K26187M4439J64704N77116O72708J59467m41299n04397
$$ -394337 -521180 -303468 -77281 -32842 131862 708978 1381686 1541153 1099854 595457
40817E95457q2706L45652N41037N40356L24321j39835o58904r24023p90948l16193
$$ 595457 512751 858403 1399440 1939796 2264117 2124282 1465378 541355 -249593 -565786
40807e65786L07017P45505P26937L80443J06445L2732k7730l5509K77725O88000
$$ -565786 -258769 486736 1213673 1594116 1700561 1733293 1705563 1670054 1947779 2635779
40797B635779M74427m37612j048229o57541l1501l16532j256883j553332q08389
$$ 2635779 3110206 2672594 1624365 966824 935323 618791 -638092 -2191424 -2999813
40788b999813M131J24312J1581L60660R39300J000656L75714l74276o52440l33508
$$ -2999813 -2995682 -2871370 -2859789 -2499129 -1559829 -559173 -183459 -557735 -1210175 -1543683
40778a543683K25922M66473J16849m56121o10508k12548K30577K79153M6701j27438
$$ -1543683 -1317761 -851288 -734439 -1190560 -1801068 -2013616 -1783039 -1503886 -1457185 -1584623
40768a584623j14176N9336L42320N34601L45334j92814o21839n82428k34893Q734
$$ -1584623 -1698799 -1639463 -1297143 -762542 -417208 -610022 -1231861 -1814289 -2049182 -2040448
40758b040448k2119j69522j77507Q7944M96488P15851N90607L80922L77827M46990
$$ -2040448 -2062567 -2232089 -2409596 -2321652 -1825164 -1109313 -518706 -137784 240043 687033
40748F87033L41668K59527M93661O71958J43322q26223j140537m32844L51655
$$ 687033 1028701 1288228 1781889 2453847 2597169 1770946 630409 197565 549220
40739E49220L85015Q9009J81877M11437J45657l66162l44385K36425O76895O71654
$$ 549220 934235 1023244 1205121 1616558 1762215 1396053 1051668 1288093 1964988 2636642
40729B636642M89058J73965m79215j162261j199845o05888j55115k04418k42183
$$ 2636642 3125700 3299665 2820450 1658189 458344 -147544 -302659 -507077 -749260
40720g49260J29389N40776N47679K91477O2573j76819m01453k52193L15073O11204
$$ -749260 -619871 -79095 468584 760061 822634 645815 244362 -7831 307242 918446
40710I18446N2103r11964j276593p02212K02019O52826L90016k13128m30968J68067
$$ 918446 970549 58585 -1218008 -1920220 -1718201 -1065375 -675359 -888487 -1319455 -1151388
40700a151388J055357J084472p8955j257046j092509J88648J067764O98848j80881
$$ -1151388 -96031 988441 909486 -347560 -1440069 -1251421 -183657 515191 334310
40691C34310m40680N4666O08427P10571L81659k10563r04740j303216q71079L91513
$$ 334310 -106370 -51704 556723 1267294 1648953 1438390 533650 -769566 -1640645 -1249132
40681a249132J566468J552385L38724q04452p76307k1141J35877n86507j030537
$$ -1249132 317336 1869721 2208445 1403993 627686 606545 742422 155915 -874622
40672h74622l93242N26362N89089N5987R433M96465N15311k22189q10400o96534
$$ -874622 -1267864 -741502 -152413 -96426 -86993 409472 924783 702594 -107806 -804340
40662h04340m91271o92753o97686J01166J085962J234398N79142q2056m55433
$$ -804340 -1295611 -1988364 -2686050 -2584884 -1498922 -264524 314618 232562 -222871
40653b22871p61260q57618m26264J46386J43230k57667j83357M29640O33153M7568
$$ -222871 -984131 -1841749 -2268013 -2121627 -1978397 -2236064 -2419421 -1989781 -1356628 -1309060
40643a309060m40706p4386O33410Q17781N24096K93627J45421j90327n11609m64244
$$ -1309060 -1749766 -1824152 -1190742 -372961 151135 444762 590183 399856 -111753 -575997
40633e75997k62575k75786k14682L96336J171432J233768N50545m8675k14171
$$ -575997 -838572 -1114358 -1329040 -932704 238728 1472496 2023041 1974366 1760195
40624A760195m51538r64355j121008n22253K35114M26102J63331q2105l23232
$$ 1760195 1308657 344302 -776706 -1298959 -1063845 -637743 -474412 -556517 -879749
40615h79749p55775j091696r13397l84241M5608L58686P29374Q44371K73815n82531
$$ -879749 -1635524 -2727220 -3640617 -4024858 -3979250 -3620564 -2891190 -2046819 -1773004 -2355535
40605b355535p70771j08606N43543N62997L65163N20485P43432M05965l36731
$$ -2355535 -3126306 -3234912 -2691369 -2128372 -1763209 -1242724 -499292 -93327 -430058
40596d30058o53365j91791M67277O17851K54223j07226j39141J4066L6783j87924
$$ -430058 -1083423 -1275214 -807937 -190086 64137 -43089 -182230 -168164 -131381 -319305
40586c19305m87518n43068j40968N69860J048743P78350j41856r39691r20356
$$ -319305 -806823 -1349891 -1490859 -920999 127744 906094 764238 -175453 -1095809
40577a095809k15758M48957O72187O87150P14169N15813o9387n76411m49534O9599
$$ -1095809 -1311567 -862610 -190423 496727 1210896 1726709 1657322 1080911 631377 700976
40567G00976J82006l44808q28499n69634L22417J134421J233630M80550o43313
$$ 700976 882982 538174 -290325 -859959 -537542 596879 1830509 2311059 1667746
40558A667746j245940q22907L5238K43538l17336n88760R2840R44771Q92583J55239
$$ 1667746 421806 -401101 -365863 -122325 -439661 -1028421 -935581 9190 901773 1057012
40548A057012k08467M6959J80304j62771m65873m07280m05261o79292o55460N0751
$$ 1057012 848545 895504 1075808 913037 447164 39884 -365377 -1044669 -1700129 -1649378
40538a649378P57767O20408m4730j89631M18878R14361O14826j20479n01888k52702
$$ -1649378 -891611 -271203 -315933 -505564 -86686 827675 1442501 1322022 820134 567432
40528E67432K70834N28707K09019n01689r70327p40310j27998J60985N773k0858
$$ 567432 838266 1366973 1575992 1074303 103976 -636334 -764332 -603347 -597574 -618432
40518f18432M02958Q51529Q28712M19644m4247m69233p60202n90462Q0553O64198
$$ -618432 -215474 636055 1464767 1884411 1840164 1370931 610729 20267 100820 765018
40508G65018O67060L97594L65860L68739q1235p23530q40806m44131k24179l34038
$$ 765018 1432078 1829672 2195532 2564271 2483036 1759506 918700 474569 250390 -83648
40498h3648k37604R2759o1300q14842j184728n84601J66876J61232j40551K11867
$$ -83648 -321252 -228493 -289793 -1104635 -2289363 -2873964 -2707088 -2545856 -2686407 -2474540
40488b474540R94411J200488O84835K22750J35877L4416j23229J07422O04128
$$ -2474540 -1480129 -279641 405194 627944 763821 798237 675008 782430 1386558
40479A386558O10658J4788l32013K9601M28203J60600n11866r87142j155468j050497
$$ 1386558 1997216 2012004 1679991 1709592 2137795 2298395 1786529 799387 -356081 -1406578
40469a406578m55053M62173Q34161K23630n21753l98639K57646L48899k65828
$$ -1406578 -1861631 -1399458 -565297 -341667 -863420 -1262059 -1004413 -655514 -921342
40460i21342o50340k78889L32923N76050M87947L40201J78396L6018P4937K72112
$$ -921342 -1571682 -1850571 -1517648 -941598 -453651 -113450 64946 100964 175901 448013
40450D48013L73123K99541K08226P4471l17320q51502j036869o85132k10626k8194
$$ 448013 821136 1120677 1328903 1403374 1086054 234552 -802317 -1487449 -1698075 -1726269
40440a726269l0619Q6106L13512M38916M24934L96866L76705K34550j45764p15209
$$ -1726269 -1756888 -1670782 -1357270 -918354 -493420 -96554 280151 514701 368937 -346272
40430c46272j186043j152329m94158L49108P53622N69378J66256j28556k80988
$$ -346272 -1532315 -2684644 -3178802 -2829694 -2076072 -1506694 -1340438 -1468994 -1749982
40421a749982k24508K45852J017369J458675J049072Q5577n43187l17855L36119
$$ -1749982 -1974490 -1728638 -711269 747406 1796478 1882055 1338868 1021013 1357132
40412A357132N12909j57396j051968j246560o13907N9749J33847j20425j02683
$$ 1357132 1870041 1712645 660677 -585883 -1199790 -1140041 -1006194 -1126619 -1229302
40403a229302J82542K87429J38787P1534J56506J14897j01836k24648j92167k12513
$$ -1229302 -1046760 -759331 -620544 -549010 -392504 -277607 -379443 -604091 -796258 -1008771
40393a008771k69739j37515P8473K6357j98109j06908L14779N04918K67534P7668
$$ -1008771 -1278510 -1416025 -1337552 -1311195 -1509304 -1616212 -1301433 -796515 -528981 -451313
40383d51313J88794K16283k1487l5568M50461Q60402O02413n2640n11101p06471
$$ -451313 -262519 -46236 -67723 -103291 347170 1207572 1809985 1757345 1246244 539773
40373E39773q21222p21647l04777R1980K23024L51022N72750L91478l58476q93979
$$ 539773 -281449 -1003096 -1307873 -1215893 -992869 -641847 -69097 322381 -36095 -930074
40363i30074o43809k98947o74801j212151q46016J87025P92261Q57035J135388
$$ -930074 -1573883 -1872830 -2547631 -3759782 -4605798 -4418773 -3626512 -2769477 -1634089
40354a634089J532868J156611J07401m40765j92213j10858m63941k38150P89635
$$ -1634089 -101221 1055390 1162791 722026 529813 418955 -44986 -283136 506499
40345E06499J163645N4096j094998o60152O50786J015429L17932m0136L43875
$$ 506499 1670144 1724240 629242 -30910 619876 1635305 1953237 1913101 2256976
40336B256976L96444l70036r57910m85842N16821R74974O12864m6719m62488m85503
$$ 2256976 2653420 2283384 1325474 839632 1356453 2331427 2944291 2897572 2435084 1949581
40326A949581l59052m77937q61907r55736l69244L91074N47929K36052K68425
$$ 1949581 1590529 1112592 250685 -705051 -1074295 -683221 -135292 100760 369185
40317C69185P60660R02764K97827l76153m62554k84715m08484o03645l31080J33753
$$ 369185 1129845 2032609 2330436 1954283 1491729 1207014 798530 194885 -136195 -2442
40307b442l1364q37210j215874m15336Q99681J407378P14103k97823o25986j71904
$$ -2442 -33806 -871016 -2086890 -2502226 -1602545 -195167 518936 221113 -404873 -576777
40297e76777M80150Q24168O75921P1176o06744o98383n0373M92720Q3013p96780
$$ -576777 -96627 727541 1403462 1474638 867894 169511 119138 611858 694871 -101909
40287a01909q91439o5055M75404J34892j44871L86775Q63756K50815p56222p33316
$$ -101909 -993348 -1058403 -582999 -448107 -592978 -206203 657553 908368 152146 -581170
40277e81170J80353N82675J24822j12326L80361P56008M09486o1717o9877J6696
$$ -581170 -400817 181858 306680 194354 574715 1330723 1740209 1678492 1608615 1625311
40267A625311k00166l65985k33180l10512q70502j193319o31666L35599R11968
$$ 1625311 1425145 1059160 825980 515468 -355034 -1548353 -2180019 -1844420 -932452
40258i32452J086871J106236O49790m36219j256113q66862K74339R38734Q07408
$$ -932452 154419 1260655 1910445 1474226 218113 -648749 -374410 564324 1371732
40249A371732M38191m3367r28014j762033j556732l23973P50409R19611O29827
$$ 1371732 1809923 1766556 838542 -923491 -2480223 -2804196 -2053787 -1134176 -504349
40240e04349M00382K2960o49523j052865o96883L0107L94727J89005l07048p32035
$$ -504349 -103967 -81007 -730530 -1783395 -2480278 -2450171 -2055444 -1866439 -2173487 -2905522
40230b905522o99014q787Q54147J020032L86818j36889O7321M75212L99340J03154
$$ -2905522 -3604536 -3613323 -2759176 -1739144 -1352326 -1489215 -1421894 -946682 -547342 -444188
40220d44188J72532L58880K907p11081r26597m84709j85668n11349q95116o34647
$$ -444188 -271656 87224 90131 -620950 -1547547 -2032256 -2217924 -2729273 -3624389 -4259036
40210d259036O1576M25690K15278j9985K75941R08058J111212M79556m29985o65478
$$ -4259036 -4197460 -3771770 -3556492 -3576477 -3300536 -2392478 -1281266 -801710 -1231695 -1897173
40200a897173m9668O07808O52373M49194O34546R41685N73429l89415q84791m13106
$$ -1897173 -1946841 -1339033 -686660 -237466 397080 1338765 1912194 1522779 637988 224882
40190B24882J69939n0461o29701m47272N40568J161408O91261j88552m78587k48478
$$ 224882 394821 344360 -285341 -732613 -192045 969363 1660624 1472072 993485 745007
40180G45007k89028p29544q12824j25380O66618P14856J43800k42126j38549J4200
$$ 745007 455979 -273565 -1086389 -1211769 -545151 169705 313505 71379 -67170 -52970
40170e2970p9816j24459J03904K35800j12796o31874o87194j90049L60755N76811
$$ -52970 -132786 -257245 -153341 82459 -30337 -662211 -1349405 -1539454 -1178699 -601888
40160f01888M88602K50692q861o8156K09063N27067M15020q2180l82295j64261
$$ -601888 -113286 137406 128545 60389 269452 796519 1211539 1129359 747064 582803
40150E82803K22713L35607K15257J12845N883k36984m56737l74964m7582J95516
$$ 582803 805516 1141123 1356380 1469225 1475108 1238124 781387 406423 358841 554357
40140E54357K01349R7897L047r8895k15841l18065m29378n50684n45859l17422
$$ 554357 755706 853603 856650 757755 541914 223849 -205529 -756213 -1302072 -1619494
40130a619494m1682J518k00134m05224m52790l59927j65583M7180N2284k48201
$$ -1619494 -1661176 -1659658 -1859792 -2265016 -2717806 -3077733 -3243316 -3196136 -3143852 -3392053
40120c392053m90575j97512N01438R42267Q36583O28504P14280Q06794M78773
$$ -3392053 -3882628 -4080140 -3578702 -2636435 -1799852 -1171348 -457068 349726 828499
40111H28499p7609l61230l49406l90970m73670k29177L33129P01245N93954K95885
$$ 828499 750890 389660 40254 -350716 -824386 -1053563 -720434 -19189 574765 870650
40101H70650R8730p7235k73657k25869J31272L19591p1647p32265j024690p83916
$$ 870650 969380 892145 618488 392619 523891 843482 771835 39570 -985120 -1769036
40091a769036k97437K53094Q03026J037198O24696j75815o79919o06609k76796
$$ -1769036 -2066473 -1813379 -1010353 26845 651541 475726 -204193 -810802 -1087598
40082a087598K7034L31670N06158J76800n81948j038928p21636r3009J57158R9618
$$ -1087598 -1060564 -728894 -222736 -45936 -627884 -1666812 -2388448 -2481457 -2324299 -2224681
40072b224681K79307P30397R20461N75294k4476n49963q87034q79373l74072L49237
$$ -2224681 -1945374 -1214977 -294516 280778 256302 -293661 -1180695 -2060068 -2434140 -2084903
40062b084903P07859N64602L86888M58094M39973N6734k76372m3297M65349M66210
$$ -2084903 -1377044 -812442 -425554 32540 472513 529247 252875 209578 674927 1141137
40052A141137j72249p01428n27695L2570K98884J41332m2997n8498j41939m23510
$$ 1141137 968888 267460 -260235 -227665 71219 212551 169554 111056 -30883 -454393
40042d54393n77199k75624K50292M71553L05565J90794L33695L31764j28114n62294
$$ -454393 -1031592 -1307216 -1056924 -585371 -279806 -89012 244683 576447 448333 -113961
40032a13961k44135O45686J061329M64593l91849m52594K30393O05105M1132q65636
$$ -113961 -358096 287590 1348919 1813512 1421663 969069 1199462 1804567 1845699 980063
40022I80063j075394l68730M68567O45114K46544m6455P0133K21548Q5460n8906
$$ 980063 -95331 -464061 4506 649620 896164 849709 919842 1141390 1226850 1167944
40012A167944R7767J78545l42346j066332j003490r9907M88843P2954n00354j60326
$$ 1167944 1265711 1444256 1101910 35578 -967912 -1067819 -578976 -506022 -1006376 -1166702
40002a166702P38628J037175N48337J32025K24188L94596L55098L33692L00547
$$ -1166702 -428074 609101 1157438 1289463 1513651 1908247 2263345 2597037 2897584
39993B897584j37128p97465q99517l58759q8278m94743p28004j59341M31794J63201
$$ 2897584 2760456 1962991 1063474 704715 616437 121694 -606310 -765651 -333857 -170656
39983a70656l60033n4041O85463N40680m77161r11139j39038P04399N61700q1244
$$ -170656 -530689 -584730 100733 641413 164252 -746887 -885925 -181526 380174 298930
39973B98930k92115j83750l55197n93177k02632P15350J274512J018652L82829
$$ 298930 6815 -176935 -532132 -1125309 -1327941 -612591 661921 1680573 2063402
39964B063402p8495l04595m52647m96371l30862l7225J45296P7956p9125J0371
$$ 2063402 1984907 1680312 1227665 731294 400432 363207 508503 586459 507334 517705
39954E17705M04396O54499L64896q3312P5355P49044Q47208j78291j318289j273510
$$ 517705 922101 1576600 1941496 1858184 1933539 2682583 3529791 3351500 2033211 759701
39944G59701k72704L01807r7539o01905m62263j51829m01214q75534o15412M81505
$$ 759701 486997 788804 691265 89360 -372903 -524732 -925946 -1801480 -2416892 -1935387
39934a935387J373206J169450K22189l48992Q938P42109R94891O46170K51908
$$ -1935387 -562181 607269 829458 480466 489404 1231513 2226404 2872574 3124482
39925C124482J03589j37335o80496j007427n51035L24986O81811K82641j43043
$$ 3124482 3228071 3090736 2410240 1402813 851778 1176764 1858575 2141216 1998173
39916A998173l4977K28909J8951n95844j043285j086298r71688q49441m96165
$$ 1998173 1963196 2192105 2211056 1615212 571927 -514371 -1486059 -2335500 -2831665
39907b831665K77218J194431J657944J303967L80007m51606p15038m91980j67785
$$ -2831665 -2554447 -1360016 297928 1601895 1981902 1530296 815258 323278 155493
39898A55493M7722J91581K84477K72037J95669J74283K23875K87093L49648L00126
$$ 155493 203215 394796 679273 951310 1146979 1321262 1545137 1832230 2181878 2482004
39888B482004j28183q90180j307492p96023J56049M30632j95818o94367k34380
$$ 2482004 2353821 1463641 156149 -639874 -483825 -53193 -249011 -943378 -1177758
39879a177758O89394J023029M91008l25754p88999n90303K22407J070956J096484
$$ -1177758 -488364 534665 1025673 699919 -89080 -679383 -456976 613980 1710464
39870A710464J59111p49528o71521P4086M40206J12881l17862m09114k57770P3925
$$ 1710464 1869575 1120047 448526 522612 962818 1075699 757837 348723 90953 164878
39860A64878O82290J279722J274366N79164k48810p78925j007447q38254m1820
$$ 164878 847168 2126890 3401256 3980420 3731610 2952685 1945238 1106984 1065164
39851A065164J018721J384969O76530l20882p07586n86940n97039p83410o36402
$$ 1065164 2083885 3468854 4145384 3824502 3116916 2529976 1932937 1149527 513125
39842E13125p4090K86968l8017p31213j052402o97205n4846L88128O75471J131683
$$ 513125 439035 726003 687986 -43227 -1095629 -1792834 -1847680 -1459552 -784081 347602
39832C47602J551862J191149j00771j256068j171601k06995L18045j2077k97842
$$ 347602 1899464 3090613 2989842 1733774 562173 355178 673223 661146 363304
39823C63304J21235P01567O80191J67228k90937n50754o91091n65348j25087K55506
$$ 363304 484539 1186106 1866297 2033525 1742588 1191834 500743 -64605 -189692 65814
39813F5814K76003J04353r2577m27824p05262l10964P19444J332411R32148M08595
$$ 65814 341817 446170 353593 -74231 -779493 -1090457 -371013 961398 1893546 2302141
39803B302141O96912J104666L96532j016345j524722p64795m4221k17928o48089
$$ 2302141 2999053 4103719 4500251 3483906 1959184 1194389 1150168 932240 284151
39794B84151o39554m86759m88009j84236O13770J065902M69691n69803r67442
$$ 284151 -355403 -842162 -1330171 -1514407 -900637 165265 634956 65153 -902289
39785i02289n48677J07195O08491Q11843N26909p2161k60868K46159O45436K14648
$$ -902289 -1450966 -1343771 -735280 76563 603472 531311 270443 516602 1162038 1376686
39775A376686m04896j22511P88253R79262N3919q70346q44982l17898k47933p74449
$$ 1376686 971790 849279 1637532 2616794 2670713 1800367 955385 637487 389554 -384895
39765c84895j294347j334733q57883n8384P10989J039237Q26084M19666J83894
$$ -384895 -1679242 -3013975 -3871858 -3930242 -3219253 -2180016 -1353932 -934266 -750372
39756g50372R2596p2154k89143k74511J58051Q05070J133561P22414k05911q03147
$$ -750372 -657776 -729930 -1019073 -1293584 -1135533 -330463 803098 1525512 1319601 516454
39746E16454m20685O00530J247286R65985J98598k65047j72563R5462Q8029k53680
$$ 516454 95769 696299 1943585 2909570 3108168 2843121 2670558 2766020 2854049 2600369
39736B600369o19135p07601n83022n91253q55308j008173o40572J00925O48503
$$ 2600369 1981234 1273633 690611 99358 -755950 -1764123 -2404695 -2303770 -1655267
39727a655267O97277M57532K34539Q4327l4264n2862J04003L58528N16401L97340
$$ -1655267 -957990 -500458 -265919 -181592 -215856 -268718 -164715 193813 710214 1107554
39717A107554k4942m95907o10178k57741J93971L81218L99899M69146M12597j5824
$$ 1107554 1082612 586705 -23473 -281214 -87243 293975 693874 1163020 1575617 1559793
39707A559793m89801m60240r3124j13555o17369q39837l94430N7401j33340n80350
$$ 1559793 1069992 609752 516628 403073 -214296 -1054133 -1448563 -1391162 -1524502 -2104852
39697b104852n54551j29832J38465K76198P62275J499516J749987J167562K46592
$$ -2104852 -2659403 -2789235 -2650770 -2374572 -1612297 -112781 1637206 2804768 3051360
39688C051360l75551n54303n04278m97235p41167j117893j049609j37803J058848
$$ 3051360 2675809 2121506 1617228 1119993 378826 -739067 -1788676 -1926479 -867631
39679h67631J484229R28867K89224K72066M83442J90508n66720j136610j138890
$$ -867631 616598 1545465 1834689 2106755 2590197 2780705 2213985 1077375 -61515
39670f1515o77159K9511P05423R28676N25955m0432j60452J12511K02679q2319
$$ -61515 -738674 -709163 -3740 924936 1450891 1410459 1250007 1362518 1565197 1482878
39660A482878l11575j74344N3610J6933j57883j29102J03263K45383J66836M891
$$ 1482878 1171303 996959 1050569 1067502 909619 780517 883780 1129163 1295999 1300890
39650A300890j11920j61703p2095K43535O06303N79743k7300p74672r57937m05903
$$ 1300890 1188970 1027267 955172 1198707 1805010 2384753 2357453 1582781 624844 218941
39640B18941K75297L71439j57209p17490q07206m81434j29656l6214k08562m12488
$$ 218941 494238 865677 708468 -9022 -816228 -1297662 -1427318 -1463532 -1672094 -2084582
39630b084582l08667K04052P03563O16235K4149k84377J37095P06417O58836K16134
$$ -2084582 -2393249 -2189197 -1485634 -869399 -845250 -1129627 -992532 -286115 372721 588855
39620E88855J95236O30073O83027O8097l60747P7809P57225O41284j98674p87342
$$ 588855 784091 1414164 2097191 2165288 1804541 1882350 2639575 3280859 3082185 2294843
39610B294843o79837l34201j29198J11030M26890L47744l46178j009387q14356
$$ 2294843 1615006 1280805 1151607 1262637 1689527 2037271 1691093 681706 -132650
39601a32650J76101J042156J037631L02966m26400o18079l84187j71621j22472
$$ -132650 43451 1085607 2123238 2426204 1999804 1381725 997538 825917 703445
39592G03445K3359L19635L30122j41399m33135J26435R44543P20524n76705j359533
$$ 703445 726804 1046439 1376561 1235162 802027 928462 1873005 2593529 2016824 657291
39582F57291n91505O68278P71593k16759q56625n46387j28624l01496o23817m37559
$$ 657291 65786 734064 1505657 1288898 432273 -114114 -242738 -544234 -1168051 -1605610
39572a605610J57454P09655J076578J216492R25976K78031j68208q6562Q3479
$$ -1605610 -1448156 -738501 338077 1554569 2480545 2758576 2590368 2503806 2587285
39563B587285k12237q05709j084294q13285k33410L93890Q65944Q89020L67823
$$ 2587285 2375048 1569339 485045 -328240 -561650 -167760 698184 1587204 1955027
39554A955027k57659m26523j58925O0581M2297Q2976L51346N16139K05308m03532
$$ 1955027 1697368 1270845 1111920 1172501 1214798 1297774 1649120 2165259 2370567 1967035
39544A967035o94972l00600M29000P16296J93606o12400q19812k04357N80785
$$ 1967035 1272063 971463 1400463 2116759 2310365 1697965 878153 673796 1254581
39535A254581Q18816M27668k29639q00180j000665o71700j05574P6360k47395
$$ 1254581 2073397 2501065 2271426 1471246 470581 -201119 -306693 -230333 -477728
39526d77728l87033J89761R66781J017767K27348p15963j260772j279062o98612
$$ -477728 -864761 -675000 291781 1309548 1536896 820933 -439839 -1718901 -2417513
39517b417513L46393J137275R98052L10843R0842N04071O91143K24496k14394
$$ -2417513 -2071120 -933845 64207 375050 465892 969963 1661106 1885602 1671208
39508A671208P5M60957M69327N9301l09929n21110o59516n73328j67112K18531
$$ 1671208 1671283 2132240 2601567 2660868 2350939 1829829 1170313 596985 429873 648404
39498F48404K28224k8273l12254o44385r41702p90152j19133M04385K67947j00088
$$ 648404 876628 848355 536101 -108284 -1049986 -1840138 -1959271 -1554886 -1286939 -1387027
39488a387027j13034m0826l62009n91821R7356J283368J551462M96927o21271
$$ -1387027 -1500061 -1540887 -1902896 -2494717 -2397361 -1113993 437469 934396 313125
39479C13125n97422K50284P97495N70709n9427o07973q37079o84711k73168J30703
$$ 313125 -284297 -34013 763482 1334191 1274764 666791 -170288 -854999 -1128167 -997464
39469i97464L51642L63553J39228k43040m22017j61106J04613k72957j096064
$$ -997464 -645822 -282269 -143041 -386081 -808098 -969204 -864591 -1137548 -2233612
39460b233612j389938p07031K96231Q33157Q77911P63821N50459K29812J7377
$$ -2233612 -3623550 -4330581 -4034350 -3201193 -2323282 -1559461 -1009002 -779190 -761813
39451g61813O340L207K5919L75918Q76649P83144l6756o06810k21506M20474L21817
$$ -761813 -755473 -752266 -726347 -350429 526220 1309364 1272608 665798 444292 864766 1186583
39440A186583k54052l76180n0127r451k43688o7318M23164L30044m09927o80108
$$ 1186583 932531 556351 506224 496773 253085 185767 608931 938975 529048 -151060
39430a51060O5916Q70196P43758J00718q5416J88231J68790l59754q50940q71292
$$ -151060 -85144 785052 1528810 1629528 1544112 1732343 1901133 1541379 690439 -180853
39420a80853n41802j97668q4686k87412n84431n19132O1470P13429R25816P16711
$$ -180853 -722655 -920323 -1005009 -1292421 -1876852 -2395984 -2334514 -1621085 -695269 21442
39410B1442M12089J14493k38163n29512n92525n17723m70331l57055k6410L52629
$$ 21442 433531 548024 309861 -219651 -812176 -1329899 -1800230 -2157285 -2183695 -1831066
39400a831066M71298L18333J10502p3279k43263k18531K06852Q39205J147861
$$ -1831066 -1359768 -1041435 -930933 -1004212 -1247475 -1466006 -1259154 -419949 727912
39391G27912P92752n5527q35253r44142k41524O05931O30615k65007j013233o93486
$$ 727912 1520664 1465137 629884 -314258 -555782 50149 680764 415757 -597476 -1290962
39381a290962K33828O01169J35779l75313l89897k14453j80507n5862L33515N45154
$$ -1290962 -1057134 -455965 -320186 -695499 -1085396 -1299849 -1480356 -1536218 -1202703 -657549
39371f57549J24312o10720q90686m23189L62833Q61512P88458K57942l54360o51096
$$ -657549 -533237 -1143957 -2034643 -2457832 -2094999 -1233487 -445029 -187087 -541447 -1192543
39361a192543m98475r3623K76255M65318M75782L99223L79163M68482M94250K25196
$$ -1192543 -1691018 -1784641 -1508386 -1043068 -567286 -168063 211100 679582 1173832 1399028
39351A399028k96386p22334o99123j27429P37518J306291J037322J04827n69518
$$ 1399028 1102642 380308 -318815 -446244 291274 1597565 2634887 2739714 2170196
39342B170196l68437J84828J64593m44030q79056q64833q35791q90601n49628
$$ 2170196 1801759 1986587 2151180 1707150 828094 -36739 -872530 -1763131 -2312759
39333b312759J81524N28284J91167r9392J29406K46862k17614m49812L47741J303645
$$ -2312759 -2131235 -1602951 -1411784 -1511176 -1381770 -1134908 -1352522 -1802334 -1454593 -150948
39323a50948R70974l30866q16813J30913J132953R52909J04686l18258k81580
$$ -150948 820026 489160 -327653 -196740 936213 1889122 1993808 1675550 1393970
39314A393970l84110n88183l91904J03056K14545k63306o98809m72095J98804
$$ 1393970 1009860 421677 29773 132829 347374 84068 -614741 -1086836 -888032
39305h88032N00246J3321o86714o23404L18494J089425Q03239j3271j78290L92741
$$ -888032 -387786 -374465 -1061179 -1684583 -1366089 -276664 526575 513304 335014 727755
39295G27755O45596J28202l08578N4643O64975O51738J18521l01631n29760p97736
$$ 727755 1373351 1501553 1192975 1247618 1912593 2564331 2682852 2381221 1851461 1053725
39285A053725q18322j74997P17039R74233M88879o634q5219m0101j03042k5620
$$ 1053725 235403 60406 777445 1751678 2240557 2233923 2148704 2108603 2005561 1979941
39275A979941L46642P08448P69688O41508N43337M97182M54447L97376K32396
$$ 1979941 2326583 3035031 3804719 4446227 4989564 5486746 5941193 6338569 6570965
39266F570965j19706n26607q30369j109315j375533j236155m48283L53512K61149
$$ 6570965 6451259 5924652 5094283 3984968 2609435 1373280 924997 1278509 1539658
39257A539658n49987q94594k17360O49198P46350K67007J8495J81856K64109k9775
$$ 1539658 989671 95077 -122283 526915 1273265 1540272 1558767 1740623 2004732 1974957
39247A974957m50562n81859j97298N68107J134004Q56348j90065j094318j091426
$$ 1974957 1524395 942536 745238 1313345 2447349 3303697 3113632 2019314 927888
39238I27888l95145K14591K95857n9963n42173p41550l16172N33173J052952P95323
$$ 927888 532743 747334 1043191 983228 441055 -300495 -616667 -83494 969458 1764781
39228A764781J75768j73229j78560m7792K35564N37521K61268p54287j475401
$$ 1764781 1940549 1767320 1588760 1540968 1776532 2314053 2575321 1821034 345633
39219C45633q38942N67477J108651L53267m43200l14259J32792n2854o29547o49839
$$ 345633 -493309 74168 1182819 1536086 1092886 778627 911419 858565 229018 -420821
39209d20821J07663R34285J105720M85308m93647j056355o44138L83012R67255
$$ -420821 -313158 621127 1726847 2212155 1718508 662153 18015 401027 1368282
39200A368282O21137K9406j8544K35368O1094n07428p30139k92756L31022O23029
$$ 1368282 1989419 2018825 2000281 2235649 2296743 1789315 1059176 766420 1097442 1720471
39190A720471N30006K17909j40614k77011j0812L88254M35522R2233k15158k85622
$$ 1720471 2250477 2468386 2327772 2050761 2039949 2428203 2863725 2955958 2740800 2455178
39180B455178l83238o37274o78853k00388M38193N49449l8708p65825r50464m35995
$$ 2455178 2071940 1434666 755813 555425 993618 1543067 1504359 738534 -211930 -647925
39170f47925L66904R18420R69914O50290K65665N1644M6289J11567Q5717l5970
$$ -647925 -281021 637399 1607313 2257603 2523268 2574912 2621201 2732768 2818485 2782515
39160B782515j19433j36983k47324m83183n51892k35147J81306K79704J79444
$$ 2782515 2663082 2526099 2278775 1795592 1243700 1008553 1189859 1469563 1649007
39151A649007L13351O17224O16793L57981M23721P85183N63487n38262j453283
$$ 1649007 1962358 2579582 3196375 3554356 3978077 4763260 5326747 4788485 3335202
39142C335202j176174k14879L03630L07983M51495O44045K45196n22800p34994
$$ 3335202 2159028 1944149 2247779 2555762 3007257 3651302 3896498 3373698 2638704
39133B638704l32904j83137m32935k23656N88862Q77415R1036o73236m01404J79232
$$ 2638704 2305800 2122663 1689728 1466072 2054934 2932349 3023385 2350149 1948745 2127977
39123B127977j38123r95689j052582j11345O96516O98446M30854M98185P08258
$$ 2127977 1989854 994165 -58417 -169762 526754 1225200 1656054 2154239 2862497
39114B862497O37607L08180l1965l01049n00835n91108o05949o41047o68339n72690
$$ 2862497 3500104 3808284 3776319 3475270 2974435 2383327 1777378 1136331 467992 -104698
39104a04698l47407p7928J56498K13613m5567m23716m38859J0724L73415J74609
$$ -104698 -452105 -530033 -373535 -159922 -205489 -629205 -1068064 -1057340 -683925 -509316
39094e09316l14253m89590j56270M59983R91650Q93227k27496j709434j993841
$$ -509316 -823569 -1313159 -1469429 -1009446 -17796 875431 647935 -1061499 -3055340
39085c055340m86474J361307J787142R62853L68767M27337K24793n35672q70977
$$ -3055340 -3541814 -2180507 -393365 569488 938255 1365592 1590385 1054713 183736
39076A83736j58953Q51890J204132Q87571L41974k61864p11988n61785J70984
$$ 183736 24783 876673 2080805 2968376 3310350 3048486 2336498 1774713 1945697
39067A945697P59825O90464K43991j43369m07452m58837p2127M53033L61325l76716
$$ 1945697 2705522 3395986 3639977 3496608 3089156 2630319 2558192 3011225 3372550 2995834
39057B995834p92717l34665L03868L50998Q7428J11161K80401J82909l6550j10815
$$ 2995834 2203117 1868452 2172320 2523318 2610746 2721907 3002308 3185217 3148667 3037852
39047C037852k72564o70007p99678l13898K39324K88630J87980M34212O37511
$$ 3037852 2765288 2095281 1295603 981705 1221029 1509659 1697639 2131851 2769362
39038B769362K61896k54964j99467J72481J90403O080R9260J08248n25373j217014
$$ 2769362 3031258 2776294 2576827 2749308 2939711 2945791 3045051 3153299 2627926 1410912
39028A410912r74571j19008K09713l8895j2452J89441l21403j195091r65958M17546
$$ 1410912 436341 317333 527046 488151 475699 665140 343737 -851354 -1817312 -1399766
39018a399766J136582K77191p61980n79323K02404L93594K14269M23647P19316
$$ -1399766 -263184 14007 -747973 -1327296 -1124892 -731298 -517029 -93382 625934
39009F25934N10388L01857P54699J138527L43846j061817j410010l70505O60629
$$ 625934 1136322 1438179 2192878 3331405 3675251 2613434 1203424 832919 1493548
39000A493548O17891j02489p00047r71588r70561o40022j39953J69121L01828
$$ 1493548 2111439 2008950 1308903 337315 -633246 -1273268 -1413221 -1244100 -942272
38991i42272N98341J004578J070507P75719O52004Q72167Q68853J83267q02621
$$ -942272 -343931 660647 1731154 2506873 3158877 4031044 4899897 5083164 4280543
38982D280543j328693j143074o65909m50796o25051p74461m09568L77187R20682
$$ 4280543 2951850 1808776 1142867 692071 67020 -707441 -1117009 -739822 180860
38973A80860P96012K95252j44951n29025q91729q20018o3319P70105R23450O20715
$$ 180860 976872 1272124 1127173 598148 -293581 -1113599 -1176918 -406813 516637 1137352
38963A137352O21552Q68151O10129j40570m19794J33325N91124J52654o36827
$$ 1137352 1758904 2627055 3237184 3096614 2676820 2810145 3401269 3553923 2917096
38954B917096p95575l72724j88526n08487q04768p05921m43669k65305M734N38368
$$ 2917096 2121521 1748797 1560271 1051784 247016 -458905 -902574 -1167879 -1163145 -624777
38944f24777J004414Q86277K33156k58080r4787L14983K00208m13961o49976q2342
$$ -624777 379637 1265914 1499070 1240990 1146203 1461186 1661394 1247433 597457 515115
38934E15115N28791L37361k75735k92614L18206N29294j43165q89600p98646o3107
$$ 515115 1043906 1381267 1105532 812918 1131124 1660418 1517253 627653 -170993 -234100
38924b34100M84588N14604L45898K59007J61594j25683n37774p48147m70130J37606
$$ -234100 250488 765092 1110990 1369997 1531591 1405908 868134 119987 -350143 -212537
38914b12537M97961K92874o3596j3444K78161J93916l21446o88432o23322m16464
$$ -212537 285424 578298 514702 501258 779419 973335 651889 -36543 -659865 -1076329
38904a076329k04572K39942P75492P54014o383q11393j042292q37071m42912L07698
$$ -1076329 -1280901 -1040959 -265467 488547 482164 -329229 -1371521 -2208592 -2651504 -2343806
38894b343806J304920J732988J120337K18654N509L02774K55215k44124n86795
$$ -2343806 -1038886 694102 1814439 2033093 2038602 2341376 2596591 2352467 1765672
38885A765672o31816p96844j009629o18857M16400J138885Q20463n2191m72460
$$ 1765672 1133856 337012 -672617 -1291474 -875074 263811 1084274 1032083 559623
38876E59623j59972L28661M56917K36550k7374j58958j51093L0221M15369P58714
$$ 559623 399651 728312 1185229 1421779 1394405 1235447 1084354 1114575 1529944 2288658
38866B288658O09579n0005n09609j87989L97192K55796n03888o94150Q6262O70751
$$ 2288658 2898237 2848232 2338623 2150634 2547826 2803622 2299734 1605584 1691846 2362597
38856B362597N8896j047275j386288j003202p93058p77088k32211O91802R14883
$$ 2362597 2421493 1374218 -12070 -1015272 -1808330 -2585418 -2817629 -2125827 -1210944
38847a210944J32520o49732o03710o3463L36536N49085O73365M54613k00863p85144
$$ -1210944 -1078424 -1728156 -2331866 -2395329 -2058793 -1509708 -836343 -381730 -582593 -1367737
38837a367737p61717j99808M35892P29295M31169l32694q63532n14431L59443
$$ -1367737 -2129454 -2329262 -1893370 -1164075 -732906 -1065600 -1929132 -2443563 -2084120
38828b084120P43167L85649J08423M72473R74759R41812M35030j62844o99339
$$ -2084120 -1340953 -955304 -846881 -374408 600351 1542163 1977193 1814349 1115010
38819A115010r27098m28488N41161Q84745N1504j021347j085679j82316O48376
$$ 1115010 187912 -240576 300585 1185330 1236834 215487 -870192 -1052508 -404132
38810d04132P80368L98391j11431m34816k99985J72786L63993n9494n89757o10067
$$ -404132 376236 774627 663196 228380 -71605 101181 465174 405680 -184077 -794144
38800g94144k46276M1079J96457L08637K00680k8594K93203J317103J933757J162751
$$ -794144 -1040420 -999341 -802884 -494247 -293567 -322161 -28958 1288145 3221902 4384653
38790D384653k85502r85457q25422p64201r87653q26734l34510l20897p09551
$$ 4384653 4099151 3113694 2288272 1524071 536418 -290316 -624826 -945723 -1655274
38781a655274m66307N01747R37350K62074m65671l40460L4120j18314l31649P2532
$$ -1655274 -2121581 -1619834 -682484 -420410 -886081 -1226541 -1192421 -1310735 -1642384 -1569852
38771a569852N93776M14250j47328k53190J0329q126k30824j03499K30192J72050
$$ -1569852 -976076 -561826 -709154 -962344 -952015 -960141 -1190965 -1294464 -1064272 -892222
38761h92222j63679j50971J50257J19801j66328N3707Q44718J271477P70883o7952
$$ -892222 -1055901 -1206872 -1056615 -936814 -1103142 -1049435 -204717 1066760 1837643 1769691
38751A769691m48611l42134j44530J484J32305J76965R6315j0920j31931l50150
$$ 1769691 1321080 978946 834416 835900 968205 1145170 1241485 1230565 1098634 748484
38741G48484n44194m51326j03005J79468K53653K34660J50457j8934l5695K96916
$$ 748484 204290 -247036 -350041 -170573 83080 317740 468197 449263 413568 710484
38731G10484N93789L17412k63348l26597J89556L94855j55920p44358o22571p1238
$$ 710484 1304273 1621685 1358337 1031740 1221296 1616151 1460231 715873 93302 22064
38721B2064K59637L64850N39394N84186J34413n69616r29981p59135k62924L92424
$$ 22064 281701 646551 1185945 1770131 1904544 1334928 404947 -354188 -617112 -224688
38711b24688R28627P95024j18460r40821p75482M5547M60767K16272L335J67606
$$ -224688 703939 1498963 1380503 439682 -335800 -290253 170514 386786 390121 557727
38701E57727K83314J25229Q5842L22169L66497M423k54020r9026r5101p59724
$$ 557727 841041 966270 1052112 1374281 1740778 1745201 1491181 1392155 1297054 537330
38691E37330j512488j311614o7236J240557J709725J251436L32853m69032p14797
$$ 537330 -975158 -2286772 -2354008 -1113451 596274 1847710 2180563 1711531 996734
38682I96734l94837k499L2337p4845J85109P71337J072358P60541K01417j36085
$$ 996734 601897 599398 631735 556890 741999 1513336 2585694 3346235 3547652 3411567
38672C411567k65013m31077o09622o03829m79295n18474p17798o58116p5551O30384
$$ 3411567 3146554 2715477 2105855 1502026 1022731 504257 -213541 -871657 -947208 -316824
38662c16824P78073K95703j18701P1381M70384L21090l47241p20106l81516J26828
$$ -316824 461249 756952 638251 709632 1180016 1501106 1153865 433759 52243 179071
38652A79071J87270l4267n7670O9528J3209q9992J69138O44710P31174L27053
$$ 179071 366341 332074 274404 343932 357141 267149 436287 1080997 1812171 2139224
38642B139224J0726Q0730Q7898l37693p79029o58404j66846K5087k04295k82586
$$ 2139224 2149950 2230680 2318578 1980885 1201856 543452 376606 401693 197398 -85188
38632h5188J45962O73089P13819L24900J16151M20506Q37200P31841M9279o02628
$$ -85188 60774 733863 1447682 1772582 1888733 2309239 3146439 3878280 3927559 3324931
38622C324931o97274l66668q4425j3719K8420J08208P4738q5463j76885j52417
$$ 3324931 2627657 2260989 2176564 2162845 2191265 2299473 2374211 2288748 2111863 1959446
38612A959446j95329l41185l56203j21579J93347M67150P50727Q96699N51992
$$ 1959446 1764117 1422932 1066729 945150 1138497 1605647 2356374 3253073 3805065
38603C805065j52059l88988L41408J298217J239549k5432j397443j798618j197400
$$ 3805065 3653006 3264018 3605426 4903643 6143192 6117760 4720317 2921699 1724299
38594A724299k55203N22013J027521J294018J295149R38228K01960o22466r49379
$$ 1724299 1469096 1991109 3018630 4312648 5607797 6546025 6747985 6125519 5176140
38585E176140m56041M19074Q76104O64648K53356Q3816Q4666L5253l5384l9559
$$ 5176140 4720099 5139173 6015277 6679925 6933281 7017097 7101763 7137016 7101632 7062073
38575G062073m1887j6120K64193P87088J066619P05320n0842o72052j006222j161153
$$ 7062073 7020186 7004066 7268259 8055347 9121966 9827286 9776444 9104392 8098170 6937017
38565F937017r79154k38118O64616Q85293K20304m85962l80270L01457O07327
$$ 6937017 5957863 5719745 6384361 7269654 7489958 7003996 6623726 6925183 7532510
38556G532510J40464n43674q27989q32392j030054j357686j178988j93147R93960
$$ 7532510 7672974 7129300 6301311 5468919 4438865 3081179 1902191 1709044 2703004
38547B703004J488702J141253O37310N69402P46250N80754p9462p67096r53538
$$ 2703004 4191706 5332959 5970269 6539671 7285921 7866675 7787213 7020117 6066579
38538F066579n84802r4201k4506n53234j199628j094599J43491J754195K382959
$$ 6066579 5481777 5387576 5363070 4809836 3610208 2515609 2659100 4413295 6796254
38529F796254J500111O4191n02573J16496R00654Q05045o6589p64465o50246P6158
$$ 6796254 8296365 8360556 7857983 7974479 8875133 9680178 9613589 8849124 8198878 8275036
38519H275036Q37330J251002J224973Q76519N31623N19488P72237Q75035O94905
$$ 8275036 9112366 10363368 11588341 12464860 12996483 13515971 14288208 15163243 15858148
38510A5858148O29198R31551J176025R19888N99517R98150J875347K035400J069307
$$ 15858148 16487346 17418897 18594922 19514810 20114327 21112477 22987824 25023224 26092531
38501B6092531J81126O42135K046533K944639K867863K783375L538762M730784
$$ 26092531 26273657 26915792 28962325 31906964 34774827 37558202 41096964 45827748
38493D5827748N431951N426025N304189N690498O734667Q167865R588753J0811766
$$ 45827748 51259699 56685724 61989913 67680411 74415078 82582943 92171696 102983462
38485A02983462J2085741J3859784J6290409J9153925K2227886K5474369K8840464
$$ 102983462 115069203 128928987 145219396 164373321 186601207 212075576 240916040
38478B40916040L2230385L5672788L8967789M0954108L9712397L4019683K4338619
$$ 240916040 273146425 308819213 347787002 388741110 428453507 462473190 486811809
38471D86811809J2038301j864131j6491743k9960289l9530564m3464460m2428064
$$ 486811809 498850110 496985979 480494236 450533947 411003383 367538923 325110859
38464C25110859l8764479l4557540l0524198k6468233k2374308j8860228j6549873
$$ 325110859 286346380 251788840 221264642 194796409 172422101 153561873 137012000
38457A37012000j5168453j3642051j1333017q875949p366300o922187o617658
$$ 137012000 121843547 108201496 96868479 87992530 80626230 73704043 67086385
38450F7086385n789361m741271l987916l463294k878292k343006k120762k110843
$$ 67086385 61297024 56555753 52567837 49104543 46226251 43883245 41762483 39651640
38442C9651640k071506k059652k122161j837313q43909K97500N38055k40171r31400
$$ 39651640 37580134 35520482 33398321 31561008 30717099 31014599 31552654 31312483 30381083
38433C0381083o26212K78097Q37746R56207J378211K462288L597142L995106L664792
$$ 30381083 29754871 30032968 30870714 31826921 33205132 35667420 39264562 43259668 46924460
38424D6924460L326273L517399M020569M184236L647633K604402J396653J02951
$$ 46924460 50250733 53768132 57788701 61972937 65620570 68224972 69621625 69724576
38416F9724576j303443k611552l542753m176792m773544n138567m684571l352236
$$ 69724576 68421133 65809581 62266828 58090036 53316492 48177925 43493354 40141118
38408D0141118j979585j366021j369994j402827j421790j755624k176531j984365
$$ 40141118 38161533 36795512 35425518 34022691 32600901 30845277 28668746 26684381
38400B6684381j091649k56514K4258J70351O80790J274246J450723J459049J990297
$$ 26684381 25592732 25336218 25360476 25530827 26211617 27485863 28936586 30395635 32385932
38391C2385932L089103M035018M307307M111934L867144L647319L295547K698796
$$ 32385932 35475035 39510053 43817360 47929294 51796438 55443757 58739304 61438100
38383F1438100J752984L50331j386448l034257m163989m578218m279938l493432
$$ 61438100 63191084 63541415 62154967 59120710 54956721 50378503 46098565 42605133
38375D2605133k749256k560804k823130k861579k331387j761136j844413k417873
$$ 42605133 39855877 37295073 34471943 31610364 29278977 27517841 25673428 23255555
38367B3255555k605313j942985r39148m07275n62849r62875j126637r82514p60601
$$ 23255555 20650242 18707257 17768109 17360834 16797985 15835110 14708473 13725959 12965358
38358A2965358o40014n84706m80458l38954k86068l67644m80877n27720n12144
$$ 12965358 12325344 11740638 11260180 10921226 10635158 10267514 9786637 9258917 8746773
38349H746773m38606k81006j47593k65864o09738p46366l64212J73849K00141
$$ 8746773 8308167 8027161 7879568 7613704 7003966 6257600 5893388 6067237 6267378
38340F267378l27052o70290k57576N30663P78298R6711r29776j321381o61276
$$ 6267378 5940326 5270036 5012460 5543123 6321421 6418132 5488356 4166975 3505699
38331C505699M48662R11811K77290p01220r19797k75704K83249J13262l35636
$$ 3505699 3954361 4866172 5143462 4442242 3522445 3246741 3529990 3643252 3307616
38322C307616m07558k88166n15182q77301o61472J31258O98451O67870N63245
$$ 3307616 2900058 2611892 2096710 1219409 557937 689195 1387646 2055516 2618761
38313B618761P38169O78790m9268q23917p35775M3713N14613L31143J69132M99984
$$ 2618761 3356930 4035720 3986452 3162535 2426760 2470473 2985086 3316229 3485361 3985345
38303C985345Q18448N02338j66053m27832j75364k8908l40599o87528n51478j09022
$$ 3985345 4803793 5306131 5140078 4712246 4536882 4507974 4167375 3479847 2928369 2819347
38293B819347J3140l70066p26537n16245R0531M49763K93652M0035J84732O51969
$$ 2819347 2832487 2462421 1735884 1219639 1310170 1759933 2053585 2093620 2278352 2930321
38283B930321R42877P51225J88099m84998j043112j248863r59176l92333j2409
$$ 2930321 3873198 4624423 4812522 4327524 3284412 2035549 1076373 684040 671631
38274F71631L1743J33745O61743J317540J370858N35795o35610j318149j205297
$$ 671631 703374 837119 1498862 2816402 4187260 4723055 4087445 2769296 1563999
38265A563999o48924j60535O8410K01619M65268Q64526J149963J064264O32690
$$ 1563999 915075 754540 822950 1024569 1489837 2354363 3504326 4568590 5201280
38256E201280J47164j72489l78677n49782n22314j55209K40515J83212j83849
$$ 5201280 5348444 5175955 4797278 4247496 3725182 3569973 3810488 3993700 3809851
38247C809851r7912P04995J375086J014525n667n43280l21080j69421n59014q67078
$$ 3809851 3711939 4416934 5792020 6806545 6800878 6257598 5936518 5767097 5208083 4341005
38237D341005n16305L0911P4631k20785l12269l14628o44354j007588p45682k8832
$$ 4341005 3824700 3855611 3930242 3709457 3397188 3082560 2438206 1430618 684936 656104
38227F56104K93907L7638j01588K00391M10426K10715J22245N57066J025854Q87702
$$ 656104 950011 987649 886061 1086452 1496878 1707593 1829838 2386904 3412758 4300460
38217D300460K86823k40682n66153p80406o88485j64874L18508J79593m38580
$$ 4300460 4587283 4346601 3780448 3000042 2311557 2146683 2465191 2644784 2206204
38208B206204q52898p05036k07637K69702M43745J77323k88765m05948j6460L18105
$$ 2206204 1353306 648270 440633 710335 1154080 1331403 1042638 636690 620230 938335
38198I38335J13798k75289k29074J56783L02813R7688n6029K7132J79494L13862
$$ 938335 1052133 776844 547770 704553 1007366 1105054 1049025 1076157 1255651 1569513
38188A569513L73610O0804o91836j191276p32007K58907O80687K95528r8966k1014
$$ 1569513 1943123 2003927 1312091 120815 -611192 -352285 328402 623930 524964 503950
38178E03950J76290K59109N14463Q68159O27149l81697j291087j376504r85585
$$ 503950 680240 939349 1453812 2321971 2949120 2567423 1276336 -100168 -1085753
38169a085753p27703n18814r2622K64950K59602K69371O92556J110045Q86731
$$ -1085753 -1813456 -2332270 -2424892 -2159942 -1900340 -1630969 -938413 171632 1058363
38160A058363K01162k79221l75450l14761o5727M39124P54250M46766q9801k01279
$$ 1058363 1259525 980304 604854 290093 224366 663490 1417740 1864506 1774705 1573426
38150A573426j00563m73936j114802j027092L437R45622R26804K71695k06720
$$ 1573426 1472863 998927 -115875 -1142967 -1139530 -193908 732896 1004591 797871
38141G97871k33437L625L38370N85227M53853q2782o09339p18614m22310k0179
$$ 797871 564434 568059 906429 1491656 1945509 1862727 1253388 534774 112464 92285
38131I2285J66113n1161m59333m25566L32647J056683P38699l91308j031371o40189
$$ 92285 258398 207237 -252096 -677662 -345015 711668 1450367 1059059 27688 -612501
38121f12501j35148l16874n85453l5806R33302J163126M94184r2308j1091K47834
$$ -612501 -747649 -1064523 -1649976 -1685782 -752480 410646 904830 812522 801431 1049265
38111A049265J68103P4176M71188J058343J014407J49920p07833o62793J38496
$$ 1049265 1217368 1291544 1762732 2821075 3835482 3985402 3277569 2614776 2753272
38102B753272O62051L00829l32298k76014L95254O92618J84559m33130n07509
$$ 2753272 3415323 3716152 3383854 3107840 3503094 4195712 4380271 3947141 3439632
38093C439632l76662n78078p92266m23551J89139J28062o46797j145590p76303
$$ 3439632 3062970 2484892 1692626 1269075 1458214 1586276 939479 -206111 -982414
38084i82414p8480K43588K62454L73764N22351M40683K53324K71256M06263K99754
$$ -982414 -1060894 -817306 -554852 -181088 341263 781946 1035270 1306526 1712789 2012543
38074B012543q1567m23215n63964n85718m17314J72359J019295J407016Q10978
$$ 2012543 1930976 1507761 943797 358079 -59235 113124 1132419 2539435 3350413
38065C350413l79554j222236j252888q37116m72787j37875M17841J041972J280322
$$ 3350413 2970859 1748623 495735 -341381 -814168 -952043 -534202 507770 1788092
38056A788092J010294N20366m9676q30084j622300j746435r06014K19235P71106
$$ 1788092 2798386 3318752 3269076 2438992 816692 -929743 -1835757 -1616522 -845416
38047h45416P80894Q22590Q64560L20905p06874j148679l68759Q09989J091123
$$ -845416 -64522 758068 1622628 1943533 1236659 87980 -280779 529210 1620333
38038A620333L13078n48942p49537m77703k21436o9520J13081K47952J51052p9906
$$ 1620333 1933411 1384469 634932 157229 -64207 -133727 -20646 227306 378358 298452
38028B98452r1552K83937P67659Q97247N29902J6459j89914o3658p433k90618
$$ 298452 206900 490837 1258496 2155743 2685645 2702104 2512190 2448532 2441099 2150481
38018B150481o73174p31369m01710J8267L07238M75312N00871K40699k60829o23004
$$ 2150481 1477307 745938 344228 362495 669733 1145045 1645916 1886615 1625786 1002782
38008A002782n12428n4418L29678M06175K55004q041l60901o82666o95188k78730
$$ 1002782 490354 435936 765614 1171789 1426793 1418752 1057851 375185 -320003 -598733
37998e98733K93343O27010O43748N58948M78816K72504r5259l59385k76810Q80
$$ -598733 -305390 321620 965368 1524316 2003132 2275636 2180377 1820992 1544182 1545062
37988A545062J21070K9330L332J67289K72186J19220n7572O6861L23320K05303
$$ 1545062 1666132 1695462 1698794 1866083 2138269 2257489 2199917 2266778 2590098 2795401
37978B795401l39045o80877l30709L30357N45273K28811p160J11419P2467n32571
$$ 2795401 2456356 1775479 1444770 1775127 2320400 2549211 2542051 2653470 2725937 2193366
37968B193366j199873j146477m43074J27929K14667K04518L68893M54678L61427
$$ 2193366 993493 -152984 -596058 -468129 -253462 -48944 319949 774627 1136054
37959A136054M62921P85520N78065n57902j636938j343729J10516J190396J102328
$$ 1136054 1598975 2384495 2962560 2404658 767720 -576009 -465493 724903 1827231
37950A827231O10954N22306M46456k15614r13104o40972L85670Q45344J26645
$$ 1827231 2438185 2960491 3406947 3191333 2278229 1637257 2022927 2868271 2994916
37941B994916q99362j183742p96213m60154l90570k40769Q5766K49048J18145
$$ 2994916 2095554 911812 115599 -344555 -735125 -975894 -890128 -641080 -522935
37932e22935O2912L82499P82445P18861J20361n08046o90557m65185j83544p579
$$ -522935 -460023 -77524 704921 1423782 1544143 1036097 345540 -119645 -303189 -310768
37922c10768J89597M53485N22062J49360m30731o13387j16165N81215P05651R4862
$$ -310768 -121171 332314 854376 1003736 573005 -40382 -156547 424668 1130319 1225181
37912A225181n83949o17386m2726N40950P70901P58219N82379P1728o70252r86687
$$ 1225181 641232 23846 -18880 522070 1292971 2051190 2633569 2705297 2035045 1048358
37902A048358m18747M99128P66385J92274m21031m47284j89394j90606l36706
$$ 1048358 629611 1128739 1895124 2087398 1666367 1219083 1029689 839083 502377
37893E02377j41676L85050P02056M85099j3099l54063l48409r6615J41327J10074
$$ 502377 360701 745751 1447807 1932906 1919807 1565744 1217335 1120720 1262047 1372121
37883A372121j97042m71397m31795j66787K6569K6876p1910j47833p1676K53231
$$ 1372121 1175079 703682 271887 105100 131669 158545 86635 -61198 -132874 120357
37873A20357O27961O15912K01452M1937N54337J096870P75924j76783p21777o09206
$$ 120357 748318 1364230 1565682 1607619 2161956 3258826 4034750 3857967 3136190 2526984
37863B526984o02192r61849q90394K884P84761N66736j10014k41174L1029p3601
$$ 2526984 1924792 962943 72549 75433 860194 1426930 1316916 1075742 1106771 1033170
37853A033170m06433j63281N12995N83660j35627n66336p3313N44761L34838m28326
$$ 1033170 626737 463456 976451 1560111 1424484 858148 784835 1329596 1664434 1236108
37843A236108p85770l86624L39730Q20046O94954l627o70922o00332Q4024N34114
$$ 1236108 450338 63714 403444 1223490 1918444 1914817 1243895 643563 727587 1261701
37833A261701M45269M25521P25322N80338m43108j358140j058446m3459L39724
$$ 1261701 1706970 2132491 2857813 3438151 2995043 1636903 578457 534998 874722
37824H74722o6781k34949K06803M72035P9705m11175m98160n23172q45926j063924
$$ 874722 807941 572992 779795 1251830 1331535 920360 422200 -100972 -946898 -2010822
37814b010822o60313J48449P48876R03646P86028O03536N01578N15273M17434
$$ -2010822 -2671135 -2522686 -1773810 -870164 -84136 519400 1020978 1536251 1953685
37805A953685k1143n21983n45729j48918L4354j54720j18496L63354N13523k90297
$$ 1953685 1932542 1410559 864830 715912 750266 595546 477050 840404 1353927 1063630
37795A063630j359348j482176n27592M84908P56241M95996L58666O02316R04320
$$ 1063630 -295718 -1777894 -2305486 -1820578 -1064337 -568341 -209675 392641 1296961
37786A296961P71778J27557m71945m25165J01519L85993K37278K15534N23545
$$ 1296961 2068739 2196296 1724351 1299186 1400705 1786698 2023976 2239510 2763055
37777B763055M84972l16905j128907j053490m08730j57666m07463m64553j21656
$$ 2763055 3248027 2931122 1802215 748725 339995 182329 -225134 -689687 -811343
37768h11343J34767J15641J48940K79986J76325o8415O2573N18710N72203j2891
$$ -811343 -676576 -560935 -411995 -132009 44316 -24099 38474 557184 1129387 1116496
37758A116496n25894m14253j00306j98036n16060m10190K46430R28971J078846
$$ 1116496 590602 176349 76043 -121993 -638053 -1048243 -801813 127158 1206004
37749A206004N62598k64009p76452o33123k04184j26731m11502m51496K2983N57545
$$ 1206004 1768602 1504593 728141 95018 -109166 -235897 -647399 -1098895 -1075912 -518367
37739e18367P07846O02249N17888L94583O5494m16810q90357j159834r20381j23791
$$ -518367 189479 791728 1309616 1704199 1769693 1352883 462526 -697308 -1617689 -1741480
37729a741480N61144L55039m49178p15192r3779M90446L61064Q9930L31080O27083
$$ -1741480 -1180336 -825297 -1274475 -1989667 -2083446 -1593000 -1231936 -1142006 -810926 -183843
37719a83843L08905j85318K977O42230P19031K1979o21407o31064l02228j13848
$$ -183843 125062 -60256 -57279 584951 1303982 1325961 704554 73490 -228738 -342586
37709c42586j40137k01040n3050M85242J120815J089288J70455o83123n15786
$$ -342586 -482723 -683763 -736813 -251571 869244 1958532 2128987 1445864 930078
37700I30078K01606K66102m21423q36056n25230j00552O1670L56567Q59450Q99522
$$ 930078 1131684 1397786 976363 140307 -384923 -485475 -423805 -67238 792212 1691734
37690A691734K70212j90367R8469M86048J67326n33583p46754l02007L57108R27437
$$ 1691734 1961946 1771579 1870048 2356096 2523422 1989839 1243085 941078 1298186 2225623
37680B225623J175477P16683k85166p57248l8762Q98849O74028l90956o95365
$$ 2225623 3401100 4117783 3832617 3075369 3036607 3935456 4609484 4218528 3523163
37671C523163J44388O82033o3319j069292r37203l282L51309j34902m45931j00363
$$ 3523163 3667551 4349584 4286265 3216973 2279770 2276488 2627797 2492895 2046964 1946601
37661A946601J98203l7176k01648K64358P79435N22892j80269l70123j6609M681
$$ 1946601 2144804 2107628 1905980 2170338 2949773 3472665 3292396 2922273 2905664 2910345
37651B910345n42704q52193m88389j48139m40462q16929n21499J08172K58516
$$ 2910345 2367641 1515448 1027059 878920 438458 -378471 -899970 -791798 -533282
37642e33282N2343K36463P09729N66888k89428p17345M6230J200001J396482M01874
$$ -533282 -480939 -244476 465253 1032141 742713 25368 71598 1271599 2668081 3069955
37632C069955p85466j139711n54605J69823Q8867q68690j608378j034925M75566
$$ 3069955 2284489 1144778 590173 759996 848863 -19827 -1628205 -2663130 -2187564
37623b187564J395722R71830Q8290j08519L21073N70612L73769J20072R1228K49993
$$ -2187564 -791842 179988 268278 159759 480832 1051444 1425213 1545285 1636513 1886506
37613A886506N12232O50485K07751q84576j816547j647282m57953P40140J150555
$$ 1886506 2398738 3049223 3256974 2372398 555851 -1091431 -1549384 -809244 341311
37604C41311Q01556J63671l38707m93065m06530m18197o09588n73428j178P47186
$$ 341311 1142867 1306538 967831 474766 68236 -349961 -959549 -1532977 -1534155 -786969
37594g86969J078659R29567O33340K85634k12590o83237q27012p14589n80520
$$ -786969 291690 1221257 1854597 2140231 1927641 1244404 417392 -297197 -877717
37585h77717l08518K81193Q27327Q02671L50937J4845k22041p44834j230411q27567
$$ -877717 -1186235 -905042 -77715 724956 1075893 1090738 868697 123863 -1106548 -1934115
37575a934115L81708J161239Q05182R4016j4716K33864R5873l21114l67805n9854
$$ -1934115 -1552407 -391168 414014 508030 493314 727178 823051 501937 134132 74278
37565G4278J1933k07661j34339M09566Q19146N90140K5090k19539K7286K99300
$$ 74278 86211 -121450 -255789 153777 972923 1563063 1588153 1368614 1395900 1695200
37555A695200P3046n84700r78022n43073L66003Q15041N04771J10558J34316J07390
$$ 1695200 1768246 1183546 205524 -337549 28454 843495 1348266 1458824 1593140 1700530
37545A700530m40912q65393k45990R99166J485270Q14637J2218j75913k26034
$$ 1700530 1259618 394225 148235 1147401 2632671 3447308 3459526 3283613 3057579
37536C057579o07821p92379l33901L1983m92712j207167p72169O54264J469442
$$ 3057579 2449758 1657379 1323478 1355461 862749 -344418 -1116587 -462323 1007119
37527A007119Q82126j10725l32869Q5086L88200M40742N28659N72364L41693L3822
$$ 1007119 1889245 1778520 1445651 1530737 1918937 2359679 2888338 3460702 3802395 3836217
37517C836217j02396l70440j091136j733935j443751l74933L45126J21567l87324
$$ 3836217 3733821 3363381 2272245 538310 -905441 -1280374 -935248 -813681 -1201005
37508a201005l28703K08064N28620L61303Q2734J19672M74754P84500O81029J52879
$$ -1201005 -1529708 -1321644 -793024 -431721 -348987 -229315 245439 1029939 1710968 1863847
37498A863847m22081o95717p08700o53005m87726j58427J5281k74446o68643n34333
$$ 1863847 1441766 746049 37349 -615656 -1103382 -1261809 -1246528 -1520974 -2189617 -2723950
37488b723950J5521K53090N1103P8897N43639P12505J80599l33928j63848K10529
$$ -2723950 -2708429 -2455339 -2404236 -2325339 -1781700 -1069195 -888596 -1222524 -1386372 -1175843
37478a175843J10178r8944K14772N99294K36966m32216k42041O91892R79001J37547
$$ -1175843 -1065665 -1164609 -949837 -350543 -113577 -545793 -787834 -95942 883059 1020606
37468A020606o46924l95069K98797M21230j2691m34365p43927r94938p74118J61296
$$ 1020606 373682 -21387 277410 698640 685949 251584 -492343 -1487281 -2261399 -2100103
37458b100103J088858J054521J50787o52575p31502k40217M10594Q36553O42605
$$ -2100103 -1011245 43276 194063 -458512 -1190014 -1430231 -1019637 -183084 459521
37449D59521j91859r53672q50833l4270N81346N30010K72994L55429O01669M39580
$$ 459521 267662 -686010 -1536843 -1571113 -989767 -459757 -186763 168666 770335 1209915
37439A209915k52856r19772r28217k94274K72890J54722m25168p04016m04175
$$ 1209915 957059 37287 -890930 -1185204 -912314 -757592 -1182760 -1886776 -2290951
37430b290951m428J19328K33566N76042P31119K66765m36672o76627m33989j72222
$$ -2290951 -2295379 -2176051 -1942485 -1366443 -635324 -368559 -805231 -1481858 -1915847 -2088069
37420b088069Q8074O36456J167897J011630L67331K95241J099542J649000R28570
$$ -2088069 -1999995 -1363539 -195642 815988 1183319 1478560 2578102 4227102 5155672
37411E155672m60645j119075o79648j7735Q8608k93351p59666j072247j039948
$$ 5155672 4695027 3575952 2896304 2878569 2967177 2673826 1914160 841913 -198035
37402a98035n18906K27913O07741L75648o9874k32339n8870K04395L59555K63247
$$ -198035 -716941 -489028 118713 494361 424487 192148 133278 337673 697228 960475
37392I60475j69690o87412p29941r3589O60752Q45595N03852K00066J20679o8398
$$ 960475 790785 103373 -626568 -720157 -59405 786190 1290042 1490108 1610787 1542389
37382A542389m91762p90278p27365n37662m35014k56306J07226L70635K98851
$$ 1542389 1050627 260349 -467016 -1004678 -1439692 -1695998 -1588772 -1218137 -919286
37373i19286R2025k2160j54546l23619j59499M27355P82110M03527j36672n288
$$ -919286 -827261 -849421 -1003967 -1327586 -1487085 -1059730 -277620 125907 -10765 -16053
37363a6053N30254N36137m2019m00643l61648n62875j006834p73569L34773J144755
$$ -16053 514201 1050338 1008319 607676 246028 -316847 -1323681 -2097250 -1762477 -617722
37353f17722Q43750K18179K57600N69101L01453k26942j43550L33396K57648l60098
$$ -617722 226028 444207 701807 1270908 1572361 1345419 1201869 1535265 1792913 1432815
37343A432815n99394k54861q4221l40312l29831K48040O64140L61684j33858j07119
$$ 1432815 833421 578560 494339 154027 -175804 72236 736376 1098060 964202 857083
37333H57083K42124K02890l90805j021240j130148n85407K41287O87216L75527
$$ 857083 1099207 1302097 911292 -109948 -1240096 -1825503 -1584216 -897000 -521473
37324e21473l22285o92196n13861j07634L10535P22170Q39654L16767m76854o70925
$$ -521473 -843758 -1535954 -2049815 -2157449 -1846914 -1124744 -285090 31677 -445177 -1116102
37314a116102j05322M07371K86360r8974k26365j50254k0529L28940P67158O20014
$$ -1116102 -1221424 -814053 -527693 -626667 -853032 -1003286 -1023815 -694875 72283 692297
37304F92297k61712q74136l32576P67263J160306O73214J95189J30218n4195o60008
$$ 692297 430585 -443551 -776127 -8864 1151442 1824656 2019845 2150063 2095868 1435860
37294A435860j106687q09223n0144M47983M25943J92000L3264j54898o15713j204556
$$ 1435860 329173 -480050 -530194 -82211 343732 535732 568996 414098 -201615 -1406171
37284a406171j282809l99519R22382J514462R02286j10370n29060l66388k44356
$$ -1406171 -2688980 -3088499 -2166117 -651655 250631 140261 -388799 -755187 -999543
37275i99543k67926n8737L43036M66458K67914J87793K70735N4536m47229n04230
$$ -999543 -1267469 -1326206 -983170 -516712 -248798 -61005 209730 264266 -182963 -687193
37265f87193J45119O37698J94110n89796n16298M28356R89523M23319m76665n38117
$$ -687193 -542074 95624 289734 -300062 -816360 -388004 601519 1024838 548173 10056
37255A0056J94840O46220K39875m21226n03308j5938M08496M49527L18004J83075
$$ 10056 204896 851116 1090991 669765 166457 150519 559015 1008542 1326546 1509621
37245A509621n6129l35404l01792Q0608K45557k11780q04718p40706p3945L46676
$$ 1509621 1453492 1118088 816296 896904 1142461 930681 125963 -614743 -688688 -342012
37235c42012J01660k61424j48309J81779P9820m73743q28594n30871K04274Q76294
$$ -342012 -240352 -501776 -650085 -468306 -388486 -862229 -1690823 -2221694 -2017420 -1141126
37225a141126J182244J067296O44606K15409J07764L11430M51897K73327n3281
$$ -1141126 41118 1108414 1753020 1968429 2076193 2387623 2839520 3112847 3059566
37216C059566k73837m55306p55232r94950q73007n07431k97872k44988O7086O77408
$$ 3059566 2785729 2330423 1575191 580241 -292766 -800197 -1098069 -1343057 -1275971 -598563
37206e98563J000908O85090K05238J58426L90943L77446J25042M2032J09731j02329
$$ -598563 402345 1087435 1292673 1451099 1842042 2219488 2344530 2386562 2496293 2393964
37196B393964o24248r45016p53035k57935K72643P20730Q04413K05057p91090
$$ 2393964 1769716 824700 71665 -186270 86373 807103 1611516 1816573 1025483
37187A025483j342159r90592j25145O06741Q53620M91489l28510r25615o23005
$$ 1025483 -316676 -1307268 -1432413 -825672 27948 519437 190927 -734688 -1357693
37178a357693K25964N11418m9303m81075j31441L04525M2688m50386l52592N3049
$$ -1357693 -1131729 -620311 -669614 -1150689 -1282130 -977605 -934917 -1385303 -1737895 -1684846
37168a684846j4618l22874m1964N93476M32431o78069j397876p32853O15797J287397
$$ -1684846 -1699464 -2022338 -2064302 -1470826 -1038395 -1716464 -3114340 -3847193 -3231396 -1943999
37158a943999R45098L70144L25532Q02424J175425Q47575r8911q58249p72337
$$ -1943999 -998901 -628757 -303225 499199 1674624 2522199 2423288 1565039 792702
37149G92702j92539o3059o51874j185042q73264J15542R15528R34023L92724n565
$$ 792702 600163 537104 -114770 -1299812 -2173076 -2057534 -1142006 -207983 184741 179176
37139A79176Q2667J89579k98091j040482r62567J18189Q95428L51111n96189l41543
$$ 179176 261843 451422 153331 -887151 -1849718 -1731529 -836101 -484990 -1081179 -1422722
37129a422722R58526J540008N67295q39853j361901j012078m47183J23943O51540
$$ -1422722 -464196 1075812 1643107 803254 -558647 -1570725 -2017908 -1893965 -1242425
37120a242425P43807K35358l24875m06632k44310k99947m46859k62215K09331
$$ -1242425 -498618 -263260 -588135 -994767 -1239077 -1539024 -1985883 -2248098 -2038767
37111b038767N00866L33470j26134m06643l6235Q96127J447094P03783q87700
$$ -2038767 -1537901 -1204431 -1330565 -1737208 -1773443 -877316 569778 1273561 385861
37102C85861j783636j199485J3136O63746N96870L00656m2887m24935n50083k38264
$$ 385861 -1397775 -2597260 -2584124 -1920378 -1323508 -1022852 -1065739 -1490674 -2040757 -2279021
37092b279021J50943K89621M19596P70658R78726P22310M19524N69288Q43409
$$ -2279021 -2128078 -1838457 -1418861 -648203 330523 1052833 1472357 2041645 2885054
37083B885054N97730o6833n12109n51812n08013n07935m13719k74954k36525j80973
$$ 2885054 3482784 3415951 2903842 2352030 1844017 1336082 922363 647409 410884 229911
37073B29911j045M9981j62122j89263L14351Q11572N74061j37913m56212k71750
$$ 229911 228866 278847 116725 -72538 241813 1053385 1627446 1489533 1033321 761571
37063G61571k78189o75823p90384k03858N26291O36276J09972m57914o02353l55556
$$ 761571 483382 -192441 -982825 -1186683 -660392 -24116 85856 -372058 -974411 -1329967
37053a329967p7243k4764k0843L16192R14334J165364P47504J12435k11305l37356
$$ -1329967 -1407210 -1431974 -1452817 -1136625 -222291 943073 1690577 1803012 1591707 1254351
37043A254351n71178p33278n47241k70996k58394k68013Q5790N52635O47101M75259
$$ 1254351 683173 -50105 -597346 -868342 -1126736 -1394749 -1308959 -756324 -109223 366036
37033C66036M15493L60987P6759j15463J04313K61187j58798o33197m22225J3951
$$ 366036 781529 1142516 1219275 1103812 1208125 1469312 1310514 677317 255092 269043
37023B69043k31618p44152l68501O42964Q51578Q6509k13335M74324Q01978p1033
$$ 269043 37425 -706727 -1075228 -432264 419314 505823 292488 766812 1568790 1497757
37013A497757r34056n29146L78725L26484n48124r62383n06395J03602L02545
$$ 1497757 563701 34555 413280 739764 191640 -770743 -1277138 -1173536 -870991
37004h70991J11831l06251o31081l53788M43548P97882J38649p36169p94356k47970
$$ -870991 -759160 -1065411 -1696492 -2050280 -1606732 -808850 -670201 -1406370 -2200726 -2448696
36994b448696N6139J08436M68426R65099Q82906K71213n0882J98484L99884N8440
$$ -2448696 -2392557 -2284121 -1815695 -850596 32310 303523 252641 451125 851009 909449
36984I09449n69725r63014q69560l67880J51514K19493j03393j94143J49717K80401
$$ 909449 339724 -623290 -1492850 -1860730 -1709216 -1489723 -1593116 -1787259 -1637542 -1357141
36974a357141j46248l38672L58077J059571N16995p31781q98203L99668J511012
$$ -1357141 -1503389 -1842061 -1483984 -424413 92582 -639199 -1537402 -1137734 373278
36965C73278J116698r2043o80765l64577R5065J54802p9668k83715k35013O8519
$$ 373278 1489976 1397933 717168 352591 447656 602458 522790 239075 4062 72581
36955G2581L27331K08748j87996m31586l44754j31637L3396J08035m1833m46556
$$ 72581 399912 608660 420664 -10922 -355676 -487313 -453917 -345882 -387715 -834271
36945h34271o96285l84824J85945L82535K30012K84027N70222N24894P5807j38339
$$ -834271 -1530556 -1915380 -1729435 -1346900 -1116888 -832861 -262639 262255 338062 199723
36935A99723J39522L62614J85190L4395K47474M43638K81801J12604K67418L32156
$$ 199723 339245 701859 887049 921444 1168918 1612556 1894357 2006961 2274379 2606535
36925B606535j88688r63541j262140r60042n31613l05280k29226j51095Q4680
$$ 2606535 2417847 1454306 192166 -767876 -1299489 -1604769 -1833995 -1985090 -1900410
36916a900410N77462J060444R61932J58237o38207o47850N9697P55993R03853
$$ -1900410 -1322948 -262504 699428 857665 219458 -428392 -368695 387298 1291151
36907A291151N14645n8229l81078k58159m912p8134l14101p7104O26585R09479
$$ 1291151 1805796 1747567 1366489 1108330 1103418 1025284 711183 634079 1260664 2170143
36897B170143L14747l91632m06964j53824m44785r54288o74206L49676R39094
$$ 2170143 2484890 2093258 1686294 1532470 1087685 133397 -540809 -191133 747961
36888G47961N31364q2075r4256J70273j3621n65382p74664l55397K28020M05989
$$ 747961 1279325 1197250 1102994 1273267 1259646 694264 -80400 -435797 -207777 198212
36878A98212J28504j81747j64954M3660K1216k58256k52850L34892R12028P31664
$$ 198212 326716 144969 -19985 23675 44891 -213365 -466215 -131323 780705 1512369
36868A512369P1463q3937M43528O93151O5577o64029m59179M43237Q99330M40798
$$ 1512369 1583832 1499895 1943423 2636574 2702151 2038122 1578943 2022180 2921510 3362308
36858C362308l18617p51370q77734q42200m91345J54148N68826L53480j44624
$$ 3362308 3043691 2292321 1414587 572387 81042 235190 804016 1157496 1012872
36849A012872l03063o7876J28037P8013q4355l38942p33902r02921l25333P35302
$$ 1012872 709809 641933 769970 847983 763628 424686 -309216 -1212137 -1537470 -802168
36839h02168J230671O55110k09221l75402M7353K76681J34530Q6362K54638K84230
$$ -802168 428503 1083613 874392 498990 546343 823024 957554 1043916 1298554 1582784
36829A582784J52079K40998N02504L87510j71904n36647m46105n09969j116016
$$ 1582784 1734863 1975861 2478365 2865875 2693971 2157324 1711219 1201250 85234
36820H5234j588276j108811O1520R76019J212289J031281O87141K88724J05049
$$ 85234 -1503042 -2611853 -2550333 -1574314 -362025 669256 1356397 1645121 1750170
36811A750170K89913M13915p3024r47369j370004r55776j73359L48762M43286
$$ 1750170 2040083 2453998 2380974 1433605 63601 -892175 -1065534 -716772 -273486
36802b73486K81188N8730q1017r8811q1616m9286J30685M27625N01944K02354
$$ -273486 7702 66432 -14585 -113396 -195012 -244298 -113613 314012 815956 1018310
36792A018310o6392J11855N14430O35169M14751J00347l06168q16353r78929m41417
$$ 1018310 951918 1063773 1578203 2213372 2628123 2728470 2422302 1605949 627020 185603
36782A85603K09670Q2792o05302p28285M7840P75533O99894K19644n7421k62131
$$ 185603 395273 478065 -127237 -855522 -807682 -32149 667745 887389 829968 567837
36772E67837o41667q03585l42900L57366O64419N58832L31700n8578o20912q19139
$$ 567837 -73830 -877415 -1220315 -862949 -198530 360302 692002 633424 12512 -806627
36762h06627k48027N37672P03804L67036K93424O01662P15274N09181M77118O40026
$$ -806627 -1054654 -516982 186822 553858 847282 1448944 2164218 2673399 3150517 3790543
36752C790543L10134o87947j446243j174177l07417J74495L3707k25083k47733
$$ 3790543 4100677 3412730 1966487 792310 484893 659388 693095 468012 220279
36743B20279q1376K32495O74695R20922N64985k53476q72170q72361n01205k30219
$$ 220279 138903 371398 1046093 1967015 2532000 2278524 1406354 533993 32788 -197431
36733a97431j89246j87822o8370J52005L75047N05602M83961L11620L2276k96652
$$ -197431 -386677 -574499 -642869 -490864 -115817 389785 873746 1185366 1217642 920990
36723I20990n50896n24926j38813L46535N17509K65801j15048l31551l53624j91177
$$ 920990 370094 -154832 -293645 52890 570399 836200 721152 389601 35977 -155200
36713a55200K58898Q71833J097165N59573k68430n21348j06034J40510l30134
$$ -155200 103698 975531 2072696 2632269 2363839 1842491 1736457 1876967 1546833
36704A546833r43080q09285M2434Q02851R93492P91387L52500m18008j242862
$$ 1546833 603753 -205532 -163098 639753 1633245 2424632 2777132 2359124 1116262
36695A116262j375100o18034J06885j13467q15999p28769L44880J106261N66535
$$ 1116262 -258838 -876872 -769987 -883454 -1699453 -2428222 -2083342 -977081 -410546
36686d10546n20006p40168k5735M06651R803k99347L03457J151951J063734J06191
$$ -410546 -930552 -1670720 -1696455 -1289804 -1280001 -1579348 -1275891 -123940 939794 1045985
36676A045985o11710o30868n51403p47613p78625l91387q3616j23805N7417P59183
$$ 1045985 434275 -196593 -747996 -1495609 -2274234 -2665621 -2749237 -2873042 -2815625 -2056442
36666b056442J145608M73193m88022m56852L44840N14169k94540q43258k89250
$$ -2056442 -910834 -437641 -925663 -1382515 -1037675 -523506 -818046 -1661304 -1950554
36657a950554O00372P96883N00374M83297P28140O14062J3124n87194q13872o71695
$$ -1950554 -1350182 -553299 -52925 430372 1158512 1772574 1785698 1198504 384632 -287063
36647b87063k97876P0392J18251j60808l79699l72708m58261p05939n28601L70740
$$ -287063 -584939 -514547 -396296 -557104 -936803 -1309511 -1767772 -2473711 -3002312 -2631572
36637b631572J189449R98801J56500j85295K14876M65091L0601n27044n25920
$$ -2631572 -1442123 -443322 -286822 -472117 -257241 207850 238451 -288593 -814513
36628h14513m5094M78393Q04277P07219l7583j035738j301218m86167M50086M68534
$$ -814513 -859607 -381214 423063 1130282 1092699 56961 -1244257 -1730424 -1280338 -811804
36618h11804p8968j5910Q29607J288274N37037o51673q72721J12758J143262J137677
$$ -811804 -890772 -906682 -77075 1211199 1748236 1096563 223842 336600 1479862 2617539
36608B617539K75102m70649n72924l57813l28562n12464n83630l49178P2343M08613
$$ 2617539 2892641 2421992 1849068 1491255 1162693 650229 66599 -282579 -210236 198377
36598A98377M33691J29912k57810m57249m94791n75851o13065k36086N50206J104428
$$ 198377 632068 761980 504170 46921 -447870 -1023721 -1636786 -1872872 -1322666 -218238
36588b18238Q80613J33185m62109o16606m68412j15569L63748O22201L49416k08052
$$ -218238 662375 795560 333451 -283155 -751567 -867136 -503388 118813 468229 260177
36578B60177n31682n24973m08501j15777N12599J055984Q92296K99506K45072
$$ 260177 -271505 -796478 -1204979 -1320756 -808157 247827 1140123 1439629 1684701
36569A684701Q42985J019405K08831n93646k83168O26077P54526j27491r50435
$$ 1684701 2527686 3547091 3755922 3162276 2879108 3505185 4259711 4132220 3181785
36560C181785j052846r32647j114315j220224o59980L44223R63303P51050N6750
$$ 3181785 2128939 1196292 81977 -1138247 -1798227 -1454004 -490701 260349 317099
36551C17099m54326m64149j97866m7342o3346L1775L00161L84182R2635j48383
$$ 317099 -137227 -601376 -799242 -846584 -909930 -878155 -577994 -193812 -101177 -249560
36541b49560J25457O34351P14926L28000N8521J11037J7390m61912q26391o00334
$$ -249560 -124103 510248 1225174 1553174 1611695 1722732 1740122 1278210 451819 -148515
36531a48515o3292K27678K08890J39107M6090j32143j72724P8496K12109k33890
$$ -148515 -211807 15871 224761 363868 409958 277815 105091 183587 395696 161806
36521A61806q81501q35445M0692Q46115Q48506L56851O4553P0106K4703j47900
$$ 161806 -719695 -1555140 -1514448 -668333 180173 537024 601577 671683 696386 548486
36511E48486k32986j98286j55373J4831M56397Q02967M32758n97039j373134j162553
$$ 548486 315500 117214 -38159 -23328 433069 1236036 1668794 1071755 -301379 -1463932
36501a463932k76159L94271M21431R4361j71114k69681k61172j10192K78302Q46439
$$ -1463932 -1740091 -1345820 -924389 -830028 -1001142 -1270823 -1531995 -1642187 -1363885 -517446
36491e17446J279023J169919M28022m48409p06122j15542O95060Q40313M5563
$$ -517446 761577 1931496 2359518 1911109 1204987 1089445 1784505 2624818 2670381
36482B670381j161365j963979j844405q89923K25838P08201L74229j29091m5143
$$ 2670381 1509016 -454963 -2299368 -3189291 -2963453 -2255252 -1881023 -2010114 -2055257
36473b055257O48730J324243J469857J080246M26282j71501l94269j61443J54293
$$ -2055257 -1406527 -82284 1387573 2467819 2894101 2722600 2328331 2166888 2321181
36464B321181J16165j49693j20191K81267M89612J35759l80463m81623k24321
$$ 2321181 2437346 2287653 2167462 2448729 2938341 3074100 2693637 2212014 1987693
36455A987693j15524l26134n06488l46180J2489J92059L2738k52101l18857n2274
$$ 1987693 1872169 1546035 1039547 693367 705856 897915 930653 678552 359695 307421
36445C07421L44073O03855O19907L64937j57393o80413o97671j08175M26694K96029
$$ 307421 651494 1255349 1875256 2240193 2082800 1402387 704716 596541 1023235 1319264
36435A319264j35198j15618J72304j42347j003339j218600l01210O15310M68203
$$ 1319264 1184066 1068448 1240752 1098405 95066 -1123534 -1424744 -809434 -341231
36426c41231j33603m3023N01706L86932m18569q09089l28404K88021M55799M33380
$$ -341231 -474834 -517857 -16151 370781 -47788 -856877 -1185281 -897260 -441461 -8081
36416h081M30289J39698m42789p07536l94832j4404J27182M25378R80045J026031
$$ -8081 422208 561906 119117 -588419 -983251 -997655 -870473 -445095 534950 1560981
36406A560981J20954q65803q52383q5917L33530Q2883j72804m413K60920K72475
$$ 1560981 1681935 816132 -36251 -122168 211362 294245 121441 117028 377948 650423
36396F50423J55834J31590J80744K30037K75995K52236P8007j72862l98176o27428
$$ 650423 806257 937847 1118591 1348628 1624623 1876859 1954866 1782004 1383828 756400
36386G56400p93515o02804p074M83264M29440J24299Q0974J78234N213k28190
$$ 756400 -37115 -639919 -646993 -163729 265711 390010 470984 649218 654431 426241
36376D26241k731M37810L42615j73518j31626O34622R55647J09556r13774q67531
$$ 426241 423510 861320 1203935 1030417 898791 1533413 2489060 2598616 1684842 817311
36366H17311j59610j42455r57287j356387o15958N35937J124761J076891P74234
$$ 817311 657701 515246 -442041 -1798428 -2414386 -1878449 -753688 323203 1097437
36357A097437L11146k28579l85514Q7962O03136L60141n42023j181594r68306
$$ 1097437 1408583 1180004 794490 882452 1485588 1845729 1303706 122112 -846194
36348h46194k35952L56293N55075M88285K97359Q8204M5317K86158O27068O95224
$$ -846194 -1082146 -725853 -170778 317507 614866 703070 748387 1034545 1661613 2356837
36338B356837L07575l50962r08315j080222q22224l60734p5110j79990m50572
$$ 2356837 2664412 2313450 1405135 324913 -497311 -858045 -933155 -1113145 -1563717
36329a563717m05233J19164O89196P42164K66860j93417k24949K626P2360j02345
$$ -1563717 -1968950 -1849786 -1160590 -418426 -151566 -344983 -569932 -567306 -494946 -597291
36319e97291k58136k36028j80456k38485k94511j77583j2055j16054n00465o85632
$$ -597291 -855427 -1091455 -1271911 -1510396 -1804907 -1982490 -1994545 -2110599 -2611064 -3296696
36309c296696k35754N99743J074350Q62060M73670M86932O50576K88618m75948
$$ -3296696 -3532450 -2932707 -1858357 -996297 -522627 -35695 614881 903499 427551
36300D27551o18124L45769J432978J349133K04009p02638o82374l63688m19479
$$ 427551 -190573 155196 1588174 2937307 3141316 2438678 1756304 1392616 973137
36291I73137m89987L4305P91130Q36680K5120p66613q03420k53250L16859O25997
$$ 973137 483150 517455 1308585 2145265 2170385 1403772 600352 347102 663961 1289958
36281A289958O27128K54259m09889r81738j116304q67794n24155k48429m5682
$$ 1289958 1917086 2171345 1761456 779718 -336586 -1204380 -1728535 -1976964 -2022646
36272b022646J16749L45819P73224J252971J320263P25508j62376p73789r83710
$$ -2022646 -1905897 -1560078 -786854 466117 1786380 2511888 2349512 1575723 592013
36263E92013r96593p81770j53784O00091P86346K53227k32326K3094O33883O66799
$$ 592013 -404580 -1186350 -1340134 -740043 46303 299530 67204 90298 724181 1390980
36253A390980j7446o03607n49603k99486m27887o49454l30558L05132L12833n18885
$$ 1390980 1373534 769927 220324 -79162 -507049 -1156503 -1487061 -1181929 -869096 -1387981
36243a387981j128860n73622N92730J021328L93018k42432p089O72790Q40325
$$ -1387981 -2516841 -3090463 -2497733 -1476405 -1083387 -1325819 -1332908 -660118 180207
36234A80207L60296p2378k2395J91638J39295o2198J360L60602N70905L35173
$$ 180207 540503 468125 445730 637368 776663 714465 715825 1076427 1647332 1982505
36224A982505n9694j80850j68691n44965j202407j215698j81624Q06681M64582
$$ 1982505 1922811 1741961 1573270 1028305 -174102 -1389800 -1571424 -764743 -300161
36215c00161o64475p35241O67137J697244Q81184o94222j061509k66002P5574
$$ -300161 -964636 -1699877 -1032740 664504 1545688 851466 -210043 -476045 -400471
36206d00471m06074l93834O14736J285105O43317l43405m81799k91014p92345
$$ -400471 -806545 -1200379 -585643 699462 1342779 999374 517575 226561 -565784
36197e65784j375241o46343J020975J630500M47057q61969n77552Q27048J627296
$$ -565784 -1941025 -2587368 -1566393 64107 511164 -350805 -928357 -101309 1525987
36188A525987J116998j7403r77224j468570j316882m90925M09400N28695j06589
$$ 1525987 2642985 2625582 1648358 179788 -1137094 -1628019 -1218619 -689924 -796513
36179g96513m87618l7768M56748o0959j253360j619586m52100J160199J665525
$$ -796513 -1284131 -1321899 -865151 -926110 -2179470 -3799056 -4251156 -3090957 -1425432
36170a425432Q77136p7470l20214m2649K02706L08074M12575M24170J76835k23227
$$ -1425432 -548296 -625766 -945980 -988629 -785923 -477849 -65274 358896 535731 312504
36160C12504n79640q94548j124681r27443j39045O69355P08468P4547k28788M23818
$$ 312504 -267136 -1161684 -2286365 -3213808 -3352853 -2683498 -1975030 -1900483 -2129271 -1705453
36150a705453J431386J717437J003410l0157o54128p70099p18629p47982p86303
$$ -1705453 -274067 1443370 2446780 2416623 1762495 992396 273767 -474215 -1260518
36141a260518n92807p5810M72095N30125o7057p42092o82565J43874Q07392N51324
$$ -1260518 -1853325 -1929135 -1457040 -926915 -993972 -1736064 -2418629 -2274755 -1467363 -916039
36131i16039j58350k33058M73454Q87394K53903p16812q29858n3140O15508O81184
$$ -916039 -1074389 -1307447 -833993 53401 307304 -409508 -1239366 -1292506 -676998 4186
36121D186O00578O55356M02850l25855p69005k88059N29143O13912j14652p98678
$$ 4186 604764 1260120 1662970 1337115 568110 280051 809194 1423106 1308454 509776
36111E09776q87870n40622M8173Q43183J457026J294630M53352k23504k92578
$$ 509776 -378094 -918716 -870543 -27360 1429666 2724296 3177648 2954144 2661566
36102B661566k61601o12274r09073m97983L21578N67616n4022o96147m74775M02823
$$ 2661566 2399965 1787691 878618 380635 702213 1269829 1215807 519660 44885 447708
36092D47708R34214N64239k06003n06472j39127L06219K79282j21735m58931n44558
$$ 447708 1381922 1946161 1740158 1233686 1094559 1400778 1680060 1558325 1099394 554836
36082E54836m73758l07513n1946J60734J61271m4901l39966o21109p01463l70156
$$ 554836 81078 -226435 -278381 -117647 43624 -1277 -341243 -962352 -1663815 -2033971
36072b033971J88065M03835J39237N0609N68879J004901N27199l51901m06428
$$ -2033971 -1845906 -1442071 -1302834 -1252225 -683346 321555 848754 496853 90425
36063I0425L21588N07297k81580q24821k96371K91174k35967j167196r42930L85287
$$ 90425 412013 919310 637730 -187091 -483462 -192288 -428255 -1595451 -2538381 -2153094
36053b153094J210392O95585l15077p94643p15037m34206J2029M95494N21758
$$ -2153094 -942702 -247117 -562194 -1356837 -2071874 -2506080 -2494051 -1998557 -1476799
36044a476799k0299m33827j20200N36915P38207L61387o7166k36716k98499l39387
$$ -1476799 -1497098 -1930925 -2051125 -1514210 -776003 -414616 -481782 -718498 -1016997 -1356384
36034a356384j84502J62842L39684J36388j06470M4722M01897L23758l11906p41358
$$ -1356384 -1540886 -1378044 -1038360 -901972 -1008442 -963720 -561823 -238065 -549971 -1291329
36024a291329k91736N72725P72603J24483l70199L1741P81261R39674N29887K74132
$$ -1291329 -1583065 -1010340 -237737 -113254 -483453 -451712 329549 1269223 1799110 2073242
36014B073242L75450M06655K48461K45978L71882R7476o47110j160297j007892
$$ 2073242 2448692 2855347 3103808 3349786 3721668 3819144 3172034 2011737 1003845
36005A003845o89889p63430r06089n20672J63256L75408j008k96401j30707R3865
$$ 1003845 313956 -449474 -1355563 -1876235 -1712979 -1337571 -1338579 -1634980 -1765687 -1671822
35995a671822l5891l10204l75179l30500l79545k75368K71115Q36246O68270j08496
$$ -1671822 -1707713 -2017917 -2393096 -2723596 -3103141 -3378509 -3107394 -2271148 -1602878 -1711374
35985a711374m18682K91390J173650J161184M83646J55946K97646O0164p46825
$$ -1711374 -2130056 -1838666 -665016 496168 979814 1135760 1433406 1493570 746745
35976G46745j151226n84273J35256J35550j19282K14137P59220N54612j51781
$$ 746745 -404481 -988754 -853498 -717948 -837230 -623093 136127 690739 538958
35967E38958j91883N03259O61494k24939r45865m15939O85167J046142O25302
$$ 538958 347075 850334 1511828 1286889 341024 -74915 610252 1656394 2281696
35958B281696L44362M45261K96619l41403q66464p56089k39048J04690m1451n51731
$$ 2281696 2626058 3071319 3367938 3026535 2160071 1403982 1164934 1269624 1228173 676442
35948F76442r22739n99544L59824J069193P21750l81354j165843j037583l08069
$$ 676442 -246297 -845841 -486017 583176 1304926 923572 -242271 -1279854 -1587923
35939a587923M93729J092666J252284P90607K3055l85703k80413k29617o04086
$$ -1587923 -1094194 -1528 1250756 2041363 2064418 1678715 1398302 1168685 564599
35930E64599r52602p10422j16178J05775k31777n72320l84166K49853Q31909R64389
$$ 564599 -388003 -1098425 -1214603 -1108828 -1340605 -1912925 -2297091 -2047238 -1215329 -250940
35920b50940O41147K20017J07963L38908N25341L63662N7022J6094K50529L55844
$$ -250940 390207 610224 718187 1057095 1582436 1946098 2003120 2019214 2269743 2625587
35910B625587Q7325l51248o44369p13321o21015l89085r9624J0327k02549n27744
$$ 2625587 2712912 2361664 1717295 1003974 382959 -6126 -105750 -95423 -297972 -825716
35900h25716o07709l79072j12774n743O6703L05137O51853Q58465Q18568O54283
$$ -825716 -1433425 -1812497 -1925271 -1931014 -1864311 -1559174 -907321 -48856 769712 1423995
35890A423995M48977Q9674m47736p75981m10764M55157Q47719J13805j024443
$$ 1423995 1872972 1962646 1514910 738929 328165 783322 1631041 1744846 720403
35881G20403j117734J65539J445215J291934j0380r72855q18700j08891L97184
$$ 720403 -397331 -231792 1213423 2505357 2494977 1522122 703422 594531 991715
35872I91715N84869N28725Q0410o56534j132051j113763j037410j110996p70899
$$ 991715 1576584 2105309 2185719 1529185 397134 -716629 -1754039 -2865035 -3635934
35863c635934K78323J164873R51931J49183L820N68280P35346J78568j07021M38625
$$ -3635934 -3357611 -2192738 -1240807 -1091624 -1087804 -519524 215822 394390 287369 725994
35853G25994R24119M56364m21868o56588l05463k38479o67906r58523p19659k43564
$$ 725994 1650113 2106477 1684609 1028021 722558 484079 -183827 -1142350 -1862009 -2105573
35843b105573J03706K43234J51169j34876k88831l6742K85751R6569m69725n82357
$$ -2105573 -2001867 -1758633 -1607464 -1742340 -2031171 -2067913 -1782162 -1685593 -2155318 -2737675
35833b737675J06716Q67289Q27593R8370m79636m78975k73631k75206k71454J39270
$$ -2737675 -2630959 -1763670 -936077 -837707 -1317343 -1796318 -2069949 -2345155 -2616609 -2477339
35823b477339P17464P37674P3955m27331q7644N36222M33866k45817l09016O37563
$$ -2477339 -1759875 -1022201 -948246 -1375577 -1463221 -926999 -493133 -738950 -1047966 -410403
35813d10403J461236J127709J84596j68667J32833J35609n32055j163856j098409
$$ -410403 1050833 2178542 2363138 2194471 2327304 2462913 1930858 767002 -331407
35804c31407n23773J7770K99989L44024J40981k67562o49043o95430k53815M70340
$$ -331407 -855180 -837410 -537421 -193397 -52416 -319978 -969021 -1664451 -1918266 -1447926
35794a447926R05883O16817m2983k15661K54010M83218r4684p11000m07747L63496
$$ -1447926 -542043 74774 31791 -183870 70140 553358 458674 -252326 -660073 -296577
35784b96577L91782l44479o31664N1330Q00864P94859M10819L20731M12533K61176
$$ -296577 95205 -249274 -880938 -829608 -28744 766115 1176934 1497665 1910198 2171374
35774B171374n1898k46818m10810o52491o68363k33744K59822K85254j12169n03399
$$ 2171374 2119476 1872658 1461848 809357 140994 -92750 167072 452326 340157 -163242
35764a63242o29088l96194K53319J021636J203910M82581n01423q36495l75615
$$ -163242 -792330 -1188524 -935205 86431 1290341 1772922 1271499 435004 59389
35755E9389K95861O58559O21635L16862p1649l90860o47498q70656q06632k00449
$$ 59389 355250 1013809 1635444 1952306 1880657 1489797 842299 -28357 -834989 -1035438
35745a035438N14553M66062m01131j000994n16762N11674J076158J010994P10905
$$ -1035438 -520885 -54823 -455954 -1456948 -1973710 -1462036 -385878 625116 1336021
35736A336021K08613n26596q81486k90648O20946O81134j24209o44022k95471
$$ 1336021 1544634 1018038 136552 -154096 466850 1147984 1023775 379753 84282
35727H4282K59248L73403L08581M23164L56776l18815j194193j416672p45289
$$ 84282 343530 716933 1025514 1448678 1805454 1486639 292446 -1124226 -1869515
35718a869515K04936O11564J32154q16041j312812p49764M79827J372818J440984
$$ -1869515 -1664579 -1053015 -920861 -1736902 -3049714 -3799478 -3319651 -1946833 -505849
35709e05849J085874Q23464O43652L45099L1564q9890j28934l87532r12057j350332
$$ -505849 580025 1403489 2047141 2392240 2423804 2333914 2204980 1817448 905391 -444941
35699d44941j216529l23755Q92683J574841J224653K20404o76415j119338j137835
$$ -444941 -1661470 -1985225 -1092542 482299 1706952 1927356 1250941 131603 -1006232
35690a006232o51005L12449J106599J017744L45621J02760N18152P34362K37129
$$ -1006232 -1657237 -1344788 -238189 779555 1125176 1227936 1746088 2480450 2717579
35681B717579l86976n67075o38570r32460q88790l3430Q53487O67161l15000p74108
$$ 2717579 2330603 1763528 1124958 192498 -696292 -729722 123765 790926 475926 -298182
35671b98182k38134M31404M63595J07422n8653P9184L43766N83714N77507J86591
$$ -298182 -536316 -104912 358683 466105 407452 486636 830402 1414116 1991623 2178214
$$ [...]
##END NTUPLES=NMR SPECTRUM
##END=
