##TITLE=31Pdec_DE-AcClold2Bor
 , 24 sc
20.8.2026
##JCAMPDX= 6.0         $$ Bruker NMR JCAMP-DX V2.0
##DATA TYPE= NMR SPECTRUM
##DATA CLASS= NTUPLES
##ORIGIN= UXNMR, Bruker Analytische Messtechnik GmbH
##OWNER= root
$$ XWIN-NMR		Version 3.5
$$ Thu Aug 20 13:47:04 2026 Russian Standard Time (UT+4h)  she@DPX200
##.OBSERVE FREQUENCY= 81.013821
##.OBSERVE NUCLEUS= ^31P
##.ACQUISITION MODE= SIMULTANEOUS
##.ACQUISITION SCHEME= undefined
##.AVERAGES= 64
##.DIGITISER RES= 17
##SPECTROMETER/DATA SYSTEM= spect
##.PULSE SEQUENCE= zgpg30
##.SOLVENT NAME= DMSO
##.SHIFT REFERENCE= (INTERNAL, DMSO, 0, 197.392)
##AUDIT TRAIL= $$ (NUMBER, WHEN, WHO, WHERE, WHAT)
$$ ##TITLE= Audit trail, XWIN-NMR		Version 3.5
$$ ##JCAMPDX= 5.01
$$ ##ORIGIN= Bruker BioSpin GmbH
$$ ##OWNER= she
$$ F:/spectra/data/she/nmr/P31/2/pdata/1/auditp.txt
$$ ##AUDIT TRAIL=  $$ (NUMBER, WHEN, WHO, WHERE, WHAT)
(   1,<2026-08-20 13:46:15.34 +0400>,<she>,<DPX200>,
      <created by zg, POWCHK disabled, PULCHK disabled
       configuration hash MD5:
       00 E9 B6 7A A2 85 ED C7 34 08 36 98 17 FE 4E 26
       data hash MD5: 32K
       93 86 6C BB 12 A6 70 BB 83 1B B2 8C 72 4C 7E E1>)
(   2,<2026-08-20 13:46:17.03 +0400>,<she>,<DPX200>,
      <Start of raw data processing
       efp BC_mod = 2 LB = 1.5 FT_mod = 6 PKNL = 1 PHC0 = 1958.989 PHC1 = 86.89841 SI = 64K 
       data hash MD5: 64K
       43 B3 2A 51 6E 1A 42 30 03 4E D9 5A 6E 5F F8 9D>)
(   3,<2026-08-20 13:46:28.48 +0400>,<she>,<DPX200>,
      <abs ABSG = 5 
       data hash MD5: 64K
       E3 A9 10 92 F7 32 00 66 2E 33 5D 73 C6 35 D7 FB>)
$$ ##END=
$$ 
$$ hash MD5
$$ 91 2F 06 8A BD 47 AF 4D 45 D8 F3 0A F1 8F 46 AD
##$RELAX= 
##$RELAX= 
##$RELAX= 
##$RELAX= 
##$RELAX= 
##$RELAX= 
##$RELAX= 
##$RELAX= 
$$ Bruker specific parameters
$$ --------------------------
##$DU= <F:/spectra>
##$EXPNO= 2
##$NAME= <P31>
##$PROCNO= 1
##$TYPE= <nmr>
##$USER= <she>
##$AMP= (0..31)
100 100 100 100 100 100 100 100 100 100 100 100 100 100 100 100 100 100 
100 100 100 100 100 100 100 100 100 100 100 100 100 100 
##$AQSEQ= 0
##$AQ_mod= 1
##$AUNM= <au_zg>
##$AUTOPOS= <>
##$BF1= 81.014009
##$BF2= 200.13
##$BF3= 200.13
##$BF4= 200.13
##$BF5= 200.13
##$BF6= 200.13
##$BF7= 200.13
##$BF8= 200.13
##$BYTORDA= 1
##$CFDGTYP= 0
##$CFRGTYP= 5
##$CHEMSTR= <none>
##$CNST= (0..31)
1 1 145 1 1 1 1 1 1 1 1 1 1 1 1 1 1 1 1 1 1 1 1 1 1 1 1 1 1 1 1 1 
##$CPDPRG= <waltz16>
##$CPDPRG1= <>
##$CPDPRG2= <waltz16>
##$CPDPRG3= <>
##$CPDPRG4= <mlev>
##$CPDPRG5= <mlev>
##$CPDPRG6= <mlev>
##$CPDPRG7= <mlev>
##$CPDPRG8= <mlev>
##$CPDPRGB= <>
##$CPDPRGT= <>
##$D= (0..31)
0 1 0 0 0 0 0 0 0 0.06 0 0.03 2e-05 3e-06 0 0 0.0002 0 0 0 0 0 0 0 0 0 
0 0 0 0 0 0 
##$DATE= 1787219174
##$DBL= (0..7)
120 120 120 11 120 120 24 19 
##$DBP= (0..7)
150 150 150 150 150 150 150 150 
##$DBP07= 0
##$DBPNAM0= <>
##$DBPNAM1= <>
##$DBPNAM2= <>
##$DBPNAM3= <>
##$DBPNAM4= <>
##$DBPNAM5= <>
##$DBPNAM6= <>
##$DBPNAM7= <>
##$DBPOAL= (0..7)
0.5 0.5 0.5 0.5 0.5 0.5 0.5 0.5 
##$DBPOFFS= (0..7)
0 0 0 0 0 0 0 0 
##$DE= 6
$$ [...]
##$SUBNAM3= <"">
##$SUBNAM4= <"">
##$SUBNAM5= <"">
##$SUBNAM6= <"">
##$SUBNAM7= <"">
##$SUBNAM8= <"">
##$SUBNAM9= <"">
##$SW= 400.765351723535
##$SWIBOX= (0..15)
0 1 3 0 0 0 0 0 0 0 0 0 0 0 0 0 
##$SW_h= 32467.5324675325
##$TD= 32768
##$TD0= 1
##$TE= 0
##$TE2= 300
##$TE3= 300
##$TEG= 300
##$TL= (0..7)
0 120 53 12 22 120 120 120 
##$TP= (0..7)
150 150 150 150 150 150 150 150 
##$TP07= 0
##$TPNAME0= <>
##$TPNAME1= <>
##$TPNAME2= <>
##$TPNAME3= <>
##$TPNAME4= <>
##$TPNAME5= <>
##$TPNAME6= <>
##$TPNAME7= <>
##$TPOAL= (0..7)
0.5 0.5 0.5 0.5 0.5 0.5 0.5 0.5 
##$TPOFFS= (0..7)
0 0 0 0 0 0 0 0 
##$TUNHIN= 0
##$TUNHOUT= 0
##$TUNXOUT= 0
##$USERA1= <user>
##$USERA2= <user>
##$USERA3= <user>
##$USERA4= <user>
##$USERA5= <user>
##$V9= 5
##$VALIST= <valist>
##$VCLIST= <CCCCCCCCCCCCCCC>
##$VD= 0
##$VDLIST= <DDDDDDDDDDDDDDD>
##$VPLIST= <PPPPPPPPPPPPPPP>
##$VTLIST= <TTTTTTTTTTTTTTT>
##$WBST= 1024
##$WBSW= 4
##$XGAIN= (0..3)
0 0 0 0 
##$XL= 0
##$YL= 0
##$YMAX_a= 5429
##$YMIN_a= -4372
##$ZGOPTNS= <>
##$ZL1= 120
##$ZL2= 120
##$ZL3= 120
##$ZL4= 120
##$ABSF1= 197.3918
##$ABSF2= -203.3724
##$ABSG= 5
##$ABSL= 3
##$ALPHA= 0
##$AQORDER= 0
##$ASSFAC= 0
##$ASSFACI= 0
##$ASSFACX= 0
##$ASSWID= 0
##$AUNMP= <proc_1d>
##$AZFE= 0.1
##$AZFW= 0.5
##$BCFW= 0
##$BC_mod= 2
##$BYTORDP= 0
##$COROFFS= 0
##$CY= -3
##$DATMOD= 1
##$DC= 0
##$DFILT= <>
##$DTYPP= 0
##$F1P= 0
##$F2P= 0
##$FCOR= 1
##$FTSIZE= 65536
##$FT_mod= 6
##$GAMMA= 0
##$GB= 0
##$INTBC= 1
##$INTSCL= 9.790993e-09
##$ISEN= 30
##$LB= 1.5
##$LEV0= 0
##$LPBIN= 0
##$MAXI= 10000
##$MC2= 0
##$MEAN= 0
##$ME_mod= 0
##$MI= 50
##$NCOEF= 0
##$NC_proc= -8
##$NLEV= 6
##$NOISF1= 182.463
##$NOISF2= 159.3651
##$NSP= 0
##$NTH_PI= 0
##$NZP= 0
##$OFFSET= 197.3918
##$PC= 4
##$PHC0= 1958.989
##$PHC1= 86.89841
##$PH_mod= 1
##$PKNL= yes
##$PPARMOD= 0
##$PSCAL= 0
##$PSIGN= 0
##$REVERSE= no
##$SF= 81.014063255964
##$SI= 65536
##$SIGF1= 159.3651
##$SIGF2= -187.1042
##$SINO= 113.3802
##$SIOLD= 16384
##$SREGLST= <1H.CDCl3>
##$SSB= 0
##$STSI= 65536
##$STSR= 0
##$SW_p= 32467.5324675325
##$SYMM= 0
##$S_DEV= 0
##$TDeff= 32768
##$TDoff= 0
##$TI= <>
##$TILT= no
##$TM1= 0
##$TM2= 0
##$TOPLEV= 0
##$USERP1= <user>
##$USERP2= <user>
##$USERP3= <user>
##$USERP4= <user>
##$USERP5= <user>
##$WDW= 1
##$XDIM= 65536
##$YMAX_p= 117093588
##$YMIN_p= -386090142
$$ End of Bruker specific parameters
$$ ---------------------------------
##NTUPLES= NMR SPECTRUM
##VAR_NAME=  FREQUENCY,     SPECTRUM/REAL,   SPECTRUM/IMAG
##SYMBOL=    X,             R,               I
##VAR_TYPE=  INDEPENDENT,   DEPENDENT,       DEPENDENT
##VAR_FORM=  AFFN,          ASDF,            ASDF
##VAR_DIM=   65536,         65536,           65536
##UNITS=     HZ,            ARBITRARY UNITS, ARBITRARY UNITS
##FACTOR=    0.49542278885378, 1,            1
##FIRST=     15991.5117654749, 0,            0
##LAST=      -16476.0207020576, 0,           0
##MIN=       -16476.0207020576, -386090142,  0
##MAX=       15991.5117654749, 117093588,    0
$$ Real data points
##PAGE= N=1
##DATA TABLE= (X++(R..R)), XYDATA
$$ [...]
##PAGE= N=2
##DATA TABLE= (X++(I..I)), XYDATA
$$ plain form
7470 4285378 5233681 4391614 2078419 321063 282631 685056 -362836 -2906092 -5170193
7461 -5170193 -5518358 -3961662 -1941235 -807143 -658680 -927802 -1678185 -3287943 -4930287
7452 -4930287 -4857832 -2656296 239006 2862839 5834402 9166681 10870914 9487142 6563709
7443 6563709 4605303 3582170 1630015 -1370210 -3114588 -1873256 1405475 4165519
7435 4165519 4440823 2212239 -537987 -1534850 -677411 -17919 -664207 -1177193 -191312
7426 -191312 1231485 1852596 3158063 7223590 12653567 15676144 15060181 13146960 11879960
7417 11879960 10522065 7899763 4564886 1844535 489777 929080 3329788 6841399
7409 6841399 9958694 11743042 11555551 8232247 1626584 -5230102 -7933973 -5188936
$$ packed form
7470D285378R48303q42067k313195j757356l8432M02425j047892k543256k264101
7461e170193l48165J556696K020427J134092J48463k69122p50383j609758j642344
7452d930287P2455K201536K895302K623833K971563L332279J704233j383772k923433
7443F563709j958406j023133j952155l000225j744378J241332L278731K760044
7435D165519K75304k228584k750226r96863Q57439O59492o46288n12986R85881
7426a91312J422797O21111J305467M065527N429977L022577o15963j913221j267000
7417A1879960j357895k622302l334877k720351j354758M39303K400708L511611
7409F841399L117295J784348j87491l323304o605663o856686k703871K745037
$$ plain form
7401 -5188936 314038 5593448 9852909 13075600 14598104 14029764 11903518 8803799
7393 8803799 5291990 2703776 2116897 2549764 2317636 1991611 3373182 5650028 5878742
7384 5878742 3733721 2172026 2369024 1817666 -781689 -2508315 -645528 3111091 5716566
7375 5716566 7141028 8535181 8726020 6262000 3002200 1862677 2310351 1686944 -103958
7366 -103958 -906411 -525839 -869299 -2102498 -2242172 -805073 338177 116875 -704417
7357 -704417 -2022343 -4834363 -8325424 -9395574 -6543289 -2168836 292418 -22212 -1574976
7348 -1574976 -2641270 -2337793 -647715 1612105 3403479 4234573 3761674 1285042 -2974016
7339 -2974016 -6664975 -7211298 -4723783 -1365744 1645105 4299809 5695733 4628559
$$ packed form
7401e188936N502974N279410M259461L222691J522504n68340k126246l099719
7393H803799l511809k588214n86879M32867k32128l26025J381571K276846K28714
7384E878742k145021j561695J96998n51358k599355j726626J862787L756619K605475
7375E716566J424462J394153J90839k464020l259800j139523M47674o23407j790902
7366a03958q02453L80572l43460j233199j39674J437099J143250k21302q21292
7357g04417j317926k812020l491061j070150K852285M374453K461254l14630j552764
7348a574976j066294L03477J690078K259820J791374Q31094m72899k476632m259058
7339b974016l690959n46323K487515L358039L010849K654704J395924j067174
$$ plain form
7331 4628559 2487696 2498295 5069264 6553520 4056475 -701325 -3873650 -4073038 -2884261
7322 -2884261 -2133343 -2179945 -2258078 -1652574 -980138 -2060268 -5172041 -6976348 -3701487
7313 -3701487 3343089 8279314 7659276 4208521 2225416 2134627 1819601 920062 858869
7304 858869 1876612 2665142 2369078 1099541 -827942 -2602289 -2749486 -757152 1984804
7295 1984804 4003045 5195980 5350929 3210502 -1035769 -4184644 -3461461 -233174 2127493
7286 2127493 2773769 3124317 3317695 2107818 -266440 -2186106 -3437062 -5007008 -6165268
7277 -6165268 -4695928 -430106 4013154 6407286 6565626 4788039 1363741 -2013445
7269 -2013445 -3074163 -1980537 -1200042 -1871371 -2677125 -2662886 -2364409 -1554444 987559
$$ packed form
7331D628559k140863J0599K570969J484256k497045m757800l172325j99388J188777
7322b884261P50918m6602p8133O05504O72436j080130l111773j804307L274861
7313c701487P044576M936225o20038l450755j983105r0789l15026q99539o1193
7304H58869J017743P88530k96064j269537j927483j774347j47197J992334K741956
7295A984804K018241J192935J54949k140427m246271l148875P23183L228287K360667
7286B127493O46276L50548J93378j209877k374258j919666j250956j569946j158260
7277f165268J469340M265822M443260K394132J58340j777587l424298l377186
7269b013445j060718J093626P80495o71329q05754J4239K98477Q09965K542003
$$ plain form
7260 987559 4374941 5466973 3414420 1394149 1958987 3517295 3575251 2650209 2319627
7251 2319627 1872634 -114875 -2865375 -4951462 -6825406 -8816364 -8730358 -5149345 -1384243
7242 -1384243 -1807841 -5193199 -6229028 -3382235 -515512 -132013 178104 2881812 6347925
7233 6347925 7965883 7948721 7301970 4958193 113530 -4720906 -6266887 -4751253 -2779743
7224 -2779743 -1109179 1552188 5325743 8636591 10509909 10740278 8213987 2132297
7216 2132297 -4957631 -8585254 -7818675 -6531303 -7833481 -9855994 -9141530 -6098915 -4309437
7207 -4309437 -5463672 -7730422 -8901203 -8672754 -7542004 -5720287 -3978972 -3708892 -4950306
7198 -4950306 -5739381 -4658113 -2897576 -2461011 -3403302 -4540079 -5983377 -8638673 -11308373
$$ packed form
7260I87559L387382J092032k052553k020271N64838J558308N7956r25042l30582
7251B319627m46993j987509k750500k086087j873944j990958Q6006L581013L765102
7242a384243m23598l385358j035829K846793K866723L83499L10117K703708L466113
7233F347925J617958j7162o46751k343777m844663m834436j545981J515634J971510
7224b779743J670564K661367L773555L310848J873318K30369k526291o081690
7216B132297p089928l627623P66579J287372j302178k022513P14464L042615J789478
7207d309437j154235k266750j170781K28449J130750J821717J741315K70080j241414
7198d950306p89075J081268J760537M36565r42291j136777j443298k655296k669700
$$ plain form
7189 -11308373 -10875337 -6326109 -594592 2923234 4054380 4530566 4627385 3433084 1552659
7180 1552659 845366 1432772 1447801 328063 5133 1664785 3415743 2963454 1122196
7171 1122196 573616 1940990 3211512 2790029 1074323 -1213546 -4254935 -7779465 -9992297
7162 -9992297 -9288583 -6473004 -4094188 -3632797 -4119519 -3599075 -1396136 1273049 2629282
7153 2629282 2018246 303505 -1263917 -2325889 -3378635 -4636818 -5439995 -5063555 -3849931
7144 -3849931 -3080094 -3561397 -4512153 -4091917 -1145638 3657779 8486500 11919707 13557911
7135 13557911 13331069 11104561 7493628 4393872 3611822 4885983 6168661 6301867 6658100
7126 6658100 9234522 13344793 15301567 12088443 5039071 -847992 -1504913 2558006
$$ packed form
7189a1308373M33036M549228N731517L517826J131146M76186R6819j194301j880425
7180A552659p07293N87406J5029j119738l22930J659652J750958m52289j841258
7171A122196n48580J367374J270522m21483j715706k287869l041389l524530k212832
7162i992297P03714K815579K378816M61391m86722N20444K202939K669185J356233
7153B629282o11036j714741j567422j061972j052746j258183q03177L76440J213624
7144c849931P69837m81303r50756M20236K946279M803417M828721L433207J638204
7135A3557911k26842k226508l610933l099756p82050J274161J282678J33206L56233
7126F658100K576422M110271J956774l213124p049372n887063o56921M062919
$$ plain form
7118 2558006 7283743 9286366 8571173 7309200 6770313 6075355 3819636 324915 -2201937
7109 -2201937 -1846710 970813 4033633 5835148 6904958 8350865 9898614 10319441 9381058
7100 9381058 8152478 7328305 6467392 5261638 4374224 4290191 4307768 3632441 2793621 2921214
7090 2921214 3954684 4504021 3405511 846315 -1811179 -2867843 -1438185 1606063
7082 1606063 4243646 5320327 5295135 4529496 2141454 -2119529 -5976980 -6657405 -4507793
7073 -4507793 -2584094 -2511718 -2749161 -1577067 56478 -46594 -2178645 -4315395 -4508354
7064 -4508354 -2861368 -1217176 -1245076 -2841224 -4567374 -5719003 -7061981 -8783564 -8979070
7055 -8979070 -6006754 -1564037 1040336 1574559 3098395 6896297 10054131 9595324 6622864
$$ packed form
7118B558006M725737K002623p15193j261973n38887o94958k255719l494721k526852
7109b201937L55227K817523L062820J801515J069810J445907J547749M20827r38383
7100I381058j228580q24173q60913j205754q87414q4033J7577o75327q38820J27593
7090B921214J033470N49337j098510k559196k657494j056664J429658L044248
7082A606063K637583J076681k5192p65639k388042m260983l857451o80425K149612
7073d507793J923699P2376k37443J172094J633545j03072k132051k136750j92959
7064d508354J646986J644192k7900j596148j726150j151629j342978j721583j95506
7055h979070K972316M442717K604373N34223J523836L797902L157834m58807k972460
$$ plain form
7046 6622864 4277662 3344078 2165605 -130102 -2373105 -2764658 -251102 4546990 8637907
7037 8637907 8487887 4294141 850996 1947078 5318903 5793838 2242916 -1739666 -3397112
7028 -3397112 -3472617 -3098871 -1584626 1370328 3907010 4088875 2092385 -693142 -3078010
7019 -3078010 -3775565 -1649170 2500951 5942133 6936719 6294636 5165631 3114256 -208080
7010 -208080 -3110340 -3461023 -1340261 1484678 3986620 6238766 7891585 7947802 6212800
7001 6212800 3924670 2581758 2471641 2443843 1199089 -1030673 -2575011 -2689746 -2865168
6992 -2865168 -4244012 -4725057 -1439161 3938566 5847579 2164428 -2422818 -2791249 -342675
6983 -342675 -177079 -3169556 -5038334 -3053697 235314 1045959 -800722 -2769375 -3423582
$$ packed form
7046F622864k345202r33584j178473k295707k243003l91553K513556M798092M090917
7037H637907j50020m193746l443145J096082L371825M74935l550922l982582j657446
7028c397112p5505L73746J514245K954954K536682J81865j996490k785527k384868
7019c078010o97555K126395M150121L441182R94586o42083j129005k051375l322336
7010b08080k902260l50683K120762K824939K501942K252146J652819N6217j735002
7001F212800k288130j342912j10117k7798j244754k229762j544338j14735j75422
6992b865168j378844m81045L285896N377727J909013l683151m587246l68431K448574
6983c42675J65596k992477j868778J984637L289011Q10645j846681j968653o54207
$$ plain form
6974 -3423582 -3445620 -3679693 -3822047 -3226229 -2167328 -1723629 -2335430 -2918309 -2042215 181019
6964 181019 2303244 3502367 3931604 3054075 -220118 -4805695 -7138206 -5439618 -2498049
6955 -2498049 -2085235 -4187070 -6141653 -6917026 -7288702 -7000233 -5293994 -3771767 -4976949
6946 -4976949 -7809519 -7902040 -3481923 2256479 5700309 6736849 6808260 6038914 4237773
6937 4237773 2380030 1083361 -449047 -2206885 -2188321 472931 3076139 2477041 -662243
6928 -662243 -3014955 -2909419 -1330172 435860 1820189 2129216 805252 -1536675 -3790534
6919 -3790534 -5693832 -7214626 -7437583 -5731539 -3364368 -2208893 -2354408 -2634498 -2819851
6910 -2819851 -3361808 -3599896 -2519414 -1027615 -1025120 -2049732 -1388655 1668020 3997840
$$ packed form
6974c423582k2038k34073j42354N95818J058901M43699o11801n82879Q76094K223234
6964A81019K122225J199123M29237q77529l274193m585577k332511J698588K941569
6955b498049M12814k101835j954583p75373l71676K88469J706239J522227j205182
6946d976949k832570r2521M420117N738402L443830J036540P1411p69346j801141
6937D237773j857743j296669j532408j757838J8564K661252K603208n99098l139284
6928f62243k352712J05536J579247J766032J384329L09027j323964k341927k253859
6919c790534j903298j520794k22957J706044K367171J155475j45515k80090j85353
6910b819851n41957k38088J080482J491799K495j024612O61077L056675K329820
$$ plain form
6901 3997840 2515401 -1730708 -4955992 -5172459 -3665322 -2225892 -535763 2793374
6893 2793374 7070059 8747749 4973431 -2321795 -7490395 -7114152 -3573489 -1587784
6885 -1587784 -2642177 -4666256 -6018377 -7075260 -8019148 -7770388 -5960081 -4001508 -3209586
6876 -3209586 -3268921 -3331248 -3319447 -3430634 -3550288 -3743368 -4078288 -3511620 -592005 3816982
6866 3816982 6119475 3742496 -1634277 -5833412 -6391228 -3964987 -497019 2466749
6858 2466749 3928957 3391506 1203024 -1405212 -2839659 -2003114 695873 3199095 3582496
6849 3582496 2193981 1074198 1126218 1170011 163129 -1242173 -2159424 -2850228 -3426971
6840 -3426971 -2726999 -180462 2405352 2932282 2137504 2549719 4661851 6262396 5713644
$$ packed form
6901C997840j482439m246109l225284k16467J507137J439430J690129L329137
6893B793374M276685J677690l774318p295226n168600L76243L540663J985705
6885a587784j054393k024079j352121j056883r43888K48760J810307J958573P91922
6876c209586n9335o2327J1801j11187j19654j93080l34920N66668K919615M408987
6866C816982K302493k376979n376773m199135n57816K426241L467968K963768
6858B466749J462208n37451k188482k608236j434447Q36545K698987K503222L83401
6849C582496j388515j119783N2020M3793j006882j405302r17251o90804n76743
6840c426971O99972K546537K585814N26930p94778M12215K112132J600545n48752
$$ plain form
6831 5713644 3904216 2333971 921214 -1284644 -4273004 -6977437 -8507504 -8764246
6823 -8764246 -8101250 -6875011 -5298950 -3572237 -2070493 -1143990 -629055 -47992 441415
6814 441415 -5418 -1480719 -2608479 -2116869 -451921 1161228 2546932 4154634 5370119
6805 5370119 4903591 2791718 501712 -1032529 -2022794 -2420739 -1665292 -378650 -618253
6796 -618253 -3351082 -6809761 -8427452 -7609938 -5720349 -4141898 -3358855 -3290639 -3365815
6787 -3365815 -2518684 -198830 2418553 2942456 38354 -4748064 -7764953 -6535830 -2610459
6778 -2610459 -381777 -2247870 -5739858 -6771543 -4914856 -3224093 -3004170 -1679258
6770 -1679258 2966669 8967879 12599791 12820166 11080593 8180674 4005876 -352302
$$ packed form
6831E713644j809428j570245j412757k205858k988360k704433j530067k56742
6823h764246O62996J226239J576061J726713J501744R26503N14935N81063M89407
6814D41415m46833j475301j127760M91610J664948J613149J385704J607702J215485
6805E370119m66528k111873k290006j534241r90265l97945P55447J286642k39603
6796f18253k732829l458679j617691Q17514J889589J578451P83043O8216p5176
6787c365815Q47131K319854K617383N23903k904102m786418l016889J229123L925371
6778b610459K228682j866093l491988j031685J856687J690763K19923J324912
6770a679258M645927O001210L631912K20375j739573k899919m174798m358178
$$ plain form
6762 -352302 -3060912 -4200318 -5503315 -7105205 -6946287 -4227875 -1289974 -705919 -2094893
6753 -2094893 -3235383 -3084011 -2132595 -670973 1541932 4078375 5746902 5890361 4874423
6744 4874423 3227035 1190887 -649894 -1164433 226151 2489919 3603358 2491484
6736 2491484 273817 -641337 1138802 4647760 7594668 8531197 7766463 6457335 5413635
6727 5413635 4849099 4755174 5215006 6469900 8548293 10520454 10525035 7473295 2814913
6718 2814913 -366354 -511163 823974 977860 -892691 -3458889 -5102109 -5335955 -4810572
6709 -4810572 -4822912 -6615016 -10193435 -13708064 -14776173 -12767468 -9328209 -6431358 -4431171
6700 -4431171 -2495573 -598561 -253679 -2809125 -7304849 -10744078 -10912533 -8643710 -6823002
$$ packed form
6762c52302k708610j139406j302997j601890J58918K718412K937901N84055j388974
6753b094893j140490J51372R51416J461622K212905K536443J668527J43459j015938
6744D874423j647388k036148j840781n14539J390584K263768J113439j111874
6736B491484k217667r15154J780139L508958K946908R36529p64734j309128j043700
6727E413635n64536r3925M59832J254894K078393J972161M581l051740m658382
6718B814913l181267j44809J335137J53886j870551k566198j643220k33846N25383
6709d810572j2340j792104l578419l514629j068109K008705L439259K896851K000187
6700d431171J935598J897012L44882k555446m495724l439229j68455K268823J820708
$$ plain form
6691 -6823002 -7272615 -9077876 -9857788 -8076196 -4116892 173685 2752102 2813338 1351894
6682 1351894 3745 -629948 -972705 -1101314 -570680 349626 791158 1137805 3019273
6673 3019273 6316174 7853207 4958198 -750311 -5147935 -6411846 -5887164 -4799036
6665 -4799036 -2893212 -604438 222489 -1020098 -2406462 -2177804 -1078210 -646120 -718317
6656 -718317 -231508 716286 1332781 1814297 2898205 4290730 5032043 4975336 4541175 3524657
6646 3524657 1661026 -1424 59439 1646447 2907362 2637997 1267804 -356872 -1728059
6637 -1728059 -2175518 -1226185 105953 -149808 -2413403 -4758312 -5358820 -4726857 -4730264
6628 -4730264 -6240659 -8605578 -10799098 -12180029 -12412135 -11405006 -9420768 -7019406
$$ packed form
6691f823002m49613j805261p79912J781592L959304M290577K578417O1236j461444
6682A351894j348149o33693l42757j28609N30634R20306M41532L46647J881468
6673C019273L296901J537033k895009n708509m397624j263911N24682J088128
6665d799036J905824K288774Q26927j242587j386364K28658J099594M32090p2197
6656g18317M86809R47794O16495M81516J083908J392525P41313n6707m34161j016518
6646C524657j863631j662450O0863J587008J260915k69365j370193j624676j371187
6637a728059m47459R49333J332138k55761k263595k344909o00508O31963l407
6628d730264j510395k364919k193520j380931k32106J007129J984238K401362
$$ plain form
6620 -7019406 -4898516 -3572317 -2840262 -1900688 -612736 -142194 -1272191 -2592590 -2163768
6611 -2163768 -1008864 -2690624 -8346516 -14046018 -14884042 -10706051 -6130937 -5485482 -9064282
6602 -9064282 -13732291 -15657668 -12829007 -6559083 -744312 1448279 348220 -1310493
6594 -1310493 -1687196 -952439 287225 1918514 3463197 3792300 2383023 41203 -2029422
6585 -2029422 -3234311 -3553423 -3278314 -2924069 -2722798 -2244296 -1247122 -580332 -1069472
6576 -1069472 -1720956 -612478 2179686 4155049 3559509 1590258 568372 1096585 2005769
6567 2005769 2142701 1244658 -116195 -640208 628327 2447609 1928899 -1624515 -4691455
6558 -4691455 -3453662 916323 3285907 927867 -3523674 -6130900 -6309756 -5895785 -5409040
$$ packed form
6620g019406K120890J326199P32055R39574J287952M70542j129997j320399M28822
6611b163768J154904j681760n655892n699502q38024M177991M575114O45455l578800
6602i064282m668009j925377K828661O269924N814771K192591j100059j658713
6594a310493l76703P34757J239664J631289J544683L29103j409277k341820k070625
6585b029422j204889l19112K75109L54245K01271M78502R97174O66790m89140
6576a069472o51484J108478K792164J975363n95540j969251j021886N28213R09184
6567B005769J36932q98043j360853n24013J268535J819282n18710l553414l066940
6558d691455J237793M369985K369584k358040m451541k607226j78856M13971M86745
$$ plain form
6549 -5409040 -3675414 -635920 1809597 2353146 2112931 2974460 5044850 6791793 7192079
6540 7192079 6643929 5865173 4990204 4075386 3536378 3378505 2668601 759130 -1200745
6531 -1200745 -999983 2163205 6611959 9825070 10650970 9818465 8900832 9047185 10203023
6522 10203023 11230686 11049791 9657021 7645471 5082356 1878993 -819025 -1057005
6514 -1057005 1539484 4984848 7244929 8183485 8446240 7868608 6396596 5347057 5818899
6505 5818899 6528385 5253584 2163559 -316744 -959426 -919120 -1095939 -600824 998634
6496 998634 1799067 -272839 -4337236 -7206152 -6848701 -4169348 -1634473 -962953 -1888635
6487 -1888635 -2519043 -1154998 1851368 4515147 5721892 6335049 7191874 7197883 4727177
$$ packed form
6549e409040J733626L039494K445517N43549k40215Q61529K070390J746943M00286
6540G192079n48150p78756q74969r14818n39008j57873p09904j909471j959875
6531a200745K00762L163188M448754L213111Q25900q32505r17633J46353J155838
6522A0203023J027663j80895j392770k011550k563115l203363k698018k37980
6514a057005K596489L445364K260081R38556K62755n77632j472012j049539M71842
6505E818899P09486j274801l090025k480303o42682M0306j76819M95115J599458
6496I98634Q00433k071906m064397k868916L57451K679353K534875O71520r25682
6487a888635o30408J364045L006366K663779J206745O13157Q56825O009k470706
$$ plain form
6478 4727177 201769 -4139048 -6635495 -7020224 -5264935 -1414445 3209797 6351999
6470 6351999 7192873 7217871 7837752 8080395 5802934 836015 -4115052 -5886193 -3739257
6461 -3739257 246135 3446939 5238344 7044731 9694835 11397770 9529582 4426322
6453 4426322 -125483 -1062705 417973 718263 -1632588 -4903426 -7126272 -8104246 -8116397
6444 -8116397 -6570992 -3150549 885442 3793708 5042609 5001009 3884274 2273757 1869464
6435 1869464 4097992 8256324 12350517 15269930 16639303 15390627 11009433 6017769
6427 6017769 4164044 5323032 5143153 1204571 -3453750 -5175644 -5136202 -6570391 -8711543
6418 -8711543 -7806333 -3449813 374556 963533 -147764 -742937 -967594 -1497848 -1785423
$$ packed form
6478D727177m525408m340817k496447l84729J755289L850490M624242L142202
6470F351999Q40874K4998O19881K42643k277461m966919m951067j771141K146936
6461c739257L985392L200804J791405J806387K650104J702935j868188n103260
6453D426322m551805r37222J480678L00290k350851l270838k222846r77974j2151
6444h116397J545405L420443M035991K908266J248901m1600j116735j610517m04293
6435A869464K228528M158332M094193K919413J369373j248676m381194m991664
6427F017769j853725J158988j79879l938582m658321j721894L9442j434189k141152
6418h711543R05210M356520L824369N88977j111297n95173k24657n30254k87575
$$ plain form
6409 -1785423 -1813906 -2942656 -5254583 -6499660 -5464152 -4023472 -3958408 -4159296 -3175322
6400 -3175322 -2094695 -2234900 -2219296 -476776 1203437 74086 -2952313 -4623031 -4303256
6391 -4303256 -4004081 -4207220 -3620207 -2934798 -4719165 -8920696 -12185048 -12590800 -11571752
6382 -11571752 -10069710 -6508337 -442148 5125834 7479706 7607900 7512672 6570085 3399307
6373 3399307 -450941 -1722999 404569 3661355 5579653 5334233 3491369 1492142
6365 1492142 582103 36656 -2324764 -6651348 -9905420 -10013213 -9239587 -10822502 -13745489
6356 -13745489 -14009723 -10411294 -5917116 -3371732 -2724796 -2798750 -3056892 -2873680 -1441416
6347 -1441416 505088 704913 -1763827 -4940382 -6168893 -4800272 -2213939 -296945
$$ packed form
6409a785423k8483j128750k311927j245077J035508J440680O5064k00888R83974
6400c175322J080627j40205J5604J742520J680213j129351l026399j670718L19775
6391d303256K99175k03139N87013O85409j784367m201531l264352m05752J019048
6382a1571752J502042L561373O066189N567982K353872J28194r5228r42587l170778
6373C399307l850248j272058K127568L256786J918298k45420j842864j999227
6365A492142r10039n45447k361420m326584l254072j07793P73626j582915k922987
6356a3745489k64234L598429M494178K545384O46936p3954k58142J83212J432264
6347a441416J946504J99825k468740l176555j228511J368621K586333J916994
$$ plain form
6339 -296945 -400100 -2657289 -5663604 -7506003 -7362294 -5541577 -2473115 1018858 2955663
6330 2955663 1833407 -762536 -1295748 1275431 4203734 5078683 5114003 6610570 8902461
6321 8902461 9254733 7016135 4424409 3249232 2861410 2323822 2423163 4066321 5829374
6312 5829374 5234981 2558413 1434985 4555055 9938916 12990231 11611317 7617116
6304 7617116 3506978 136796 -2002049 -1756438 817491 3341279 3753756 2810135 2209445
6295 2209445 1631274 -127964 -2196218 -2503650 -1165526 -389707 -1084976 -1959724 -1985615
6286 -1985615 -1324700 244161 3104660 5531719 4407216 -689910 -6297384 -9002926
6278 -9002926 -8643409 -6886816 -4941005 -3727355 -4041359 -5115073 -4869730 -2794332 -768457
$$ packed form
6339b96945j03155k257189l006315j842399J43709J820717L068462L491973J936805
6330B955663j122256k595943n33212K571179K928303Q74949L5320J496567K291891
6321H902461L52272k238598k591726j175177l87822n37588R9341J643158J763053
6312E829374n94393k676568j123428L120070N383861L051315j378914l994201
6304G617116m110138l370182k138845K45611K573929K523788M12477r43621o00690
6295B209445n78171j759238k068254l07432J338124P75819o95269q74748k5891
6286a985615O60915J568861K860499K427059j124503n097126n607474k705542
6278i002926L59517J756593J945811J213650l14004j073714K45343K075398K025875
$$ plain form
6269 -768457 -158270 -352124 -1079802 -3228042 -5712262 -4752922 1012326 7299628 9191306
6260 9191306 7315422 5797815 6016018 6247004 6155128 7177693 8576121 7289669 2594350
6251 2594350 -2405929 -4973768 -5593562 -5586128 -4630345 -2261748 292869 1619135 2158958
6242 2158958 3238145 4925273 6124583 6317230 6226107 6762238 7691221 7566932 5422809
6233 5422809 2529496 1375155 2405902 3283382 2384688 1117700 952891 300294 -2666410
6224 -2666410 -5771339 -5454891 -2967721 -3385782 -7816199 -11064029 -8856444 -3482680 267740
6215 267740 1398944 1729267 1293158 -1295921 -5105364 -7331699 -7500247 -8145229 -10668981
6206 -10668981 -12920417 -12032544 -8171627 -4209741 -2266212 -1570360 108408 3384918
$$ packed form
6269g68457O10187j93854p27678k148240k484220R59340N765248O287302J891678
6260I191306j875884j517607K18203K30986r1876J022565J398428j286452m695319
6251B594350n000279k567839o19794P434R55783K368597K554617J326266N39823
6242B158958J079187J687128J199310J92647r1123N36131R28983j24289k144123
6233E422809k893313j154341J030747Q77480q98694j266988j64809o52597k966704
6224b666410l104929L16448K487170m18061m430417l247830K207585N373764L750420
6215B67740J131204L30323m36109k589079l809443k226335j68548o44982k523752
6206a0668981k251436Q87873L860917L961886J943529O95852J678768L276510
$$ plain form
6198 3384918 6241910 6388368 4022844 1378442 -75835 -726693 -1247634 -1475220 -1219510
6189 -1219510 -878483 -745274 -724797 -933034 -1457958 -1600744 -796488 -46553 -499841 -885294
6179 -885294 956961 3835450 3840470 258282 -2616876 -1472019 1467651 2295448 706103
6170 706103 -1609983 -4826732 -9244351 -12018613 -10318802 -6581626 -6016564 -9354603 -12497534
6161 -12497534 -13184388 -13281648 -13924264 -13272838 -10716306 -8893265 -9165117 -8808005 -5489154
6152 -5489154 -1450806 -235751 -1742194 -3549678 -4953010 -6394990 -6684308 -4444282
6144 -4444282 -1365021 -457212 -1416843 -1050392 1630103 3945488 3705795 1825467 -203022
6135 -203022 -2700651 -6147676 -9350048 -11037646 -11664241 -11964882 -11263742 -9073867 -6945396
$$ packed form
6198C384918K856992J46458k365524k644402j454277o50858n20941k27586K55710
6189a219510L41027J33209K0477k08237n24924j42786Q04256P49935m53288l85453
6179h85294J842255K878489N020l582188k875158J144857K939670Q27797j589345
6170G06103k316086l216749m417619k774262J699811L737176N65062l338039l142931
6161a2497534o86854r7260o42616O51426K556532J823041k71852L57112L318851
6152e489154M038348J215055j506443j807484j403332j441980k89318K240026
6144d444282L079261R07809r59631L66451K680495K315385k39693j880328k028489
6135b03022k497629l447025l202372j687598o26595l00641P01140K189875K128471
$$ plain form
6126 -6945396 -6385595 -5944274 -3159102 884211 2025444 -1155043 -4800027 -4724151 -1703815
6117 -1703815 393249 153864 -447551 104745 1075764 1770584 2871869 4481542 5082350
6108 5082350 3908049 2580011 2687297 3147478 1961519 -352876 -1306962 -131558 1240627
6099 1240627 1216578 656493 998361 1604430 368568 -3337882 -7353494 -8674872 -6396020
6090 -6396020 -2427749 603821 1657269 1176612 -468542 -3060852 -5171916 -4573575 -975570
6081 -975570 2929965 4288700 2973604 731967 -1183988 -2103899 -1051650 2086485 5250184
6072 5250184 6249913 5794039 6453927 8897465 11273509 12160988 11812610 10426134 7703710
6063 7703710 4560732 2720418 1842765 -397155 -4329658 -7086670 -7001308 -6608492 -8889367
$$ packed form
6126f945396N59801M41321K785172M043313J141233l180487l644984P5876L020336
6117a703815K097064k39385o01415N52296R71019O94820J101285J609673O00808
6108E082350j174301j328038J07286M60181j185959k314395r54086J175404J372185
6099A240627k4049n60085L41868O06069j235862l706450m015612j321378K278852
6090f396020L968271L031570J053448m80657j645154k592310k111064N98341L598005
6081i75570L905535J358735j315096k241637j915955r19911J052249L138135L163699
6072E250184R99729m55874O59888K443538K376044Q87479l48378j386476k722424
6063G703710l142978j840314q77653k239920l932503k757012Q5362L92816k280875
$$ plain form
6054 -8889367 -12583859 -14101440 -12790791 -11290895 -11202876 -11384543 -10773133 -10305396 -11127655
6045 -11127655 -12706510 -13757507 -13934042 -13763924 -13608731 -13240515 -12038834 -9477606 -5875953
6036 -5875953 -2548811 -629212 14836 28449 -763731 -2833326 -5398258 -6755258 -6221543
6027 -6221543 -4501894 -2082959 1189340 4506497 5771641 4011652 923860 -1256713
6019 -1256713 -2471193 -3930564 -5263023 -4563754 -1362919 2254139 4028324 3544161 1321564
6010 1321564 -2277462 -5945383 -6934975 -3847599 926196 3771721 4280654 4578376 4639378
6001 4639378 1887041 -3534244 -6910682 -5117220 -1778018 -2595159 -7183041 -9635406
5993 -9635406 -6768748 -1803846 745271 335863 -706653 -697295 608642 2658008 4146793
$$ packed form
6054h889367l694492j517581J310649J499896Q8019j81667O11410M67737q22259
6045a1127655j578855j050997j76535J70118J55193L68216J201681K561228L601653
6036e875953L327142J919599O44048J3613p92180k069595k564932j357000N33715
6027f221543J719649K418935L272299L317157J265144j759989l087792k180573
6019a256713j214480j459371j332459O99269L200835L617058J774185m84163k222597
6010A321564l599026l667921r89592L087376M773795K845525N08933K97722O1002
6001D639378k752337n421285l376438J793462L339202q17141m587882k452365
5993i635406K866658M964902K549117m09408j042516R358J305937K049366J488785
$$ plain form
5984 4146793 3990671 3026664 2992942 3470056 2332702 -175740 -989879 842836 2213511
5975 2213511 1133882 431913 2995738 6224610 5464333 1216557 -1592791 -831825 754347
5966 754347 824513 625229 1778932 3289304 3398108 2088288 323829 -1462913 -3100018
5957 -3100018 -4308832 -5148663 -5524718 -4427441 -1536788 878500 426658 -1150040 336883
5948 336883 4911525 7431734 4994413 1482624 1666516 3979729 3361187 -609856 -3144439
5939 -3144439 -1545331 1298497 1812401 648981 722653 2577205 3894065 2549071 -1523287
5930 -1523287 -6855617 -11385838 -13219404 -11844530 -8853416 -6702963 -6542884 -7679837
5922 -7679837 -9009042 -10086414 -10559301 -9628602 -7108760 -4411304 -2990973 -1807564 1895528
$$ packed form
5984D146793j56122r64007l3722M77114j137354k508442q14139J832715J370675
5975B213511j079629p01969K563825L228872p60277m247776k809348P60966J586172
5966G54347P0166j99284J153703J510372J08804j309820j764459j786742j637105
5957c100018j208814q39831l76055J097277K890653K415288m51842j576698J486923
5948C36883M574642K520209k437321l511789J83892K313213o18542l971043k534583
5939c144439J599108K843828N13904j163420P3672J854552J316860j344994m072358
5930a523287n332330m530221j833566J374874K991114K150453J60079j136953
5922g679837j329205j077372m72887R30699K519842K697456J420331J183409L703092
$$ plain form
5913 1895528 8429766 13935023 14513199 11019839 7625096 6205690 4819420 2032680
5905 2032680 -155744 620467 3120514 3800295 1185643 -2889871 -5799660 -6160926 -3853089
5896 -3853089 36002 3161926 3571658 2001872 1306204 3005180 5446214 6021081 4218577
5887 4218577 1585121 -576191 -2265464 -3792856 -4940950 -5472244 -5673657 -5874645 -5930914
5878 -5930914 -5716915 -5675269 -6137816 -6379425 -5293423 -3036687 -1001821 105388 1051455
5869 1051455 2359706 2992004 1859052 -202390 -1282554 -642716 1279903 4511904 9251766
5860 9251766 13911609 15554204 13263133 9734721 8426637 9870276 11582122 10994077
5852 10994077 7809667 3939355 1607053 1239193 1166292 -151444 -1949812 -2177975 -413588
$$ packed form
5913A895528O534238N505257N78176l493360l394743j419406j386270k786740
5905B032680k188424P76211K500047O79781k614652m075514k909789l61266K307837
5896c853089L889091L125924M09732j569786o95668J698976K441034N74867j802504
5887D218577k633456k161312j689273j527392j148094n31294k01413k00988n6269
5878e930914K13999M1646m62547k41609J086002K256736K034866J107209R46067
5869A051455J308251O32298j132952k061442j080164O39838J922619L232001M739862
5860I251766M659843J642595k291071l528412j308084J443639J711846n88045
5852A0994077l184410l870312k332302l67860p2901j317736j798368k28163J764387
$$ plain form
5843 -413588 1557991 1975604 399015 -3129076 -8156294 -12608383 -13737556 -11402437 -8566319
5834 -8566319 -7403077 -6859580 -5467759 -4369497 -5303103 -7190813 -7261043 -4661298 -806917
5825 -806917 2890213 5425486 5412236 2541843 -881220 -2620556 -4118027 -8241534 -13640776
5816 -13640776 -15132748 -10699813 -4683121 -2229046 -3326001 -4475318 -3955213 -2827257
5808 -2827257 -2222117 -2269754 -3023289 -4198431 -4340124 -2217591 1004621 2667614 1888228
5799 1888228 652683 1384371 4341492 7618751 9033582 7877428 5276082 2910044
5791 2910044 1332129 -50183 -1365215 -1724342 -814301 88208 -290077 -1449193 -2041332
5782 -2041332 -1852017 -1673607 -1801463 -1899371 -1903955 -1899060 -1582810 -967991 -873429 -1424003 -1122969
$$ packed form
5843d13588J971579M17613j576589l528091n027218m452089j129173K335119K836118
5834h566319J163242N43497J391821J098262r33606j887710p0230K599745L854381
5825h06917L697130K535273j3250k870393l423063j739336j497471m123507n399242
5816a3640776j491972M432935O016692K454075j096955j149317N20105J127956
5808b827257O05140m7637p53535j175142j41693K122533L222212J662993p79386
5799A888228j235545P31688K957121L277259J414831j156154k601346k366038
5791B910044j577915j382312j315032l59127R10041R02509l78285j159116n92139
5782b041332J89315J78410j27856r7908m584M895L16250O14819R4562n50574L01034
$$ plain form
5771 -1122969 687700 1548636 -1159936 -5534807 -6863268 -4380212 -2557508 -4217995
5763 -4217995 -6155949 -4377873 -524075 833925 -670880 -1149757 1170730 3896755
5755 3896755 5179475 6397543 8718606 10383305 9510269 7137415 5319141 4092853
5747 4092853 2438642 689309 -157895 -289894 -111159 1507207 5649017 10551834 12691826
5738 12691826 10740524 6690802 3038331 531821 -1146977 -2192491 -2822138 -3488735
5730 -3488735 -4252939 -4450956 -3348583 -1054303 1022885 813769 -2215118 -5366394 -5102122
5721 -5102122 -2088568 -1557306 -6549276 -12900816 -14058805 -9452348 -4368774 -2291448
5713 -2291448 -1744174 -1099045 -1855569 -5192234 -9006131 -11021832 -12083550 -13708282 -14691458
$$ packed form
5771a122969J810669Q60936k708572m374871j328461K483056J822704j660487
5763d217995j937954J778076L853798J358000j504805m78877K320487K726025
5755C896755J282720J218068K321063J664699q73036k372854j818274j226288
5747D092853j654211j749333q47204j31999J78735J618366M141810M902817K139992
5738A2691826j951302m049722l652471k506510j678798j045514o29647o66597
5730c488735p64204j98017J102373K294280K077188k09116l028887l151276K64272
5721e102122L013554N31262m991970o351540j157989M606457N083574K077326
5713b291448N47274O45129p56524l336665l813897k015701j061718j624732r83176
$$ plain form
5704 -14691458 -13023360 -9467402 -6367434 -4104601 -1498212 1085132 1757099 76058
5696 76058 -2222531 -3606048 -4247464 -4978363 -5789667 -5505690 -2818000 1606109 4298473
5687 4298473 2375398 -1816557 -2309492 2794404 8312711 8956732 6093496 4119702 3106416
5678 3106416 -41749 -4854783 -7352573 -6683203 -6331000 -7713998 -7505483 -3303913 2145466
5669 2145466 4920922 4985495 4794411 5349236 5993778 6099981 4842205 1118988 -4346815
5660 -4346815 -8530712 -9572148 -9116471 -9488988 -10229465 -9331951 -6454435 -3019077 -352823
5651 -352823 720947 -123277 -1595563 -1294631 1035241 2517954 1148963 -1300369 -2507570
5642 -2507570 -3332720 -5340600 -6804149 -5153109 -2078025 -1781303 -4488000 -6085955 -4586676
$$ packed form
5704a4691458J668098L555958L099968K262833K606389K583344O71967j681041
5696G6058k298589j383517o41416p30899q11304K83977K687690M424109K692364
5687D298473j923075m191955m92935N103896N518307O44021k863236j973794j013286
5678C106416l148165m813034k497790O69370L52203j382998K08515M201570N449379
5669B145466K775456O4573j91084N54825O44542J06203j257776l723217n465803
5660d346815m183897j041436M55677l72517p40477Q97514K877516L435358K666254
5651c52823J073770q44224j472286L00932K329872J482713j368991k449332j207201
5642b507570q25150k007880j463549J651040L075084K96722k706697j597955J499279
$$ plain form
5633 -4586676 -2543235 -1936414 -1119708 885866 1034102 -3376849 -9618957 -12450662 -10557473
5624 -10557473 -6787394 -3275943 -75510 1831926 237170 -4500815 -8523803 -9082907
5616 -9082907 -7850356 -7821459 -8812015 -8403079 -6284736 -4992304 -6192007 -8346846 -8866892
5607 -8866892 -7234621 -5118366 -4249117 -5047618 -6857629 -8709928 -9863902 -9969786 -8822619
5598 -8822619 -6237025 -2649111 388842 1280932 222826 -904108 -902621 -656142 -1532405
5589 -1532405 -3252669 -4345071 -4248106 -3937311 -4534835 -6046576 -7573879 -8380721 -8626777
5580 -8626777 -8912931 -8869169 -6817843 -2032744 3005449 4519574 1963990 -1414565 -3244212
5571 -3244212 -4735785 -7281270 -9174144 -8384078 -6290571 -5283574 -4447135 -1639223 1314485
$$ packed form
5633d586676K043441O06821Q16706K005574J48236m410951o242108k831705J893189
5624a0557473L770079L511451L200433J907436j594756m737985m022988n59104
5616i082907J232551K8897r90556M08936K118343J292432j199703k154839n20046
5607h866892J632271K116255Q69249p98501j810011j852299j153974j05884J147167
5598h822619K585594L587914L037953Q92090j058106j126934J487K46479q76263
5589a532405j720264j092402R6965L10795n97524j511741j527303q06842k46056
5580h626777k86154M3762K051326M785099N038193J514125k555584l378555j829647
5571c244212j491573k545485j892874P90066K093507J006997Q36439K807912K953708
$$ plain form
5562 1314485 214442 -4724092 -8341881 -7728283 -5625276 -5192432 -5578298 -4917132 -3994420
5553 -3994420 -4166498 -4663962 -4734140 -5722613 -8155647 -9335455 -7011165 -3282065 -1665538
5544 -1665538 -2228958 -2818975 -3122464 -3908377 -4001123 -2033491 50953 -576065 -2609903
5535 -2609903 -2470255 -744422 -1914744 -7064030 -11550779 -11504197 -8595111 -6364973 -5376250
5526 -5376250 -4435493 -3671249 -3630418 -3446015 -2540622 -2574803 -5247942 -9264281 -11604479
5517 -11604479 -10993694 -8456734 -5472262 -3307449 -3154729 -4927679 -6451047 -5584324 -2825131
5508 -2825131 -455704 282233 -340933 -2159233 -5143346 -7912909 -8295903 -6027481 -3399132
5499 -3399132 -2382207 -2186899 -648892 2597807 5343684 5171329 2075233 -1334074 -2026573
$$ packed form
5562A314485j100043m938534l617789O13598K103007M32844l85866O61166R22712
5553c994420j72078m97464p0178r88473k433034j179808K324290L729100J616527
5544a665538n63420n90017l03489p85913r2746J967632K084444o27018k033838
5535b609903J39648J725833j170322n149286m486749M6582K909086K230138R88723
5526e376250R40757P64244M0831J84403R05393l4181k673139m016339k340198
5517a1604479O10785K536960K984472K164813J52720j772950j523368Q66723K759193
5508b825131K369427P37937o23166j818300k984113k769563l82994K268422K628349
5499c399132J016925J95308J538007L246699K745877j72355l096096l409307o92499
$$ plain form
5490 -2026573 941050 5787267 9676128 10979571 9999490 7937562 5823494 4537018
5482 4537018 4967726 7096225 9036144 8232656 4375200 425200 -222275 2660817 6162703
5473 6162703 7518106 6405230 4345552 3223377 4368858 7458568 9893298 8900853
5465 8900853 4983532 1628312 640610 -283061 -3603758 -7361678 -7280764 -2754730 2120659
5456 2120659 3786503 3011572 2540175 3084563 3386914 3131504 3711276 5777054 7334123
5447 7334123 5406630 -450354 -7136738 -10956622 -10957773 -8701828 -5664418 -2424988 121081
5438 121081 1039854 1142561 2139527 3248056 1241311 -4576241 -9927760 -10422393 -6989003
5429 -6989003 -3952095 -3257358 -3410339 -2991603 -2165613 -1153774 64241 697077 48172
$$ packed form
5490b026573K967623M846217L888861J303443r80081k061928k114068j286476
5482D537018M30708K128499J939919q03488l857456l950000o47475K883092L501886
5473F162703J355403j112876k059678j122175J145481L089710K434730r92445
5465H900853l917321l355220r87702r23671l320697l757920Q0914M526034M875389
5456B120659J665844p74931m71397N44388L02351k55410N79772K065778J557069
5447G334123j927493n856984o686384l819884j151K255945L037410L239430K546069
5438A21081R18773J02707R96966J108529k006745n817552n351519m94633L433390
5429f989003L036908O94737j52981M18736Q25990J011839J218015O32836o48905
$$ plain form
5420 48172 -933064 -1177434 -1826248 -4499664 -7941415 -9249320 -8000430 -6230609 -4758288
5411 -4758288 -2804557 -1061241 -1449575 -3348324 -3586613 -1043792 2022733 4126019 6553583
5402 6553583 9828635 11503230 9554085 5534195 2531715 2002778 3848123 7244910
5394 7244910 10047853 9771471 6596647 3109016 -43304 -5250753 -12987393 -18865657
5386 -18865657 -18377331 -12543248 -6366854 -3252091 -3039942 -3974358 -4430051 -3710406 -2587085
5377 -2587085 -2003537 -785722 3101572 8320426 10308209 7234975 2685662 405696
5369 405696 -348699 -1668172 -2576625 -1205637 1344996 3021561 4440497 6780953 8202798
5360 8202798 6483635 3524180 2888541 4075423 3669508 1396092 406061 1635073 2393056
$$ packed form
5420D8172r81236k44370o48814k673416l441751j307905J248890J769821J472321
5411d758288J953731J743316l88334j898749k38289K542821L066525K103286K427564
5402F553583L275052J674595j949145m019890l002480n28937J845345L396787
5394G244910K802943k76382l174824l487631l152320n207449p736640n878264
5386a8865657M88326N834083O176394L114763K12149r34416m55693P19645J123321
5377b587085N83548J217815L887294N218854J987783l073234m549313k279966
5369D05696p54395j319473r08453J370988K550633J676565J418936K340456J421845
5360H202798j719163k959455o35639J186882m05915k273416r90031J229012P57983
$$ plain form
5351 2393056 1174433 -223260 -469902 -1001372 -3083198 -5463376 -6500551 -6459437 -6424874
5342 -6424874 -6703417 -7262288 -8174055 -8796887 -7800526 -4703030 -664646 2295730 2458463
5333 2458463 -216217 -2955190 -2059441 2396791 5536590 3657759 -534594 -1565373
5325 -1565373 1587366 5380785 7437935 8270401 7987619 5731947 2594911 1052185 1041196
5316 1041196 358730 -802296 75070 2655605 3244509 760968 -1333137 -971265 -822627
5307 -822627 -2998914 -4616823 -2247217 2420007 5171198 5135650 4378617 3596164 2015550
5298 2015550 298185 -96836 297556 73009 215625 2875780 7016214 8692848 6324143
5289 6324143 2764365 1029572 448515 -1332923 -4374706 -6476771 -6280199 -4470380 -2188695
$$ packed form
5351B393056j218623j397693k46642n31470k081826k380178j037175M1114L4563
5342f424874k78543n58871r11767o22832R96361L097496M038384K960376J62733
5333B458463k674680k738973Q95749M456232L139799j878831m192353j030779
5325a565373L152739L793419K057150Q32466k82782k255672l137036j542726j0989
5316A041196o82466j161026Q77366K580535N88904k483541k094105L61872J48638
5307h22627k176287j617909K369606M667224K751191l5548p57033p82453j580614
5298B015550j717365l95021L94392k24547J42616K660155M140434J676634k368705
5289F324143l559778j734793n81057j781438l041783k102065J96572J809819K281685
$$ plain form
5280 -2188695 -46623 949831 -721171 -4918260 -8520978 -8139112 -4076281 66794 1924663
5271 1924663 2607284 3796659 4830490 4228211 2261871 -45959 -3018557 -7059157 -10384931
5262 -10384931 -10635589 -8234175 -5811532 -4718247 -4312881 -4129676 -4317159 -4369940 -3880034
5253 -3880034 -4068724 -6005462 -7883363 -6920438 -3416964 172141 3465987 7601848 10860280
5244 10860280 9550141 4057721 -486901 -1061458 -151087 -642118 -1567949 -1308455 -1073264
5235 -1073264 -2176518 -3072311 -2251019 -1431783 -2829251 -5507659 -7243414 -7827413 -7862881
5226 -7862881 -6613152 -3964382 -2365450 -3691845 -5987294 -6362149 -5427759 -5718297 -7183899
5217 -7183899 -7465828 -5609017 -2638972 504755 2915468 2834506 -251944 -3584842 -4001711
$$ packed form
5280b188695K142072R96454j671002m197089l602718L81866M062831M143075J857869
5271A924663O82621J189375J033831o02279j966340k307830k972598m040600l325774
5262a0384931k50658K401414K422643J093285M05366J83205j87483n2781M89906
5253c880034j88690j936738j877901R62925L503474L589105L293846M135861L258432
5244A0860280j310139n492420m544622n74557R10371m91031r25831K59494K35191
5235a073264j103254q95793Q21292Q19236j397468k678408j735755n83999l5468
5226g862881J249729K648770J598932j326395k295449l74855R34390k90538j465602
5217g183899k81929J856811K970045L143727K410713q0962l086450l332898m16869
$$ plain form
5208 -4001711 -2007502 -474473 -479939 -1262587 -3058694 -6567105 -10211461 -11281709 -9657369
5199 -9657369 -7504404 -5627298 -3243268 -1195522 -1876378 -5247033 -7984104 -7807665 -6326939
5190 -6326939 -6266956 -7602695 -7834268 -5255246 -1076002 1487397 329507 -3030767 -4799801
5181 -4799801 -3370839 -1238963 -1500934 -4018547 -6605395 -8362889 -9647021 -10071494 -9106589
5172 -9106589 -7798648 -7393835 -6948532 -4821546 -1946906 -944202 -2214275 -3494115 -3318577
5163 -3318577 -2584021 -2526478 -3215894 -4190574 -4818679 -4188023 -2407005 -1626882 -3781611
5154 -3781611 -7607241 -9865812 -9222379 -7036266 -4843210 -3148893 -2226095 -1923475 -1111166
5145 -1111166 581733 1145951 -1335868 -5292082 -7363852 -6912487 -6000765 -5401386 -3881193
$$ packed form
5208d001711J994209J533029n466p82648j796107l508411l644356j070248J624340
5199i657369K152965J877106K384030K047746o80856l370655k737071J76439J480726
5190f326939N9983j335739k31573K579022M179244K563399j157890l360274j769034
5181d799801J428962K131876k61971k517613k586848j757494j284132m24473R64905
5172i106589J307941M04813M45303K126986K874640J002704j270073j279840J75538
5163c318577P34556N7543o89416r74680o28105O30656J781018P80123k154729
5154c781611l825630k258571O43433K186113K193056J694317R22798L02620Q12309
5145a111166J692899N64218k481819l956214k071770M51365R11722N99379J520193
$$ plain form
5136 -3881193 -1481960 -249726 -1093498 -2633841 -3717298 -4650007 -5662296 -6599133 -8176735
5127 -8176735 -10840213 -12415063 -10073742 -4973774 -1618772 -1906955 -3163357 -3114109 -3337250
5118 -3337250 -5945313 -9679942 -11448276 -9873119 -5835155 -1272540 1508762 1363338
5110 1363338 165198 1078556 4172508 6160983 5330635 3808708 3582729 3407174 1817952
5101 1817952 363559 953351 2090245 956189 -1925835 -3236600 -1801332 -364758
5093 -364758 -1928625 -5967053 -8984670 -8193731 -4342973 -1013485 -988837 -3532979 -5744804
5084 -5744804 -6029325 -5084114 -3990333 -3069499 -2539813 -2481090 -1983080 -63204 2380226
5075 2380226 3184728 1499773 -1927582 -6516051 -11399009 -13592238 -10113363 -2837509
$$ packed form
5136c881193K399233J232234q43772j540343j083457r32709j012289r36837j577602
5127h176735k663478j574850K341321N099968L355002k88183j256402M9248k23141
5118c337250k608063l734629j768334J575157M037964M562615K781302j45424
5110A363338j198140R13358L093952J988475q30348j521927k25979j75555j589222
5101A817952j454393N89792J136894j134056k882024j310765J435268J436574
5093c64758j563867m038428l017617P90939L850758L329488K4648k544142k211825
5084e744804k84521R45211J093781R20834N29686N8723M98010J919876K443430
5075B380226Q04502j684955l427355m588469m882958k193229L478875P275854
$$ plain form
5067 -2837509 1917219 273905 -5014698 -8483421 -7709048 -3932476 483411 3424765
5059 3424765 3881260 3126250 3457661 4768425 4535069 2226184 834834 2155706 3400891
5050 3400891 1300925 -2583859 -3887968 -1609225 830269 375359 -2305676 -4368704
5042 -4368704 -3817714 -678558 3509195 6826014 8022052 6730127 3214158 -1189163
5034 -1189163 -3825798 -2651912 1239350 4411101 4646091 2390818 -1113839 -5087908
5026 -5087908 -8541149 -10754229 -12935689 -16995342 -21885866 -23518644 -19418095 -11570200
5018 -11570200 -3919068 965667 2259700 438127 -2586590 -4961101 -7062164 -10012260
5010 -10012260 -12212808 -10724061 -6483060 -4195129 -5813260 -8028869 -7863992 -6685164
$$ packed form
5067b837509M754728j643314n288603l468723P74373L776572M415887K941354
5059C424765M56495p55010L31411J310764k33356k308885j391350J320872J245185
5050C400891k099966l884784j304109K278743K439494m54910k681035k063028
5042d368704N50990L139156M187753L316819J196038j291925l515969m403321
5034a189163k636635J173886L891262L171751K34990k255273l504657l974069
5026e087908l453241k213080k181460m059653m890524j632778M100549P847895
5018a1570200P651132M884735J294033j821573l024717k374511k101063k950096
5010a0012260k200548J488747M241001K287931j618131k215609J64877J178828
$$ plain form
5002 -6685164 -6386004 -5603929 -2869659 -239642 -416569 -2739649 -4993032 -6858774 -8879887
4993 -8879887 -10431798 -11388510 -13306502 -16310775 -17465006 -14976969 -11156586 -8239193
4985 -8239193 -4512035 1654514 7006565 7327362 4129274 2728961 4856765 7509680
4977 7509680 8285261 7632516 6120041 3352172 -80551 -2513199 -3350280 -3277950 -2742823
4968 -2742823 -1995137 -1673596 -1533383 27435 3195738 5135204 3356884 -908572 -4752899
4959 -4752899 -7008586 -7493883 -5433384 -1569852 513346 -1468320 -4967966 -6417953
4951 -6417953 -6497121 -8061528 -10800839 -12027288 -11572903 -11978019 -14350936 -17245613 -19139419
4942 -19139419 -19406139 -17633605 -14316730 -11258369 -9394628 -7664190 -5592237 -4765085
$$ packed form
5002f685164K99160P82075K734270K630017j76927k323080k253383j865742k021113
4993h879887j551911r56712j917992l004273j154231K488037L820383K917393
4985h239193L727158O166549N352051L20797l198088j400313K127804K652915
4977G509680P75581o52745j512475k767869l432723k432648q37081P2330N35127
4968b742823P47686L21541J40213J560818L168303J939466j778320m265456l844327
4959d752899k255687m85297K060499L863532K083198j981666l499646j449987
4951f417953p9168j564407k739311j226449M54385m05116k372917k894677j893806
4942a9139419k66720J772534L316875L058361J863741J730438K071953Q27152
$$ plain form
4934 -4765085 -5988651 -7676664 -8932004 -11021105 -13732410 -14146116 -11706990 -10440456
4926 -10440456 -12991812 -16584727 -18104338 -18570349 -18985408 -16969217 -11961300 -8488904
4918 -8488904 -9245794 -10251407 -8270990 -7234092 -10940726 -15294106 -15224248 -13873557 -16748283
4909 -16748283 -21677920 -23142646 -22038477 -22352717 -22518237 -19227501 -15729442 -17014450
4901 -17014450 -20653307 -21489295 -20982483 -22686585 -23866819 -21657159 -21285494 -26905357 -31191673
4892 -31191673 -26813001 -20674046 -22153622 -25423628 -20652961 -14408850 -18655450 -27231097
4884 -27231097 -26525647 -22557676 -30791866 -45008088 -47008408 -42680207 -52413225 -68219580
4876 -68219580 -64167255 -51215540 -65090828 -82546861 -15641378 163691057 345151969
$$ packed form
4934d765085j223566j688013j255340k089101k711305m13706K439126J266534
4926a0440456k551356l592915j519611m66011m15059K016191N007917L472396
4918h488904p56890j005613J980417J036898l706634m353380O9858J350691k874726
4909a6748283m929637j464726J104169l14240j65520L290736L498059j285008
4901a7014450l638857q35988N06812j704102j180234K209660L71665n619863m286316
4892c1191673M378672O138955j479576l270006M770667O244111m246600q575647
4884b7231097P05450L967971q234190j4216222k000320M328201r733018j5806355
4876f8219580M052325J2951715j3875288j7456033O6905483J79332435J81460912
$$ plain form
4869 345151969 391204897 298906916 186690382 137578041 126720590 104285830 74604596
4862 74604596 63996419 65862336 58679112 46069975 43337237 45532980 38757345 27286952
4854 27286952 23832121 25590345 22596662 18806968 23616013 31367599 29352749 19538078
4846 19538078 14106099 14663552 12870083 7840029 6953758 11393879 14830727 15384273 16914932
4837 16914932 19417570 18822445 15570576 14031978 14307000 12851538 9899949 8642240
4829 8642240 8700989 7581745 6573568 8284495 10613808 10008430 8225394 9016908 10738530
4820 10738530 9330370 6136375 5533413 7073151 7285281 7167324 10248283 14738430 15291660
4811 15291660 11810239 9264665 9217890 8539047 6463302 6083102 8194581 9770986 9453000
$$ packed form
4869C45151969M6052928r2297981j12216534m9112341j0857451k2434760k9681234
4862G4604596j0608177J865917p183224j2609137k732738K195743o775635j1470393
4854B7286952l454831J758224k993683l789694M809045P751586k014850r814671
4846A9538078n431979N57453j793469n030054q86271M440121L436848N53546J530659
4837A6914932K502638n95125l251869j538598K75022j455462k951589j257709
4829H642240N8749j119244j008177J710927K329313o05378j783036P91514J721622
4820A0738530j408160l193995o02962J539738K12130j17957L080959M490147N53230
4811A5291660l481421k545574m6775o78843k075745l80200K111479J576405l17986
$$ plain form
4802 9453000 9271507 10221461 10948821 11269066 12350605 13078863 10788174 6075538 2749602
4793 2749602 2653583 4276381 6342524 8833352 10647709 10327035 9115873 9518017 11026686
4784 11026686 11066029 9657086 8927941 8371012 5327152 556438 -1358643 1621963 6142338
4775 6142338 8324212 8160476 7677577 7648119 7723067 7748006 7583546 6773731 4870602 1386690
4765 1386690 -3783712 -8758858 -10149014 -7227385 -3911716 -3930568 -5728799 -5398680 -2999446
4756 -2999446 -1827780 -2252878 -841646 3905767 8835085 10313545 8328561 5384915
4748 5384915 3428118 2702465 2284407 1436408 1109572 3193141 7372625 10525263 10692447
4739 10692447 9417357 8401621 6957330 5447354 7438173 14016129 19267426 17100581
$$ packed form
4802I453000j81493R49954P27360L20245J081539P28258k290689m712636l325936
4793B749602r6019J622798K066143K490828J814357l20674j211162M02144J508669
4784A1026686L9343j408943p29145n56929l043860m770714j915081K980606M520375
4775F142338K181874j63736m82899k9458P4948K4939j64460q09815j903129l483912
4765A386690n170402m975146j390156K921629L315669j8852j798231L30119K399234
4756b999446J171666m25098J411232M747413M929318J478460j984984k943646
4748E384915j956797p25653m18058q47999l26836K083569M179484L152638J67184
4739A0692447j275090j015736j444291j509976J990819O577956N251297k166845
$$ plain form
4731 17100581 10283768 6410814 6411615 4201931 -2429695 -8139815 -8819754 -7152609 -6571992
4722 -6571992 -5773052 -3128660 -1622261 -4626794 -9846988 -11898749 -9319206 -5658477
4714 -5658477 -4683703 -6954452 -10148485 -10908569 -7366142 -1206963 3797184 5963025 6709280
4705 6709280 6979124 5424982 1637838 -1518831 -1245911 1253993 2624324 2063531 1885724
4696 1885724 3859237 7007119 9199371 9508749 8449670 6600971 3813916 112028
4688 112028 -3157747 -4319447 -3793157 -3975046 -5755315 -6845751 -5138304 -2026314 -187391
4679 -187391 414728 1532523 2771241 1977070 -869117 -3211132 -3406844 -2025779 84101
4670 84101 2137728 2061774 -1820644 -7321150 -9786937 -7811364 -4792772 -3980208 -4622947
$$ packed form
4731A7100581o816813l872954Q01k209684o631626n710120o79939J667145N80617
4722f571992P98940K644392J506399l004533n220194k051761K579543L660729
4714e658477R74774k270749l194033p60084L542427O159179N004147K165841P46255
4705F709280K69844j554142l787144l156669K72920K499904J370331n60793j77807
4696A885724J973513L147882K192252L09378j059079j848699k787055l701888
4688A12028l269775j161700N26290j81889j780269j090436J707447L111990J838923
4679a87391O02119J117795J238718p94171k846187k342015j95712J381065K109880
4670H4101K053627p5954l882418n500506k465787J975573L018592Q12564o42739
$$ plain form
4661 -4622947 -4096252 -1587382 1457639 3029026 2269232 787419 1678118 5446288 8272365
4652 8272365 7156306 5151660 7274718 12273737 13800673 9935568 5807086 5287602
4644 5287602 5728520 3673600 819501 602242 2622658 4229710 4775164 4895939 4169740
4635 4169740 2827398 3447175 7480384 11869467 12326826 8621780 3997505 935722 62468
4626 62468 1478441 4240966 5816649 4756236 2880972 2614707 3540917 3825332 3368702
4617 3368702 2979448 2064466 45985 -1326744 -214407 1777867 1461860 -1206950 -3392012
4608 -3392012 -3993834 -4800271 -6788096 -8234812 -7444210 -5219074 -3569249 -3290838 -3617325
4599 -3617325 -3535738 -3070724 -3428657 -5339331 -7065751 -5592467 -904524 2569259 781352
$$ packed form
4661d622947N26695K508870L045021J571387p59794j481813Q90699L768170K826077
4652H272365j116059k004646K123058M999019J526936l865105m128482n19484
4644E287602M40918k054920k854099k17259K020416J607052N45454J20775p26199
4635D169740j342342O19777M033209M389083M57359l705046m624275l061783q73254
4626F2468J415973K762525J575683j060413j875264k66265R26210K84415m56630
4617C368702l89254r14982k018481j372729J112337J992274l16007k668810k185062
4608c392012o01822q06437j987825j446716P90602K225136J649825K78411l26487
4599c617325Q1587M65014l57933j910674j726420J473284M687943L473783j787907
$$ plain form
4590 781352 -4721364 -8637067 -8399776 -6506961 -6340936 -7922931 -8744180 -7430208 -5300444
4581 -5300444 -4462966 -5185257 -5883686 -5769176 -6208097 -8120790 -9207212 -6437079 -1125869
4572 -1125869 1760997 379450 -1154461 1357188 6383702 9449400 9343871 8132574
4564 8132574 6455780 2703097 -3133995 -8068045 -9588244 -8516637 -7358728 -6968182
4556 -6968182 -5830044 -2450151 2059789 4506405 3384734 1268518 1707725 4318350
4548 4318350 5589639 4538663 4073586 5645579 6227216 2914361 -2473485 -6034954 -6486582
4539 -6486582 -4650140 -941739 3563704 6034477 5279336 4205785 5626222 7903939
4531 7903939 8376466 8484232 10849791 13469985 12405612 9016254 8448031 10976892 10908444
$$ packed form
4590G81352n502716l915703K37291J892815J66025j581995q21249J313972K129764
4581e300444Q37478p22291o98429J14510m38921j912693j086422K770133N311210
4572a125869K886866j381547j533911K511649N026514L065698j05529j211297
4564H132574j676794l752683n837092m934050j520199J071607J157909L90546
4556f968182J138138L379893M509940K446616j121671k116216M39207K610625
4548D318350J271289j050976m65077J571993N81637l312855n387846l561469m51628
4539f486582J836442L708401M505443K470773p55141j073551J420437K277717
4531G903939M72527J07766K365559K620194j064373l389358n68223K528861o8448
$$ plain form
4522 10908444 5171959 -2470164 -7357192 -8886929 -7568811 -2453868 5192939 10030701
4514 10030701 8576454 4194370 2489962 3980833 4917376 3570339 1859950 1494447
4506 1494447 1952504 2449162 3253056 4397423 4747426 3070255 -577789 -4617892 -6897794
4497 -6897794 -6430483 -4478509 -3173684 -2923333 -2266816 -366001 1981249 4179314 6718353
4488 6718353 9314190 10149561 8448683 6198311 5598903 6064690 5542318 3798240 2447236
4479 2447236 2250461 2206759 1208987 -798433 -3196881 -5077648 -5554294 -4911698 -5053424
4470 -5053424 -7247995 -9548640 -8369807 -3312563 1274848 980137 -3439094 -7275399
4462 -7275399 -7957743 -7717557 -9384170 -11632069 -10694472 -5987207 -1318858 -50793 -1436955
$$ packed form
4522A0908444n736485p642123m887028j529737J318118N114943P646807M837762
4514A0030701j454247m382084j704408J490871R36543j347037j710389l65503
4506A494447M58057M96658Q03894J144367L50003j677171l648044m040103k279902
4497f897794M67311J951974J304825K50351O56517J900815K347250K198065K539039
4488F718353K595837Q35371j700878k250372n99408M65787n22372j744078j351004
4479B447236j96775m3702r97772k007420k398448j880767m76646O42596j41726
4470e053424k194571k300645J178833N057244M587411k94711m419231l836305
4462g275399o82344K40186j666613k247899R37597M707265M668349J268065j386162
$$ plain form
4453 -1436955 -2880234 -3567262 -3909967 -3148633 -289392 3148993 3994207 1397859 -1958464
4444 -1958464 -3142870 -2042611 -807279 -1500524 -4599520 -8620857 -10872970 -9584427
4436 -9584427 -5640956 -1603436 810175 1493085 837309 -671651 -1965613 -2055491 -1307055
4427 -1307055 -806274 -535165 433334 2037303 3165849 3645644 4622337 6504134 7962552
4418 7962552 7582079 5469289 2887789 1200869 1125613 1893775 1346104 -1717386 -5464854
4409 -5464854 -6954236 -5942449 -4750043 -4313420 -2934009 203470 2756102 2165188 -824940
4400 -824940 -3451617 -4664753 -5705183 -7352556 -8240213 -6350345 -1564724 3658487 6315506
4391 6315506 5700506 3865873 2937440 2803891 2352700 1874972 2336526 2780671 857663
$$ packed form
4453a436955j443279o87028l42705P61334K859241L438385Q45214k596348l356323
4444a958464j184406J100259J235332o93245l098996m021337k252113J288543
4436i584427L943471M037520K413611O82910o55776j508960j293962q9878P48436
4427a307055N00781K71109R68499J603969J128546M79795R76693J881797J458418
4418G962552l80473k112790k581500j686920p5256P68162n47671l063490l747468
4409e464854j489382J011787J192406M36623J379411L137479K552632n90914k990128
4400h24940k626677j213136j040430j647373q87657J889868M785621N223211K657019
4391F315506o15000j834633r28433j33549m51191m77728M61554M44145j923008
$$ plain form
4382 857663 -3615770 -7641597 -8445916 -6488263 -4417745 -4282576 -6245593 -8765110 -9589944
4373 -9589944 -7838652 -5448928 -5254704 -7381768 -9034018 -8116702 -5454175 -3145496 -2574462
4364 -2574462 -4462376 -8740492 -13429267 -15585121 -14534356 -12541163 -11293050 -9664458
4356 -9664458 -6385950 -3030824 -2231910 -3983295 -5728616 -5694525 -4555632 -3965451 -4634964
4347 -4634964 -5839812 -6055631 -4160850 -532910 3045675 4637444 3263779 -550527
4339 -550527 -4529255 -5690507 -3127204 607768 2388863 2269781 2506672 3602703 4150099
4330 4150099 4395561 6387244 9667589 10447647 7073673 3208304 2839135 4510463 3698293
4321 3698293 -599720 -4918397 -6298449 -5189307 -3361868 -1563352 8534 717424
$$ packed form
4382H57663m473433m025827q04319J957653K070518J35169j963017k519517q24834
4373i589944J751292K389724J94224k127064j652250R17316K662527K308679N71034
4364b574462j887914m278116m688775k155854J050765J993193J248113J628592
4356i664458L278508L355126P98914j751385j745321L4091J138893N90181o69513
4347d634964j204848k15819J894781L627940L578585J591769j373665l814306
4339e50527l978728j161252K563303L734972J781095j19082K36891J096031N47396
4330D150099K45462J991683L280345P80058l373974l865369l69169J671328q12170
4321C698293m298013m318677j380052J109142J827439J798516J571886P08890
$$ plain form
4313 717424 51170 -1522641 -2844148 -3113630 -2799272 -3505333 -6199140 -9320327 -9781830
4304 -9781830 -6627392 -2687041 -1509162 -3318081 -5102874 -4275359 -1191704 1785942
4296 1785942 2841479 2210684 1684009 2836718 5567640 8075664 8019281 4076922 -2594849
4287 -2594849 -8269956 -9397565 -6254490 -2661676 -1334974 -1271325 -873007 -1172162 -3506059
4278 -3506059 -6112499 -6320831 -4749243 -3949372 -4057670 -3427178 -2499028 -2912961 -3538020
4269 -3538020 -2012002 56848 -1491911 -6247072 -8632568 -5680759 -640839 2650190
4261 2650190 4248247 5082105 4161444 1353664 -1005539 -1684301 -2187606 -2973208 -2022140
4252 -2022140 840215 2399666 1043798 -862493 -1692543 -3087401 -5435436 -5806936 -3392936
$$ packed form
4313G17424o66254j573811j321507k69482L14358p06061k693807l121187m61503
4304i781830L154438L940351J177879j808919j784793Q27515L083655K977646
4296A785942J055537o30795n26675J152709K730922K508024n6383l942359o671771
4287b594849n675107j127609L143075L592814J326702O3649L98318k99155k333897
4278c506059k606440k08332J571588P99871j08298O30492R28150m13933o25059
4269c538020J526018K068850j548759m755161k385496K951809N039920L291029
4261B650190J598057Q33858r20661k807780k359203o78762n03305p85602R51068
4252b022140K862355J559451j355868j906291q30050j394858k348035l71500K414000
$$ plain form
4243 -3392936 -2116849 -4454605 -7396098 -8042701 -8278449 -9954429 -10424512 -7390625 -3616855
4234 -3616855 -2254670 -1911466 -809106 -998099 -3538806 -4512727 -1385315 1415813 -888266
4225 -888266 -5846307 -8749624 -10350017 -13082514 -14377157 -11066628 -6408945 -5401343
4217 -5401343 -6772244 -6568943 -5606795 -6174723 -5781848 -1868126 1722628 782589 -1616071
4208 -1616071 -1452817 -1865402 -6118170 -9243538 -6859092 -4910451 -9075474 -12824082 -9468658
4199 -9468658 -6354815 -10604177 -12150952 -2396691 3587865 -4775150 7118140 86185422
4191 86185422 210293324 285974552 253017502 156777020 86066415 68681987 66305787
4184 66305787 50348463 34166338 33022945 36244819 30882377 22501730 18931877 15439360
$$ packed form
4243c392936J276087k337756k941493o46603k35748j675980m70083L033887L773770
4234c616855J362185L43204J102360j88993k540707r73921L127412K801128k304079
4225h88266m958041k903317j600393k732497j294643L310529M657683J007602
4217e401343j370901K03301R62148n67928L92875L913722L590754r40039k398660
4208a616071J63254m12585m252768l125368K384446J948641m165023l748608L355424
4199i468658L113843m249362j546775R754261N984556q363015J1893290P9067282
4191H6185422J24107902P5681228l2957050r6240482p0710605j7384428k376200
4184F6305787j5957324j6182125j143393L221874n362442q380647l569853l492517
$$ plain form
4176 15439360 8173230 4495425 8668669 12029345 7726776 2530040 4272303 8727972
4168 8727972 8484760 5400365 5167015 7315476 8786559 10656952 14000184 15176380 11890680
4159 11890680 8429856 9067065 11645736 12865072 14122520 16735421 17172245 12929627
4151 12929627 8042036 6904448 7244250 5011316 1989648 2552024 6184061 8783529
4143 8783529 8711925 6868886 3584409 -138165 -1172260 1569728 4186175 3007503 42987
4134 42987 -539683 1642038 4569175 7821943 10925482 10932975 6484556 1748403 1721810
4125 1721810 5924335 10974282 16390718 22635976 26223011 23239706 16516789 13000537
4117 13000537 14145681 14689385 11362817 7187823 5789775 6492946 7222342 8178421 9985450
$$ packed form
4176A5439360p266130l677805M173244L360676m302569n196736J742263M455669
4168H727972k43212l084395k33350K148461J471083J870393L343232J176196l285700
4159A1890680l460824O37209K578671J219336J257448K612901M36824m242618
4151A2929627m887591j137588L39802k232934l021668N62376L632037K599468
4143H783529p1604j843039l284477l722574j034095K741988K616447j178672k964516
4134D2987n82670K181721K927137L252768L103539P493m448419m736153k6593
4125A721810M202525N049947N416436O245258L587035k983305o722917l516252
4117A3000537J145144N43704l326568m174994j398048P03171P29396R56079J807029
$$ plain form
4108 9985450 11129623 9872038 6884686 4008394 1886735 450626 282300 1637636
4100 1637636 3002009 2486882 583509 132517 3083228 7998440 11409691 11461028 9567032
4091 9567032 8343817 8739890 9849998 10683979 10830413 9840720 7463526 4396134 1502863
4082 1502863 -1389040 -4416190 -6034073 -4678537 -1775456 -412499 -850367 -317325 2077171
4073 2077171 3457058 1687754 -1153356 -1891191 -559756 555163 377612 -457593 -1064093
4064 -1064093 -589020 1390069 3250673 1997016 -2657920 -6752605 -6681927 -3668436 -1476008
4055 -1476008 -1277349 -1319033 -521830 314342 557349 776865 1565363 2617044 3016455 1987516
4045 1987516 -596 -786597 1326628 4722185 5880107 4185324 2728138 3362619 4101014
$$ packed form
4108I985450J144173j257585k987352k876292k121659j436109j68326J355336
4100A637636J364373n15127j903373m50992K950711M915212L411251N1337j893996
4091I567032j223215L96073J110108Q33981J46434r89693k377194l067392k893271
4082A502863k891903l027150j617883J355536K903081J362957m37868N33042K394496
4073B077171J379887j769304k841110p37835J331435J114919j77551q35205o06500
4064a064093M75073J979089J860604j253657m654936m094685P0678L013491K192428
4055a476008J98659m1684P97203Q36172K43007K19516P88498J051681L99411j028939
4045A987516j988112p86001K113225L395557J157922j694783j457186O34481P38395
$$ plain form
4036 4101014 3159617 2265397 3218070 4117877 2431816 -493872 -1676766 -1474198 -2464165
4027 -2464165 -4610632 -5491125 -4687477 -4106055 -4013167 -2301923 1851698 6480835 9447578
4018 9447578 10320218 9602122 8245660 7682112 8137831 7430068 3846796 -463219 -1793527
4009 -1793527 40821 2156772 3732247 6784225 11245946 13206814 9940152 3907225
4001 3907225 -314274 -1282798 -1182272 -2419665 -5188633 -7622146 -7511080 -4480503 -678750
3992 -678750 1436341 1696379 1566135 1697280 1959859 3191239 6348863 9926140 10795665
3983 10795665 8146625 4389070 1708886 -7687 -1292582 -1582992 -535672 1307596
3975 1307596 4132959 8900930 14451409 16656377 12451042 3723779 -4212518 -7362955
$$ packed form
4036D101014r41397q94220R52673Q99807j686061k925688j182894K02568r89967
4027b464165k146467q80493Q03648N81422R2888J711244M153621M629137K966743
4018I447578Q72640p18096j356462n63548M55719p07763l583272m310015j330308
4009a793527J834348K115951J575475L051978M461721J960868l266662o032927
4001C907225m221499r68524J00526j237393k768968k433513J11066L030577L801753
3992f78750K115091K60038j30244J31145K62579J231380L157624L577277Q69525
3983A0795665k649040l757555k680184j716573j284895k90410J047320J843268
3975A307596K825363M767971N550479K204968m205335q727263p936297l150437
$$ plain form
3967 -7362955 -5572544 -1485302 1945801 3585212 4511866 6068374 7848080 8615554 8620301
3958 8620301 9161808 10123886 10183687 9541094 9884239 11143651 11032047 8816105 6756306
3949 6756306 6296192 5608094 3076527 662152 900041 2399025 1614226 -1897029 -5249259
3940 -5249259 -6864106 -8025485 -9379186 -9022073 -5583020 -1020162 1534085 1465986 485346
3931 485346 -383546 -1577525 -2829347 -2372885 497815 3388540 3137229 -86408 -2780325
3922 -2780325 -2570215 -969768 -768862 -2281118 -3789762 -4548177 -5276879 -6197440 -6634549
3913 -6634549 -6490242 -6244572 -5539928 -3785800 -2263171 -3210927 -6067888 -7056228 -4095877
3904 -4095877 -275231 -307117 -4444843 -7996044 -6872563 -2134054 1485669 903468 -2019999
$$ packed form
3967g362955J790411M087242L431103J639411R26654J556508J779706P67474M747
3958H620301N41507R62078N9801o42593L43145J259412j11604k215942k059799
3949F756306m60114o88098k531567k414375K37889J498984p84799l511255l352230
3940e249259j614847j161379j353701L57113L439053M562858K554247o8099r80640
3931D85346q68892j193979j251822M56462K870700K890725k51311l223637k693917
3922b780325K10110J600447K00906j512256j508644p58415p28702r20561m37109
3913f634549J44307K45670P04644J754128J522629r47756k856961r88340K960351
3904d095877L820646l1886m137726l551201J123481M738509L619723n82201k923467
$$ plain form
3895 -2019999 -2689445 847916 5516856 6895291 4450109 1642985 1263286 2632709 3704416
3886 3704416 3903151 3868369 3834699 3473915 2598868 1348850 324612 632083 2661575
3877 2661575 4809851 4970595 3423332 2348318 2249569 1381058 -427869 -331900 3135598
3868 3135598 6713301 6258011 2339978 -909252 -1427963 -560603 695993 3231484 6831700
3859 6831700 8661619 6589883 2385015 -168019 485037 2744610 4680063 6190805
3851 6190805 7955016 9389734 8914654 6212867 2990244 698282 -1488048 -4930857
3843 -4930857 -8401706 -8998534 -6638004 -5219655 -7694081 -11706378 -12360958 -8481763 -3883318
3834 -3883318 -2521222 -4318541 -6153822 -5390550 -1723640 3322092 7749560 10355338
$$ packed form
3895b019999o69446L537361M668940J378435k445182k807124l79699J369423J071707
3886C704416J98735l4782l3670l60784q75047j250018j024238L07471K029492
3877B661575K148276J60744j547263j075014r8749q68511j808927R5969L467498
3868C135598L577703m55290l918033l249230n18711Q67360J256596K535491L600216
3859F831700J829919k071736m204868k553034O53056K259573J935453J510742
3851F190805J764211J434718m75080k701787l222623k291962k186330l442809
3843d930857l470849n96828K360530J418349k474426m012297o54580L879195M598445
3834c883318J362096j797319j835281P63272L666910N045732M427468K605778
$$ plain form
3826 10355338 11328890 11616276 11541296 10226478 6619500 1128922 -4016373 -6537839 -6408193
3817 -6408193 -5768950 -6113827 -6468808 -5426340 -3984502 -4358385 -6298460 -7035285 -5393953
3808 -5393953 -3566959 -3615523 -4314051 -3177318 -108138 2737115 3694574 2790420 1252000
3799 1252000 1109019 4048260 9209274 13268667 14100292 13034467 12087024 10781422 7857681
3790 7857681 4388953 2313518 983297 -1673348 -5034849 -5982612 -3325290 762201
3782 762201 4005264 6138318 7423906 7715646 7620286 8163438 8693126 7575271 5522338
3773 5522338 5289998 6948808 6615795 1969665 -3654962 -5412567 -3266318 -1194134 -1353605
3764 -1353605 -2273588 -2488786 -2723864 -3627934 -3786084 -1513377 2604924 6223374 7649998
$$ packed form
3826A0355338R73552K87386p4980j314818l606978n490578n145295k521466J29646
3817f408193O39243l44877l54981J042468J441838l73883j940075p36825J641332
3808e393953J826994m8564o98528J136733L069180K845253R57459r04154j538420
3799A252000j42981K939241N161014M059393Q31625j065825r47443j305602k923741
3790G857681l468728k075435j330221k656645l361501r47763K657322M087491
3782G62201L243063K133054J285588K91740r5360N43152N29688j117855k052933
3773E522338k32340J658810l33013m646130n624627j757605K146249K072184j59471
3764a353605r19983k15198k35078r04070j58150K272707M118301L618450J426624
$$ plain form
3755 7649998 6877842 4779628 2321179 513841 182799 1213217 2390601 2611294 2226443
3746 2226443 2586428 4119159 5586676 5672906 4538654 3041807 1150616 -1648010 -4674108
3737 -4674108 -6104726 -4858516 -1576680 2136836 4502015 4019524 744457 -2809568
3729 -2809568 -3686316 -1855489 -106529 -201008 -953905 -988611 -1385982 -3798219 -7204858
3720 -7204858 -8634085 -6723941 -2957455 390562 2094724 1995551 760413 -150706 422664
3711 422664 1887748 2542652 2019457 2060495 4249038 7759151 10158618 10017895 7942683
3702 7942683 5230715 2448901 -288406 -2366689 -2992339 -2511777 -2430445 -3445114 -4143778
3693 -4143778 -2730253 300524 2604534 3263046 4033382 6442664 8988867 8796431 5401527
$$ packed form
3755G649998p72156k098214k458449j807338l31042J030418J177384K20693l84851
3746B226443L59985J532731J467517Q6230j134252j496847j891191k798626l026098
3737d674108j430618J246210L281836L713516K365179m82491l275067l554025
3729b809568q76748J830827J748960r4479p52897l4706l97371k412237l406639
3720g204858j429227J910144L766486L348017J704162r9173j235138r11119N73370
3711D22664J465084O54904n23195M1038K188543L510113K399467j40723k075212
3702G942683k711968k781814k737307k078283o25650M80562Q1332j014669o98664
3693d143778J413525L030777K304010O58512P70336K409282K546203j92436l394904
$$ plain form
3684 5401527 1216836 -1605754 -3019926 -3424024 -1987653 1948253 6702439 9142142
3676 9142142 7850119 4349378 950874 -1645684 -4037856 -6166867 -6727692 -4639493
3668 -4639493 -509896 3694002 6297905 7147801 7301131 7612665 7808648 7227988 6271626
3659 6271626 6212492 7080228 6685708 3015726 -2737390 -6946493 -7462493 -5447109 -3116092
3650 -3116092 -1315805 -93718 43541 -1012308 -1943690 -1498991 -332796 225431 589489
3641 589489 2186954 4561299 5310667 3336450 366211 -1470859 -2078001 -2530081 -3115213
3632 -3115213 -3437693 -3655641 -4409661 -5797704 -7231593 -8186531 -8650256 -9050712 -9987724
3623 -9987724 -11638653 -13176340 -13243188 -11304369 -8136051 -4837126 -1976694 25526 471083
$$ packed form
3684E401527m184691k822590j414172m04098J436371L935906M754186K439703
3676I142142j292023l500741l398504k596558k392172k129011n60825K088199
3668d639493M129597M203898K603903Q49896J53330L11534J95983n80660r56362
3659F271626n9134Q67736l94520l669982n753116m209103n16000K015384K331017
3650c116092J800287J222087J37259j055849r31382M44699J166195N58227L64058
3641E89489J597465K374345P49368j974217k970239j837070o07142m52080n85132
3632c115213l22480k17948p54020j388043j433889r54938m63725m00456r37012
3623i987724j650929j537687o6848J938819L168318L298925K860432K002220M45557
$$ plain form
3614 471083 -923343 -3189250 -4582744 -4009945 -1930014 -21700 73141 -1928921 -4710505
3605 -4710505 -6616919 -7139331 -6937677 -6634380 -6072039 -4706797 -2366264 261638 1661609
3596 1661609 495010 -2907292 -6547969 -8880290 -10341902 -12049315 -13771243 -14334693
3588 -14334693 -13320432 -10968579 -7094543 -1862771 2812453 4685018 3981522 2884153
3580 2884153 2253074 1026254 -950679 -1984273 -1172740 296383 1423613 2707000 4036247
3571 4036247 3699138 1247083 -718943 259802 3080339 4940450 5297025 5756277 6939930
3562 6939930 7630758 6633487 3885346 207606 -2842850 -3810007 -3287820 -3777541 -6159802
3553 -6159802 -7929035 -6880418 -4761517 -4561482 -5719547 -5460382 -3962317 -4188414 -6473966
$$ packed form
3614D71083j394426k265907j393494N72799K079931J908314R4841k002062k781584
3605d710505j906414n22412K01654L03297N62341J365242K340533K627902J399971
3596A661609j166599l402302l640677k332321j461612j707413j721928n63450
3588a4334693J014261K351853L874036N231772M675224J872565p03496j097369
3580B884153o31079j226820j976933j033594Q11533J469123J127230J283387J329247
3571D036247l37109k452055j966026R78745K820537J860111L56575M59252J183653
3562F939930O90828r97271k748141l677740l050456r67157N22187m89721k382261
3553f159802j769233J048617K118901K00035j158065K59165J498065k26097k285552
$$ plain form
3544 -6473966 -7358904 -5016959 -2269263 -2207815 -3669221 -3506510 -1318595 708563 1428032
3535 1428032 1638038 1901214 1838202 1822006 3422717 7124991 10515760 10007927 4741674
3526 4741674 -1685322 -4118958 -748607 5365539 9824280 11001895 10078469 8422969
3518 8422969 6696795 5831676 6759634 8986304 10944849 11745347 11120300 8125573 2225765
3509 2225765 -4220598 -7201618 -5711926 -2963526 -1929826 -1997659 -1469346 -949908 -1896124
3500 -1896124 -3524896 -3911510 -3305890 -3706473 -5327721 -5858419 -3590206 518525 4326530
3491 4326530 6519059 6597058 4288419 80941 -4181933 -6199921 -5075675 -2250480 -239776
3482 -239776 112649 915717 4692842 10432218 13787685 12209269 8374923 6861509 8503579
$$ packed form
3544f473966q84938K341945K747696O1448j461406J62711K187915K027158P19469
3535A428032K10006K63176o3012j6196J600711L702274L390769n07833n266253
3526D741674o426996k433636L370351O114146M458741J177615r23426j655500
3518H422969j726174q65119R27958K226670J958545Q00498o25047k994727n899808
3509B225765o446363k981020J489692K748400J033700o7833N28313N19438r46216
3500a896124j628772l86614O05620m00583j621248n30698K268213M108731L808005
3491D326530K192529P7999k308639m207478m262874k017988J124246K825195K010704
3482b39776L52425Q03068L777125N739376L355467j578416l834346j513414J642070
$$ plain form
3473 8503579 10160930 9504817 7572458 6292120 5771744 5094683 4135724 3226569 2035147
3464 2035147 125577 -1827251 -2471732 -1319948 842584 3012298 4901220 6754038
3456 6754038 8492027 9199530 7730365 4101938 -43154 -2967616 -4573714 -5795473
3448 -5795473 -6573252 -5875991 -4050005 -3503186 -5831590 -9273155 -10424472 -7946448 -3290081
3439 -3290081 1627501 5659766 7502359 5840417 1572800 -1635556 -624505 3994320
3431 3994320 8862216 11370330 10903771 7604135 2156558 -3079882 -4976784 -2834932
3423 -2834932 605284 2304841 1907409 725599 -637855 -1980974 -2123866 -246124 1827374
3414 1827374 1182541 -2036929 -4371639 -3748136 -2233752 -2673972 -4449848 -4635156 -2265161
$$ packed form
3473H503579J657351o56113j932359j280338n20376o77061r58959r09155j191422
3464B035147j909570j952828o44481J151784K162532K169714J888922J852818
3456F754038J737989P07503j469165l628427m145092k924462j606098j221759
3448e795473p77779O97261J825986N46819k328404l441565j151317K478024M656367
3439c290081M917582M032265J842593j661942m267617l208356J011051M618825
3431C994320M867896K508114m66559l299636n447577n236440j896902K141852
3423b834932L440216J699557l97432j181810j363454j343119j42892J877742K073498
3414A827374o44833l219470k334710O23503J514384m40220j775876j85308K369995
$$ plain form
3405 -2265161 746762 2492877 2758799 1824405 -322871 -2889347 -4081899 -3180089 -1788023
3396 -1788023 -1885569 -3305081 -4303133 -4236006 -4329277 -5605001 -7228135 -7677373 -6906109 -6363769
3386 -6363769 -6994591 -8154955 -8766341 -8622831 -7836530 -5721557 -1535178 3650113 7071205
3377 7071205 6935974 4292560 1677622 468989 160688 -326740 -1482090 -3091775 -4451179
3368 -4451179 -4645472 -3203902 -598503 2143818 4159458 4920909 4311434 3118471 2810386
3359 2810386 3841406 4643208 3554341 1478918 993145 2561210 3423210 1212810 -2767581
3350 -2767581 -5263204 -5041567 -3619922 -2767361 -3077361 -4699054 -7432099 -9664154 -9017947
3341 -9017947 -5070069 -303348 2516837 2982190 2373218 1558286 674475 -106286 -908679
$$ packed form
3405b265161L011923J746115K65922r34394k147276k566476j192552R01810J392066
3396a788023r7546j419512r98052O7127r3271j275724j623134m49238P71264N42340
3386f363769o30822j160364o11386J43510P86301K114973M186379N185291L421092
3377G071205j35231k643414k614938j208633l08301m87428j155350j609685j359404
3368d451179j94293J441570K605399K742321K015640P61451o09475j192963l08085
3359B810386J031020Q01802j088867k075423m85773J568065Q62000k210400l980391
3350b767581k495623K21637J421645Q52561l10000j621693k733045k232055O46207
3341i017947L947878M766721K820185M65353o08972q14932q83811p80761q02393
$$ plain form
3332 -908679 -2649551 -5862691 -9486452 -12079661 -13675015 -14953417 -15206431 -13108254 -9266084
3323 -9266084 -5716293 -2665413 1759964 7661410 11789748 11470378 8133664 5030833
3315 5030833 3170890 1866092 1930841 5268977 11319494 16446387 17567004 14902409 10799816
3306 10799816 7168728 4449387 2140895 83895 -479309 2022640 6511839 8843903
3298 8843903 6367532 1849638 342951 2778615 5548432 6188375 6018987 6437584 6068424
3289 6068424 3416648 -262599 -2776856 -3695258 -3431061 -1603124 1593666 4005495 3725983
3280 3725983 1567130 -518290 -2230450 -4196956 -5737588 -5676819 -4599244 -4073539 -4111463
3271 -4111463 -3380811 -1528752 542625 2274735 3538280 3602878 1867569 -765605 -2989051
$$ packed form
3332i08679j740872l213140l623761k593209j595354j278402k53014K098177L842170
3323i266084L549791L050880M425377N901446M128338l19370l336714l102831
3315E030833j859943j304798O4749L338136O050517N126893J120617k664595m102593
3306A0799816l631088k719341k308492k057000n63204K501949M489199K332064
3298H843903k476371m517894j506687K435664K769817O39943j69388M18597l69160
3289F068424k651776l679247k514257r18402K64197J827937L196790K411829k79512
3280C725983k158853k085420j712160j966506j540632O0769J077575N25705l7924
3271d111463P30652J852059K071377J732110J263545O4598j735309k633174k223446
$$ plain form
3262 -2989051 -5018313 -7532739 -9350656 -8547450 -5688321 -3512472 -3236846 -3496276 -3281415
3253 -3281415 -3493203 -4746431 -5800453 -5411168 -4161400 -3300933 -3046693 -3097096 -3753362
3244 -3753362 -5437707 -7754547 -9810389 -10993040 -11008212 -9687653 -7140621 -3822493 -497552
3235 -497552 1648520 1511424 -642043 -3125105 -4845660 -6294025 -7561547 -7158826 -4786018
3226 -4786018 -3505218 -6146670 -10676726 -12569263 -11112480 -9529946 -9099651 -7639201
3218 -7639201 -4540884 -2626604 -3179277 -3408393 -1321901 785217 645296 166120 1702265
3209 1702265 3368725 2262612 -57452 153055 2573347 3313082 966195 -1871111 -2817654
3200 -2817654 -1780034 932487 4889990 7842670 7252126 4005426 1604595 1349985 1273758
$$ packed form
3262b989051k029262k514426j817917Q03206K859129K175849K75626k59430K14861
3253c281415k11788j253228j054022L89285J249768Q60467K54240n0403o56266
3244c753362j684345k316840k055842j182651j5172J320559K547032L318128L324941
3235d97552K146072j37096k153467k483062j720555j448365j267522M02721K372808
3226d786018J280800k641452m530056j892537J456783J582534M30295J460450
3218g639201L098317J914280n52673k29116K086492K107118j39921m79176J536145
3209A702265J666460j106113k320064K10507K420292P39735k346887k837306r46543
3200b817654J037620K712521L957503K952680n90544l246700k400831k54610p6227
$$ plain form
3191 1273758 62421 -1138488 -1304712 -771917 750074 4250241 8587675 10623968 9359282
3182 9359282 7260269 6492465 6612747 6928097 7987211 9384339 9259600 7620073 6940626
3173 6940626 7567573 6036877 644257 -4678391 -5577604 -3652854 -3631075 -6203693 -7993595
3164 -7993595 -7432369 -6278244 -5694389 -4964138 -4238628 -4657958 -5205854 -3215060 975202
3155 975202 3434274 2242195 414609 1149332 2971089 2338802 -815763 -3071230 -2131940
3146 -2131940 1079772 4574011 7247176 8492956 7774508 5435341 3010921 2045686 2883559
3137 2883559 4758711 6703051 8248061 9505560 10661718 11329550 10551603 7689245 3336962
3128 3336962 -810350 -3266528 -4184611 -5301269 -7845312 -10479029 -10317544 -6503985 -1634995
$$ packed form
3191A273758j211337j200909j66224N32795J521991L500167M337434K036293j264686
3182I359282k099013p67804J20282L15350J059114J397128j24739j639527o79447
3173F940626O26947j530696n392620n322648q99213J924750K1779k572618j789902
3164g993595N61226J154125N83855P30251P25510m19330n47896J990794M190262
3155I75202K459072j192079j827586P34723J821757o32287l154565k255467R39290
3146b131940L211712L494239K673165J245780p18448k339167k424420r65235Q37873
3137B883559J875152J944340J545010J257499J156158O67832p77947k862358m352283
3128C336962m147312k456178r18083j116658k544043k633717J61485L813559M868990
$$ plain form
3119 -1634995 1392112 2771733 4339276 5706453 4470365 420188 -3139400 -3425726
3111 -3425726 -1468819 114943 856315 1968104 3364153 3462367 1694745 -675989 -2324586
3102 -2324586 -2939340 -2447024 -685298 1721456 3390866 3666846 3227422 2906179 2939875
3093 2939875 3776945 6271645 10009863 12569848 12145784 10428112 10836266 13583866 14741772
3084 14741772 11616369 7058728 5712402 6965247 5368876 -1099063 -6938568 -6030697
3076 -6030697 -85122 3564569 1507363 -2381272 -3242738 -1055147 1122810 1571660 683873
3067 683873 -433359 -420252 1348501 2904738 1168358 -3112190 -4716656 -744310 4631877
3058 4631877 5532693 2238388 -410561 -849641 -2023515 -4987760 -6422666 -4002198 -166517
$$ packed form
3119a634995L027107J379621J567543J367177j236088m050177l559588k86326
3111c425726J956907J583762P41372J111789J396049R8214j767622k370734j648597
3102b324586o14754M92316J761726K406754J669410K75980m39424l21243L3696
3093B939875Q37070K494700L738218K559985m24064j717672M08154K747600J157906
3084A4741772l125403m557641j346326J252845j596371o467939n839505R07871
3076f030697N945575L649691k057206l888635q61466K187591K177957M48850q87787
3067F83873j117232J3107J768753J556237j736380m280548j604466L972346N376187
3058D631877R00816l294305k648949m39080j173874k964245j434906K420468L835681
$$ plain form
3049 -166517 1514695 655546 -1192007 -3300353 -5157950 -5446263 -3834167 -2017173 -1175575
3040 -1175575 -241765 1603868 2799019 1805746 -286775 -1757727 -2985607 -4817852 -6092757
3031 -6092757 -5540605 -4439531 -4264757 -3297518 626810 5061159 5118424 757462 -2642335
3022 -2642335 -2090358 -976475 -3016833 -6143451 -6056360 -3336922 -2696239 -5847779 -9168303
3013 -9168303 -9227629 -7404895 -7137832 -8701786 -9270703 -7415212 -4884346 -3361436 -1761397
3004 -1761397 1558000 5467441 7401853 7358036 7681991 8647388 7464724 3091722 -1017172
2995 -1017172 -1417425 501910 1207256 496961 562628 971982 -924925 -4739740 -6742964
2986 -6742964 -5757841 -5179549 -7407876 -10044783 -10023376 -8265764 -7227057 -6294318 -3053739
$$ packed form
3049a66517J681212q59149j847553k108346j857597k88313J612096J816994Q41598
3040a175575R33810J845633J195151r93273k092521j470952j227880j832245j274905
3031f092757N52152J101074J74774R67239L924328M434349N7265m360962l399797
3022b642335N51977J113883k040358l126618Q7091K719438O40683l151540l320524
3013i168303n9326J822734K67063j563954n68917J855491K530866J522910J600039
3004a761397L319397L909441J934412m3817L23955R65397j182664m373002m108894
2995a017172m00253J919335P05346p10295O5667M09354j896907l814815k003224
2986f742964R85123N78292k228327k636907K1407J757612J038707R32739L240579
$$ plain form
2977 -3053739 2229696 6503497 7698345 6292855 3797176 1774060 1633402 3245073
2969 3245073 4222899 2490287 -887203 -3132317 -3435829 -3491034 -4944684 -7997710 -11868979
2960 -11868979 -14912699 -15054979 -12043774 -8505059 -6704445 -5134467 -826677 5602736
2952 5602736 10137662 10490162 8187795 5424880 2882698 1252036 1724784 3570350 3832542
2943 3832542 1033580 -2924648 -5800796 -7510455 -8079980 -6007429 -1323838 2066320
2935 2066320 656519 -3210034 -3772943 500603 5195681 6419444 5530728 5608354 5948990
2926 5948990 3176110 -3015534 -8193684 -8069539 -3310971 1671892 3711474 3242500 2131107
2917 2131107 948174 -853204 -3215432 -5147333 -5749044 -4761596 -2550431 -329555 286254
$$ packed form
2977c053739N283435M273801J194848j405490k495679k023116j40658J611671
2969C245073R77826j732612l377490k245114l03512n5205j453650l053026l871269
2960a1868979l043720j42280L011205L538715J800614J569978M307790O429413
2952E602736M534926L52500k302367k762915k542182j630662M72748J845566K62192
2943C832542k798962l958228k876148j709659n69525K072551M683591L390158
2935B066320j409801l866553n62909M273546M695078J223763q88716P7626L40636
2926E948990k772880o191644n178150J24145M758568M982863K039582m68974j111393
2917B131107j182933j801378k362228j931901o01711R87448K211165K220876O15809
$$ plain form
2908 286254 -911870 -2049107 -1716250 -1376804 -3108382 -5554847 -5222134 -2225160 -1219255
2899 -1219255 -4796765 -9098755 -8901814 -4724511 -1321719 -671663 -608351 67655 -346930
2890 -346930 -2262605 -2693471 431569 4759152 6817690 6620841 6251611 5571317 2591012
2881 2591012 -2456572 -6443108 -7062982 -4966765 -1816840 1673562 5087863 7577215
2873 7577215 8852866 9684595 10629526 11361683 11761664 12210387 12052316 9470207 4252535
2864 4252535 -750442 -2670521 -2076349 -1560660 -1827519 -1450948 -10105 1173143 1648501
2855 1648501 2570460 3897306 3232563 -879681 -6095828 -8467027 -6579143 -2180920 2339201
2846 2339201 5691280 7717097 9121791 10643559 11489842 9627040 4959831 949556
$$ packed form
2908B86254j198124j137237L32857L39446j731578k446465L32713K996974J005905
2899a219255l577510m301990J96941M177303L402792O50056O3312O76006m14585
2890c46930j915675m30866L125040M327583K058538j96849l69230o80294k980305
2881B591012n047584l986536o19874K096217L149925L490402L414301K489352
2873G577215J275651Q31729R44931P32157L99981M48723j58071k582109n217672
2864D252535n002977j920079N94172N15689k66859L76571J440843J183248M75358
2855A648501R21959J326846o64743m112244n216147k371199J887884M398223M520121
2846B339201L352079K025817J404694J521768Q46283j862802m667209m010275
$$ plain form
2838 949556 960700 3728679 4792507 2161774 -1857269 -4569578 -5966433 -7014478 -7275123
2829 -7275123 -5944178 -3833562 -2571757 -2430249 -2177421 -769757 1594302 3800180 4735472
2820 4735472 4249877 3367870 3020184 2683968 1204123 -1191483 -3019307 -3674125 -3801017
2811 -3801017 -3343201 -1280665 1886256 3501950 2044730 -638008 -1935129 -1710677 -1187387
2802 -1187387 -277384 1573665 3139731 2895348 2177426 3819041 7481447 9403349 7750123
2793 7750123 5437930 5922704 8380177 9374937 7906732 6108874 5346723 4394400 2304860
2784 2304860 899361 2612289 6885151 10606913 11929505 11818746 11454655 10012424 6371517
2775 6371517 1736040 -1253602 -1522163 -177974 1314954 1940160 833931 -1445161 -1689189
$$ packed form
2838I49556J1144K767979J063828k630733m019043k712309j396855j048045k60645
2829g275123J330945K110616J261805J41508K52828J407664K364059K205878R35292
2820D735472m85595q82007l47686l36216j479845k395606j827824o54818j26892
2811c801017M57816K062536L166921J615694j457220k682738j297121K24452N23290
2802a187387R10003J851049J566066k44383p17922J641615L662406J921902j653226
2793G750123k312193M84774K457473R94760j468205j797858p62151r52323k089540
2784B304860j405499J712928M272862L721762J322592j10759l64091j442231l640907
2775F371517m635477k989642k68561J344189J492928O25206j106229k279092k44028
$$ plain form
2766 -1689189 2872628 9716798 12527600 9048898 4295995 3637273 5673535 5400752 2141888
2757 2141888 -120940 497168 1267590 -229777 -2470421 -2781068 -971596 1437543 3417259
2748 3417259 4257939 3057325 206905 -1790014 -661434 2998124 6465791 7742978
2740 7742978 6953853 5482050 4400393 3526921 1935790 -285786 -1385517 -128959 1952476
2731 1952476 2228775 742074 335529 2687013 6126720 8046887 7750340 6136186 4168086
2722 4168086 2569136 1730593 1176624 240558 -478079 130825 1340982 1070921 -843144
2713 -843144 -2150724 -1629835 -475193 654013 2938450 6146632 7324741 5365028 4051524
2704 4051524 7130056 12396202 14448282 11994932 8555476 6641640 5336632 3836034
$$ packed form
2766a689189M561817O844170K810802l478702m752903o58722K036262k72783l258864
2757B141888k262828O18108P70422j497367k240644l10647J809472K409139J979716
2748C417259Q40680j200614k850420j996919J128580L659558L467667J277187
2740G742978p89125j471803j081657q73472j591131k221576j099731J256558K081435
2731A952476K76299j486701m06545K351484L439707J920167k96547j614154j968100
2722D168086j598950q38543n53969r36066p18637O08904J210157k70061j914065
2713h43144j307580N20889J154642J129206K284437L208182J178109j959713j313504
2704D051524L078532N266146K052080k453350l439456j913836j305008j500598
$$ plain form
2696 3836034 3448876 4772879 5809560 4572702 1822757 3959 610548 3077557 5077880
2687 5077880 3862728 -1196663 -7301246 -10822835 -11027421 -9845089 -8751124 -8040174 -8431190
2678 -8431190 -10400361 -11975220 -10390425 -6521267 -4605862 -6630401 -9956520 -11614475
2670 -11614475 -11728932 -11032218 -8374430 -3484858 392151 -63246 -3640203 -6337001 -6582872
2661 -6582872 -5986986 -5830929 -5730773 -5468756 -5541035 -5784479 -5489656 -4837288 -4425722 -3681471
2651 -3681471 -1697386 692980 1897842 2446825 4364390 7334533 8075179 4598353 -937394
2642 -937394 -4848496 -5752351 -4597600 -2523339 -337125 948931 786871 -134544 -1031841
2633 -1031841 -2441328 -5189333 -8304742 -9436163 -7523977 -3900507 -440405 2288401
$$ packed form
2696C836034l87158J324003J036681j236858k749945j818798O06589K467009K000323
2687E077880j215152n059391o104583l521589k04586J182332J093965P10950l91016
2678h431190j969171j574859J584795L869158J915405k024539l326119j657955
2670a1614475j14457O96714K657788M889572L877009m55397l576957k696798k45871
2661f582872N95886J56057J00156K62017p2279k43444K94823O52368M11566P44251
2651c681471J984085K390366J204862N48983J917565K970143P40646l476826n535747
2642i37394l911102r03855J154751K074261K186214J286056j62060r21415q97297
2633a031841j409487k748005l115409j131421J912186L623470L460102K728806
$$ plain form
2625 2288401 4466569 5630921 4965518 2701594 219286 -1390770 -2159268 -2505853 -2521211
2616 -2521211 -2411057 -2802584 -3759999 -4100033 -2782262 -637335 569202 723265 1520402
2607 1520402 3641783 5272115 4413128 1592354 -927769 -1966681 -2229938 -2605929 -2810077
2598 -2810077 -1915497 342112 2946723 4235754 3493509 1972436 1681461 2973671 4124893
2589 4124893 3554236 1548834 -454227 -1166046 160807 3003706 4789963 3005173 -857115
2580 -857115 -1930691 1546377 4937008 3337051 -1136107 -2204523 1477803 4601114
2572 4601114 2803784 -2297504 -6834891 -9499009 -10648365 -9951578 -7568209 -5459458
2564 -5459458 -5125263 -5668699 -5884536 -6275769 -7064188 -6458579 -3481338 -551639 -202196
$$ packed form
2625B288401K178168J164352o65403k263924k482308j610056p68498l46585j5358
2616b521211J10154l91527r57415l40034J317771K144927J206537J54063P97137
2607A520402K121381J630332q58987k820774k520123j038912k63257l75991k04148
2598b810077Q94580K257609K604611J289031p42245j521073k90975J292210J151222
2589D124893n70657k005402k003061p11819J326853K842899J786257j784790l862288
2580h57115j073576L477068L390631j599957m473158j068416L682326L123311
2572D601114j797330n101288m537387k664118j149356O96787K383369K108751
2564e459458L34195n43436k15837l91233p88419O05609K977241K929699L49443
$$ plain form
2555 -202196 -749507 1261631 5114115 6226036 2712196 -1758578 -2864626 -886512 420848
2546 420848 -1440554 -5489281 -8821423 -9396061 -7731758 -6149269 -5893184 -5420608 -2695327
2537 -2695327 1161206 2222089 -1852842 -9061831 -15114639 -17229579 -15734826 -13098808
2529 -13098808 -11722212 -11726434 -10788509 -7144200 -2563766 -820840 -3058802 -6376721 -7581099
2520 -7581099 -6738088 -6113629 -6985098 -8708496 -10050826 -10290159 -9432930 -8130539 -7108722
2511 -7108722 -6323617 -5081707 -3058976 -557672 2135946 4682640 6156504 5964670 5300996
2502 5300996 5974092 7495044 7295665 4540415 1590425 432940 -245256 -2569798 -5875322
2493 -5875322 -8012676 -9074542 -11098375 -14437756 -17017815 -17466303 -16779607 -16221766 -15351101
$$ packed form
2555b02196n47311K011138L852484J111921l513840m470774j106048J978114J307360
2546D20848j861402m048727l332142n74638J664303J582489K56085M72576K725281
2537b695327L856533J060883m074931p208989o052808k114940J494753K636018
2529a3098808J376596m222R37925L644309M580434J742926k237962l317919j204378
2520g581099Q43011O24459q71469j723398j342330k39333Q57229J302391J021817
2511g108722P85105J241910K022731K501304K693618K546694J473864j91834o63674
2502E300996O73096J520952j99379k755250k949990j157485o78196k324542l305524
2493e875322k137354j061866k023833l339381k580059m48488O86696N57841Q70665
$$ plain form
2484 -15351101 -13057185 -9336244 -5169210 -1431860 1441681 3313849 4322690 4617436
2476 4617436 4042515 2607192 1121915 516463 525091 647 -1332699 -2490215 -2962306
2467 -2962306 -3762343 -5894423 -8434300 -9235235 -7602893 -5464104 -5311503 -7183740 -8343215
2458 -8343215 -6317875 -1807735 2093095 3219926 1875315 -725987 -3891566 -6730650
2450 -6730650 -7634491 -5869709 -2802043 -366066 823279 827456 -695367 -3082530 -3427893
2441 -3427893 553185 6653368 9796081 8017385 4656602 3893966 6068919 8363332
2433 8363332 8441720 6267665 3506624 2102638 2612183 3487710 2951067 1515895 1013926
2424 1013926 1124653 -655884 -4736617 -7712092 -6681862 -3260274 -1219923 -1755991 -3286301
$$ packed form
2484a5351101K293916L720941M167034L737350K873541J872168J008841K94746
2476D617436n74921j435323j485277o05452Q628n24444j333346j157516m72091
2467b962306q00037k132080k539877q00935J632342K138789J52601j872237j159475
2458h343215K025340M510140L900830J126831j344611k601302l165579k839084
2450f730650r03841J764782L067666K435977J189345M177j522823k387163l45363
2441c427893L981078O100183L142713j778696l360783p62636K174953K294413
2433H363332P8388k174055k761041j403986N09545Q75527n36643j435172n01969
2424A013926J10727j780537m080733k975475J030230L421588K040351n36068j530310
$$ plain form
2415 -3286301 -4580870 -5608906 -6152385 -6045251 -6333074 -7990528 -9916198 -10367215 -9861428
2406 -9861428 -10155160 -10676777 -8950782 -4937705 -1956259 -2181335 -3827037 -4282981 -3722018
2397 -3722018 -3701035 -4137432 -3997574 -3668105 -4211245 -5029328 -4678218 -3650787 -3843532 -5002521
2387 -5002521 -4201529 36599 5101790 7477323 7227751 7190430 8200112 7561219 3090117
2378 3090117 -3174368 -6981564 -6771125 -4800735 -3568938 -3023509 -1970408 -586408 -109925
2369 -109925 -884549 -2103999 -3072969 -3519350 -3072371 -1764608 -782596 -1261901 -2418409
2360 -2418409 -2419224 -1142103 -251292 -171395 861476 3603779 5706953 4814927 2428802
2351 2428802 2221222 4849154 6780075 4731289 -518019 -5474268 -7631997 -6828223 -4020941
$$ packed form
2415c286301j294569j028036n43479J07134k87823j657454j925670m51017N05787
2406i861428k93732n21617J725995M013077K981446k25076j645702m55944N60963
2397c722018K0983m36397J39858L29469n43140q18083L51110J027431j92745j158989
2387e002521Q00992M238128N065191K375533k49572l7321J009682o38893m471102
2378C090117o264485l807196K10439J970390J231797N45429J053101J384000M76483
2369a09925p74624j219450r68970m46381M46979J307763R82012m79305j156508
2360b418409q15J277121Q90811P9897J032871K742303K103174q92026k386125
2351B428802k07580K627932J930921k048786n249308m956249k157729Q03774K807282
$$ plain form
2342 -4020941 -218255 3449697 5688364 5720568 3977973 1866303 569409 -13479 -885630
2333 -885630 -2386077 -3511282 -3236607 -1920790 -528507 1093356 3806723 6933160 7940166
2324 7940166 5381057 1284035 -638015 992691 3915206 4998716 3519300 1357228
2316 1357228 539003 1254511 2223083 2287597 1117445 -1206490 -4204770 -6365690 -5792537
2307 -5792537 -2638784 -80066 -1205563 -5121041 -7874427 -7454081 -5960025 -6120669 -7726732
2298 -7726732 -9007224 -9724151 -10659931 -11148149 -9671627 -6575679 -3808300 -1977686 -13237
2289 -13237 2057442 2615740 1567969 1444071 3932503 7367918 9300413 9707215 9781121
2280 9781121 9285016 7470836 5337093 4394620 4017414 2622173 877235 871814 2235846
$$ packed form
2342d020941L802686L667952K238667L2204j742595k111670j296894n82888q72151
2333h85630j500447j125205K74675J315817J392283J621863K713367L126437J007006
2324G940166k559109m097022j922050J630706K922515J083510j479416k162072
2316A357228q18225P15508R68572O4514j170152k323935k998280k160920N73153
2307e792537L153753K558718j125497l915478k753386M20346J494056j60644j606063
2298g726732j280492p16927r35780m88218J476522L095948K767379J830614J964449
2289a3237K070679N58298j047771j23898K488432L435415J932495M06802P3906
2280I781121m96105j814180k133743r42473l77206j395241j744938n421J364032
$$ plain form
2271 2235846 2136639 -326135 -2581715 -2427506 -793064 596815 1749193 2814308 2342569
2262 2342569 -402711 -3058079 -2820270 -550199 468072 -594890 -1253341 29979 1358813
$$ packed form
2271B235846r9207k462774k255580J54209J634442J389879J152378J065115m71739
2262B342569k745280k655368K37809K270071J018271j062962o58451J283320J328834
$$ [...]
##END NTUPLES=NMR SPECTRUM
##END=
