##TITLE=31Pdec_DE-AcClnew
 , 64 sc
19.8.2026
##JCAMPDX= 6.0         $$ Bruker NMR JCAMP-DX V2.0
##DATA TYPE= NMR SPECTRUM
##DATA CLASS= NTUPLES
##ORIGIN= UXNMR, Bruker Analytische Messtechnik GmbH
##OWNER= root
$$ XWIN-NMR		Version 3.5
$$ Wed Aug 19 15:06:04 2026 Russian Standard Time (UT+4h)  she@DPX200
##.OBSERVE FREQUENCY= 81.013821
##.OBSERVE NUCLEUS= ^31P
##.ACQUISITION MODE= SIMULTANEOUS
##.ACQUISITION SCHEME= undefined
##.AVERAGES= 64
##.DIGITISER RES= 17
##SPECTROMETER/DATA SYSTEM= spect
##.PULSE SEQUENCE= zgpg30
##.SOLVENT NAME= DMSO
##.SHIFT REFERENCE= (INTERNAL, DMSO, 0, 197.392)
##AUDIT TRAIL= $$ (NUMBER, WHEN, WHO, WHERE, WHAT)
$$ ##TITLE= Audit trail, XWIN-NMR		Version 3.5
$$ ##JCAMPDX= 5.01
$$ ##ORIGIN= Bruker BioSpin GmbH
$$ ##OWNER= she
$$ F:/spectra/data/she/nmr/P31/2/pdata/1/auditp.txt
$$ ##AUDIT TRAIL=  $$ (NUMBER, WHEN, WHO, WHERE, WHAT)
(   1,<2026-08-19 15:05:17.68 +0400>,<she>,<DPX200>,
      <created by zg, POWCHK disabled, PULCHK disabled
       configuration hash MD5:
       00 E9 B6 7A A2 85 ED C7 34 08 36 98 17 FE 4E 26
       data hash MD5: 32K
       8D 2A 76 9C E6 AA 2E 3E 31 B5 0A C5 33 1E 56 AE>)
(   2,<2026-08-19 15:05:20.04 +0400>,<she>,<DPX200>,
      <Start of raw data processing
       efp BC_mod = 2 LB = 1.5 FT_mod = 6 PKNL = 1 PHC0 = 1978.36 PHC1 = 47.69841 SI = 64K 
       data hash MD5: 64K
       B8 52 57 EF B9 F4 E1 01 19 3E 58 D6 42 CA 1A D6>)
(   3,<2026-08-19 15:05:34.64 +0400>,<she>,<DPX200>,
      <abs ABSG = 5 
       data hash MD5: 64K
       8E 4E B7 E4 78 B4 BF 6E 5A AE F4 15 3E 10 61 33>)
$$ ##END=
$$ 
$$ hash MD5
$$ 73 16 FE 9D 95 23 6C 56 7D 2E 7C 60 1E 90 14 9E
##$RELAX= 
##$RELAX= 
##$RELAX= 
##$RELAX= 
##$RELAX= 
##$RELAX= 
##$RELAX= 
##$RELAX= 
$$ Bruker specific parameters
$$ --------------------------
##$DU= <F:/spectra>
##$EXPNO= 2
##$NAME= <P31>
##$PROCNO= 1
##$TYPE= <nmr>
##$USER= <she>
##$AMP= (0..31)
100 100 100 100 100 100 100 100 100 100 100 100 100 100 100 100 100 100 
100 100 100 100 100 100 100 100 100 100 100 100 100 100 
##$AQSEQ= 0
##$AQ_mod= 1
##$AUNM= <au_zg>
##$AUTOPOS= <>
##$BF1= 81.014009
##$BF2= 200.13
##$BF3= 200.13
##$BF4= 200.13
##$BF5= 200.13
##$BF6= 200.13
##$BF7= 200.13
##$BF8= 200.13
##$BYTORDA= 1
##$CFDGTYP= 0
##$CFRGTYP= 5
##$CHEMSTR= <none>
##$CNST= (0..31)
1 1 145 1 1 1 1 1 1 1 1 1 1 1 1 1 1 1 1 1 1 1 1 1 1 1 1 1 1 1 1 1 
##$CPDPRG= <waltz16>
##$CPDPRG1= <>
##$CPDPRG2= <waltz16>
##$CPDPRG3= <>
##$CPDPRG4= <mlev>
##$CPDPRG5= <mlev>
##$CPDPRG6= <mlev>
##$CPDPRG7= <mlev>
##$CPDPRG8= <mlev>
##$CPDPRGB= <>
##$CPDPRGT= <>
##$D= (0..31)
0 1 0 0 0 0 0 0 0 0.06 0 0.03 2e-05 3e-06 0 0 0.0002 0 0 0 0 0 0 0 0 0 
0 0 0 0 0 0 
##$DATE= 1787137517
##$DBL= (0..7)
120 120 120 11 120 120 24 19 
##$DBP= (0..7)
150 150 150 150 150 150 150 150 
##$DBP07= 0
##$DBPNAM0= <>
##$DBPNAM1= <>
##$DBPNAM2= <>
##$DBPNAM3= <>
##$DBPNAM4= <>
##$DBPNAM5= <>
##$DBPNAM6= <>
##$DBPNAM7= <>
##$DBPOAL= (0..7)
0.5 0.5 0.5 0.5 0.5 0.5 0.5 0.5 
##$DBPOFFS= (0..7)
0 0 0 0 0 0 0 0 
##$DE= 6
$$ [...]
##$SUBNAM3= <"">
##$SUBNAM4= <"">
##$SUBNAM5= <"">
##$SUBNAM6= <"">
##$SUBNAM7= <"">
##$SUBNAM8= <"">
##$SUBNAM9= <"">
##$SW= 400.765351723535
##$SWIBOX= (0..15)
0 1 3 0 0 0 0 0 0 0 0 0 0 0 0 0 
##$SW_h= 32467.5324675325
##$TD= 32768
##$TD0= 1
##$TE= 0
##$TE2= 300
##$TE3= 300
##$TEG= 300
##$TL= (0..7)
0 120 53 12 22 120 120 120 
##$TP= (0..7)
150 150 150 150 150 150 150 150 
##$TP07= 0
##$TPNAME0= <>
##$TPNAME1= <>
##$TPNAME2= <>
##$TPNAME3= <>
##$TPNAME4= <>
##$TPNAME5= <>
##$TPNAME6= <>
##$TPNAME7= <>
##$TPOAL= (0..7)
0.5 0.5 0.5 0.5 0.5 0.5 0.5 0.5 
##$TPOFFS= (0..7)
0 0 0 0 0 0 0 0 
##$TUNHIN= 0
##$TUNHOUT= 0
##$TUNXOUT= 0
##$USERA1= <user>
##$USERA2= <user>
##$USERA3= <user>
##$USERA4= <user>
##$USERA5= <user>
##$V9= 5
##$VALIST= <valist>
##$VCLIST= <CCCCCCCCCCCCCCC>
##$VD= 0
##$VDLIST= <DDDDDDDDDDDDDDD>
##$VPLIST= <PPPPPPPPPPPPPPP>
##$VTLIST= <TTTTTTTTTTTTTTT>
##$WBST= 1024
##$WBSW= 4
##$XGAIN= (0..3)
0 0 0 0 
##$XL= 0
##$YL= 0
##$YMAX_a= 3955
##$YMIN_a= -7890
##$ZGOPTNS= <>
##$ZL1= 120
##$ZL2= 120
##$ZL3= 120
##$ZL4= 120
##$ABSF1= 197.3918
##$ABSF2= -203.3724
##$ABSG= 5
##$ABSL= 3
##$ALPHA= 0
##$AQORDER= 0
##$ASSFAC= 0
##$ASSFACI= 0
##$ASSFACX= 0
##$ASSWID= 0
##$AUNMP= <proc_1d>
##$AZFE= 0.1
##$AZFW= 0.5
##$BCFW= 0
##$BC_mod= 2
##$BYTORDP= 0
##$COROFFS= 0
##$CY= -3
##$DATMOD= 1
##$DC= 0
##$DFILT= <>
##$DTYPP= 0
##$F1P= 0
##$F2P= 0
##$FCOR= 1
##$FTSIZE= 65536
##$FT_mod= 6
##$GAMMA= 0
##$GB= 0
##$INTBC= 1
##$INTSCL= 9.790993e-09
##$ISEN= 30
##$LB= 1.5
##$LEV0= 0
##$LPBIN= 0
##$MAXI= 10000
##$MC2= 0
##$MEAN= 0
##$ME_mod= 0
##$MI= 50
##$NCOEF= 0
##$NC_proc= -8
##$NLEV= 6
##$NOISF1= 182.463
##$NOISF2= 159.3651
##$NSP= 0
##$NTH_PI= 0
##$NZP= 0
##$OFFSET= 197.3918
##$PC= 4
##$PHC0= 1978.36
##$PHC1= 47.69841
##$PH_mod= 1
##$PKNL= yes
##$PPARMOD= 0
##$PSCAL= 0
##$PSIGN= 0
##$REVERSE= no
##$SF= 81.014063255964
##$SI= 65536
##$SIGF1= 159.3651
##$SIGF2= -187.1042
##$SINO= 113.3802
##$SIOLD= 16384
##$SREGLST= <1H.CDCl3>
##$SSB= 0
##$STSI= 65536
##$STSR= 0
##$SW_p= 32467.5324675325
##$SYMM= 0
##$S_DEV= 0
##$TDeff= 32768
##$TDoff= 0
##$TI= <>
##$TILT= no
##$TM1= 0
##$TM2= 0
##$TOPLEV= 0
##$USERP1= <user>
##$USERP2= <user>
##$USERP3= <user>
##$USERP4= <user>
##$USERP5= <user>
##$WDW= 1
##$XDIM= 65536
##$YMAX_p= 183309186
##$YMIN_p= -427269250
$$ End of Bruker specific parameters
$$ ---------------------------------
##NTUPLES= NMR SPECTRUM
##VAR_NAME=  FREQUENCY,     SPECTRUM/REAL,   SPECTRUM/IMAG
##SYMBOL=    X,             R,               I
##VAR_TYPE=  INDEPENDENT,   DEPENDENT,       DEPENDENT
##VAR_FORM=  AFFN,          ASDF,            ASDF
##VAR_DIM=   65536,         65536,           65536
##UNITS=     HZ,            ARBITRARY UNITS, ARBITRARY UNITS
##FACTOR=    0.49542278885378, 1,            1
##FIRST=     15991.5117654749, 0,            0
##LAST=      -16476.0207020576, 0,           0
##MIN=       -16476.0207020576, -427269250,  0
##MAX=       15991.5117654749, 183309186,    0
$$ Real data points
##PAGE= N=1
##DATA TABLE= (X++(R..R)), XYDATA
$$ [...]
##PAGE= N=2
##DATA TABLE= (X++(I..I)), XYDATA
$$ plain form
7479 5427921 3463925 -2273683 -7873094 -10549939 -10586390 -8739761 -5033201 -815285 809683
7470 809683 -1678249 -5888408 -7939903 -6484608 -3530318 -2009629 -3265445 -6409851
7462 -6409851 -9456952 -11030724 -10994539 -9649912 -7313400 -5118060 -4742982 -5980550 -5968836
7453 -5968836 -2926306 478852 237695 -3124624 -5044003 -3454836 -1360316 -1871510 -4097120
7444 -4097120 -5812078 -7121625 -8842910 -9655533 -7975243 -5158965 -3821626 -3919290 -3373860
7435 -3373860 -1913777 -1322459 -2050450 -2520116 -2181964 -2558144 -4359760 -5850177 -5295831
7426 -5295831 -3322597 -1685839 -1206365 -2010282 -4101873 -6046264 -4682619 1176834 7246627
7417 7246627 7081177 23850 -6694358 -6149336 -471215 1806124 -3122629 -9620189 -10509092
$$ packed form
7479E427921j963996n737608n599411k676845l6451J846629L706560M217916J624968
7470H09683k487932m210159k051495J455295K954290J520689j255816l144406
7462f409851l047101j573772L6185J344627K336512K195340L75078j237568J1714
7453e968836L042530L405158k41157l362319j919379J589167K094520n11194k225610
7444d097120j714958j309547j721285q12623J680290K816278J337339r7664N45430
7435c373860J460083N91318p27991m69666L38152l76180j801616j490417N54346
7426e295831J973234J636758M79474q03917k091591j944391J363645N859453O069793
7417G246627j65450p057327o718208N45022N678121K277339m928753o497560q88903
$$ plain form
7408 -10509092 -6138659 -2315037 -1688870 -1807308 -1004728 -1219771 -3789092 -6691046 -8061611
7399 -8061611 -8975737 -10344531 -10278487 -7485351 -4477482 -4030862 -4880546 -4619462 -4523048
7390 -4523048 -6924547 -9557709 -8069935 -3775848 -3022243 -7656309 -11676831 -9965150
7382 -9965150 -5627070 -4876681 -7965814 -9573974 -6573000 -1374193 2105572 2639056 1471798
7373 1471798 84573 -1091268 -2566707 -4497557 -5398272 -3318006 1054026 4074197
7365 4074197 3327863 773129 26020 1624124 2895511 1796662 -1004378 -3408767 -3539572
7356 -3539572 -563975 4344682 8038598 8010899 4998259 1814103 50227 -665189 -835676
7347 -835676 -565040 -644062 -2063953 -4272330 -5806892 -6741107 -8292986 -9709652 -8251103
$$ packed form
7408a0509092M370433L823622O26167j18438Q02580k15043k569321k901954j370565
7399h061611r14126j368794O6044K793136L007869M46620q49684K61084R6414
7390d523048k401499k633162J487774M294087P53605m634066m020522J711681
7382i965150M338080P50389l089133j608160L000974N198807L479765N33484j167258
7373A471798j387225j175841j475439j930850r00715K080266M372032L020171
7365D074197p46334k554734p47109J598104J271387j098849k801040k404389j30805
7356c539572K975597M908657L693916k7699l012640l184156j763876p15416j70487
7347h35676K70636p9022j419891k208377j534562r34215j551879j416666J458549
$$ plain form
7338 -8251103 -3461983 1067792 2098353 829477 325417 694263 -109159 -1754731 -1511850
7329 -1511850 996382 2549209 1153379 -980092 -1414044 -1764988 -4829881 -9125871 -10267221
7320 -10267221 -7646933 -5807742 -7884816 -11012902 -10573705 -6620809 -3173790 -2457361
7312 -2457361 -2876793 -2343053 -786550 1049571 3040604 5101438 6801964 8227185 9853931
7303 9853931 11111178 10555455 8064205 5342237 3476462 1462723 -1818231 -5457769
7295 -5457769 -7555883 -7425337 -5643765 -2808316 531950 3318960 4505955 3845637 1580500
7286 1580500 -1899857 -5387659 -6862953 -5367678 -2289527 206799 1404647 1835184
7278 1835184 1864158 1848278 2851757 5394234 7781745 7531119 4703319 2259028 2523387
$$ packed form
7338h251103M789120M529775J030561j268876n04060L68846q03422j645572K42881
7329a511850K508232J552827j395830k133471m33952l50944l064893m295990j141350
7320a0267221K620288J839191k077074l128086M39197L952896L447019P16429
7312b457361m19432N33740J556503J836121J991033K060834J700526J425221J626746
7303I853931J257247n55723k491250k721968j865775k013739l280954l639538
7295e457769k098114J30546J781572K835449L340266K787010J186995o60318k265137
7286A580500l480357l487802j475294J495275L078151K496326J197848M30537
7278A835184K8974j5880J003479K542477K387511k50626k827800k444291K64359
$$ plain form
7269 2523387 4454867 5093037 2907181 -923063 -3969126 -4642255 -3120366 -829878 790179
7260 790179 1192962 751566 210080 37134 -19833 -673266 -2028034 -3068275 -2909781 -2207778
7250 -2207778 -2138938 -2130232 -238365 3752258 7161111 7147693 3424289 -2244953 -7621539
7241 -7621539 -10365448 -8895567 -4366496 -144763 2186700 4589341 8702535 12316936
7233 12316936 12234654 9031251 6055559 4772961 4029795 3034867 1911194 -71536 -3387083
7224 -3387083 -5636002 -3675837 1321900 4460360 3367467 408369 -1969084 -4042248
7216 -4042248 -5521616 -3817964 1440509 5590372 4366816 -18009 -1889890 258864
7208 258864 2854980 3259917 2977968 4370842 7127681 9258058 9821430 9358976 8348812
$$ packed form
7269B523387J931480O38170k185856l830244l046063o73129J521889K290488J620057
7260G90179M02783m41396n41486j72946n6967o53433j354768j040241J58494P02003
7250b207778O8840Q706J891867L990623L408853j3418l723404n669242n376586
7241g621539k743909J469881M529071M221733K331463K402641M113194L614401
7233A2316936q2282l203403k975692j282598p43166r94928j123673j982730l315547
7224c387083k248919J960165M997737L138460j092893k959098k377453k073164
7216d042248j479368J703652N258473M149863j223556m384825j871881K148754
7208B58864K596116M04937k81949J392874K756839K130377N63372m62454j010164
$$ plain form
7199 8348812 6229880 2260738 -2590561 -5209453 -3119780 2080434 5626480 4661518
7191 4661518 972191 -2038421 -3235152 -3452273 -3435186 -4007290 -6478538 -10472997 -12674463
7182 -12674463 -10309118 -4940336 -289686 2710397 5672404 8247874 7624655 3220960
7174 3220960 -1366530 -2607872 -916079 1165991 2615770 4015261 5427393 6033270
7166 6033270 5296393 3335434 709272 -1436111 -1950004 -1333822 -1827244 -4614600 -7745503
7157 -7745503 -8372011 -6694982 -5955408 -8147132 -11292444 -12066249 -10113422 -8070506 -7402779
7148 -7402779 -6173291 -2091449 3640954 7502902 8129848 7380216 6799732 5530743 2818257
7139 2818257 236223 -591433 -835273 -2662719 -5613705 -7217059 -6688375 -5543739 -4640347
$$ packed form
7199H348812k118932l969142m851299k618892K089673N200214L546046r64962
7191D661518l689327l010612j196731k17121J7087n72104k471248l994459k201466
7182a2674463K365345N368782M650650L000083K962007K575470o23219m403695
7174C220960m587490j241342J691793K082070J449779J399491J412132O05877
7166F033270p36877j960959k626162k145383n13893O16182m93422k787356l130903
7157g745503o26508J677029P39574k191724l145312p73805J952827K042916O67727
7148g402779J229488M081842N732403L861948O26946p49632n80484j268989k712486
7139B818257k582034q27656k43840j827446k950986j603354N28684J144636R03392
$$ plain form
7130 -4640347 -3101788 -631375 1376623 1963965 2084855 2888792 3831597 3535993 1641340
7121 1641340 -1011311 -3360193 -4756418 -5248829 -5535566 -5946724 -5391865 -2327440 2854137
7112 2854137 7241965 7730246 3670619 -2573595 -7139062 -7267823 -3582230 351249 1630963
7103 1630963 804454 134651 95616 -577668 -2036943 -2873130 -2461754 -1532250 -369123
7094 -369123 1200534 1980499 429677 -1944947 -1390572 2580685 5535141 3937605 -104743
7085 -104743 -2370560 -2372717 -2600371 -3659528 -3743005 -2430998 -1821555 -3476238 -6449596
7076 -6449596 -8745879 -9122998 -7386650 -4473570 -2391162 -2734382 -5045530 -7448886 -8604935
7067 -8604935 -8247687 -6591329 -4464081 -3329028 -3776288 -4563322 -4399400 -3860277 -4146436
$$ packed form
7130d640347J538559K470413K007998N87342J20890Q03937R42805k95604j894653
7121A641340k652651k348882j396225m92411k86737m11158N54859L064425N181577
7112B854137M387828M88281m059627o244214m565467j28761L685593L933479J279714
7103A630963q26509o69803l9035o73284j459275q36187M11376R29504J163127
7094c69123J569657P79965j550822k374624N54375L971257K954456j597536m042348
7085a04743k265817k157k27654j059157q3477J312007O09443j654683k973358
7076f449596k296283l77119J736348K913080K082408l43220k311148k403356j156049
7067h604935L57248J656358K127248J135053m47260p87034J63922N39123k86159
$$ plain form
7058 -4146436 -5032185 -5841825 -7262681 -9741959 -10969797 -8029035 -2059510 2174595 1997065
7049 1997065 -436322 -1833747 -1652809 -1081434 -425020 721165 2118459 3246403 4070719
7040 4070719 4375281 3313803 617465 -2594658 -4948562 -5903866 -5327011 -3310548 -1035087
7031 -1035087 -313545 -1362325 -2465669 -2862275 -4289198 -8053721 -12007486 -12664733 -9795128
7022 -9795128 -6825377 -6578928 -8298462 -9341135 -8519083 -6920013 -5981605 -5553451 -4107076
7013 -4107076 -751760 3306575 5665688 4911907 1593938 -2432420 -4862098 -3931731 -230248
7004 -230248 2681184 1443408 -2929404 -5932239 -5093022 -2453229 -800115 -152534 257856
6995 257856 -839924 -4687344 -9180007 -10674744 -8399514 -4558195 -938432 1833691
$$ packed form
7058d146436q85749q09640j420856k479278j227838K940762N969525M234105j77530
7049A997065k433387j397425J80938N71375O56414J146185J397294J127944Q24316
7040D070719L04562j061478k696338l212123k353904r55304N76855K016463K275461
7031a035087P21542j048780j103344l96606j426923l764523l953765o57247K869605
7022i795128K969751K46449j719534j042673Q22052J599070R38408M28154J446375
7013d107076L355316M058335K359113p53781l317969m026358k429678R30367L701483
7004b30248K911432j237776m372812l002835Q39217K639793J653114O47581M10390
6995B57856j097780l847420m492663j494737K275230L841319L619763K772123
$$ plain form
6987 1833691 2553578 398361 -2465895 -2698338 -707665 -419072 -3199653 -5416702 -3714057
6978 -3714057 343897 3133695 3933298 4454501 5448091 6589451 8296687 10772717 12149502
6969 12149502 10414627 6727671 4149650 3236689 1519789 -2415941 -6854033 -9622558
6961 -9622558 -10679765 -11052923 -10949107 -10094592 -8775414 -7520968 -6449188 -5363895 -3693155
6952 -3693155 -338861 4961302 9855703 10795418 7161996 2411111 -65773 -738709 -2123687
6943 -2123687 -4596758 -6236263 -6258814 -6219683 -7328351 -8392096 -7460336 -4508376 -1462140
6934 -1462140 3207 -170349 -1175266 -2675721 -4862209 -7336973 -8658469 -7608297
6926 -7608297 -4741662 -2036017 -933580 -1239861 -1854844 -1787306 -434745 2059145 4383494
$$ packed form
6987A833691P19887k155217k864256k32443J990673K88593k780581k217049J702645
6978c714057M057954K789798P99603N21203R93590J141360J707236K476030J376785
6969A2149502j734875l686956k578021r12961j716900l935730m438092k768525
6961i622558j057207l73158J03816Q54515J319178J254446J071780J085293J670740
6952c693155L354294N300163M894401R39715l633422m750885k476884o72936j384978
6943b123687k473071j639505k2551L9131j108668j063745R31760K951960L046236
6934a462140J465347j73556j004917j500455k186488k474764j321496J050172
6926g608297K866635K705645J102437l06281o14983O7538J352561K493890K324349
$$ plain form
6917 4383494 5093378 4603542 5024151 7268518 9494012 9440561 7224408 4607828 2648809
6908 2648809 1705390 2766102 6529846 11321107 13961976 13083404 10134801 7029741 4347789
6899 4347789 2018538 109151 -1525226 -2946996 -3140923 -850846 3090280 5823245
6891 5823245 5614824 3692974 2356394 2609821 4261261 6755836 8875167 8967467 6751470
6882 6751470 4082696 3056819 4108129 6400846 8837261 10088780 9099255 6407028
6874 6407028 3639160 1118733 -2198219 -5661011 -6263709 -2693509 2194527 5007945
6866 5007945 5800473 6005288 4650617 151913 -5443785 -7852188 -5954807 -2568582 356
6857 356 1918262 3353528 3541770 2933852 3083907 3589131 2224228 -946411 -2809386
$$ packed form
6917D383494P09884m89836M20609K244367K225494n3451k216153k616580j959019
6908B648809r43419J060712L763744M791261K640869q78572k948603l105060k681952
6899D347789k329251j909387j634377j421770j93927K290077L941126K732965
6891E823245k08421j921850j336580K53427J651440K494575K119331R2300k215997
6882F751470k668774j025877J051310K292717K436415J251519r89525k692227
6874F407028k767868k520427l316952l462792o02698L570200M888036K813418
6866E007945P92528K04815j354671m498704n595698k408403J897381L386225K568938
6857C56J917906J435266J88242o07918J50055N05224j364903l170639j862975
$$ plain form
6848 -2809386 -1884171 -598911 -1179536 -2401649 -2682169 -3414549 -6213384 -9137131 -9071925
6839 -9071925 -6495226 -4640500 -4817704 -5663064 -6513906 -8379495 -11357310 -13759931 -14415333
6830 -14415333 -13834820 -12650013 -10697922 -8126725 -5792924 -4003411 -2099744 381389
6822 381389 3213208 6135117 8762765 9976487 8880043 6307664 3792181 1208017
6814 1208017 -2474367 -6008551 -6211721 -2636663 723704 518566 -1247653 -448809 2551156
6805 2551156 3204086 -173124 -3451434 -2602773 465697 1068186 -1082025 -1819346 477882
6796 477882 1987781 -717892 -5249148 -6749605 -4523926 -1858412 -462262 928031
6788 928031 2440593 1726943 -1826031 -4895418 -4374378 -1237502 1901442 4766779 8263642
$$ packed form
6848b809386R25215J285260n80625j222113k80520p32380k798835k923747O5206
6839i071925K576699J854726j77204q45360q50842j865589k977815k402621o55402
6830a4415333N80513J184807J952091K571197K333801J789513J903667K481133
6822C81389K831819K921909K627648J213722j096444k572379k515483k584164
6814A208017l682384l534184k03170L575058L360367k05138j766219P98844K999965
6805B551156O52930l377210l278310Q48661L068470O02489k150211p37321K297228
6796D77882J509899k705673m531256j500457K225679K665514J396150J390293
6788I28031J512562p13650l552974l069387N21040L136876L138944K865337L496863
$$ plain form
6779 8263642 11145984 11055601 8221847 5359666 4057814 3519717 2739643 1845498 1304837
6770 1304837 1573523 3333032 6358153 8591715 8338693 6977836 7252893 9136214 9912610
6761 9912610 8420491 6479507 5587805 4992288 4172406 4669068 7592012 10969047 11405573
6752 11405573 7646319 1617629 -3117651 -3615788 -15890 3477283 1989858 -4390162
6744 -4390162 -10033300 -10109236 -5801455 -1715565 -41821 364331 507018 -102790 -1406423
6735 -1406423 -1978290 -1043141 235082 233244 -1303941 -3390829 -4990728 -5638045 -5411860
6726 -5411860 -4786924 -4445213 -4989442 -6503417 -8063177 -7975307 -5259849 -933369 2882126
6717 2882126 5082838 6003117 5979986 4879346 3147349 1772782 791396 -617655 -2061825
$$ packed form
6779H263642K882342r0383k833754k862181j301852n38097p80074q94145n40661
6770A304837K68686J759509L025121K233562k53022j360857K75057J883321P76396
6761I912610j492119j940984q91702n95517q19882M96662K922944L377035M36526
6752A1405573l759254o028690m735280m98137L599898L493173j487425o380020
6744d390162n643138p5936M307781M085890J673744M06152J42687o09808j303633
6735a406423n71867R35149J278223j838j537185k086888j599899o47317K26185
6726e411860O24936L41711n44229j513975j559760Q7870K715458M326480L815495
6717B882126K200712R20279k3131j100640j731997j374567r81386j409051j444170
$$ plain form
6708 -2061825 -1787508 501525 2458585 1930268 -597439 -3540946 -6378076 -8732764 -9181378
6699 -9181378 -7086357 -4213858 -2381951 -784440 2059900 4966495 5454365 3695405
6691 3695405 2271580 2339650 2791711 3122471 4284620 6295955 7539589 7078519 5567859
6682 5567859 3537812 1031377 -776045 -290061 1420805 1055423 -2051733 -4107790 -1893206
6673 -1893206 2438259 3953258 1067935 -3179621 -5267861 -4469985 -2126504 523835
6665 523835 3184804 5974339 8513788 9541943 7731857 3044431 -3068035 -8747239
6657 -8747239 -12491965 -13213023 -10766377 -6659515 -3220442 -1744632 -2038073 -3374329 -4766264
6648 -4766264 -4878437 -3463643 -2573185 -4200457 -6807330 -6705322 -3172237 578202 2144399
$$ packed form
6708b061825K74317K289033J957060n28317k527707k943507k837130k354688m48614
6699i181378K095021K872499J831907J597511K844340K906595M87870j758960
6691C695405j423825O8070M52061L30760J162149K011335J243634m61070j510660
6682E567859k030047k506435j807422M85984J710866l65382l107156k056057K214584
6673a893206M331465J514999k885323m247556k088240P97876K343481K650339
6665E23835K660969K789535K539449J028155j810086m687426o112466n679204
6657h747239l744726p21058K446646M106862L439073J475810k93441j336256j391935
6648d766264j12173J414794Q90458j627272k606873J02008L533085L750439J566197
$$ plain form
6639 2144399 2492137 2534822 685259 -3707239 -7423538 -7149225 -4266951 -2665275 -3196370
6630 -3196370 -3581585 -2841010 -2392063 -2932012 -3231363 -2344345 -794189 567374 1089982
6621 1089982 73193 -2129381 -3347912 -2019592 296990 1038098 364586 126569 42179
6612 42179 -1713934 -4449471 -5121541 -2903322 -192850 1404029 2561514 2981142 565094
6603 565094 -4526517 -8511825 -8817665 -7344540 -6822713 -6779919 -5492459 -3263770 -1126253
6594 -1126253 1323404 4018275 4580436 1442176 -2989702 -5279958 -5398093 -5204089 -4365690
6585 -4365690 -1474924 2080916 3410765 2779171 3214513 5662456 8110820 9367417 9886963
6576 9886963 8795402 4437690 -1225494 -3213569 -432692 1979112 -180040 -4111374
$$ packed form
6639B144399L47738M2685j849563m392498l716299K74313K882274J601676n31095
6630c196370l85215P40575M48947n39949k99351Q87018J550156J361563N22608
6621A089982j016789k202574j218531J328320K316582P41108o73512k38017q4390
6612D2179j756113k735537o72070K218219K710472J596879J157485M19628k416048
6603E65094n091611l985308l05840J473125N21827M2794J287460K228689K137517
6594a126253K449657K694871N62161l138260m431878k290256j18135J94004Q38399
6585d365690K890766L555840J329849o31594M35342K447943K448364J256597N19546
6576I886963j091561m357712n663184j988075K780877K411804k159152l931334
$$ plain form
6568 -4111374 -4410685 -855802 2044773 1772071 210718 -257874 317838 893031 1192085
6559 1192085 1208053 694407 -115438 -542243 -741029 -1895185 -4599726 -7732099 -9296189
6550 -9296189 -8077561 -4643990 -1237527 -309437 -2280811 -4826906 -5130849 -2831638 -170637
6541 -170637 568377 -945791 -3423231 -5316239 -5655195 -4273104 -1768884 735805 1944853
6532 1944853 891325 -2226035 -5631133 -7215503 -6598279 -5262697 -4395809 -3714261 -3033077
6523 -3033077 -3537328 -6023909 -8832488 -9329886 -7150065 -4413429 -2932496 -2730518 -3182639
6514 -3182639 -3875022 -4068844 -2946886 -976243 233140 -119843 -1407248 -3126020 -5447860
6505 -5447860 -7608564 -7522457 -4280273 209005 3354961 4658437 5176255 5384359 5130977
$$ packed form
6568d111374k99311L554883K900575k72702j561353m68592N75712N75193K99054
6559A192085J5968n13646q09845m26805j98786j154156k704541l132373j564090
6550i296189J218628L433571L406463R28090j971374k546095l03943K299211K661001
6541a70637P39014j514168k477440j893008l38956J382091K504220K504689J209048
6532A944853j053528l117360l405098j584370O17224J335582Q66888O81548O81184
6523c033077n04251k486581k808579m97398K179821K736636J480933K01978m52121
6514c182639o92383j93822J121958J970643J209383l52983j287405j718772k321840
6505e447860k160704Q6107L242184M489278L145956J303476N17818K08104k53382
$$ plain form
6496 5130977 4755828 4399132 2839175 -880417 -4877792 -5780812 -3114808 -264229 -101011
6487 -101011 -1429341 -1120890 1623395 4794592 6410353 6033552 3988153 1072822 -753304
6478 -753304 710954 5289775 9783016 10976681 8841711 6084195 5013251 5534936 5833832
6469 5833832 4276505 817997 -2854955 -4703453 -4346755 -3456267 -3664111 -4581681 -4763056
6460 -4763056 -4142077 -4064624 -4833340 -4889671 -3293685 -1686563 -2377035 -5096182 -7039424
6451 -7039424 -6042423 -2714557 487373 1403020 -428671 -3386693 -4704951 -2897062 425378
6442 425378 2065155 852841 -1250506 -2031541 -1714139 -1799086 -2351268 -2154632 -1307424
6433 -1307424 -1805644 -4701195 -7791822 -7478751 -2876299 2900845 6033961 6094025 6096346
$$ packed form
6496E130977l75149l56696j559957l719592l997375r03020K666004K850579J63218
6487a01011j328330L08451K744285L171197J615761l76801k045399k915331j826126
6478g53304J464258M578821M493241J193665k134970k757516j070944N21685K98896
6469E833832j557327l458508l672952j848498L56698Q90488k07844r17570j81375
6460d763056O20979P7453p68716n6331J595986J607122o90472k719147j943242
6451g039424R97001L327866L201930R15647j831691k958022j318258J807889L322440
6442D25378J639777j212314k103347p81035L17402q4947n52182J96636Q47208
6433a307424m98220k895551l090627L13071M602452N777144L133116O0064K321
$$ plain form
6424 6096346 8411574 11460858 11382512 6885141 1391507 -388232 2412872 6015402 6429455
6415 6429455 3870949 2077131 3602572 6864442 8337841 6878519 4733980 4393960
6407 4393960 5770392 7077504 7287205 6462700 4452545 1061324 -2395316 -3416261 -993212
6398 -993212 3131170 6602802 8736679 9692343 8599588 4405827 -1584949 -5881752 -6319413
6389 -6319413 -4407814 -3367237 -4451898 -6073778 -6205175 -4593006 -2372527 -432965
6381 -432965 951305 1249833 -271534 -3049604 -4737528 -3470425 -429544 1094384 -510125
6372 -510125 -3378898 -4656312 -3719963 -2056765 -842944 -70308 142296 -1110588 -4124058
6363 -4124058 -7171869 -7406622 -3627286 1771461 4079963 502941 -6433438 -10543506
$$ packed form
6424F096346K315228L049284p8346m497371n493634j779739K801104L602530M14053
6415F429455k558506j793818J525441L261870J473399j459322k144539l40020
6407D393960J376432J307112K09701q24505k010155l391221l456640j020945K423049
6398i93212M124382L471632K133877R55664j092755m193761n990776m296803m37661
6389f319413J911599J040577j084661j621880j31397J612169K220479J939562
6381d32965J384270K98528j521367k778070j687924J267103L040881J523928j604509
6372e10125k868773j277414R36349J663198J213821P72636K12604j252884l013470
6363d124058l047811k34753L779336N398747K308502l577022o936379m110068
$$ plain form
6355 -10543506 -8009522 -1389731 3245743 2784271 -433878 -2328344 -1671632 -311368
6347 -311368 -36919 -552609 -371871 1326128 4170593 7452633 10774728 13546568 14363544
6338 14363544 11896697 6699642 1277513 -2271212 -4002437 -4914787 -5077227 -4287836 -3668564
6329 -3668564 -4510985 -5703693 -4622368 -1145453 1477941 979855 -779503 -883568 137904
6320 137904 -471415 -2786943 -3605082 -1301939 1332567 678183 -2912679 -5756069 -5574236
6311 -5574236 -3773240 -2897087 -3387879 -3841157 -3696982 -4218516 -6312584 -8364730 -7602593
6302 -7602593 -3749561 -97059 -88397 -3544508 -7257389 -8795051 -8482497 -7851552 -7624634
6293 -7624634 -7618886 -7466865 -6865882 -5967803 -5797894 -7111907 -8463179 -7085692 -2797928
$$ packed form
6355a0543506K533984O619791M635474m61472l218149j894466O56712J360264
6347c11368K74449n15690J80738J697999K844465L282040L322095K771840Q16976
6338A4363544k466847n197055n422129l548725j731225r12350j62440P89391O19272
6329c668564q42421j192708J081325L476915K623394m98086j759358j04065J021472
6320A37904o09319k315528q18139K303143K634506o54384l590862k843390J81833
6311e574236J800996Q76153m90792m53278J44175n21534k094068k052146P62137
6302g602593L853032L652502Q662l456111l712881j537662L12554O30945K26918
6293g624634N748J52021O00983Q98079J69909j314013j351272J377487M287764
$$ plain form
6284 -2797928 664019 104217 -2644878 -3276919 -1418354 -1230630 -4948459 -9009760 -8682328
6275 -8682328 -4317166 -328498 788299 523972 821585 1423571 1464771 1356661 1703359
6266 1703359 1863360 1092950 237811 843201 2882902 4488646 3984542 1554945 -1126261
6257 -1126261 -2551577 -2717152 -2999484 -4588766 -7079569 -8906550 -8968836 -7274959 -4368405
6248 -4368405 -1230090 374670 -1014266 -4638211 -8036693 -10007326 -11524285 -12990956
6240 -12990956 -12592537 -9065839 -4450552 -1752958 -852013 755990 3611701 5387835
6232 5387835 4539730 2323289 379683 -1503617 -3991998 -6231452 -6734583 -5331231 -3186836
6223 -3186836 -1515884 -842769 -714686 245513 2907056 5796854 6036274 2912083 -726825
$$ packed form
6284b797928L461947n59802k749095o32041J858565J87724l717829m061301L27432
6275h682328M365162L988668J116797k64327K97613O01986M1200j08110L46698
6266A703359J60001p70410q55139O05390K039701J605744n04104k429597k681206
6257a126261j425316j65575k82332j589282k490803j826981o2286J693877K906554
6248d368405L138315J604760j388936l623945l398482j970633j516959j466671
6240a2990956L98419L526698M615287K697594R00945J608003K855711J776134
6232E387835q48105k216441j943606j883300k488381k239454n03131J403352K144395
6223c186836J670952O73115J28083R60199K661543K889798K39420l124191l638908
$$ plain form
6214 -726825 -1674747 -18203 1402381 371063 -2766460 -5852824 -6871192 -5760234 -4579791
6205 -4579791 -4858266 -4765864 -936307 6165935 11153375 9822908 4340732 7831 -1363160
6196 -1363160 -1838553 -2422446 -1567453 1199852 3639355 3957088 3121219 2918881 3841708
6187 3841708 5845524 8840585 11081301 9531327 3995963 -995648 -1051884 2462874 4310644
6178 4310644 2208874 -1089305 -2529930 -2461938 -2445000 -2038263 -76698 2312580 2589981
6169 2589981 475660 -1432887 -1074592 824785 2497953 3344693 3269571 1445215 -2368866
6160 -2368866 -6109082 -7028538 -4895470 -1999752 -261702 -46737 -1359000 -3726174 -4884560
6151 -4884560 -2620949 1213361 1742197 -2172462 -5432512 -3644362 420410 1025270 -2194685
$$ packed form
6214g26825r47922J656544J420584j031318l137523l086364j018368J110958J180443
6205d579791k78475R2402L829557P102242M987440j330467n482176m332901j370991
6196a363160m75393n83893Q54993K767305K439503L17733q35869k02338R22827
6187C841708K003816K995061K240716j549974n535364m991611n6236L514758J847770
6178D310644k101770l298179j440625O7992J6938M06737J961565K389278K77401
6169B589981k114321j908547L58295J899377J673168Q46740p5122j824356l814081
6160b368866l740216r19456K133068K895718J738050K14965j312263k367174j158386
6151d884560K263611L834310N28836l914659l260050J788150M064772O04860l219955
$$ plain form
6142 -2194685 -4714306 -4608573 -4320464 -4994253 -4472865 -2283913 -1568253 -3630741 -5026374
6133 -5026374 -3234854 -1285605 -2741449 -5322994 -4379309 -628434 882004 -1161224
6125 -1161224 -2581937 -646459 2034631 2290798 1117678 1022160 1485010 67506 -3542231
6116 -3542231 -7311115 -9873573 -11400815 -11814649 -10380717 -7501800 -5262794 -5302078 -6969310
6107 -6969310 -8369936 -8744261 -8873896 -9070195 -7843251 -3727466 1808782 4885702 3546441
6098 3546441 404596 -457219 1533843 3352210 2874315 1164837 -226619 -1868420 -4692148
6089 -4692148 -7203588 -6656494 -2604723 2522785 6388945 8688611 9858764 9529859 7347991
6080 7347991 4343702 2101060 800626 -710303 -2778805 -4103893 -3722386 -2806235 -3119720
$$ packed form
6142b194685k519621J05733K88109o73789N21388K188952P15660k062488j395633
6133e026374J791520J949249j455844k581545R43685L750875J510438k043228
6125a161224j420713J935478K681090K56167j173120r5518M62850j417504l609737
6116c542231l768884k562458j527242m13834J433932K878917K239006l9284j667232
6107f969310j400626l74325j29635j96299J226944M115785N536248L076920j339261
6098C546441l141845q61815J991062J818367m77895j709478j391456j641801k823728
6089d692148k511440N47094M051771N127508L866160K299666J170153l28905k181868
6080G347991l004289k242642j300434j510929k068502j325088L81507R16151l13485
$$ plain form
6071 -3119720 -4074498 -3054142 780285 4505029 4510216 717892 -3651140 -6028597 -6665304
6062 -6665304 -6937660 -7218489 -7124407 -6666693 -6211832 -5960097 -6184096 -7398024 -9546464
6053 -9546464 -11437967 -11687385 -10027591 -7297604 -4546991 -2588301 -1840410 -1847936 -1338040
6044 -1338040 401567 2396511 3032466 2045720 546433 -829430 -2505339 -4279829 -4426653
6035 -4426653 -1807759 1678705 2325578 -1300630 -6441750 -8876308 -7028216 -2948892
6027 -2948892 166111 775367 -228103 -669741 891730 3673316 5344111 4800688 3869538
6018 3869538 5189529 8627697 11239327 10979756 8852366 6778669 5133101 3661146
6010 3661146 3158272 4166712 4985889 3326303 -284956 -2865925 -2838671 -1624320 -1227598
$$ packed form
6071c119720r54778J020356L834427L724744N187l792324m369032k377457o36707
6062f665304k72356k80829R4082M57714M54861K51735k23999j213928k148440
6053i546464j891503k49418J659794K729987K750613J958690P47891p526N09896
6044a338040J739607J994944O35955r86746j499287j375863j675909j774490j46824
6035d426653K618894L486464O46873l626208n141120k434558J848092M079324
6027b948892L115003O09256j003470m41638J561471K781586J670795n43423r31150
6018C869538J319991L438168K611630k59571k127390k073697j645568j471955
6010C661146n02874J008440Q19177j659586l611259k580969K7254J214351L96722
$$ plain form
6001 -1227598 -2159206 -4004255 -5915334 -6025791 -2782950 1998616 3717458 323084 -4775002
5992 -4775002 -6903953 -5396638 -2633316 86652 2574636 3063328 -451309 -5985757
5984 -5985757 -8421848 -5908242 -2527677 -2863015 -6226430 -8367919 -7215844 -4573204
5976 -4573204 -2975078 -3044960 -3829189 -4115193 -3231477 -1515506 -3281 900468 1921294
5967 1921294 3306044 3480147 715486 -4027262 -7262531 -6369338 -2146225 2149390 3795170
5958 3795170 2678781 906253 382584 676173 -234386 -2934735 -5353232 -5342052 -3452674
5949 -3452674 -1948504 -1923838 -2826885 -3982885 -4721743 -3657934 -276687 2787787 1724496
5940 1724496 -3377092 -7715183 -7284350 -3322913 35812 709803 -382399 -1706252 -2403328
$$ packed form
6001a227598r31608j845049j911079j10457L242841M781566J718842l394374n098086
5992d775002k128951J507315K763322K719968K487984M88692l514637n534448
5984e985757k436091K513606L380565l35338l363415k141489J152075K642640
5976d573204J598126o9882p84229k86004Q83716J715971J512225R03749J020826
5967A921294J384750J74103k764661m742748l235269Q93193M223113M295615J645780
5958C795170j116389j772528n23669K93589r10559k700349k418497J1180J889378
5949c452674J504170K4666r03047j156000p38858J063809L381247L064474j063291
5940A724496n101588m338091M30833L961437L358725O73991j092202j323853o97076
$$ plain form
5931 -2403328 -2168681 -1662929 -2328047 -4304173 -5544988 -4714743 -3801417 -5557090 -9090859
5922 -9090859 -10611756 -8472521 -5101682 -3701332 -5114022 -8142303 -10787801 -10788149 -7145243
5913 -7145243 -1900896 1380852 1474152 202340 -739471 -1302523 -1134787 892682 4074990
5904 4074990 5687781 5004224 4601505 5621550 4909471 139934 -4774026 -3725713 3170856
5895 3170856 9359404 9978388 6563332 3227730 1643890 1018578 323198 -994090 -2807596
5886 -2807596 -3855353 -2913454 -771927 749059 1911023 4808748 9425388 12557951
5878 12557951 11957603 9248382 7165877 5958504 4356760 2279826 377669 -1834398
5870 -1834398 -5126074 -8535155 -10114764 -9242415 -6701685 -3209132 469488 2706409
$$ packed form
5931b403328K34647N05752o65118j976126j240815Q30245R13326j755673l533769
5922i090859j520897K139235L370839J400350j412690l028281k645498l48L642906
5913g145243N244347L281748R3300j271812r41811n63052J67736K027469L182308
5904D074990J612791o83557m02719J020045p12079m769537m913960J048313O896569
5895C170856O188548O18984l415056l335602j583840o25312o95380j317288j813506
5886b807596j047757R41899K141527J520986J161964K897725M616640L132563
5878A2557951o00348k709221k082505j207373j601744k076934j902157k212067
5870a834398l291676l409081j579609Q72349K540730L492553L678620K236921
$$ plain form
5862 2706409 2449660 1320001 2214947 5398189 7624405 5950622 1421482 -1826487 -799687
5853 -799687 3327212 6338922 5300286 1761625 -76751 1400731 3209164 2006939
5845 2006939 -1119779 -2203702 -54156 2169854 1460573 -1227613 -2923174 -2800193 -2614643
5836 -2614643 -3573647 -4534182 -3808207 -1789798 -878355 -2806830 -6639677 -9805059 -10790331
5827 -10790331 -10218871 -9422851 -8878047 -8328516 -7527334 -6222642 -4149099 -1759113 -309071
5818 -309071 -451672 -1416787 -2444103 -4189686 -7382517 -10642225 -11306446 -8572107 -4547950
5809 -4547950 -1935726 -1651029 -2823926 -4029107 -4203662 -3294627 -2360784 -2336309 -2629375
5800 -2629375 -1871879 -156327 669826 -538365 -2495460 -3019010 -1647030 104490 781269
$$ packed form
5862B706409k56749j129659Q94946L183242K226216j673783m529140l247969J026800
5853g99687M126899L011710j038636l538661j838376J477482J808433j202225
5845B006939l126718j083923K149546K224010p09281k688186j695561J22981J85550
5836b614643r59004r60535P25975K018409R11443j928475l832847l165382r85272
5827a0790331N71460P96020N44804N49531Q01182J304692K073543K389986J450042
5818c09071j42601r65115j027316j745583l192831l259708o64221K734339M024157
5809d547950K612224K84697j172897j205181j74555R09035R33843K4475k93066
5800b629375P57496J715552Q26153j208191j957095n23550J371980J751520O76779
$$ plain form
5791 781269 496816 304836 614323 762683 236281 -334966 -227670 -281236 -1924014 -4190650
5781 -4190650 -3748656 595475 5189529 5753694 3190690 2186160 4341806 6130017 4518561
5772 4518561 1402137 526012 2379170 4474285 5176929 4958637 4715132 4812617 5251060
5763 5251060 5206288 3104918 -1230488 -5180786 -5845177 -3562552 -1222399 -340708 373871
5754 373871 2419592 5091819 6248848 4663173 1422782 -579351 868884 4517536
5746 4517536 6265338 3856586 12259 -914808 1484250 3821756 4073635 3591057 3720487
5737 3720487 3647314 2800664 2417647 2772568 1434831 -3074622 -7749646 -8240343 -4584636
5728 -4584636 -983805 -379091 -2038407 -4349372 -6897613 -8938001 -8517957 -4907868 -490348
$$ packed form
5791G81269k84453j91980L09487J48360n26402n71247J07296n3566j642778k266636
5781d190650M41994M344131M594054N64165k563004j004530K155646J788211j611456
5772D518561l116424q76125J853158K095115P02644k18292k43505R7485M38443
5763E251060m4772k101370m335406l950298o64391K282625K340153Q81691P14579
5754C73871K045721K672227J157029j585675l240391k002133J448235L648652
5746D517536J747802k408752l844327r27067K399058K337506K51879m82578J29430
5737C720487p3173q46650l83017L54921j337737m509453m675024m90697L655707
5728d584636L600831O04714j659316k310965k548241k040388M20044L610089M417520
$$ plain form
5719 -490348 1259096 -995657 -5877368 -10884255 -13796215 -13523109 -10495740 -5837213 -237471
5710 -237471 5182572 7329531 3243814 -5080018 -10649672 -8668599 -2082624 2543814
5702 2543814 3089100 2627060 3267382 3448666 1842110 -33527 -802069 -1646265 -3491719
5693 -3491719 -4362439 -2267478 1149204 2821988 2961359 4459311 7996354 10681121 9972312
5684 9972312 6674515 3424193 1945651 2265784 3065093 2443517 -128740 -2407502 -1690292
5675 -1690292 1148111 2052955 -917483 -4769454 -5429684 -2644878 707730 2705113 3584536
5666 3584536 3809317 3463870 3584337 5800979 9829281 12840417 12358586 8972798 5450890
5657 5450890 3845418 4127368 4987703 5029516 3440480 492245 -2371448 -3590560 -3055127
$$ packed form
5719d90348J749444k254753m881711n006887k911960K73106L027369M658527N599742
5710b37471N420043K146959m085717q323832n569654J981073O585975M626438
5702B543814N45286m62040O40322J81284j606556j875637p68542q44196j845454
5693c491719q70720K094961L416682J672784J39371J497952L537043K684767p08809
5684I972312l297797l250322j478542L20133P99309o21576k572257k278762P17210
5675a690292K838403R04844k970438l851971o60230K784806L352608J997383Q79423
5666C584536K24781l45447J20467K216642M028302L011136m81831l385788l521908
5657E450890j605472K81950Q60335M1813j589036k948235k863693j219112N35433
$$ plain form
5648 -3055127 -2307807 -2875950 -4680636 -6360205 -6696397 -5218633 -2056393 1645775 3465234
5639 3465234 1499711 -3112816 -6930620 -8113103 -8004144 -7998663 -7098824 -4592438 -2990054
5630 -2990054 -4926280 -8252243 -8226444 -4662093 -2688615 -5141107 -8261731 -7508147 -4299921
5621 -4299921 -3478316 -6159303 -8877656 -8934094 -7184430 -5613218 -4897518 -4618670 -3864297
5612 -3864297 -1660167 1452546 2795787 564903 -3160309 -4841339 -4391448 -4809983 -7145392
5603 -7145392 -9182945 -9673064 -10362533 -12349781 -13498194 -11600735 -7786868 -4587934 -2534517
5594 -2534517 -905943 -133414 -880857 -1836210 -916698 1882191 4835986 6981659 8263798
5585 8263798 8015509 5686754 2664110 912070 -67457 -2402097 -5839332 -7297680 -5193278
$$ packed form
5648c055127P47320n68143j804686j679569l36192J477764L162240L702168J819459
5639C465234j965523m612527l817804j182483J08959N481Q99839K506386J602384
5630b990054j936226l325963K5799L564351J973478k452492l120624P53584L208226
5621d299921Q21605k680987k718353n6438J749664J571212P15700K78848P54373
5612c864297K204130L112713J343241k230884l725212j681030M49891m18535k335409
5603g145392k037553m90119o89469j987248j148413J897459L813867L198934K053417
5594b534517J628574P72529p47443r55353R19512K798889K953795K145673J282139
5585H263798k48289k328755l022644j752040r79527k334640l437235j458348K104402
$$ plain form
5576 -5193278 -1660687 762612 2248669 3698578 3821737 838611 -3976254 -7132198
5568 -7132198 -7184460 -6044303 -5894836 -6655642 -6877244 -5500974 -2199330 2503252 6711040
5559 6711040 8142140 6595539 4336103 3127007 2118969 -79787 -2508424 -2986400
5551 -2986400 -1601557 -999504 -3004262 -6583095 -9452441 -10195998 -8521620 -5160077 -2132151
5542 -2132151 -1308520 -1644704 415479 6245588 12253494 13834901 11138235 8583040 8989273
5533 8989273 10543029 9943340 6549538 2618537 871427 2530493 6504294 9790641
5525 9790641 9778259 6857938 3843916 2382489 1217028 -1252644 -4117319 -5041148 -3335934
5516 -3335934 -496447 1947444 3770280 5215693 5843993 4586103 751877 -4759232
$$ packed form
5576e193278L532591K423299J486057J449909J23159k983126m814865l155944
5568g132198n2262J140157J49467p60806k21602J376270L301644M702582M207788
5559F711040J431100j546601k259436j209096j008038k198756k428637m77976
5551b986400J384843O02053k004758l578833k869346p43557J674378L361543L027926
5542b132151Q23631l36184K060183N830109O007906J581407k696666k555195M06233
5533H989273J553756n99689l393802l931001j747110J659066L973801L286347
5525I790641j2382k920321l014022j461427j165461k469672k864675r23829J705214
5516c335934K839487K443891J822836J445413O28300j257890l834226n511109
$$ plain form
5508 -4759232 -9112981 -9346162 -5479057 -1275136 -731813 -3933024 -7322710 -7905133 -6049067
5499 -6049067 -4092552 -3413149 -3367842 -2171441 1767600 8474845 15461724 18821432 16574973
5490 16574973 10995257 6624089 5709829 6424761 5889604 3846327 2352857 2660848 3969096
5481 3969096 5187071 6268645 7198469 7098855 5444650 3181308 1482318 250313 -859727
5472 -859727 -834601 1386579 4301959 4601450 986458 -4270863 -7993654 -8893745 -7339369
5463 -7339369 -4105656 -419270 2027606 2391980 1484531 644732 502460 1171399 2527982
5454 2527982 3719186 3554588 2063022 562752 -266908 -872030 -845398 1413592 5770868
5445 5770868 9226351 9621690 8526958 8047641 6667510 1604193 -5797718 -10838764 -11597529
$$ packed form
5508d759232m353749k33181L867105M203921N43323l201211l389686n82423J856066
5499f049067J956515O79403M5307J196401L939041O707245O986879L359708k246459
5490A6574973n579716m371168r14260P14932n35157k043277j493470L07991J308248
5481C969096J217975J081574R29824r9614j654205k263342j698990j232005j110040
5472h59727K5126K221180K915380K99491l614992n257321l722791r00091J554376
5463g339369L233713L686386K446876L64374r07449q39799j42272O68939J356583
5454B527982J191204j64598j491566j500270q29660o05122K6632K258990M357276
5445E770868L455483L95339j094732m79317j380131n063317p401911n041046p58765
$$ plain form
5436 -11597529 -10692799 -10376240 -9528721 -7082108 -5228135 -6696594 -10692495 -13837303 -14080420
5427 -14080420 -11980820 -9156165 -7100885 -6763294 -7843919 -8953794 -9238461 -9000619 -8235806
5418 -8235806 -6156107 -3113589 -1096333 -817383 -293122 1576761 1953546 -2405055 -9695419
5409 -9695419 -14440541 -13925384 -10179867 -5878420 -1947430 320548 -1080700 -5169552
5401 -5169552 -7309703 -4904334 -1212898 -626217 -2349651 -2302692 141885 1372449 -726519
5392 -726519 -4186738 -6964608 -10031456 -14595121 -18837224 -19851896 -17432008 -13781776
5384 -13781776 -10339394 -6894283 -3442401 -985584 -193764 -501871 -859379 -593026 597482
5375 597482 2751781 5438317 7691371 8207599 5745063 161082 -6382168 -10082265 -8573349
$$ packed form
5436a1597529R04730L16559Q47519K446613J853973j468459l995901l144808k43117
5427a4080420K099600K824655K055280L37591j080625j109875k84667K37842P64813
5418h235806K079699L042518K017256K78950N24261J869883L76785m358601p290364
5409i695419m745122N15157L745517M301447L930990K267978j401248m088852
5401e169552k140151K405369L691436N86681j723434M6959K444577J230564k098968
5392g26519l460219k777870l066848m563665m242103j014672K419888L650232
5384a3781776L442382L445111L451882K456817P91820l08107l57508K66353J190508
5375E97482K154299K686536K253054N16228k462536n583981o543250l700097J508916
$$ plain form
5366 -8573349 -3291612 1917240 4310227 3794675 1727650 -402143 -1190172 220799 3101347
5357 3101347 5265279 4944343 2460154 -48837 -434224 1633984 4272806 5206198 4354532
5348 4354532 3812675 4527310 4248094 512906 -5248172 -9175687 -10506640 -12595996 -17170625
5339 -17170625 -20403926 -17444907 -9417038 -2778832 -1698770 -3763607 -4226999 -2267143
5331 -2267143 -880633 -1548699 -1841229 644417 4050607 4393949 1295145 -1268912 -551131
5322 -551131 1534499 2302018 2758048 5028528 7433839 6432039 2700292 640697 1552207
5313 1552207 2124691 934525 1241326 4633508 6877288 4409345 992516 2406096 7022524
5304 7022524 7795955 2809031 -2206375 -2569531 -455333 -128009 -1811859 -3036369 -3034783
$$ packed form
5366h573349N281737N208852K392987n15552k067025k129793p88029J410971K880548
5357C101347K163932l20936k484189k508991l85387K068208K638822R33392q51666
5348D354532n41857P14635k79216l735188n761078l927515j330953k089356m574629
5339a7170625l233301K959019Q027869O638206J080062k064837m63392J959856
5331b267143J386510o68066k92530K485646L406190L43342l098804k564057P17781
5322e51131K085630P67519M56030K270480K405311j001800l731747k059595R11510
5313A552207N72484j190166L06801L392182K243780k467943l416829J413580M616428
5304G022524P73431m986924n015406l63156K114198L27324j683850j224510J586
$$ plain form
5295 -3034783 -2970676 -3487539 -4145945 -4279743 -3327932 -1521429 -675189 -2430750 -5254671
5286 -5254671 -5607193 -3016770 -1370458 -3639970 -7781236 -9866411 -9160166 -7728959 -6728068
5277 -6728068 -5821522 -5348273 -6320654 -8295413 -9316783 -8310551 -6226385 -4638642 -4144595
5268 -4144595 -4155205 -3632945 -2249073 -1216479 -2342231 -5649479 -8632897 -8632036 -5470879
5259 -5470879 -1285121 1583107 2115582 988077 48442 672464 2195700 2782386 2015827
5250 2015827 1422215 2200744 3937387 5907190 7818665 8669825 7015527 3507480 1111662
5241 1111662 1373073 2427862 2274726 1823399 2564017 3283615 1887496 -958351 -2926116
5232 -2926116 -3788045 -5140445 -6933364 -7187670 -5118345 -2037648 841110 3181289 4187405
$$ packed form
5295c034783O4107n16863o58406j33798R51811J806503Q46240j755561k823921
5286e254671l52522K590423J646312k269512m141266k085175P06245J431207J000891
5277f728068R06546M73249r72381j974759j021370J006232K084166J587743M94047
5268d144595j0610N22260J383872J032594j125752l307248k983418Q61L161157
5259e470879M185758K868228N32475j127505r39635O24022J523236N86686p66559
5250B015827n93612P78529J736643J969803J911475Q51160j654298l508047k395818
5241A111662K61411J054789j53136m51327P40618P19598j396119k845847j967765
5232b926116q61929j352400j792919k54306K069325L080697K878758K340179J006116
$$ plain form
5223 4187405 2920797 157783 -2218733 -3796196 -5479040 -6799693 -5881587 -2521849
5215 -2521849 967208 2573328 2276575 720544 -1449708 -2573329 -1045828 1692870
5207 1692870 1990096 -790207 -2461131 643561 6734891 11239084 12554541 12480001 12191995
5198 12191995 10931778 8590882 6782541 6422553 6116638 4180187 1188990 -771426
5190 -771426 -1023904 -1187083 -2685013 -4315176 -3626427 -673052 1286969 -162848 -3309610
5181 -3309610 -4778802 -4121546 -3489065 -3365596 -1875539 1059498 2168211 -700125 -5059338
5172 -5059338 -7143213 -6990038 -7503360 -9586729 -11118863 -10515883 -8673698 -7005900 -5755089
5163 -5755089 -4937075 -5060074 -5812850 -5431043 -2760199 634631 1569764 -1530756 -7029049
$$ packed form
5223D187405j266608k763014k376516j577463j682844j320653R18106L359738
5215b521849L489057J606120k96753j556031k170252j123621J527501K738698
5207A692870K97226k780303j670924L104692O091330M504193J315457p4540k88006
5198A2191995j260217k340896j808341l59988l05915j936451k991197j960416
5190g71426k52478j63179j497930j630163O88749K953375J960021j449817l146762
5181c309610j469192O57256O32481J23469J490057K935037J108713k868336m359213
5172e059338k083875J53175n13322k083369j532134O02980J842185J667798J250811
5163e755089Q18014j22999p52776L81807K670844L394830R35133l100520n498293
$$ plain form
5154 -7029049 -11673480 -13525979 -13318036 -13060730 -13513224 -13427940 -11491531 -8472991 -6765703
5145 -6765703 -7917668 -11122661 -13990833 -14313687 -11448749 -6923195 -3660859 -3573320 -5560258
5136 -5560258 -6732867 -5940054 -4977230 -5574064 -6491883 -5309741 -2440519 -1056441 -2535940
5127 -2535940 -4197260 -3047688 -131895 1013451 -642104 -2614450 -2756898 -1664779
5119 -1664779 -790493 -589180 -1503027 -4307191 -7749306 -8116299 -3779699 1297291 1627564
5110 1627564 -2823752 -6787123 -6884247 -5540170 -6641911 -9975818 -11965591 -10409781 -6487901
5101 -6487901 -2716185 -556023 56086 24338 298921 1290243 2721705 3807772 3446800
5092 3446800 844674 -3246742 -6349136 -6523104 -4739930 -3757420 -4625559 -5750601 -5606755
$$ packed form
5154g029049m644431j852499K07943K57306m52494Q5284J936409L018540J707288
5145f765703j151965l204993k868172l22854K864938M525554L262336Q7539j986938
5136e560258j172609P92813R62824n96834r17819J182142K869222J384078j479499
5127b535940j661320J149572K915793J145346j655555j972346j42448J092119
5119a664779Q74286K01313r13847k804164l442115l66993M336600N076990L30273
5110A627564m451316l963371r7124J344077j101741l333907j989773J555810L921880
5101f487901L771716K160162O12109l1748K74583R91322J431462J086067l60972
5092C446800k602126m091416l102394j73968J783174R82510q68139j125042J43846
$$ plain form
5083 -5606755 -4584901 -3400101 -1506166 1380348 3527163 3019365 873563 257903 2289393
5074 2289393 4418158 4049801 2478971 3443775 7985480 12569724 13051457 9017452 2923611
5065 2923611 -3519764 -9576903 -12919992 -10632200 -4075240 515676 -1099086 -5862254
5057 -5862254 -7755876 -5588159 -3140969 -2956841 -4079511 -5679910 -8536372 -11767310
5049 -11767310 -11888831 -7344639 -1491502 1159071 159141 -1155352 -46194 2906892
5041 2906892 4756426 3141429 -1008192 -3751647 -2384828 926096 1704010 -922131
5033 -922131 -3439353 -3132625 -921860 1566105 4178750 5992757 4529492 -137892 -3398878
5024 -3398878 -1474447 3190383 5167510 3323981 1515083 2616637 5153771 6309644
$$ packed form
5083e606755J021854J184800J893935K886514K146815n07798k145802o15660K031490
5074B289393K128765l68357j570830R64804M541705M584244M81733m034005o093841
5065B923611o443375o057139l343089K287792O556960M590916j614762m763168
5057e862254j893622K167717K447190J84128j122670j600399k856462l230938
5049a1767310j21521M544192N853137K650573r99930j314493J109158K953086
5041B906892J849534j614997m149621k743455J366819L310924P77914k626141
5033i22131k517222L06728K210765K487965K612645J814007j463265m667384l260986
5024c398878J924431M664830J977127j843529j808898J101554K537134J155873
$$ plain form
5016 6309644 5734472 5210328 5880727 7006237 7322153 6988152 7396545 8640968 8356962
5007 8356962 4742204 -66247 -2145079 -1277854 -1537638 -5793426 -12290982 -17553456 -20004355
4998 -20004355 -19606279 -16630115 -12356043 -8822703 -6599861 -4723119 -3235661 -3028153
4990 -3028153 -2921831 -711686 2204294 1828672 -1441134 -2111987 1678849 4407965 1915384
4981 1915384 -1653179 -857676 1949210 988976 -3031104 -4408394 -1899027 10502 -1558592
4972 -1558592 -5163436 -9165651 -13196465 -15809560 -15586249 -14314129 -14683819 -15574448 -14036828
4963 -14036828 -10737761 -8483363 -6596136 -2397788 2457940 3080828 -1259667 -6442540
4955 -6442540 -10216497 -13839696 -16690406 -15375632 -9693579 -4324898 -2974611 -4963142
$$ packed form
5016F309644n75172n24144O70399J125510L15916l34001M08393J244423k84006
5007H356962l614758m808451k078832Q67225k59784m255788o497556n262474k450899
4998b0004355L98076K976164M274072L533340K222842J876742J487458K07508
4990c028153J06322K210145K915980l75622l269806o70853L790836K729116k492581
4981A915384l568563P95503K806886r60234m020080j377290K509367J909529j569094
4972a558592l604844m002215m030814k613095K23311J272120l69690q90629J537620
4963a4036828L299067K254398J887227M198348M855728O22888m340495n182873
4955f442540l773957l623199k850710J314774N682053N368681J350287j988531
$$ plain form
4947 -4963142 -8270557 -11528274 -12642830 -10276866 -7227018 -7630928 -10640644 -11872957
4939 -11872957 -10972995 -11810443 -14823774 -15642375 -12592907 -9390617 -8715530 -9017088 -9411707
4930 -9411707 -11751154 -15658024 -17202236 -14973114 -12437813 -12215643 -12860656 -12906683 -13073306
4921 -13073306 -13139888 -11807955 -10591875 -12298333 -15103667 -14352077 -10628278 -9096306 -10416667
4912 -10416667 -10091722 -7489637 -7015781 -9326500 -10524589 -11281552 -16636230 -24928429 -27914479
4903 -27914479 -24498193 -22809617 -25529366 -25731428 -21419923 -20641132 -26541092 -31184518
4895 -31184518 -30808180 -32738628 -39453725 -41222561 -34191528 -30115907 -36890137 -45083523
4887 -45083523 -46052496 -46877911 -53560716 -57231294 -53171166 -54582505 -68686541 -79603756
$$ packed form
4947d963142l307415l257717j114556K365964L049848m03910l009716j232313
4939a1872957Q99962q37448l013331q18601L049468L202290O75087l01558l94619
4930i411707k339447l906870j544212K229122K535301K22170o45013m6027j66623
4921a3073306o6582J331933J216080j706458k805334P51590L723799J531972j320361
4912a0416667L24945K602085M73856k310719j198089p56963n354678q292199k986050
4903b7914479L416286J688576k719749k02062M311505P78791n899960m643426
4895c1184518L76338j930448o715097j768836P031033M075621o774230q193386
4887d5083523r68973q25415o682805l670578M060128j411339j4104036j0917215
$$ plain form
4879 -79603756 -77126638 -79618606 -100850848 -120379755 -124246393 -146106316 -210514823 -252814896
4871 -252814896 -171644901 25987487 202437118 244981145 187113082 135109342 127270109
4864 127270109 124014264 100960680 80696206 78518208 76772410 63267315 51956938
4857 51956938 52929130 54906452 49344457 44787230 46519439 45349151 36706699 30322673
4849 30322673 31534813 31563256 25155349 20512545 22942741 24963879 21601831 20193373
4841 20193373 25512718 29236398 24224182 16911999 15621605 17602892 17267174 17033484
4833 17033484 20229732 22323121 18989225 15165073 16856407 20784294 20840483 18549020
4825 18549020 18719016 20310206 19686968 18087084 18412678 19011960 17376360 15599097 15840193
$$ packed form
4879g9603756K477118k491968k1232242j9528907l866638k1859923o4408507m2300073
4871b52814896Q1169995J97632388J76449631M2544027n7868063n2003740p839233
4864A27270109l255845k3053584k0264474k177998j745798j3505095j1310377
4857E1956938R72192J977322n561995m557227J732209j170288q642452o384026
4849C0322673J212140K8443o407907m642804K430196K021138l362048j408458
4841B0193373N319345L723680n012216p312183j290394J981287l35718k33690
4833A7033484L196248K093389l333896l824152J691334L927887N6189k291463
4825A8549020J69996J591190o23238j599884L25594N99282j635600j777263K41096
$$ plain form
4816 15840193 14972517 10087207 4760013 3383902 3688047 1538060 -1021689 439757
4808 439757 4406617 5903751 4574429 3663183 3381330 1792571 335252 2125347 6093020
4799 6093020 8502920 9095878 10461461 12614292 13405082 13158025 13730010 13884410 10793439
4790 10793439 5768133 3605861 6029789 9865917 11889732 11805806 10317482 7782091
4782 7782091 5334088 4610352 5863806 8155349 11069183 14411570 16895397 17088491 15198645
4773 15198645 12544088 10114177 8645690 8631131 9260909 9253166 9531910 12397175 17010973
4764 17010973 19189306 17431548 15362235 15776641 16280181 14074628 11150117 10652636 11498270
4755 11498270 11121516 10678291 12643320 15466523 15511235 12689311 9680629 7163427 4292171
$$ packed form
4816A5840193q67676m885310n327194j376111L04145k149987k559749J461446
4808D39757L966860J497134j329322r11246k81853j588759j457319J790095L967673
4799F093020K409900N92958J365583K152831P90790k47057N71985J54400l090971
4790A0793439n025306k162272K423928L836128K023815q3926j488324k535391
4782G782091k448003p23736J253454K291543K913834L342387K483827J93094j889846
4773A5198645k654557k429911j468487j4559O29778p743K78744K865265M613798
4764A7010973K178333j757758k069313M14406N03540k205553k924511m97481Q45634
4755A1498270l76754m43225J965029K823203M4712k821924l008682k517202k871256
$$ plain form
4746 4292171 2319311 3056154 5018382 5690644 6276587 9294795 12656072 11652496 6551134
4737 6551134 2806521 3256502 5024857 5000944 3858769 3447139 4124961 5890881 8695884
4728 8695884 10624268 9093842 4967033 2500897 4130879 7740437 9708609 8362386
4720 8362386 4315185 -61625 -1577352 653505 3260020 2642580 363268 972951 4814094
4711 4814094 7179766 5199899 1581985 342053 2175611 5148361 6845768 4864472
4703 4864472 -1631079 -9560458 -13825132 -12540753 -8003419 -2394998 3992167 9734650
4695 9734650 11620232 8836093 4665178 2326660 1905604 2574084 4385519 6057247 4509762
4686 4509762 -684008 -5121383 -4672377 -716321 2297766 2689508 2258272 2497920 2812178
$$ packed form
4746D292171j972860P36843J962228O72262N85943L018208L361277j003576n101362
4737F551134l744613M49981J768355k3913j142175m11630O77822J765920K805003
4728H695884J928384j530426m126809k466136J629982L609558J968172j346223
4720H362386m047201m376810j515727K230857K606515o17440k279312O09683L841143
4711D814094K365672j979867l617914j239932J833558K972750J697407j981296
4703D864472o495551p929379m264674J284379M537334N608421O387165N742483
4695I734650J885582k784139m170915k338518m21056O68480J811435J671728j547485
4686D509762n193770m437375M49006L956056L014087L91742m31236K39648L14258
$$ plain form
4677 2812178 2053602 -94819 -3045955 -5407374 -5591646 -3255258 203561 2894931 3655504
4668 3655504 2412038 630313 890718 4040048 7099075 6449872 2989182 1223467 3024453
4659 3024453 5605976 6464050 6643233 7393894 7096872 4212259 737071 -171327 1624454
4650 1624454 3897657 5485292 6696883 7332949 6543573 4322905 1774967 273629 909337
4641 909337 3698280 6894408 8598226 9457332 11779531 15430171 17155720 15085399 11259383
4632 11259383 8153873 5434111 2314943 599484 2423439 6480501 9232207 9079315
4624 9079315 7322425 5893100 5916355 7562923 9674239 10407785 9479072 8564281 8536849
4615 8536849 8231944 7243739 7452957 9558362 10400510 6740581 181265 -4736668 -6307116
$$ packed form
4677B812178p58576k148421k951136k361419j84272K336388L458819K691370P60573
4668C655504j243466j781725K60405L149330L059027o49203l460690j765715J800986
4659C024453K581523Q58074J79183P50661k97022k884613l475188r08398J795781
4650A624454K273203J587635J211591O36066p89376k220668k547938j501338O35708
4641I09337K788943L196128J703818Q59106K322199L650640J725549k070321l826016
4632A1259383l105510k719762l119168j715459J823955M057062K751706j52892
4624I079315j756890j429325K3255J646568K111316P33546r28713r14791k7432
4615H536849l04905r88205K09218K105405Q42148l659929o559316m917933j570448
$$ plain form
4606 -6307116 -6497534 -6754001 -6310541 -4953777 -4548439 -6543975 -9525868 -10423484 -7743084
4597 -7743084 -3201202 -88011 281642 139778 2233230 5649208 6705780 4131944 820023
4588 820023 -327685 405208 1673332 3471696 5575605 6218518 4469945 1746634 -724616
4579 -724616 -3295706 -5171442 -3957787 -424410 377313 -3597372 -7036839 -5002653 -1237665
4570 -1237665 -2555339 -7649134 -8770622 -3582927 2015181 3387286 2586296 2799168 3724127
4561 3724127 4762495 7024637 9223491 6779887 -1371794 -9318602 -11155683 -7845117
4553 -7845117 -3647588 545784 5960290 10955978 12345203 10451685 8600228 8175458
4545 8175458 7760346 6609590 5417026 3774601 329984 -4054251 -6350438 -5480491 -3807299
$$ packed form
4606f307116j90418k56467M43460J356764M05338j995536k981893q97616K680400
4597g743084M541882L113191L69653j41864K093452L415978J056572k573836l311921
4588H20023j147708P32893J268124J798364K103909O42913j748573k723311k471250
4579g24616k571090j875736J213655L533377Q01723l974685l439467K034186L764988
4570a237665j317674n093795j121488N187695N598108J372105q00990K12872R24959
4561C724127J038368K262142K198854k443604q151681p946808j837081L310566
4553g845117M197529M193372N414506M995688J389225j893518j851457m24770
4545H175458m15112j150756j192564j642425l444617m384235k296187Q69947J673192
$$ plain form
4536 -3807299 -3326669 -2643189 456775 4929296 7213526 5804174 3231372 2825732 4677292
4527 4677292 5984059 5013430 3292738 3347618 5342970 6990733 6252560 3152288 -709397
4518 -709397 -3414061 -3719743 -1807487 915626 3240014 4945006 5769533 4816577 2193512
4509 2193512 48444 172007 1443006 1653045 998935 1232631 1888486 459677 -3336823
4500 -3336823 -6457339 -6655904 -5162814 -4098872 -3561878 -2645259 -1219274 853388 4376404
4491 4376404 8990635 12309617 12682031 11532428 11241388 11874028 11831597 10779599 9885555
4482 9885555 9558886 8884744 7461670 6278310 6201531 6544870 5898385 4049538 2261983
4473 2261983 1290789 -95201 -3269644 -6612845 -6427002 -2025223 2449605 3447204 3024563
$$ packed form
4536c807299M80630O83480L099964M472521K284230j409352k572802m05640J851560
4527D677292J306767r70629j720692N4880J995352J647763p38173l100272l861685
4518g09397k704664l05682J912256K723113K324388J704992Q24527r52956k623065
4509B193512k145068J23563J270999K10039o54110K33696O55855j428809l796500
4500c336823l120516j98565J493090J063942N36994R16619J425985K072662L523016
4491D376404M614231L318982L72414j149603k91040O32640m2431j051998q94044
4482I885555l26669o74142j423074j183360p6779L43339o46485j848847j787555
4473B261983r71194j385990l174443l343201J85843M401779M474828R97599m22641
$$ plain form
4464 3024563 5104398 8437727 7994128 3248855 97819 2971233 9190888 13347659
4456 13347659 13798516 12416451 11070593 11110773 13608111 17180752 17905743 14246971 9823733
4447 9823733 8384762 8505339 6782226 3906986 3097953 4020213 3252751 464483 -775363
4438 -775363 977236 2697556 2048892 961262 1914482 3798567 4050106 2690367 1679696
4429 1679696 1759095 2264731 2941990 3624536 2845085 -785933 -5778199 -8471786 -7212655
4420 -7212655 -4267849 -2702193 -2622949 -1842968 513827 2826693 3489205 2960324 2546206
4411 2546206 2485746 2429669 2696772 3449658 3462613 1715971 -222216 286929 3017552 4917879
4401 4917879 4551904 3853331 4369973 4468323 2209909 -1209326 -3322363 -4097576 -5177082
$$ packed form
4464C024563K079835L333329m43599m745273l151036K873414O219655M156771
4456A3347659M50857j382065j345858M0180K497338L572641P24991l658772m423238
4447I823733j438971J20577j723113k875240q09033R22260p67462k788268j239846
4438g75363J752599J720320o48664j087630R53220J884085K51539j359739j010671
4429A679696P9399N05636O77259O82546p79451l631018m992266k693587J259131
4420g212655K944806J565656P9244P79981K356795K312866O62512n28881m14118
4411B546206o0460n6077K67103P52886J2955j746642j938187N09145K730623J900327
4401D917879l65975o98573N16642R8350k258414l419235k113037p75213j079506
$$ plain form
4392 -5177082 -6457017 -6138974 -3845332 -1256269 471432 1905364 3602708 4776824
4384 4776824 4271447 1989852 -868717 -2539517 -2046337 -351788 616351 701807 1968543
4375 1968543 5232354 7666511 5945935 896115 -3278669 -4073180 -2792530 -1614190
4367 -1614190 -819710 329801 1659162 2117469 1053775 -1080826 -2936359 -3235336 -2074446
4358 -2074446 -986299 -1138471 -2028009 -2725590 -3604524 -5545906 -7928981 -8899033 -7680693
4349 -7680693 -5582277 -4609292 -5642888 -7657653 -8231903 -5559132 -667701 3271849 4715267
4340 4715267 5615338 8232699 11418374 12170695 10179355 8394019 8880875 10212771 9842591
4331 9842591 7671003 6027636 6470811 7583648 6579888 3042816 28010 411607 2988850
$$ packed form
4392e177082j279935L18043K293642K589063J727701J433932J697344J174116
4384D776824n05377k281595k858569j670800M93180J694549R68139Q5456J266736
4375A968543L263811K434157j720576n049820m174784p94511J280650J178340
4367a614190P94480J149511J329361M58307j063694k134601j855533k98977J160890
4358b074446J088147j52172q89538o97581q78934j941382k383075r70052J218340
4349g680693K098416R72985j033596k014765n74250K672771M891431L939550J443418
4340D715267R00071K617361L185675P52321j991340j785336M86856J331896l70180
4331I842591k171588j643367M43175J112837j003760l537072l014806L83597K577243
$$ plain form
4322 2988850 4097794 2774015 1849039 3702189 7672217 12362797 17315839 20906378
4314 20906378 19926871 13853433 6959951 3503700 3026639 2915720 2914720 3824229 4217091
4305 4217091 2431644 106647 -210561 462451 -578247 -2745618 -3355406 -2737727 -3546794
4296 -3546794 -5510367 -5641345 -3755663 -3034707 -4364335 -4575448 -1658759 2062886 3468965
4287 3468965 2263907 -63588 -2029023 -2062165 439674 3142754 2700376 -612503 -2946250
4278 -2946250 -2109589 133277 1525272 2010416 2179352 1917679 1535178 1783641 2139740
4269 2139740 1365182 -24752 -197444 1222804 3106441 4718133 4986465 1475708 -6041359
4260 -6041359 -12412157 -12232391 -7286584 -3971930 -4182572 -4260454 -2288639 -96903 1899272
$$ packed form
4322B988850J108944j323779r24976J853150L970028M690580M953042L590539
4314B0906378r79507o073438o893482l456251m77061j10919j000R09509L92862
4305D217091j785447k324997l17208O73012j040698k167371o09788O17679q09067
4296c546794j963573j30978J885682P20956j329628k11113K916689L721645J406079
4287C468965j205058k327495j965435l3142K501839K703080m42378l312879k333747
4278b946250Q36661K242866J391995M85144J68936k61673l82501K48463L56099
4269B139740p74558j389934j72692J420248J883637J611692K68332l510757p517067
4260f041359o370798J79766M945807L314654k10642p7882J971815K191736J996175
$$ plain form
4251 1899272 5044102 7101789 3781705 -3075694 -6120921 -3240195 -399648 -1468721
4243 -1468721 -2938658 -2008983 -2044691 -5402084 -7876995 -5492047 -818580 2271237 4309341
4234 4309341 6121849 5240195 1480331 54633 3801013 8092829 8576500 7744705 8480537
4225 8480537 7918931 4007760 1387225 3753682 6838267 6131582 4818380 6288728 5986929
4216 5986929 -190556 -6196012 -4628260 793062 1992689 117756 1474059 5245978
4208 5245978 6572793 6820559 9342552 10322652 5664862 944803 1833726 1940604 -5318453
4199 -5318453 -11646754 -8592566 -7425679 -21409256 -38749621 -44981524 -65451126 -141123297
4191 -141123297 -252250595 -311675729 -262729747 -151563230 -69198346 -46659427 -45046560
$$ packed form
4251A899272L144830K057687l320084o857399l045227K880726K840547j069073
4243a468721j469937R29675l5708l357393k474911K384948M673467L089817K038104
4234D309341J812508q81654l759864j425698L746380M291816M83671q31795P35832
4225H480537n61606l911171k620535K366457L084585p06685j313202J470348l01799
4216E986929o177485o005456J567752N421322J199627j874933J356303L771919
4208E245978J326815K47766K521993R80100m657790m720059Q88923J06878p259057
4199e318453o328301L054188J166887j3983577j7340365o231903k0469602p5672171
4191a41123297j11127298n9425134M8945982J11166517Q2364884K2538919J612867
$$ plain form
4184 -45046560 -30707398 -13224176 -9376013 -12148446 -9690907 -6297683 -8579944 -10301555
4176 -10301555 -4977331 1046661 108835 -3879166 -4330527 -3570628 -6017511 -8617874 -7214041
4167 -7214041 -5148615 -7000052 -9705221 -7707792 -2164618 1734256 2510547 1710743 -568595
4158 -568595 -4226441 -6786135 -6944780 -6934171 -7641924 -5748933 164594 5239195 4873858
4149 4873858 1578032 247632 358916 -1504164 -4331812 -4081598 -924600 676275 -1000632
4140 -1000632 -2563216 -812883 3064098 5499730 4483362 934391 -2368374 -2952237
4132 -2952237 -552479 3193048 6846086 9842802 11263823 10031020 6806253 3661327
4124 3661327 1458702 -238442 -662231 1527912 4600172 4632655 1514707 112341 3135637
$$ packed form
4184d5046560J4339162J7483222L848163k772433K457539L393224k282261j721611
4176a0301555N324224O023992r37826l988001m51361P59899k446883k600363J403833
4167g214041K065426j851437k705169J997429N543174L898874P76291p99804k279338
4158e68595l657846k559694j58645J0609p07753J892991N913527N074601l65337
4149D873858l295826j330400J11284j863080k827648K50214L156998J600875j676907
4140a000632j562584J750333L876981K435632j016368l548971l302765n83863
4132b952237K399758L745527L653038K996716J421021j232803l224767l144926
4124C661327k202625j697144m23789K190143L072260L2483l117948j402366L023296
$$ plain form
4115 3135637 6661571 5978533 2607914 1521437 3699807 5788566 5906659 5516565 5636427
4106 5636427 4942061 2507039 -210111 -1303228 -834200 -392166 -1025095 -2227540 -2813262
4097 -2813262 -2534165 -2337173 -2586600 -2032674 -53578 1051978 -1313839 -5377050 -6321393
4088 -6321393 -3100152 -411855 -2055905 -5559628 -6158559 -3577361 -1512524 -1893017 -3040213
4079 -3040213 -3027972 -1975928 -795948 298683 1629281 3507105 5839950 7734115 8222265
4070 8222265 7952492 8854959 11192944 12471671 10684678 7262913 5131202 4980781 5241663
4061 5241663 4799585 3800675 2280780 -131290 -3099352 -5467898 -6501174 -6670319 -7226168
4052 -7226168 -8984058 -10984376 -10693720 -6802734 -1572133 1386741 1541719 1394391 2071938
$$ packed form
4115C135637L525934o83038l370619j086477K178370K088759J18093l90094J19862
4106E636427o94366k435022k717150j093117M69028M42034o32929j202445n85722
4097b813262K79097J96992k49427N53926J979096J105556k365817m063211r44343
4088f321393L221241K688297j644050l503723n98931K581198K064837l80493j147196
4079c040213J2241J052044J179980J094631J330598J877824K332845J894165M88150
4070H222265k69773R02467K337985J278727j786993l421765k131711j50421K60882
4061E241663m42078r98910j519895k412070k968062k368546j033276j69145n55849
4052g226168j757890k000318K90656L890986N230601K958874J54978j47328O77547
$$ plain form
4043 2071938 2104885 1298532 2115773 5230674 7063551 4563865 -204292 -3267566 -4188034
4034 -4188034 -4974252 -5579027 -4356628 -1882916 -556675 -834556 -1140772 -1203483 -2340211
4025 -2340211 -4521597 -6100505 -6553652 -6868011 -7259628 -7163631 -7390271 -9371258 -11998894
4016 -11998894 -12115704 -8814009 -4659445 -1900761 14982 2185512 3947796 4277971
4008 4277971 3712159 3454124 3812759 4578611 5787078 7112441 7442949 5948442 3011474
3999 3011474 -248846 -2666479 -3199253 -1540986 1082107 2679756 2459219 1373150 662942
3990 662942 625245 809967 622497 -322417 -1851642 -3378715 -4774036 -6461605 -8158706
3981 -8158706 -8610865 -7462258 -6080388 -5263053 -3621725 -25851 3818780 5521173 5458825
$$ packed form
4043B071938L2947q06353Q17241L114901J832877k499686m768157l063274r20468
4034d188034p86218o04775J222399K473712J326241k77881l06216o2711j136728
4025b340211k181386j578908m53147l14359l91617R5997k26640j980987k627636
4016a1998894j16810L301695M154564K758684J915743K170530J762284L30175
4008D277971n65812k58035L58635P65852J208467J325363L30508j494507k936968
3999C011474l260320k417633n32774J658267K623093J597649k20537j086069p10208
3990F62942l7697J84722j87470r44914j529225j527073j395321j687569j697101
3981h158706m52159J148607J381870Q17335J641328L595874L844631J702393o2348
$$ plain form
3972 5458825 5410670 4840351 1786134 -3018992 -6301587 -6598949 -5284466 -3191980 150627
3963 150627 3309466 2935485 -1302408 -5080377 -4822862 -2015404 -47067 582869 1436724
3954 1436724 2850146 4278589 6173304 8694816 9908849 8066736 4681977 2629114
3946 2629114 2052374 1065554 -59162 1255090 5403510 8922635 8528540 4783552 552780
3937 552780 -2462826 -4291063 -5173963 -5184103 -4816264 -4644032 -4559362 -4218941 -3912816 -4011725
3927 -4011725 -3796914 -2098446 647311 2216720 1307208 -431558 -228508 2349087 4974084
3918 4974084 5477409 3951809 1933521 962353 2270151 6122593 10429823 11521632 7802473
3909 7802473 1706422 -3176187 -5741179 -6780708 -6353327 -4141177 -1537204 -604390 -953883
$$ packed form
3972E458825m8155n70319l054217m805126l282595k97362J314483K092486L342607
3963A50627L158839l73981m237893l777969K57515K807458J968337O29936Q53855
3954A436724J413422J428443J894715K521512J214033j842113l384759k052863
3946B629114n76740r86820j124716J314252M148420L519125l94095l744988m230772
3937E52780l015606j828237q82900j0140L67839J72232Q4670L40421L06125r8909
3927d011725K14811J698468K745757J569409r09512j738766K03050K577595K624997
3918D974084N03325j525600k018288r71168J307798L852442M307230J091809l719159
3909G802473o096051m882609k564992j039529M27381K212150K603973R32814l49493
$$ plain form
3900 -953883 -62412 3040935 6616164 9110063 10982406 12904187 14112717 13551197 11182049
3891 11182049 7485566 3082715 -692206 -2520987 -2957074 -3803877 -5062833 -4515157 -1277167
3882 -1277167 2301433 3732998 3684968 4530591 6855684 8988590 9134662 6730928 2572775
3873 2572775 -1269597 -2606553 -1418302 -269384 -1441160 -4361083 -6684712 -7076665
3865 -7076665 -6110187 -5240751 -5582335 -6885990 -7359927 -5635594 -3095112 -2538963 -4174024
3856 -4174024 -5177535 -4126223 -3221370 -4365645 -5548251 -3751380 357792 3526552
3848 3526552 4449369 4191609 2921806 -375663 -4706013 -6689656 -4642135 -1092151 48486
3839 48486 -2295431 -5900124 -8177879 -8639835 -8614318 -9165650 -9877119 -9964326 -9779044 -9849752
$$ packed form
3900i53883Q91471L103347L575229K493899J872343J921781J208530n61520k369148
3891A1182049l696483m402851l774921j828781m36087q46803j258956N47676L237990
3882a277167L578600J431565m8030Q45623K325093K132906J46072k403734m158153
3873B572775l842372j336956J188251J148918j171776k919923k323629l91953
3865g076665R66478Q69436l41584j303655m73937J724333K540482N56149j635061
3856d174024j003511J051312R04853j144275j182606J796871M109172L168760
3848C526552R22817k57760j269803l297469m330350j983643K047521L549984J140637
3839D8486k343917l604693k277755m61956K5517n51332p11469q7207J85282p0708
$$ plain form
3829 -9849752 -8877183 -4996209 437556 2956092 511033 -3321842 -3883575 -1387192 279283
3820 279283 -613477 -1954083 -1424318 897163 3571922 5265560 5099315 3260048 1137761
3811 1137761 -468444 -2475349 -5273811 -6728531 -4810156 -1005185 1844666 4104482
3803 4104482 8166652 13155168 14945720 12159283 8309088 6662013 6448081 5907179 5765665
3794 5765665 7163909 8645256 7972310 5335803 2433042 -216985 -2778115 -4178589
3786 -4178589 -3142615 -535808 1399746 1840785 1750836 1810891 1600608 773394 -226419
3777 -226419 -684459 -150081 1182973 2000717 560416 -3131525 -6526863 -7109698 -5261077
3768 -5261077 -3348197 -2401524 -1166645 1507620 4735045 6626325 6418419 4927579 3366886
$$ packed form
3829i849752R72569L880974N433765K518536k445059l832875n61733K496383J666475
3820B79283q92760j340606N29765K321481K674759J693638j66245j839267k122287
3811A137761j606205k006905k798462j454720J918375L804971K849851K259816
3803D104482M062170M988516J790552k786437l850195j647075k13932n40902j41514
3794E765665J398244J481347o72946k636507k902761k650027k561130j400474
3786d178589J035974K606807J935554M41039q9949O0055k10283q27214r99813
3777b26419m58040N34378J333054Q17744j440301l691941l395338n82835J848621
3768e261077J912880R46673J234879K674265L227425J891280k07906j490840j560693
$$ plain form
3759 3366886 2434327 2427552 3333500 4225442 3307653 -107859 -3748372 -4207759 -1277658
3750 -1277658 1336294 853054 -1010836 -1375080 -1071080 -2801922 -5650583 -5800491 -2971307
3741 -2971307 -1635191 -4255162 -7387293 -7027678 -4345650 -2847881 -2634942 -1358642 900521
3732 900521 1802105 1041861 690858 1280110 941948 -1065711 -2938813 -3299433 -3198473
3723 -3198473 -4148516 -6002213 -7665955 -8442176 -8057492 -6772067 -5893483 -6661215 -8115719
3714 -8115719 -7596969 -4042654 445729 2814460 1669940 -2382744 -7186666 -9370541
3706 -9370541 -6545993 -732941 2086071 -2031202 -10037001 -14712581 -12267072 -5701530
3698 -5701530 -666756 472120 -178425 404348 2802051 5425007 7032214 7889609 8502891
$$ packed form
3759C366886r32559o775R05948Q91942r17789l415512l640513m59387K930101
3750a277658K613952m83240j863890l64244L04000j730842k848661j49908K829184
3741b971307J336116k619971l132131L59615K682028J497769K12939J276300K259163
3732I00521R01584p60244l51003N89252l38162k007659j873102l60620J00960
3723c198473r50043j853697j663742p76221L84684J285425Q78584p67732j454504
3714h115719N18750L554315M488383K368731j144520m052684m803922k183875
3706i370541K824548N813052K819012m117273q005799m675580K445509O565542
3698e701530N034774J138876o50545N82773K397703K622956J607207Q57395O13282
$$ plain form
3689 8502891 8435676 7163716 5197798 3148573 342606 -3905125 -7798714 -7990882 -3824272
3680 -3824272 1161588 3298556 2900846 2581343 2714855 1214826 -2192818 -4183475 -1734614
3671 -1734614 3753356 7900957 8139570 5514699 2226541 -665475 -2696768 -3011783 -1362243
3662 -1362243 719717 1198626 -148746 -1738201 -2314534 -1908228 -730094 1348851 3678722
3653 3678722 4682390 3959731 3432203 4891962 7064505 6851985 3449350 -464663 -2098380
3644 -2098380 -1617183 -955431 -781171 -75356 1737966 3710852 4651433 4433240 3600910
3635 3600910 2599764 2167311 3715922 7923012 12893738 15147066 13254033 9552559
3627 9552559 7182381 6188030 4145132 442671 -2019531 -325173 4482142 8120263
$$ packed form
3689H502891o7215j271960j965918k049225k805967m247731l893589j92168M166610
3680c824272M985860K136968l97710l19503J33512j500029l407644j990657K448861
3671a734614N487970M147601K38613k624871l288158k892016k031293l15015J649540
3662a362243K081960M78909j347372j589455n76333M06306J178134K078945K329871
3653C678722J003668p22659n27528J459759K172543k12520l402635l914013j633717
3644b098380M81197O61752J74260P05815J813322J972886R40581k18193q32330
3635C600910j001146m32453J548611M207090M970726K253328j893033l701474
3627I552559k370178r94351k042898l702461k462202J694358M807315L638121
$$ plain form
3619 8120263 7348633 2809840 -1978531 -3838680 -2477396 -314187 407007 202478 1173703
3610 1173703 3383069 4241840 2449558 709496 2555367 7508205 11581858 12149971 10093669
3601 10093669 7227057 4123000 1282083 206590 1626132 3807072 4193805 2318254
3593 2318254 64519 -644813 323194 1528473 1433473 -195337 -2159886 -3322337 -3918675
3584 -3918675 -4540942 -4202353 -1206759 3586004 6384993 4857906 1435091 283284 1939492
3575 1939492 3265437 2418432 1293080 2349294 5206909 7765652 9197164 10153235 10805601
3566 10805601 10333827 8232939 4946912 1186255 -2547399 -5884256 -8839783 -11923211
3558 -11923211 -15084982 -16846222 -15743712 -12674780 -10406228 -10315878 -10907013 -10194308 -8255831
$$ packed form
3619H120263p71630m538793m788371j860149J361284K163209P21194k04529R71225
3610A173703K209366Q58771j792282j740062J845871M952838M073653N68113k056302
3601A0093669k866612l104057k840917j075493J419542K180940L86733j875551
3593B318254k253735p09332R68007J205279r5000j628810j964549j162451n96338
3584c918675o22267L38589K995594M792763K798989j527087l422815j151807J656208
3575A939492J325945q47005j125352J056214K857615K558743J431512R56071O52366
3566A0805601m71774k100888l286027l760657l733654l336857k955527l083428
3558a1923211l161771j761240J102510L068932K268552R0350n91135P12705J938477
$$ plain form
3549 -8255831 -6424868 -5162290 -4189697 -3957994 -5304236 -7815780 -9924145 -10645169 -10120557
3540 -10120557 -8593172 -6144393 -3452518 -1447454 17516 1877373 3952887 4689471
3532 4689471 3393908 1571774 1214354 2478316 3718014 3357254 1417121 -399147 -238878
3523 -238878 1666125 2748317 1109307 -1901791 -3675998 -4047359 -4505706 -4274414 -850341
3514 -850341 4755669 7218349 3535148 -2722767 -6484802 -7572200 -8626080 -9285361 -7056903
3505 -7056903 -2856721 -872076 -2460443 -4088599 -2385037 1809905 5533336 7298829
3497 7298829 7507383 7293328 7834174 9157040 9314980 6608075 2644147 857114 1809724
3488 1809724 2592006 1291246 -840962 -2485969 -4427523 -7080279 -8528021 -7022808
$$ packed form
3549h255831J830963J262578R72593K31703j346242k511544k108365p21024N24612
3540a0120557J527385K448779K691875K005064J464970J859857K075514P36584
3532D689471j295563j822134l57420J263962J239698l60760j940133j816268J60269
3523b38878J905003J082192j639010l011098j774207l71361m58347K31292L424073
3514h50341N606010K462680l683201o257915l762035j087398j053880o59281K228458
3505g056903M200182J984645j588367j628156J703562M194942L723431J765493
3497G298829K08554k14055N40846J322866J57940k706905l963928j787033R52610
3488A809724P82282j300760k132208j645007j941554k652756j447742J505213
$$ plain form
3480 -7022808 -3594790 -634891 409727 -1061293 -4788331 -8157997 -7422685 -2489839
3472 -2489839 1884071 1986797 -39747 84899 2466039 3776305 2792933 1509548 1250417
3463 1250417 1058941 124118 -937629 -1591179 -2015350 -2088376 -1725017 -2179008 -4907432
3454 -4907432 -9010355 -11735131 -11634289 -9430030 -5953774 -1522546 2457419 3734577
3446 3734577 1933308 -814402 -2694329 -3912058 -4866714 -4603274 -2429397 358938 1908118
3437 1908118 2223623 2924500 4970156 7534610 8987661 8488177 6701837 5066916 4200265
3428 4200265 3339683 1853509 732742 1496948 3893731 5979282 6514091 6027777 5419029
3419 5419029 4931292 4906688 6060622 8085467 9047311 7318096 3685210 706908 96699
$$ packed form
3480g022808L428018K959899J044618j471020l727038l369666P35312M932846
3472b489839M373910J02726k026544J24646K381140J310266r83372j283385k59131
3463A250417j91476r34823j061747o53550m24171p3026L63359m53991k728424
3454d907432m102923k724776J00842K204259L476256M431228L979965J277158
3446C734577j801269k747710j879927j217729r54656K63440K173877K788335J549180
3437A908118L15505P00877K045656K564454J453051m99484j786340j634921q66651
3428D200265q60582j486174j120767P64206K396783K085551N34809m86314o08748
3419E419029m87737k4604J153934K024845R61844j729215l632886k978302o10209
$$ plain form
3410 96699 1162158 1684520 167964 -2562440 -3975869 -2320436 1640158 5705782 8599526
3401 8599526 10428088 11107111 9652285 5594122 389206 -3250384 -3459809 -713992 2582575
3392 2582575 4219882 4177608 4192869 5183046 5882066 4556875 1130540 -3261387 -7751816
3383 -7751816 -11418885 -12484218 -9901535 -5569345 -3002633 -3450197 -4856206 -4969754 -3854188
3374 -3854188 -2635046 -1245738 1276278 4778304 7379827 7202676 4512995 1708117
3366 1708117 712238 841312 477204 503917 3613410 9362422 12845671 10606324 5500490
3357 5500490 2664245 2664020 2403751 1204586 1219546 2324908 1772159 -420536 -835650 1038968
3347 1038968 907695 -3324593 -7280177 -6483567 -3171555 -2355225 -3945376 -3739676 -694218
$$ packed form
3410I6699J065459N22362j516556k730404j413429J655433L960594M065624K893744
3401H599526J828562O79023j454826m058163n204916l639590k09425K745817L296567
3392B582575J637307m2274J5261R90177O99020j325191l426335m391927m490429
3383g751816l667069j065333K582683M332190K566712m47564j406009j13548J115566
3374c854188J219142J389308K522016L502026K601523j77151k689681k804878
3366A708117r95879J29074l64108K6713L109493N749012L483249k239347n105834
3357E500490k836245k25k60269j199165J4960J105362n52749k192695m15114J874618
3347A038968j31273m232288l955584P96610L312012Q16330j590151K05700L045458
$$ plain form
3338 -694218 1778681 1575466 577359 787936 1330396 783072 116440 1518603 5241310
3329 5241310 8794439 9288858 6430208 2920934 1246582 529818 -1737444 -5084725 -6054896
3320 -6054896 -3628871 -1380960 -2264329 -4352767 -4513232 -3447061 -3590098 -4381428 -3615961
3311 -3615961 -1686678 -314560 1291182 4297172 5640755 1251543 -6277805 -9279346
3303 -9279346 -5553663 -1662908 -3335931 -7788338 -9115216 -7042297 -5777594 -6842680
3295 -6842680 -7745074 -6729461 -4867408 -3494167 -2614067 -2168687 -2534179 -3129895 -2180584
3286 -2180584 1240039 5565303 7765206 6236221 2705759 689363 1526740 2916675
3278 2916675 2511865 1457512 1937231 2540128 -48471 -4905640 -7021595 -4867793 -3179223
$$ packed form
3338f94218K472899k03215r98107K10577N42460n47324o66632J402163L722707
3329E241310L553129M94419k858650l509274j674352p16764k267262l347281r70171
3320f054896K426025K247911q83369k088438j60465J066171j43037p91330P65467
3311c615961J929283J372118J605742L005990J343583m389212p529348l001541
3303i279346L725683L890755j673023m452407j326878K072919J264703j065086
3295f842680r02394J015613J862053J373241Q80100M45380l65492n95716R49311
3286b180584L420623M325264K199903j528985l530462k016396Q37377J389935
3278B916675m04810j054353M79719O02897k588599m857169k115955K153802J688570
$$ plain form
3269 -3179223 -5557350 -8573156 -7199513 -2772902 -567027 -1349661 -721924 3424228 7762709
3260 7762709 8864644 7679537 6996666 7410224 7726234 7257742 5811493 2852130 -1445604
3251 -1445604 -5031499 -5486517 -2749374 520444 1522969 -57054 -2177945 -3039273 -2989984
3242 -2989984 -3372557 -4205913 -4452691 -4344181 -5425048 -7842970 -9751874 -10275664 -10645692
3233 -10645692 -11009606 -8927084 -3526795 1349921 1566466 -1452251 -2978344 -1902070
3225 -1902070 -1324770 -2807859 -4474844 -5258081 -6679218 -9054814 -9773638 -7306523 -3845557
3216 -3845557 -1993764 -1541821 -1361853 -1664257 -2202257 -1057585 2067483 3909906 2298804
3207 2298804 669295 3933622 10875062 14918449 12794649 8602814 7770477 9851147
$$ packed form
3269c179223k378127l015806J373643M426611K205875p82634O27737M146152M338481
3260G762709J101935j185107o82871M13558L16010m68492j446249k959363m297734
3251a445604l585895m55018K737143L269818J002525j580023k120891q61328M9289
3242b989984l82573q33356k46778J08510j080867k417922j908904n23790l70028
3233a0645692l63914K082522N400289M876716K16545l018717j526093J076274
3225a902070N77300j483089j666985p83237j421137k375596p18824K467115L460966
3216c845557J851793M51943J79968l02404n38000J144672L125068J842423j611102
3207B298804j629509L264327O941440M043387k123800m191835q32337K080670
$$ plain form
3199 9851147 9608341 3894153 -4642023 -10517738 -10808126 -7345911 -4242120 -3831808 -5201799
3190 -5201799 -6104921 -5247662 -2563487 1379176 5184778 6737888 4873988 760213 -3229483
3181 -3229483 -5618276 -6036080 -4196226 -296796 3717292 5078598 3158585 501452
3173 501452 57010 1893283 3436592 2794896 992509 411035 1472261 1958283 80493
3164 80493 -2806744 -3785859 -2100055 331444 1986830 3326963 4773681 5220710 3970319
3155 3970319 2566658 2898428 4419526 4975635 3811444 2216038 1601404 2324040 4033540
3146 4033540 5855249 6481231 5232070 2838136 477718 -1203126 -1376069 1173545 5912576
3137 5912576 9544680 9333705 6629311 4880778 4941772 4866595 3670149 2223965 596123
$$ packed form
3199I851147k42806n714188q536176n875715k90388L462215L103791M10312j369991
3190e201799r03122Q57259K684175L942663L805602J553110j863900m113775l989696
3181c229483k388793m17804J839854L899430M014088J361306j920013k657133
3173E01452m44442J836273J543309o41696j802387n81474J061226M86022j877790
3164H0493k887237r79115J685804K431499J655386J340133J446718M47029j250391
3155C970319j403661L31770J521098N56109j164191j595406o14634P22636J709500
3146D033540J821709O25982j249161k393934k360418j680844j72943K549614M739031
3137E912576L632104k10975k704394j748533O0994p5177j196446j446184j627842
$$ plain form
3128 596123 -2129779 -4912343 -5026848 -2352291 -159934 -173542 -82211 2019677 3959287
3119 3959287 3165110 1313445 1641546 3406817 3034601 40489 -2135935 -1386392 501073
3110 501073 1275598 1054113 441734 -1395680 -4847811 -7969979 -8526245 -6766135 -4433247
3101 -4433247 -2040929 904402 3579265 4042494 2164111 456400 827794 1710474 -243
3092 -243 -4537348 -8468156 -8718313 -5961472 -3058155 -1384238 -343596 248235 -442778
3083 -442778 -2268881 -3583393 -3501335 -2819605 -1671886 1663998 7724249 13169179 13579725
3074 13579725 8380735 1014561 -5096383 -8477928 -8122053 -3338293 3915126 9065984
3066 9065984 9087988 5438346 1712354 -370030 -1384445 -1846513 -1343229 111806 1303053
$$ packed form
3128E96123k725902k782564j14505K674557K192357j3608R1331K101888J939610
3119C959287p94177j851665L28101J765271l72216k994112k176424P49543J887465
3110E01073P74525k21485o12379j837414l452131l122168n56266J760110K332888
3101d433247K392318K945331K674863M63229j878383j707711L71394Q82680j710717
3092b43m537105l930808k50157K756841K903317J673917J040642N91831o91013
3083d42778j826103j314512Q2058O81730J147719L335884O060251N444930M10546
3074A3579725n198990p366174o110944l381545L55875M783760P253419N150858
3066I065984K2004l649642l725992k082384j014415m62068N03284J455035J191247
$$ plain form
3057 1303053 947008 -831786 -2437853 -2291594 -580905 599926 -633477 -3751851 -6391279
3048 -6391279 -7137153 -6839950 -6871929 -6964329 -5447637 -1305544 4331451 8534015 8641434
3039 8641434 4755573 169974 -1527588 133712 2707340 4098081 4275596 3840020 2812147
3030 2812147 1568592 1249569 2045440 2437106 1498584 858096 2844493 7354428 11889525
3021 11889525 14155865 13515708 10676917 7406493 5919707 6808422 7671187 5320588 -448344
3012 -448344 -6366266 -9001393 -7671772 -4317408 -1605173 -993369 -1491821 -403006 3624421
3003 3624421 8506145 10933594 10352031 9037376 8266502 6617551 2957619 -825579 -1764490
2994 -1764490 499056 3566260 5404320 6232272 7377120 9534497 12541022 15864706
$$ packed form
3057A303053l56045j778794j606067J46259J710689J180831j233403l118374k639428
3048f391279p45874K97203l1979r2400J516692M142093N636995M202564J07419
3039H641434l885861m585599j697562J661300K573628J390741J77515m35576j027873
3030B812147j243555l19023P95871L91666r38522o40488J986397M509935M535097
3021A1889525K266340o40157k838791l270424j486786Q88715Q62765k350599n768932
3012d48344n917922k635127J329621L354364K712235O11804m98452J088815M027427
3003C624421M881724K427449n81563j314655p70874j648951l659932l783198r38911
2994a764490K263546L067204J838060Q27952J144848K157377L006525L323684
$$ plain form
2986 15864706 18460073 18595739 15078827 9214378 4649173 4015970 5977532 7012192
2978 7012192 6110262 5687434 7153410 8127299 6177223 3247609 3141546 5637895 6765467
2969 6765467 4859974 2593971 2206304 2428234 1746647 1186183 1415722 235725 -3772021
2960 -3772021 -7449697 -6751817 -2976257 -1571598 -5110081 -10659683 -13965718 -13229165 -8844205
2951 -8844205 -2577483 2579966 4606332 4981970 6431197 8148131 6711738 2198177
2943 2198177 -811412 20816 1171467 -859492 -3757091 -3270588 -66992 1658078 542480
2934 542480 -1564767 -4362211 -9093689 -13826526 -14033759 -9414185 -5674203 -7219267 -11679720
2925 -11679720 -14217370 -13920770 -12717131 -10709096 -6636289 -1576766 1695133 2635574
$$ packed form
2986A5864706K595367J35666l516912n864449m565205o33203J961562J034660
2978G012192r01930m22828J465976R73889j950076k929614j06063K496349J127572
2969F765467j905493k266003l87667K21930o81587n60464K29539j179997m007746
2960c772021l677676O97880L775560J404659l538483n549602l306035P36553M384960
2951h844205O266722N157449K026366L75638J449227J716934j436393m513561
2943B198177l009589Q32228J150651k030959k897599M86503L203596J725070j115598
2934E42480k107247k797444m731478m732837k07233M619574L739982j545064m460453
2925a1679720k537650K96600J203639K008035M072807N059523L271899R40441
$$ plain form
2917 2635574 2947783 2881272 788298 -3235087 -6304213 -6363185 -4508871 -2720061 -1395522
2908 -1395522 -229801 507722 993999 2491464 5409158 7943736 8090325 6073058 3636956
2899 3636956 1977686 1490933 2317960 3678305 3729830 1647745 -1110005 -3120131 -5311984
2890 -5311984 -8885631 -12083861 -11926293 -8785784 -6091675 -5079956 -3084444 1649875
2882 1649875 6536003 8346501 7964499 8403173 9579522 8693333 5626326 4204752 6611163
2873 6611163 9411379 7779830 2304126 -1345571 357008 4389372 5223049 1627362
2865 1627362 -2446785 -3150189 -804684 1687567 2548736 1863006 -55252 -2902526 -5200580
2856 -5200580 -4979814 -2423633 -317425 -686078 -1970194 -939653 2997489 6782141 7192795
$$ packed form
2917B635574L12209o6511k092974m023385l069126n8972J854314J788810J324539
2908a395522J165721P37523M86277J497465K917694K534578J46589k017267k436102
2899C636956j659270m86753Q27027J360345N1525k082085k757750k010126k191853
2890e311984l573647l198230J57568L140509K694109J011719J995512M734319
2882A649875M886128J810498l82002M38674J176349q86189l067007j421574K406411
2873F611163K800216j631549n475704l649697J702579M032364Q33677l595687
2865A627362m074147p03404K345505K492251Q61169o85730j918258k847274k298054
2856e200580K20766K556181K106208l68653j284116J030541L937142L784652M10654
$$ plain form
2847 7192795 4364021 1332347 575217 1530115 1534224 -1061339 -5022547 -7621526 -7537330
2838 -7537330 -5738550 -3595498 -1203951 1818262 4819848 6613597 7176328 7604759 8188896
2829 8188896 7636908 4862776 839324 -2209619 -3296962 -3562370 -4412142 -5327550 -4235662
2820 -4235662 -156794 5127039 8597659 8924750 7202402 4964277 2627141 386582
2812 386582 -597653 602391 2678126 2957727 786744 -1289072 -706350 1688956 2770944
2803 2770944 1251958 -1012909 -2111739 -2669327 -4093175 -5554785 -4820351 -1799432 982550
2794 982550 2056573 3050292 5652452 8259795 7827358 4213529 353614 -1740968 -2925310
2785 -2925310 -4565670 -6391482 -7483170 -7529127 -6057035 -2128512 3813866 9161149 11724518
$$ packed form
2847G192795k828774l031674p57130R54898M109k595563l961208k598979Q4196
2838g537330J798780K143052K391547L022213L001586J793749N62731M28431N84137
2829H188896n51988k774132m023452l048943j087343k65408q49772r15408J091888
2820d235662M078868N283833L470620L27091j722348k238125k337136k240559
2812C86582r84235J200044K075735K79601k170983k075816N82722K395306J081988
2803B770944j518986k264867j098830n57588j423848j461610P34434L020919K781982
2794I82550J074023R93719K602160K607343m32437l613829l859915k094582j184342
2785b925310j640360j825812j091688m5957J472092L928523N942378N347283K563369
$$ plain form
2776 11724518 12106302 12141840 12143252 11420482 10529924 10730281 11444578 10474079 7181261 3756899
2766 3756899 2637577 3883710 5764144 6994021 7752657 9068593 11577838 14477719
2758 14477719 15738328 14036232 10454320 7456366 6156478 5513519 4326980 2901403
2750 2901403 2127973 1724923 349585 -2523835 -5345382 -5552003 -2192534 2650274 5676606
2741 5676606 5722087 4542897 4092379 4215322 3713429 2422719 1114952 419862 1002621
2732 1002621 3505177 6819455 7960872 5818429 3558957 4409990 6230889 4085281
2724 4085281 -2028237 -6308621 -5047035 -1389584 -289212 -2270981 -4887105 -7321817
2716 -7321817 -10036643 -11744700 -10464097 -7022081 -4607213 -4957999 -7059097 -9152795
$$ packed form
2776A1724518L81784L5538J412p22770q90558K00357P14297r70499l292818l424362
2766C756899j119322J246133J880434J229877P58636J315936K509245K899881
2758A4477719J260609j702096l581912k997954j299888o42959j186539j425577
2750B901403p73430m03050j375338k873420k821547k06621L359469M842808L026332
2741E676606M5481j179190m50518J22943n01893j290710j307767o95090N82759
2732A002621K502556L314278J141417k142443k259472Q51033J820899k145608
2724D085281o113518m280384J261586L657451J100372j981769k616124k434712
2716g321817k714826j708057J280603L442016K414868l50786k101098k093698
$$ plain form
2708 -9152795 -10041836 -8948018 -6194155 -3717827 -2996815 -2782245 -722176 3126122 6279142
2699 6279142 7031849 5875524 4064652 2676974 2793431 4542287 6039431 5298989 3191665
2690 3191665 2435015 3559440 4113082 2283791 -912111 -3789832 -6197640 -8336083 -9087341
2681 -9087341 -7163436 -3233437 208837 942444 -1198034 -4123845 -5196945 -3869492
2673 -3869492 -2249531 -2096005 -2074047 279411 4483985 7305445 6950309 4739544 2444590
2664 2444590 509723 -555557 198417 1918834 1807527 -1142895 -4241600 -4533313 -2388405
2655 -2388405 -145757 1021772 1177558 309936 -1012963 -1019660 1197434 3922457 4741720
2646 4741720 3173374 4819 -4362878 -8950014 -11142934 -9159222 -4756780 -1287035
$$ packed form
2708i152795q89041J093818K753863K476328P21012K14570K060069L848298L153020
2699F279142P52707j156325j810872j387678J16457J748856J497144p40442k107324
2690C191665p56650J124425N53642j829291l195902k877721k407808k138443p51258
2681i087341J923905L929999L442274P33607k140478k925811j073100J327453
2673c869492J619961J53526K1958K353458M204574K821460l55136k210765k294954
2664B444590j934867j065280P53974J720417j11307k950422l098705k91713K144908
2655b388405K242648J167529J55786q67622j322899o697K217094K725023Q19263
2646D741720j568346l168555m367697m587136k192920J983712M402442L469745
$$ plain form
2638 -1287035 154649 585417 306261 -1113107 -2725709 -2888432 -1835197 -1093526 -721768
2629 -721768 116768 116991 -3307544 -9547223 -14261198 -14480061 -11728428 -8918564 -6637301
2620 -6637301 -4098627 -1660941 -449011 -736785 -2144630 -4302489 -6182051 -6053880 -3360106
2611 -3360106 387743 3512866 5788338 7287111 7127669 4740010 1312398 -1339411
2603 -1339411 -2630581 -3070740 -3155129 -3103757 -2705858 -949648 2821212 6979414 8784943
2594 8784943 8211537 8240026 10106194 10998549 8606650 5291932 4657017 6001663 5800060
2585 5800060 3382454 1312700 775071 524779 410134 2020223 5168890 7329038 7581075
2576 7581075 7793353 8727471 8396727 5895827 3459852 2553776 1131455 -2501425 -6078155
$$ packed form
2638a287035J441684M30768k79156j419368j612602j62723J053235P41671L71758
2629g21768Q38536K23l424535o239679m713975k18863K751633K809864K281263
2620f637301K538674K437686J211930k87774j407845k157859j879562J28171K693774
2611c360106L747849L125123K275472J498773j59442k387659l427612k651809
2603a339411j291170m40159q4389N1372L97899J756210L770860M158202J805529
2594H784943n73406K8489J866168Q92355k391899l314718o34915J344646k01603
2585E800060k417606k069754n37629k50292j14645J610089L148667K160148K52037
2576G581075K12278R34118l30744k500900k435975r06076j422321l632880l576730
$$ plain form
2567 -6078155 -7013593 -7142911 -9670772 -12968410 -12086815 -6292223 -739320 287099 -1798751
2558 -1798751 -3184227 -2695642 -1670592 -1232097 -1886804 -4189532 -7570215 -9395432 -7211868
2549 -7211868 -1742431 3609699 6020815 5193876 2694833 508269 -73218 744341 1466824
2540 1466824 934293 -373472 -1109148 -833215 -456442 -1077613 -2741116 -4127933 -3394840
2531 -3394840 25884 4213856 6242778 5385952 3843695 3570546 3688320 2466273 752078
2522 752078 1234755 4438860 7527692 7622558 4821577 1493119 42843 1805219 6346054
2513 6346054 10820628 11582304 7895527 3046381 527334 283067 219816 17454 949792
2504 949792 2570281 2589268 578754 -927244 -345218 216981 -1950860 -5972948 -8547920
$$ packed form
2567f078155r35438j29318k527861l297638Q81595N794592N552903J026419k085850
2558a798751j385476M88585J025050M38495o54707k302728l380683j825217K183564
2549g211868N469437N352130K411116q26939k499043k186564n81487Q17559P22483
2540A466824n32531j307765p35676K75933L76773o21171j663503j386817P33093
2531c394840L420724M187972K028922q56826j542257k73149J17774j222047j714195
2522G52078M82677L204105L088832R4866k800981l328458j450276J762376M540835
2513F346054M474574P61676l686777m849146k519047k44267o3251k02362R32338
2504I49792J620489J8987k010514j505998N82026N62199k167841m022088k574972
$$ plain form
2495 -8547920 -8321399 -6756187 -5118482 -3109042 -726012 915844 1562966 2678498 5023306
2486 5023306 6876009 6167912 3333965 535867 -1092514 -1801312 -1547574 -8221 1753203
2477 1753203 1616101 -931616 -3840460 -4914546 -4083741 -2645945 -1385481 -325299 571508
2468 571508 1470221 2792631 4327826 4790854 3326631 1067567 44878 604638 936087
2459 936087 -620157 -3557294 -5793651 -5796319 -3842219 -1372927 725738 2973669 6000909
2450 6000909 8624852 8469855 5163035 1712665 1400199 4075141 6975046 8495598 9255836
2441 9255836 9831913 9773139 9136147 8661699 7725904 4524992 -468685 -3661157 -2859293
2432 -2859293 -465820 320979 492827 2977342 6634473 6811064 2243443 -2648014 -3795820
$$ packed form
2495h547920K26521J565212J637705K009440K383030J641856O47122J115532K344808
2486E023306J852703p08097k833947k798098j628381p08798K53738J539353J761424
2477A753203j37102k547717k908844j074086Q30805J437796J260464J060182Q96807
2468E71508Q98713J322410J535195M63028j464223k259064j022689N59760L31449
2459I36087j556244k937137k236357k668J954100K469292K098665K247931L027240
2450F000909K623943j54997l306820l450370l12466K674942K899905J520552P60238
2441I255836N76077n8774o36992m74448r35795l200912m993677l192472Q01864
2432b859293K393473P86799J71848K484515L657131J76591m567621m891457j147806
$$ plain form
2423 -3795820 -2282819 -1056519 -242126 1061436 934568 -3085205 -8798753 -10677214 -6849603
2414 -6849603 -1277694 1884155 2789803 3388380 3734803 3301328 3392379 4983474 5656281
2405 5656281 2240341 -3928898 -7844113 -7334031 -5519717 -5634734 -6479444 -5289439 -2822237
2396 -2822237 -2402170 -4708392 -6654852 -5974589 -4506440 -5628499 -9796067 -13961332 -14827203
2387 -14827203 -11758388 -6956629 -3689787 -4134228 -7977819 -12711090 -15562424 -15441364
2379 -15441364 -13190033 -10347762 -8044103 -6861659 -7009826 -8108572 -9088332 -9044916 -8431082
2370 -8431082 -8726893 -10242089 -10748149 -7585839 -1405609 3480334 3488501 -228742 -3313381
2361 -3313381 -3299310 -1846196 -1916812 -4173089 -6834731 -8171077 -8240517 -8476165 -10131843
$$ packed form
2423c795820J513001J226300Q14393J303562j26868m019773n713548j878461L827611
2414f849603N571909L161849R05648N98577L46423m33475R1051J591095O72807
2405E656281l415940o169239l915215N10082J814314j15017q44710J190005K467202
2396b822237M20067k306222j946460O80263J468149j122059m167568m165265q65871
2387a4827203L068815M801759L266842m44441l843591m733271k851334J21060
2379a5441364K251331K842271K303659J182444j48167j098746r79760M3416O13834
2370h431082k95811j515196n06060L162310O180230M885943Q167l717243l084639
2361c313381J4071J453114p0616k256277k661642j336346o9440k35648j655678
$$ plain form
2352 -10131843 -13034132 -15599132 -16188875 -14533739 -11753441 -9269556 -8013434 -8088880 -8262217
2343 -8262217 -6226125 -870602 5554429 9101720 8559522 6751428 6499512 6869384 5114816
2334 5114816 1287603 -1344838 -481144 2537658 4815828 5173638 4362488 3060044 1099530
2325 1099530 -1305278 -2707751 -1636221 1533771 4698366 6338607 7038158 8055797
2317 8055797 9198316 9501522 9533694 10864391 12828023 12227068 7771280 2840200 1611494
2308 1611494 3717264 5151957 3621426 354564 -2925460 -5829621 -7805965 -7743317 -6090122
2299 -6090122 -4912240 -4609647 -2889735 1421538 5714749 6793505 5004544 2901519
2291 2901519 1274458 -711498 -2347349 -1690006 656975 1168770 -1806350 -5203423 -5228598
$$ packed form
2352a0131843k902289k565000n89743J655136K780298K483885J256122p5446j73337
2343h262217K036092N355523O425031L547291n42198j808094k51916L69872j754568
2334E114816l827213k632441Q63694L018802K278170L57810q11150j302444j960514
2325A099530k404808j402473J071530L169992L164595J640241O99551J017639
2317H055797J142519L03206L2172J330697J963632o00955m455788m931080j228706
2308A611494K105770J434693j530531l266862l280024k904161j976344O2648J653195
2299f090122J177882L02593J719912M311273M293211J078756j788961k103025
2291B901519j627061j985956j635851O57343K346981N11795k975120l397073k5175
$$ plain form
2282 -5228598 -2761665 -2292090 -5654504 -9170621 -8086620 -2368286 3607936 6568343
2274 6568343 7516037 8887498 10535797 10387835 8127539 5891512 5151432 4973240 4100623
2265 4100623 2949138 2349667 1803317 517700 -855300 -1144160 -653945 -609995 -961145
$$ packed form
2282e228598K466933M69575l362414l516117J084001N718334N976222K960407
2274F568343R47694J371461J648299j47962k260296k236027p40080j78192q72617
2265D100623j151485n99471n46350j285617j373000k88860M90215M3950l51150
$$ [...]
##END NTUPLES=NMR SPECTRUM
##END=
