##TITLE=31Pdec_DE-AcCl_old
 , 24 sc
19.8.2026
##JCAMPDX= 6.0         $$ Bruker NMR JCAMP-DX V2.0
##DATA TYPE= NMR SPECTRUM
##DATA CLASS= NTUPLES
##ORIGIN= UXNMR, Bruker Analytische Messtechnik GmbH
##OWNER= root
$$ XWIN-NMR		Version 3.5
$$ Wed Aug 19 15:10:41 2026 Russian Standard Time (UT+4h)  she@DPX200
##.OBSERVE FREQUENCY= 81.013821
##.OBSERVE NUCLEUS= ^31P
##.ACQUISITION MODE= SIMULTANEOUS
##.ACQUISITION SCHEME= undefined
##.AVERAGES= 24
##.DIGITISER RES= 17
##SPECTROMETER/DATA SYSTEM= spect
##.PULSE SEQUENCE= zgpg30
##.SOLVENT NAME= DMSO
##.SHIFT REFERENCE= (INTERNAL, DMSO, 0, 197.392)
##AUDIT TRAIL= $$ (NUMBER, WHEN, WHO, WHERE, WHAT)
$$ ##TITLE= Audit trail, XWIN-NMR		Version 3.5
$$ ##JCAMPDX= 5.01
$$ ##ORIGIN= Bruker BioSpin GmbH
$$ ##OWNER= she
$$ F:/spectra/data/she/nmr/P31/2/pdata/1/auditp.txt
$$ ##AUDIT TRAIL=  $$ (NUMBER, WHEN, WHO, WHERE, WHAT)
(   1,<2026-08-19 15:09:58.87 +0400>,<she>,<DPX200>,
      <created by zg, POWCHK disabled, PULCHK disabled
       configuration hash MD5:
       00 E9 B6 7A A2 85 ED C7 34 08 36 98 17 FE 4E 26
       data hash MD5: 32K
       C1 C5 AA 54 A4 57 70 1B 76 A1 6A 6F 70 55 75 9E>)
(   2,<2026-08-19 15:10:02.56 +0400>,<she>,<DPX200>,
      <Start of raw data processing
       efp BC_mod = 2 LB = 1.5 FT_mod = 6 PKNL = 1 PHC0 = 1978.36 PHC1 = 47.69841 SI = 64K 
       data hash MD5: 64K
       BF 05 BB 4C A7 51 D6 1A 4C 03 9E EC E6 7A 9E 84>)
(   3,<2026-08-19 15:10:15.67 +0400>,<she>,<DPX200>,
      <pk PHC0 = 4.083674 PHC1 = 0 
       data hash MD5: 64K
       A5 9A 45 96 8F F9 15 EC 56 BC 8E 83 69 4D E0 FA>)
$$ ##END=
$$ 
$$ hash MD5
$$ 40 EF FD D5 10 0D 74 E7 A4 17 AB 67 F9 6E EB 0F
##$RELAX= 
##$RELAX= 
##$RELAX= 
##$RELAX= 
##$RELAX= 
##$RELAX= 
##$RELAX= 
##$RELAX= 
$$ Bruker specific parameters
$$ --------------------------
##$DU= <F:/spectra>
##$EXPNO= 2
##$NAME= <P31>
##$PROCNO= 1
##$TYPE= <nmr>
##$USER= <she>
##$AMP= (0..31)
100 100 100 100 100 100 100 100 100 100 100 100 100 100 100 100 100 100 
100 100 100 100 100 100 100 100 100 100 100 100 100 100 
##$AQSEQ= 0
##$AQ_mod= 1
##$AUNM= <au_zg>
##$AUTOPOS= <>
##$BF1= 81.014009
##$BF2= 200.13
##$BF3= 200.13
##$BF4= 200.13
##$BF5= 200.13
##$BF6= 200.13
##$BF7= 200.13
##$BF8= 200.13
##$BYTORDA= 1
##$CFDGTYP= 0
##$CFRGTYP= 5
##$CHEMSTR= <none>
##$CNST= (0..31)
1 1 145 1 1 1 1 1 1 1 1 1 1 1 1 1 1 1 1 1 1 1 1 1 1 1 1 1 1 1 1 1 
##$CPDPRG= <waltz16>
##$CPDPRG1= <>
##$CPDPRG2= <waltz16>
##$CPDPRG3= <>
##$CPDPRG4= <mlev>
##$CPDPRG5= <mlev>
##$CPDPRG6= <mlev>
##$CPDPRG7= <mlev>
##$CPDPRG8= <mlev>
##$CPDPRGB= <>
##$CPDPRGT= <>
##$D= (0..31)
0 1 0 0 0 0 0 0 0 0.06 0 0.03 2e-05 3e-06 0 0 0.0002 0 0 0 0 0 0 0 0 0 
0 0 0 0 0 0 
##$DATE= 1787137798
##$DBL= (0..7)
120 120 120 11 120 120 24 19 
##$DBP= (0..7)
150 150 150 150 150 150 150 150 
##$DBP07= 0
##$DBPNAM0= <>
##$DBPNAM1= <>
##$DBPNAM2= <>
##$DBPNAM3= <>
##$DBPNAM4= <>
##$DBPNAM5= <>
##$DBPNAM6= <>
##$DBPNAM7= <>
##$DBPOAL= (0..7)
0.5 0.5 0.5 0.5 0.5 0.5 0.5 0.5 
##$DBPOFFS= (0..7)
0 0 0 0 0 0 0 0 
$$ [...]
##$SUBNAM2= <"">
##$SUBNAM3= <"">
##$SUBNAM4= <"">
##$SUBNAM5= <"">
##$SUBNAM6= <"">
##$SUBNAM7= <"">
##$SUBNAM8= <"">
##$SUBNAM9= <"">
##$SW= 400.765351723535
##$SWIBOX= (0..15)
0 1 3 0 0 0 0 0 0 0 0 0 0 0 0 0 
##$SW_h= 32467.5324675325
##$TD= 32768
##$TD0= 1
##$TE= 0
##$TE2= 300
##$TE3= 300
##$TEG= 300
##$TL= (0..7)
0 120 53 12 22 120 120 120 
##$TP= (0..7)
150 150 150 150 150 150 150 150 
##$TP07= 0
##$TPNAME0= <>
##$TPNAME1= <>
##$TPNAME2= <>
##$TPNAME3= <>
##$TPNAME4= <>
##$TPNAME5= <>
##$TPNAME6= <>
##$TPNAME7= <>
##$TPOAL= (0..7)
0.5 0.5 0.5 0.5 0.5 0.5 0.5 0.5 
##$TPOFFS= (0..7)
0 0 0 0 0 0 0 0 
##$TUNHIN= 0
##$TUNHOUT= 0
##$TUNXOUT= 0
##$USERA1= <user>
##$USERA2= <user>
##$USERA3= <user>
##$USERA4= <user>
##$USERA5= <user>
##$V9= 5
##$VALIST= <valist>
##$VCLIST= <CCCCCCCCCCCCCCC>
##$VD= 0
##$VDLIST= <DDDDDDDDDDDDDDD>
##$VPLIST= <PPPPPPPPPPPPPPP>
##$VTLIST= <TTTTTTTTTTTTTTT>
##$WBST= 1024
##$WBSW= 4
##$XGAIN= (0..3)
0 0 0 0 
##$XL= 0
##$YL= 0
##$YMAX_a= 34846
##$YMIN_a= -30157
##$ZGOPTNS= <>
##$ZL1= 120
##$ZL2= 120
##$ZL3= 120
##$ZL4= 120
##$ABSF1= 0
##$ABSF2= 0
##$ABSG= 0
##$ABSL= 0
##$ALPHA= 0
##$AQORDER= 0
##$ASSFAC= 0
##$ASSFACI= 0
##$ASSFACX= 0
##$ASSWID= 0
##$AUNMP= <proc_1d>
##$AZFE= 0.1
##$AZFW= 0.5
##$BCFW= 0
##$BC_mod= 2
##$BYTORDP= 0
##$COROFFS= 0
##$CY= -3
##$DATMOD= 1
##$DC= 0
##$DFILT= <>
##$DTYPP= 0
##$F1P= 0
##$F2P= 0
##$FCOR= 1
##$FTSIZE= 65536
##$FT_mod= 6
##$GAMMA= 0
##$GB= 0
##$INTBC= 1
##$INTSCL= 9.790993e-09
##$ISEN= 30
##$LB= 1.5
##$LEV0= 0
##$LPBIN= 0
##$MAXI= 10000
##$MC2= 0
##$MEAN= 0
##$ME_mod= 0
##$MI= 50
##$NCOEF= 0
##$NC_proc= -6
##$NLEV= 6
##$NOISF1= 182.463
##$NOISF2= 159.3651
##$NSP= 0
##$NTH_PI= 0
##$NZP= 0
##$OFFSET= 197.3918
##$PC= 4
##$PHC0= 1982.444
##$PHC1= 47.69841
##$PH_mod= 1
##$PKNL= yes
##$PPARMOD= 0
##$PSCAL= 0
##$PSIGN= 0
##$REVERSE= no
##$SF= 81.014063255964
##$SI= 65536
##$SIGF1= 159.3651
##$SIGF2= -187.1042
##$SINO= 113.3802
##$SIOLD= 16384
##$SREGLST= <1H.CDCl3>
##$SSB= 0
##$STSI= 65536
##$STSR= 0
##$SW_p= 32467.5324675325
##$SYMM= 0
##$S_DEV= 0
##$TDeff= 32768
##$TDoff= 0
##$TI= <>
##$TILT= no
##$TM1= 0
##$TM2= 0
##$TOPLEV= 0
##$USERP1= <user>
##$USERP2= <user>
##$USERP3= <user>
##$USERP4= <user>
##$USERP5= <user>
##$WDW= 1
##$XDIM= 65536
##$YMAX_p= 324487156
##$YMIN_p= -10125493
$$ End of Bruker specific parameters
$$ ---------------------------------
##NTUPLES= NMR SPECTRUM
##VAR_NAME=  FREQUENCY,     SPECTRUM/REAL,   SPECTRUM/IMAG
##SYMBOL=    X,             R,               I
##VAR_TYPE=  INDEPENDENT,   DEPENDENT,       DEPENDENT
##VAR_FORM=  AFFN,          ASDF,            ASDF
##VAR_DIM=   65536,         65536,           65536
##UNITS=     HZ,            ARBITRARY UNITS, ARBITRARY UNITS
##FACTOR=    0.49542278885378, 1,            1
##FIRST=     15991.5117654749, 0,            0
##LAST=      -16476.0207020576, 0,           0
##MIN=       -16476.0207020576, -10125493,   0
##MAX=       15991.5117654749, 324487156,    0
$$ Real data points
##PAGE= N=1
##DATA TABLE= (X++(R..R)), XYDATA
$$ [...]
$$ plain form
36480 -1237545 -1098316 -1038302 -803170 -489457 -436274 -773227 -1241970 -1489967 -1439940 -1304188
36470 -1304188 -1276177 -1302359 -1205671 -968695 -773705 -742600 -757684 -628724 -366519 -186061
36460 -186061 -254825 -498962 -647811 -475853 -91993 16468 -575194 -1650739 -2438685 -2465408
36450 -2465408 -2108198 -2028205 -2270331 -2338675 -2032911 -1669049 -1420923 -1004200 -248615 498142
36440 498142 875386 1019290 1173914 1151479 689176 100928 -18392 322734 485598 123961
36430 123961 -373889 -535091 -461126 -572380 -989871 -1442185 -1611910 -1372429 -826137 -271076
36420 -271076 1197 3507 16655 171991 278778 206066 187166 470975 824524 723309
36410 723309 44059 -714193 -1010795 -885947 -844361 -1180038 -1587411 -1534807 -947664 -337690
$$ packed form
36480a237545J39229O0014K35132L13713N3183l36953m68743k47997N0027J35752
36470a304188K8011k6182R6688K36976J94990L1105j5084J28960K62205J80458
36460a86061o8764k44137j48849J71958L83860J08461n91662j075545p87946k6723
36450b465408L57210P9993k42126o8344L05764L63862K48126M16723P55585P46757
36440D98142L77244J43904J54624k2435m62303n88248j19320L41126J62864l61637
36430A23961m97850j61202P3965j11254m17491m52314j69725K39481N46292N55061
36420b71076K72273K310J3148J55336J06787p2712j8900K83809L53549j01215
36410G23309o79250p58252k96602J24848M1586l35677m07373N2604N87143O09974
$$ plain form
36400 -337690 -182430 -358552 -391642 -142139 61923 -45229 -356362 -705976 -1143243 -1671310
36390 -1671310 -2002660 -1875438 -1430772 -987773 -604939 -184373 126229 38294 -381961 -704426
36380 -704426 -705908 -631744 -766266 -1025256 -1144296 -1043891 -811683 -496770 -141772 78874
36370 78874 -35870 -476664 -1006434 -1357535 -1380870 -1080637 -619910 -255668 -163176 -321201
36360 -321201 -598428 -884036 -1077110 -1051430 -767643 -388676 -161766 -177719 -321128 -442252
36350 -442252 -497250 -537706 -654135 -920256 -1295518 -1590906 -1656325 -1622921 -1809869 -2304359
36340 -2304359 -2763924 -2778359 -2347493 -1834823 -1497628 -1273586 -1045008 -863589 -788657 -724478
36330 -724478 -630298 -722486 -1184174 -1773678 -2064807 -2067138 -2220393 -2667175 -2941396 -2645171
$$ packed form
36400c37690J55260j76122l3090K49503K04062j07152l11133l49614m37267n28067
36390a671310l31350J27222M44666M42999L82834M20566L10602q7935m20255l22465
36380g04426j482P4164j34522k58990j19040J00405K32208L14913L54998K20646
36370G8874j14744m40794n29770l51101k3335L00233M60727L64242R2492j58025
36360c21201k77227k85608j93074K5680K83787L78967K26910j5953j43409j21124
36350d42252n4998m0456j16429k66121l75262k95388o5419L3404j86948m94490
36340b304359m59565j4435M30866N12670L37195K24042K28578J81419P4932O4179
36330g24478R4180r2188m61688n89504k91129k331j53255m46782k74221K96225
$$ plain form
36320 -2645171 -2085364 -1833687 -1883979 -1740464 -1266472 -909345 -969617 -1130509 -982269 -646483
36310 -646483 -517040 -613048 -596316 -345254 -113726 -74514 -57598 88170 133602 -259387
36300 -259387 -1004937 -1609393 -1760892 -1673884 -1705725 -1812039 -1653062 -1196360 -873209 -979092
36290 -979092 -1197380 -1025224 -528224 -297772 -649167 -1217369 -1471740 -1330802 -1070645 -871153
36280 -871153 -722307 -630543 -626151 -613321 -475930 -356555 -607705 -1368765 -2316129 -2927300
36270 -2927300 -2943541 -2527695 -2018127 -1604681 -1278485 -1048860 -1054573 -1333357 -1591699 -1457511
36260 -1457511 -975521 -577957 -473113 -369678 -5727 362971 351751 101795 101254 441066
36250 441066 719934 709511 618780 550206 203014 -534320 -1095445 -851482 -44345 415211
$$ packed form
36320b645171N59807K51677n0292J43515M73992L57127o0272j60892J48240L35786
36310f46483J29443r6008J6732K51062K31528L9212J6916J45768M5432l92989
36300b59387p45550o04456j51499Q7008l1841j06314J58977M56702L23151j05883
36290i79092k18288J72156M97000K30452l51395n68202k54371J40938K60157J99492
36280h71153J48846R1764M392J2830J37391J19375k51150p61060r47364o11171
36270b927300j6241M15846N09568M13446L26196K29625n713k78784k58342J34188
36260a457511M81990L97564J04844J03435L63951L68698j1220k49956n41L39812
36250D41066K78868j0423r0731o8574l47192p37334n61125K43963Q07137M59556
$$ plain form
36240 415211 96004 -475020 -628399 -422519 -376887 -616392 -743075 -538124 -352921 -593802
36230 -593802 -1102916 -1364207 -1199375 -919384 -780836 -641206 -312240 21488 10829 -360623
36220 -360623 -747171 -857790 -676238 -296902 205522 681225 878985 639861 53184 -614985
36210 -614985 -1092290 -1230859 -1083545 -852051 -682355 -556378 -463446 -547580 -897995 -1301517
36200 -1301517 -1459321 -1397708 -1389071 -1490080 -1467248 -1205929 -875888 -623245 -406552 -220630
36190 -220630 -161439 -165446 -22908 229116 302182 194288 288599 664277 777565 218605
36180 218605 -619925 -1087959 -1131956 -1093429 -1004799 -721415 -492985 -663349 -920145 -625346
36170 -625346 85272 323012 -275257 -1051752 -1380957 -1469382 -1683913 -1773653 -1362577 -713362
$$ packed form
36240D15211l19207n71024j53379K05880M5632k39505j26683K04951J85203k40881
36230e93802n09114k61291J64832K79991J38548J39630L28966L33728j0659l71452
36220c60623l86548j10619J81552L79336N02424M75703J97760k39124n86677o68169
36210f14985m77305j38569J47314K31494J69696J25977R2932q4134l50415m03522
36200a301517j57804O1613Q637j01009K2832K61319L30041K52643K16693J85922
36190b20630N9191m007J42538K52024P3066j07894R4311L75678J13288n58960
36180B18605q38530m68034m3997L8527Q8630K83384K28430j70364k56796K94799
36170f25346P10618K37740n98269p76495l29205q8425k14531q9740M11076O49215
$$ plain form
36160 -713362 -351431 -272577 -145799 -23693 -185982 -442828 -287341 260579 597393 439253
36150 439253 229580 427854 836090 931315 584920 152819 -25049 4398 -77598 -459232
36140 -459232 -928499 -1069249 -762503 -324727 -16520 338558 940686 1432814 1215203 325929
36130 325929 -464758 -561465 -162286 167349 165605 -75244 -380864 -548908 -393990 -16582
36120 -16582 167927 -85149 -524722 -812296 -1043141 -1517948 -2122094 -2332303 -1880942 -1100110
36110 -1100110 -491078 -175541 70946 372061 526696 262004 -374969 -978794 -1188585
36101 -1188585 -1069033 -986667 -1147807 -1420126 -1610703 -1707139 -1765504 -1767585 -1720075 -1708868 -1701695
36090 -1701695 -1489572 -1028491 -659781 -723763 -1082885 -1334336 -1422198 -1685338 -2260809 -2776018
$$ packed form
36160g13362L61931P8854J26778J22106j62289k56846J55487N47920L36814j58140
36150D39253k09673J98274M08236R5225l46395m32101j77868K9447q1996l81634
36140d59232m69267j40750L06746M37776L08207L55078O02128M92128k17611q89274
36130C25929p90687r6707L99179L29635j744k40849l05620j68044J54918L77408
36120a6582J84509k53076m39573k87574k30845m74807o04146k10209M51361P80832
36110a100110O09032L15537K46487L01115J54635k64692o36973o03825k09791
36101a188585J19552Q2366j61140k72319j90577r6436n8365k081M7510J1207P173
36090a701695K12123M61081L68710o3982l59122k51451q7862k63140n75471n15209
$$ plain form
36080 -2776018 -2788511 -2309251 -1725979 -1358296 -1234675 -1190174 -1030776 -669027 -235811 -33434
36070 -33434 -265298 -795752 -1237436 -1294621 -1000420 -622783 -374479 -251117 -157074 -125675
36060 -125675 -315558 -774058 -1292207 -1535917 -1266891 -464285 601110 1378936 1377923 690024
36050 690024 7578 -116801 104019 70442 -331546 -621884 -485267 -209712 -194703 -367795
36040 -367795 -374942 -141479 63181 34246 -159312 -362680 -523989 -660846 -781508 -889614
36030 -889614 -990497 -1065389 -1081623 -1033667 -961907 -966917 -1208943 -1792311 -2574329 -3164776 -3230158
36019 -3230158 -2796490 -2196591 -1743569 -1506988 -1368291 -1208494 -1022815 -887103 -834764 -791038
36009 -791038 -664221 -486042 -399381 -501996 -754045 -1022601 -1146710 -1007541 -678777 -486579
$$ packed form
36080b776018j2493M79260N83272L67683J23621M4501J59398L61749M33216K02377
36070c3434k31864n30454m41684n7185K94201L77637K48304J23362R4043L1399
36060a25675j89883m58500n18149k43710K69026Q02606J065395P77826j013o87899
36050F90024o82446j24379K20820l3577m01988k90338J36617K75555J5009j73092
36040c67795p147K33463K04660k8935j93558k03368j61309j36857j20662j08106
36030h89614j00883p4892j6234M7956P1760n010k42026n83368p82018n90447o5382
36019c230158M33668N99899M53022K36581J38697J59797J85679J35712N2339M3726
36009g91038J26817J78179Q6661j02615k52049k68556j24109J39169L28764J92198
$$ plain form
35999 -486579 -706136 -1133289 -1191455 -639906 8924 39451 -584572 -1178043 -1195214 -838584
35989 -838584 -656257 -771342 -816764 -580371 -365811 -539203 -955493 -1146623 -998546 -869681
35979 -869681 -959299 -950321 -545142 -32535 100194 -66352 -3745 423551 766626 727626
35969 727626 552255 466866 237637 -336015 -911641 -1069349 -996671 -1188068 -1636859 -1857613
35959 -1857613 -1643318 -1290320 -1066950 -954928 -994201 -1394137 -2106049 -2674520 -2754651 -2509093
35949 -2509093 -2313147 -2323126 -2490463 -2717534 -2802639 -2499134 -1868625 -1363055 -1320799 -1555187
35939 -1555187 -1646975 -1454628 -1120772 -786069 -570534 -651163 -1026025 -1319457 -1170950 -766692
35929 -766692 -638909 -933112 -1224585 -1146648 -872883 -792930 -955708 -1084361 -1023821 -922013
$$ packed form
35999d86579k19557m27153n8166N51549O48830L0527o24023n93471j7171L56630
35989h38584J82327j15085m5422K36393K14560j73392m16290j91130J48077J28865
35979h69681q9618Q978M05179N12607J32729j66546O2607M27296L43075l9000
35969G27626j75371q5389k29229n73652n75626j57708P2678j91397m48791k20754
35959a857613K14295L52998K23370J12022l9273l99936p11912n68471q0131K45558
35949b509093J95946r979j67337k27071q5105L03505O30509N05570M2256k34388
35939a555187r1788J92347L33856L34703K15535q0629l74862k93432J48507M04258
35929g66692J27783k94203k91473P7937K73765P9953j62778j28653O0540J01808
$$ plain form
35919 -922013 -959340 -1083879 -1107785 -983128 -863265 -874888 -930018 -859324 -679340 -583651 -662787
35908 -662787 -794215 -861208 -901515 -933726 -825708 -519694 -240743 -254292 -512699 -773743
35898 -773743 -979503 -1236161 -1468926 -1439049 -1156660 -949816 -994479 -1066140 -933006 -723617
35888 -723617 -657316 -627865 -368298 82242 384672 341581 67142 -275812 -640829 -958384
35878 -958384 -1087374 -1009843 -874821 -743310 -488864 -97237 125899 -127734 -743269 -1298475
35868 -1298475 -1558789 -1635121 -1662583 -1585954 -1363968 -1167199 -1181151 -1317880 -1307956 -1044709
35858 -1044709 -689579 -452617 -408717 -531207 -755389 -960541 -1018795 -942551 -889409 -937875
35848 -937875 -944742 -732597 -355706 -49387 59808 53572 15799 -125255 -455122 -859925
$$ packed form
35919i22013l7327j24539k3906J24657J19863j1623n5130P0694J79984R5689p9136
35908f62787j31428o6993m0307l2211J08018L06014K78951j3549k58407k61044
35898g73743k05760k56658k32765K9877K82389K06844m4663p1661J33134K09389
35888g23617O6301K9451K59567M50540L02430m3091k74439l42954l65017l17555
35878i58384j28990P7531J35022J31511K54446L91627K23136k53633o15535n55206
35868a298475k60314p6332k7462P6629K21986J96769j3952j36729R924K63247
35858a044709L55130K36962M3900j22490k24182k05152n8254P6244N3142m8466
35848i37875o867K12145L76891L06319J09195o236l7773j41054l29867m04803
$$ plain form
35838 -859925 -1082544 -999891 -774604 -702857 -927028 -1296104 -1503234 -1390865 -1138937 -1102928
35828 -1102928 -1420906 -1838151 -2001835 -1871882 -1700004 -1624833 -1498613 -1201494 -917043 -889607
35818 -889607 -1040377 -1096325 -1064494 -1273554 -1854723 -2442127 -2568077 -2191512 -1658107 -1267264
35808 -1267264 -1069161 -990679 -941890 -821387 -599618 -410236 -435258 -705558 -1098686 -1460481
35798 -1460481 -1613061 -1370169 -769246 -222453 -172441 -580625 -979143 -1042441 -869010 -674894
35788 -674894 -499400 -328167 -249983 -318662 -439194 -539410 -691007 -925766 -1105764 -1133044
35778 -1133044 -1135604 -1286881 -1571634 -1862900 -2082017 -2159542 -2027648 -1803831 -1765433 -1944906
35768 -1944906 -1986094 -1665699 -1321325 -1403817 -1783814 -1933736 -1709427 -1476533 -1435561 -1305558
$$ packed form
35838h59925k22619Q2653K25287P1747k24171l69076k07130J12369K51928L6009
35828a102928l17978m17245j63684J29953J71878P5171J26220K97119K84451K7436
35818h89607j50770n5948L1831k09060n81169n87404j25950L76565N33405L90843
35808a267264J98103P8482M8789J20503K21769J89382k5022k70300l93128l61795
35798a460481j52580K42892O00923N46793N0012m08184l98518o3298J73431J94116
35788f74894J75494J71233P8184o8679j20532j00216j51597k34759j79998k7280
35778a133044k560j51277k84753k91266k19117p7525J31894K23817L8398j79473
35768a944906m1188L20395L44374q2492l79997j49922K24309K32894M0972J30003
$$ plain form
35758 -1305558 -851681 -329529 -145142 -349663 -732495 -1197048 -1744265 -2202573 -2289212 -1978954
35748 -1978954 -1616046 -1570742 -1863063 -2190380 -2290785 -2188981 -2030052 -1768758 -1235333 -541694
35738 -541694 -143906 -297987 -680488 -841608 -837909 -1010444 -1265306 -1121543 -542342 -161582
35728 -161582 -417811 -916278 -1027780 -784271 -736055 -1126769 -1674081 -2083379 -2315478 -2296458
35718 -2296458 -1793838 -810801 143674 455017 34982 -605247 -918261 -841075 -705255 -736750
35708 -736750 -823243 -805149 -777180 -904901 -1083773 -1056459 -812712 -582362 -464699 -408608
35698 -408608 -550210 -1106922 -1807271 -1933643 -1239846 -388370 -74508 -115378 68086 398026
35688 398026 266811 -391097 -886568 -779444 -481775 -564224 -923186 -1030849 -751920 -518120
$$ packed form
35758a305558M53877N22152J84387k04521l82832m64553n47217m58308q6639L10258
35748a978954L62908M5304k92321l27317j00405J01804J58929K61294N33425O93639
35738e41694L97788j54081l82501j61120L699j72535k54862J43763N79201L80760
35728a61582k56229m98467j11502K43509M8216l90714n47312m09298k32099J9020
35718b296458N02620R83037R54475L11343m20035o40229l13014P7186J35820l1495
35708g36750q6493J8094K7969j27721j78872K7314K43747K30350J17663N6091
35698d08608j41602n56712p00349j26372O93797Q51476L13862m0870J83464L29940
35688C98026j31215o57908m95471J07124K97669q2449l58962j07663K78929K33800
$$ plain form
35678 -518120 -737298 -1277549 -1596322 -1335035 -771883 -592518 -1106727 -1830273 -2061845 -1735983
35668 -1735983 -1369936 -1260000 -1190280 -983337 -836077 -886248 -869693 -534751 -91305 98955
35658 98955 56076 55513 121995 5184 -386557 -808932 -935446 -609633 93208 868550 1309808
35647 1309808 1227219 820737 419299 131194 -124106 -368984 -537153 -592557 -500934 -181284
35637 -181284 327530 746680 804512 538090 189139 -87118 -231466 -164160 71723 173004
35627 173004 -107481 -579096 -859256 -933856 -1105231 -1395767 -1433008 -1053470 -639746 -630973
35617 -630973 -966819 -1254285 -1296951 -1231880 -1259080 -1423177 -1607686 -1651958 -1543463 -1494895
35607 -1494895 -1649326 -1699917 -1109555 132213 1246402 1417173 647735 -350627 -950122
$$ packed form
35678e18120k19178n40251l18773K61287N63152J79365n14209p23546k31572L25862
35668a735983L66047J09936O9720K06943J47260n0171J6555L34942M43446J90260
35658I8955m2879n63O6482j16811l91741m22375j26514L25813P02841P75342M41258
35647A309808q2589m06482m01438k88105k55300k44878j68169n5404R1623L19650
35637a81284N08814M19150N7832k66422l48951k76257j44348O7306K35883J01281
35627A73004k80485m71615k80160p4600j71375k90536l7241L79538M13724Q773
35617f30973l35846k87466m2666O5071k7200j64097j84509m4272J08495M8568
35607a494895j54431n0591N90362J241768J114189J70771p69438r98362n99495
$$ plain form
35598 -950122 -1033355 -799313 -502339 -367918 -462115 -577672 -448395 -106887 153625 179812
35588 179812 106517 70339 14929 -103809 -129029 78573 337647 283244 -173801 -685298
35578 -685298 -846499 -639231 -367840 -198904 33087 470543 883587 917566 591059 237522
35568 237522 -37490 -463879 -1064219 -1424550 -1295729 -1068178 -1231082 -1614585 -1672780 -1374343
35558 -1374343 -1236748 -1467189 -1652772 -1469642 -1180196 -1153339 -1324805 -1465254 -1616535 -1862892
35548 -1862892 -1936592 -1489946 -640459 111155 435522 385447 186602 101687 347472 795036
35538 795036 855775 49845 -1327319 -2432828 -2753048 -2448600 -1893063 -1280943 -736457
35529 -736457 -399085 -237313 -58556 178775 309244 262816 120682 -168603 -742411 -1391580
$$ packed form
35598i50122q3233K34042K96974J34421r4197j15557J29277L41508K60512K6187
35588A79812p3295l6178n5410j18738k5220K07602K59074n4403m57045n11497
35578f85298j61201K07268K71391J68936K31991M37456M13044L3979l26507l53537
35568B37522k75012m26389o00340l60331J28821K27551j62904l83503n8195K98437
35558a374343J37595k30441j85583J83130K89446K6857j71466j40449j51281k46357
35548a862892p3700M46646Q49487P51614L24367n0075j98845q4915K45785M47564
35538G95036O0739q05930j377164j105509l20220L04448N55537O12120N44486
35529g36457L37372J61772J78757K37331J30469m6428j42134k89285n73808o49169
$$ plain form
35519 -1391580 -1613978 -1313660 -1025459 -1148725 -1359838 -1178241 -767502 -682180 -1047484 -1502478
35509 -1502478 -1814718 -2020123 -2011513 -1551574 -788283 -273087 -292499 -560402 -729247 -826736
35499 -826736 -979704 -1070099 -967543 -844086 -934741 -1144338 -1186571 -1014807 -851856 -846684
35489 -846684 -928786 -977830 -950121 -849926 -720286 -627223 -521631 -193103 451433 1108407
35479 1108407 1298941 897822 256349 -241608 -548849 -794104 -962166 -947912 -847530 -959162
35469 -959162 -1425421 -2006968 -2308880 -2180783 -1825045 -1551837 -1506020 -1609758 -1668755 -1507698
35459 -1507698 -1094397 -602471 -305113 -340268 -602351 -900961 -1168332 -1441081 -1698552 -1848439
35449 -1848439 -1890717 -1996207 -2348790 -2907737 -3339641 -3227828 -2445903 -1364819 -590925
$$ packed form
35519a391580k22398L00318K88201j23266k11113J81597M10739Q5322l65304m54994
35509a502478l12240k05405Q610M59939P63291N15196j9412k67903j68845r7489
35499h26736j52968r0395J02556J23457r0655k09597m2233J71764J62951N172
35489h46684q2102m9044K7709J00195J29640R3063J05592L28528O44536O56974
35479A108407J90534m01119o41473m97957l07241k45255j68062J4254J00382j11632
35469i59162m66259n81547l01912J28097L55738K73208M5817j03738n8997J61057
35459a507698M13301M91926K97358l5155k62083k98610k67371k72749k57471j49887
35449a848439m2278j05490l52583n58947m31904J11813P81925J081084P73894
$$ plain form
35440 -590925 -412652 -583456 -721516 -771644 -899851 -1078621 -1078565 -851313 -612180 -479533
35430 -479533 -328078 -123530 -104260 -411312 -787069 -935400 -1002486 -1340161 -1863769 -2044946
35420 -2044946 -1632783 -1051980 -887611 -1189135 -1508794 -1497571 -1223554 -950664 -840798 -910298
35410 -910298 -1079636 -1174662 -1035994 -743257 -589632 -687219 -753505 -533046 -309092 -615416
35400 -615416 -1405431 -1930919 -1658633 -938699 -443890 -291424 -202988 -282923 -956702 -2094943
35390 -2094943 -2843094 -2594128 -1676144 -801366 -254421 51365 131572 2809 -97321 -52017
35380 -52017 -220471 -936862 -1792358 -1994753 -1446239 -888088 -840812 -952818 -686473 -181361
35370 -181361 -1494 -313041 -788710 -1205151 -1659311 -2145603 -2341781 -2036811 -1511684 -1216884
$$ packed form
35440e90925J78273j70804j38060n0128j28207j78770N6K27252K39133J32647
35430d79533J51455K04548J9270l07052l75757j48331o7086l37675n23608j81177
35420b044946M12163N80803J64369l01524l19659J1223K74017K72890J09866o9500
35410i10298j69338r5026J38668K92737J53625r7587o6286K20459K23954l06324
35400f15416p90015n25488K72286P19934M94809J52466Q8436p9935o73779j138241
35390b094943p48151K48966R17984Q74778N46945L05786Q0207j28763j00130M5304
35380e2017j68454p16391q55496k02395N48514N58151M7276j12006K66345N05112
35370a81361J79867l11547m75669m16441m54160m86292j96178L04970N25127K94800
$$ plain form
35360 -1216884 -1191033 -1082331 -725388 -392211 -356517 -482103 -489522 -448640 -675432 -1205732
35350 -1205732 -1723705 -2033927 -2246412 -2408669 -2337590 -1997832 -1685473 -1592173 -1531341 -1376620
35340 -1376620 -1379563 -1643354 -1666278 -995751 -87188 161484 -369833 -957110 -1178503 -1377274
35330 -1377274 -1818614 -2138054 -2005281 -1716633 -1646830 -1600467 -1244321 -814219 -810311 -1193391
35320 -1193391 -1410983 -1132766 -552499 -55429 61966 -322121 -975625 -1343872 -1133677
35311 -1133677 -749918 -787252 -1245166 -1672781 -1920801 -2195444 -2437435 -2281405 -1732235 -1291295
35301 -1291295 -1205621 -1125666 -786059 -532639 -793053 -1399872 -1832080 -1831485 -1415753 -603580
35291 -603580 403935 1006663 712936 -205304 -1019719 -1445195 -1760360 -2074061 -2061288 -1589234
$$ packed form
35360a216884K5851J08702L56943L33177L5694j25586p419M0882k26792n30300
35350a205732n17973l10222k12485j62257P1079L39758L12359R3300O0832J54721
35340a376620k943k63791k2924O70527R08563K48672n31317n87277k21393j98771
35330a377274m41340l19440J32773K88648O9803M6363L56146M30102L908l83080
35320a193391k17592K78217N80267M97070J17395l84087o53504l68247K10195
35311a133677L83759l7334m57914m27615k48020k74643k41991J56030N49170M40940
35301a291295Q5674P9955L39607K53420k60414o06819m32208N95M15732Q12173
35291f03580J007515O02728k93727r18240q14415m25476l15165l13701J2773M72054
$$ plain form
35281 -1589234 -1071275 -893635 -909274 -853284 -877425 -1193356 -1456299 -1110918 -315856 61645
35271 61645 -449397 -1269398 -1489843 -946510 -291240 -209968 -850206 -1861100 -2687230 -2880696
35261 -2880696 -2401457 -1650927 -1083503 -835642 -827757 -1020468 -1302331 -1303569 -738401 84155
35251 84155 494682 272588 -160012 -442345 -722308 -1167577 -1466032 -1227990 -617467 -138398
35241 -138398 55300 192949 306393 95213 -540968 -1230940 -1575646 -1596162 -1559793 -1568154
35231 -1568154 -1515906 -1325611 -1028616 -666262 -269408 57889 147404 -68749 -412254 -549549
35221 -549549 -318368 53498 198408 109144 177639 591309 918735 595707 -291828 -1062449
35211 -1062449 -1271241 -1134467 -1040257 -990816 -760488 -370511 -110024 -147625 -336408 -416534
$$ packed form
35281a589234N17959J77640j5639N5990k4141l15931k62943L45381P95062L77501
35271F1645n11042q20001k20445N43333O55270Q1272o40238j010894q26130j93466
35261b880696M79239P50530N67424K47861P885j92711k81863j238N65168Q22556
35251H4155M10527k22094m32600k82333k79963m45269k98455K38042O10523M79069
35241a38398J93698J37649J13444k11180o36181o89972l44706k0516L6369q361
35231a568154N2248J90295K96995L62354L96854L27297Q9515k16153l43505j37295
35221e49549K31181L71866J44910q9264O8495M13670L27426l23028q87535p70621
35211a062449k08792J36774R4210M9441K30328L89977K60487l7601j88783q0126
$$ plain form
35201 -416534 -298154 -134803 -165867 -472540 -882694 -1161571 -1271145 -1350735 -1479911 -1605878
35191 -1605878 -1680148 -1674802 -1466039 -956453 -387309 -256630 -753994 -1487595 -1963138 -2137484
35181 -2137484 -2275163 -2458757 -2564808 -2605879 -2710882 -2755056 -2392723 -1608724 -936889 -892296
35171 -892296 -1369671 -1852122 -2093685 -2305627 -2692670 -3119714 -3353888 -3380100 -3267996 -2921928
35161 -2921928 -2271158 -1619888 -1425770 -1654971 -1721088 -1267948 -698234 -617036 -996143 -1285809
35151 -1285809 -1202328 -948652 -707639 -427738 -201497 -349786 -887049 -1317393 -1272514 -1009068
35141 -1009068 -918196 -849573 -385665 385244 870054 744355 314656 34377 -10481 -19085
35131 -19085 -139984 -362205 -588382 -717357 -741648 -773045 -871421 -908727 -779646 -690136 -982621
$$ packed form
35201d16534J18380J63351l1064l06673m10154k78877j09574p9590j29176j25967
35191a605878p4270N346K08763N09586N69144J30679m97364p33601m75543j74346
35181b137484j37679j83594j06051m1071j05003m4174L62333P83999O71835M4593
35171h92296m77375m82451k41563k11942l87043m27044k34174k6212J12104L46068
35161b921928O50770O51270J94118k29201o6117M53140N69714Q1198l79107k89666
35151a285809Q3481K53676K41013K79901K26241j48289n37263m30344M4879K63446
35141a009068R0872O8623M63908P70909M84810j25699m29699k80279m4858q604
35131a9085j20899k22221k26177j28975k4291l1397r8376l7306J29081Q9510k92485
$$ plain form
35120 -982621 -1646344 -2239680 -2378681 -2116183 -1772365 -1588497 -1643578 -1920408 -2294392 -2553249
35110 -2553249 -2545214 -2257497 -1721079 -966427 -142799 451878 589400 319488 -104449 -472053
35100 -472053 -766781 -1123754 -1643686 -2199444 -2471229 -2270428 -1777010 -1331448 -1068743 -939932
35090 -939932 -990627 -1292313 -1587256 -1390749 -639894 46938 16553 -684067 -1437520 -1767258
35080 -1767258 -1692610 -1501342 -1425547 -1508536 -1607593 -1547330 -1368229 -1317792 -1483584 -1609172
35070 -1609172 -1458752 -1177145 -1027598 -942571 -676350 -294983 -121416 -226680 -393952 -617635
35060 -617635 -1161377 -1944353 -2322455 -1815872 -756421 125623 518574 580495 401270 -110565
35050 -110565 -855158 -1508735 -1947704 -2351444 -2773885 -2947095 -2692214 -2250879 -1970555 -1845831
$$ packed form
35120i82621o63723n93336j39001K62498L43818J83868n5081k76830l73984k58857
35110b553249Q035K87717N36418P54652Q23628N94677J37522k69912m23937l67604
35100d72053k94728l56973n19932n55758k71785K00801M93418M45562K62705J28811
35090i39932n0695l01686k94943J96507P50855O86832l0385p00620p53453l29738
35080a767258P4648J91268P5795q2989r9057O0263J79101N0437j65792j25588
35070a609172J50420K81607J49547Q5027K66221L81367J73567j05264j67272k23683
35060f17635n43742p82976l78102N06583J059451Q82044L92951O1921j79225n11835
35050a10565p44593o53577m38969m03740m22441j73210K54881M41335K80324J24724
$$ plain form
35040 -1845831 -1618856 -1224483 -895615 -854090 -1071951 -1332852 -1412376 -1226001 -901296 -668560
35030 -668560 -606511 -572742 -454571 -339262 -299534 -194513 74427 265092 89314 -271511
35020 -271511 -346727 -92839 10971 -272377 -522203 -305056 128507 193518 -222950 -735816
35010 -735816 -1096417 -1403338 -1725707 -1952728 -2064824 -2173488 -2209146 -1920595 -1305601 -736349
35000 -736349 -527648 -643449 -914495 -1238444 -1471314 -1484645 -1475740 -1816294 -2380104 -2483118
34990 -2483118 -1847911 -1173113 -1213526 -1651871 -1566324 -836946 -318863 -567771 -1134593 -1380916
34980 -1380916 -1354171 -1437494 -1612889 -1584372 -1359045 -1224926 -1278188 -1355847 -1352416 -1277822 -1081193
34969 -1081193 -736856 -461355 -542620 -949845 -1349294 -1484943 -1326398 -918968 -388516 -67369
$$ packed form
35040a845831K26975L94373L28868M1525k17861k60901p9524J86375L24705K32736
35030f68560O2049L3769J18171J15309L9728J05021K68940J90665j75778l60825
35020b71511p5216K53888J03810k83348k49826K17147M33563O5011m16468n12866
35010g35816l60601l06921l22369k27021j12096j08664l5658K88551O14994N69252
35000g36349K08701j15801k71046l23949k32870j3331Q905l40554n63810j03014
34990b483118O35207O74798m0413m38345Q5547P29378N18083k48908n66822k46323
34980a380916K6745q3323j75395K8517K25327J34119n3262p7659L431P4594J96629
34969a081193L44337K75501q1265m07225l99449j35649J58545M07430N30452L21147
$$ plain form
34959 -67369 -266460 -836039 -1232486 -1124747 -692973 -244293 170313 579297 798161 600435
34949 600435 75486 -416134 -617056 -569704 -497585 -603765 -913249 -1207158 -1197717 -876482
34939 -876482 -591431 -662472 -1031878 -1425923 -1722599 -1969610 -2163436 -2255081 -2296389 -2315106
34929 -2315106 -2099511 -1428315 -534200 10600 -8243 -188011 -140110 -66754 -387453 -1004751
34919 -1004751 -1353011 -1139032 -665163 -362736 -334598 -482687 -776309 -1153793 -1369728 -1244773
34909 -1244773 -995567 -1041293 -1468395 -1907623 -1982544 -1680042 -1215998 -749867 -368371 -173304
34899 -173304 -185624 -253791 -237120 -210707 -310374 -446953 -399434 -163671 39937 127489 260466
34888 260466 516121 700359 622686 350825 63399 -138674 -150123 131034 504888 463661
$$ packed form
34959f7369j99091n69579l96447J07739M31774M48680M14606M08984K18864j97726
34949F00435n24949m91620k00922M7352P2119j06180l09484k93909R441L21235
34939h76482K85051p1041l69406l94045k96676k47011j93826r1645m1308j8717
34929b315106K15595O71196Q94115N44800j8843j79768M7901P3356l20699o17298
34919a004751l48260K13979M73869L02427K8138j48089k93622l77484k15935J24955
34909a244773K49206m5726m27102m39228p4921L02502M64044M66131L81496J95067
34899a73304j2320o8167J6671K6413r9667j36579M7519K35763K03608Q7552J32977
34888B60466K55655J84238p7673k71861k87426k02073j1449K81157L73854m1227
$$ plain form
34878 463661 -213686 -1100693 -1692890 -2077181 -2586409 -3034744 -2938597 -2433498 -2249046 -2613262
34868 -2613262 -2859313 -2436647 -1704587 -1282099 -1142222 -916654 -678053 -735916 -889175 -599458
34858 -599458 117952 608605 476741 45076 -221098 -296716 -420501 -698114 -1068946 -1397807
34848 -1397807 -1480519 -1227418 -920242 -974956 -1351800 -1535362 -1234301 -759282 -528213 -532165
34838 -532165 -526524 -453139 -395302 -347922 -307889 -403681 -680392 -929042 -972967 -953384 -1082301
34827 -1082301 -1279442 -1325121 -1229874 -1164052 -1121338 -935525 -580243 -217564 7101 42453
34817 42453 -92107 -220453 -48373 473328 967159 1077900 958376 993594 1174113 1131164
34807 1131164 743164 308208 84880 18529 -21903 -68038 -183735 -459920 -795634 -968325
$$ packed form
34878D63661o77347q87007n92197l84291n09228m48335R6147N05099J84452l64216
34868b613262k46051M22666P32060M22488J39877K25568K38601n7863j53259K89717
34858e99458P17410M90653j31864m31665k66174p5618j23785k77613l70832l28861
34848a397807q2712K53101L07176n4714l76844j83562L01061M75019K31069l952
34838e32165N641P3385N7837M7380M0033r5792k76711k48650m3925J9583j28917
34827a082301j97141m5679R5247O5822M2714J85813L55282L62679K24665L5352
34817D2453j34560j28346J72080N21701M93831J10741j19524L5218J80519m2949
34807A131164l88000m34956k23328o6351m0432m6135j15697k76185l35714j72691
$$ plain form
34797 -968325 -981298 -1045797 -1178302 -1165067 -993669 -922796 -1000100 -941455 -691652 -660003 -1090243
34786 -1090243 -1603923 -1763072 -1731365 -1906205 -2184488 -2149772 -1810315 -1542238 -1342316 -769205
34776 -769205 238363 1051245 1142178 779995 615290 867680 1244204 1453095 1468775 1386560
34766 1386560 1282548 1177974 968284 469605 -288908 -912897 -989628 -541078 42010 454663
34756 454663 674594 774640 799000 845833 1026308 1252588 1259726 946121 535193 288179
34746 288179 200364 104099 -70422 -296008 -584589 -917097 -1107058 -958118 -553587 -189373
34736 -189373 -4411 114501 218482 131725 -258270 -739727 -1003417 -1007219 -912231 -757403
34726 -757403 -458434 -116273 -46995 -390629 -883657 -1177029 -1258718 -1382652 -1631435 -1751068
$$ packed form
34797i68325j2973o4499j32505J3235J71398P0873p7304N8645K49803L1649m30240
34786a090243n13680j59149L1707j74840k78283L4716L39457K68077J99922N73111
34776g69205J007568Q12882R0933l62183j64705K52390L76524K08891J5680q2215
34766A386560j04012j04574k09690m98679p58513o23989p6731M48550N83088M12653
34756D54663K19931J00046K4360M6833J80475K26280P138l13605m10928k47014
34746B88179q7815r6265j74521k25586k88581l32508j89961J48940M04531L64214
34736a89373J84962J18912J03981q6757l89995m81457k63690l802R4988J54828
34726g57403K98969L42161O9278l43634m93028k93372q1689j23934k48783j19633
$$ plain form
34716 -1751068 -1492427 -996196 -703457 -885313 -1362041 -1737285 -1825467 -1742692 -1635098 -1500056
34706 -1500056 -1307946 -1103723 -874352 -503782 -49361 107017 -317663 -994323 -1217969
34697 -1217969 -706034 107417 615802 564522 -40030 -1102975 -2208700 -2577569 -1785375
34688 -1785375 -452448 257727 -97551 -844623 -1148907 -966327 -814796 -945484 -1142123
34679 -1142123 -1211106 -1259162 -1414873 -1568299 -1544791 -1372871 -1223627 -1176354 -1185052 -1215274 -1253451
34668 -1253451 -1189249 -869459 -357341 -6460 -121689 -590475 -999643 -1112511 -1066442 -1055576
34658 -1055576 -1013562 -779259 -465554 -426707 -818890 -1356449 -1603100 -1431643 -1111350 -966599
34648 -966599 -1014714 -968481 -599999 -72212 180869 -41764 -426435 -510276 -266965 -110816
$$ packed form
34716a751068K58641M96231K92739j81856m76728l75244q8182Q2775J07594J35042
34706a500056J92110K04223K29371L70570M54421J56378m24680o76660k23646
34697a217969N11935Q13451N08385n1280o04552j062945j105725l68869P92194
34688a785375J332927P10175l55278p47072l04284J82580J51531j30688j96639
34679a142123o8983m8056j55711j53426K3508J71920J49244M7273q698l0222l8177
34668a253451O4202L19790N12118L50881j15229m68786m09168j12868M6069J0866
34658a055576M2014K34303L13705L8847l92183n37559k46651J71457L20293J44751
34648i66599m8115M6233L68482N27787K53081k22633l84671q3841K43311J56149
$$ plain form
34638 -110816 -289807 -529496 -443964 -103389 65783 -141811 -509114 -766911 -884537 -914044
34628 -914044 -818696 -636223 -597259 -825584 -1046447 -882229 -401263 -77327 -158007 -362826
34618 -362826 -348529 -224368 -366957 -860780 -1379108 -1585902 -1438878 -1079936 -619846 -113525
34608 -113525 367104 731561 923226 955940 906269 825157 631839 199999 -363208 -658165
34598 -658165 -401927 174542 553430 522903 313543 160798 25277 -181196 -393154 -578614
34588 -578614 -875540 -1334273 -1736504 -1905701 -2004096 -2231422 -2379412 -2047473 -1268079 -564630
34578 -564630 -315016 -342791 -258081 28163 293209 356183 270932 205205 220149 177542 -111629
34567 -111629 -604514 -977529 -987993 -799594 -752116 -880008 -939605 -898753 -1032362 -1400248
$$ packed form
34638a10816j78991k39689Q5532L40575J69172k07594l67303k57797j17626k9507
34628i14044R5348J82473L8964k28325k20863J64218M80966L23936q0680k04819
34618c62826J4297J24161j42589m93823n18328k06794J47024L58942M60090N06321
34608a13525M80629L64457J91665L2714m9671q1112j93318m31840n63207k94957
34598f58165K56238N76469L78888l0527k09360j52745j35521k06473k11958j85460
34588e78614k96926m58733m02231j69197r8395k27326j47990L31939P79394P03449
34578e64630K49614k7775Q4710K86244K65046O2974q5251o5727J4944m2607k89171
34567a11629m92885l73015j0464J88399M7478j27892n9597M0852j33609l67886
$$ plain form
34557 -1400248 -1576597 -1160999 -329235 390097 703469 657838 373866 46536 76796 734106
34547 734106 1634557 1961078 1362731 337176 -427862 -787649 -1005359 -1174506 -1110559 -694847
34537 -694847 -43039 605489 950703 704192 -102154 -931906 -1198747 -941216 -736953 -875281
34527 -875281 -965488 -568175 93895 400335 166857 -144643 -65237 315319 528516 296940
34517 296940 -208096 -609216 -717777 -663546 -656477 -700938 -664224 -594818 -731768 -1082210 -1240044
34506 -1240044 -883889 -283984 14022 -88566 -211306 -153869 -152257 -376025 -594318 -570611
34496 -570611 -451149 -488952 -661690 -854539 -1158272 -1626241 -1932915 -1683973 -986315 -356052
34486 -356052 -118371 -223608 -561228 -1038769 -1367339 -1233673 -800648 -625337 -896239 -1118938
$$ packed form
34557a400248j76349M15598Q31764P19332L13372m5631k83972l27330L0260O57310
34547G34106R00451L26521n98347j025555p65038l59787k17710j69147O3947M15712
34537f94847O51808O48528L45214k46511q06346q29752k66841K57531K04263j38328
34527h75281r0207L97313O62070L06440k33478l11500P9406L80556K13197k31576
34517B96940n05036m01120j08561N4231P069m4461L6714O9406j36950l50442j57834
34506a240044L56155N99905K98006j02588j22740N7437J612k23768k18293K3707
34496e70611J19462l7803j72738j92849l03733m67969l06674K48942O97658O30263
34486c56052K37681j05237l37620m77541l28570J33666M33025J75311k70902k22699
$$ plain form
34476 -1118938 -808078 -182696 139796 -67557 -487377 -780574 -942669 -1131809 -1378567
34467 -1378567 -1551888 -1527684 -1353041 -1232372 -1277885 -1285981 -928779 -220160 411182 636674
34457 636674 618704 705825 916486 982442 808458 610392 592223 706589 780286 720055 550675
34446 550675 359117 222753 117743 -72070 -367085 -578387 -518063 -272399 -108318 -143466
34436 -143466 -284653 -472299 -770388 -1167581 -1490064 -1616152 -1629189 -1638056 -1556981 -1206547
34426 -1206547 -597101 -4052 250907 60777 -404242 -863868 -1158360 -1301950 -1309319 -1075237
34416 -1075237 -553730 4388 204802 -37019 -365568 -416422 -238561 -144257 -254140 -393686
34406 -393686 -402458 -323316 -227151 -40218 310507 678692 786072 518561 22991 -493648
$$ packed form
34476a118938L10860O25382L22492k07353m19820k93197j62095j89140k46758
34467a378567j73321K4204J74643J20669m5513q096L57202P08619O31342K25492
34457F36674j7970Q7121K10661O5956j73984j98066j8169J14366P3697o0231j69380
34446E50675j91558j36364j05010j89813k95015k11302O0324K45664J64081l5148
34436a43466j41187j87646k98089l97193l22483j26088j3037q867Q1075L50434
34426a206547O09446N93049K54959j90130m65019m59626k94492j43590p369K34082
34416a075237N21507N58118K00414k41821l28549n0854J77861R4304j09883j39546
34406c93686q772P9142R6165J86933L50725L68185J07380k67511m95570n16639
$$ plain form
34396 -493648 -954254 -1373442 -1727032 -1919874 -1835305 -1404752 -729065 -166101 -135951 -685213
34386 -685213 -1343327 -1606999 -1523593 -1573078 -1961389 -2283742 -2005716 -1084655 36960 895695
34376 895695 1283186 1201805 820580 483673 531074 979997 1455851 1530655 1144911 686685
34366 686685 630399 1054103 1530766 1567849 1116911 515271 -19024 -549537 -1014329 -1026446
34356 -1026446 -381295 476457 880470 738468 535856 604514 794700 898731 966033 1044035
34346 1044035 985121 741120 540893 511884 390427 -81956 -676174 -927566 -743552 -430857
34336 -430857 -205711 -26394 114831 101754 -25533 -4122 312003 765282 1133158 1327454
34326 1327454 1287151 966934 579441 528841 837708 924075 335510 -483585 -638636 43653
$$ packed form
34396d93648m60606m19188l53590j92842Q4569M30553O75687N62964L0150n49262
34386f85213o58114k63672Q3406m9485l88311l22353K78026R21061J121615Q58735
34376H95695L87491q1381l81225l36907M7401M48923M75854P4804l85744m58226
34366F86685n6286M23704M76663L7083m50938o01640n34295n30513m64792j2117
34356a026446O45151Q57752M04013j42002k02612O8658J90186J04031O7302P8002
34346A044035n8914k44001k00227k9009j21457m72383n94218k51392J84014L12695
34336d30857K25146J79317J41225j3077j27287K1411L16125M53279L67876J94296
34326A327454m0303l20217l87493n0600L08867Q6367n88565q19095j55051O82289
$$ plain form
34316 43653 805036 1022699 958179 1143357 1484047 1473893 1024245 500524 31328 -600537
34306 -600537 -1291426 -1457110 -852951 -79933 156229 -40824 -61759 229214 387979 198790
34296 198790 -5061 29364 36296 -280363 -687621 -726586 -361240 59512 393874 867631
34286 867631 1577452 2161252 2186475 1727050 1316514 1310411 1480738 1376561 981549 766317
34276 766317 1016451 1356292 1196907 538276 -11293 -41338 183430 218371 100079 187314
34266 187314 502113 626323 305815 -150709 -240274 143802 659431 945474 921657 704315
34256 704315 427192 209393 148862 221720 271612 229799 269700 553201 861811 759757
34246 759757 221192 -180502 67603 769189 1306544 1426183 1394484 1447483 1493387 1422690
$$ packed form
34316D3653P61383K17663o4520J85178L40690j0154m49648n23721m69196o31865
34306f00537o90889j65684O04159P73018K36162j97053k0935K90973J58765j89189
34296A98790k03851L4425O932l16659m07258l8965L65346M20752L34362M73757
34286H67631P09821N83800K5223m59425m10536o103J70327j04177l95012k15232
34276G66317K50134L39841j59385o58631n49569l0045K24768L4941j18292Q7235
34266A87314L14799J24210l20508m56524q9565L84076N15629K86043k3817k17342
34256G04315k77123k17799o0531P2858M9892m1813L9901K83501L08610j02054
34246G59757n38565m01694K48105P01586N37355J19639l1699N2999M5904p0697
$$ plain form
34236 1422690 1335019 1298353 1187364 949486 774757 802705 892795 895453 924050 1108694 1275712
34225 1275712 1159432 809720 531240 510517 706163 965010 1027607 615825 -178176 -770082
34215 -770082 -728585 -405416 -480041 -960856 -1173127 -791001 -316350 -306910 -623304 -790766
34205 -790766 -719494 -634293 -548567 -284423 83000 236797 97460 -49168 26108 213547
34195 213547 300949 286081 335377 557738 907180 1220585 1294906 1014686 475732 -49980
34185 -49980 -303418 -189333 206881 670192 954367 950008 791693 727476 851139 1015037
34175 1015037 1026531 875301 732665 762703 979736 1294543 1656965 2077265 2473180 2599278
34165 2599278 2288842 1753949 1447615 1550240 1771737 1775265 1590437 1409022 1182835 762329
$$ packed form
34236A422690q7671l6666j10989k37878j74729K7948R0090K658K8597J84644J67018
34225A275712j16280l49712k78480k0723J95646K58847O2597m11782p94001n91906
34215g70082M1497L23169p4625m80815k12271L82126M74651R440l16394j67462
34205g90766P1272Q5201Q5726K64144L67423J53797j39337j46628P5276J87439
34195B13547Q7402j4868M9296K22361L49442L13405P4321k80220n38954n25712
34185d9980k53438J14085L96214M63311K84175m359j58315o4217J23663J63898
34175A015037J1494j51230j42636L0038K17033L14807L62422M20300L95915J26098
34165B599278l10436n34893l06334J02625K21497L528j84828j81415k26187m20506
$$ plain form
34155 762329 321794 216635 372944 258238 -339623 -889429 -804540 -278638 -17724 -275128
34145 -275128 -598295 -538282 -184870 138661 359912 601590 865629 1022791 1016717 904848
34135 904848 774598 739403 912578 1258615 1569979 1700458 1699914 1620695 1385236 1017148
34125 1017148 787811 866597 1008321 924036 807994 1056659 1529441 1625060 1205240 914558
34115 914558 1302839 2068031 2546452 2601447 2565263 2548744 2348117 1958705 1666725 1577910
34105 1577910 1490059 1336169 1353441 1647234 1945066 2010675 2001930 2137760 2245297 1981349
34095 1981349 1391648 910631 801943 881831 870312 780540 801293 927266 911946 606344
34085 606344 203672 41965 205628 442117 497988 410280 368119 401642 398105 393772 618813
$$ packed form
34155G62329m40535j05159J56309j14706n97861n49806Q4889N25902K60914k57404
34145b75128l23167O0013L53412L23531K21251K41678K64039J57162o074j11869
34135I04848j30250l5195J73175L46037L11364J30479n44p9219k35459l68088
34125A017148k29337P8786J41724q4285j16042K48665M72782R5619m19820k90682
34115I14558L88281P65192M78421N4995l6184j6519k00627l89412k91980q8815
34105A577910q7851j53890J7272K93793K97832O5609q745J35830J07537k63948
34095A981349n89701m81017j08688P9888j1519q9772K0753J25973j5320l05602
34085F06344m02672j61707J63663K36489N5871q7708m2161L3523l537m333K25041
$$ plain form
34074 618813 1162440 1758164 2033165 1878060 1467482 1021526 692180 606756 815661 1153567
34064 1153567 1303943 1111721 778361 650871 819573 1009489 925163 654834 622303 1092032
34054 1092032 1802818 2192599 1968583 1366932 852738 666639 706800 766990 790618 881021
34044 881021 1108709 1363961 1458159 1381771 1373786 1642980 2070581 2326161 2293656 2245488 2507369
34033 2507369 3030836 3416227 3360101 2989022 2696687 2703330 2882761 3043383 3232576 3609789
34023 3609789 4103334 4432897 4492371 4451940 4383284 4066857 3385841 2667981 2323079 2288642
34013 2288642 2171916 1860147 1640488 1734530 2057977 2469941 2931178 3355620 3623463 3825340
34003 3825340 4182382 4623123 4761688 4442037 3999839 3805266 3820936 3805436 3698092 3586722
$$ packed form
34074F18813N43627N95724K75001j55105m10578m45956l29346q5424K08905L37906
34064A153567J50376j92222l33360j27490J68702J89916q4326k70329l2531M69729
34054A092032P10786L89781k24016o01651n14194j86099M0161O0190K3628R0403
34044H81021K27688K55252R4198p6388p985K69194M27601K55580l2505m8168K61881
34033B507369N23467L85391n6126l71079k92335O643J79431J60622J89193L77213
34023C609789M93545L29563N9474m0431o8656l16427o81016p17860l44902l4437
34013B288642j16726l11769k19659R4042L23447M11964M61237M24442K67843K01877
34003C825340L57042M40741J38565l19651m42198j94573J5670j5500j07344j11370
$$ plain form
33993 3586722 3498416 3399736 3214768 2747983 1886319 1004417 782515 1384860 2192847 2623619
33983 2623619 2783050 2942363 2874730 2328890 1784355 1940028 2577122 2733297 2090503 1459784
33973 1459784 1653560 2496270 3278327 3676365 3823276 3848569 3791150 3767209 3865814 3975349
33963 3975349 3939440 3773715 3571977 3352845 3144531 3041861 3022897 2885582 2520132 2069863
33953 2069863 1682718 1306489 894556 604957 593983 788897 1055277 1401371 1809338 2073004
33943 2073004 2085124 2132653 2587513 3368170 3993025 4141193 3904170 3502734 3040350 2601218
33933 2601218 2340693 2316231 2345902 2183747 1824265 1550744 1639862 2030713 2356663 2370676
33923 2370676 2267064 2427233 2868035 3161438 2987515 2585329 2513266 3053353 3928805 4513028
$$ packed form
33993C586722q8306r8680j84968m66785q61664q81902k21902O02345Q07987M30772
33983B623619J59431J59313o7633n45840n44535J55673O37094J56175o42794o30719
33973A459784J93776Q42710P82057L98038J46911K5293n7419k3941R8605J09535
33963C975349l5909j65725k01738k19132k08314j02670j8964j37315l65450m50269
33953B069863l87145l76229m11933k89599j0974J94914K66380L46094M07967K63666
33943B073004J2120M7529M54860P80657O24855J48168k37023m01436m62384m39132
33933B601218k60525k4462K9671j62155l59482k73521Q9118L90851L25950J4013
33923B370676j03612J60169M40802K93403j73923m02186p2063N40087Q75452N84223
$$ plain form
33913 4513028 4305378 3393336 2503435 2372182 2967058 3553157 3615646 3408889 3440728 3794628
33903 3794628 4263667 4793816 5345439 5576384 5209618 4613146 4477734 4914554 5367702
33894 5367702 5463174 5420185 5476147 5428199 5052753 4592461 4462236 4701763 5020115 5202689
33884 5202689 5212281 5051030 4780159 4557230 4446828 4331394 4194400 4286513 4739207 5201569
33874 5201569 5224892 4913783 4800759 5074889 5342499 5270251 5087189 5201618 5596630 5938569
33864 5938569 6146672 6485973 7061625 7534942 7520607 7100298 6737227 6729277 6922251 6986921
33854 6986921 6842434 6725763 6894197 7306682 7583104 7307476 6461250 5548575 5164234
33845 5164234 5410413 5879524 6232068 6552247 7000948 7392783 7431939 7221293 7169447 7418749
$$ packed form
33913D513028k07650r12042q89901j31253N94876N86099O2489k06757L1839L53900
33903C794628M69039N30149N51623K30945l66766n96472j35412M36820M53148
33894E367702R5472m2989N5962m7948l75446m60292j30225K39527L18352J82574
33884E202689R592j61251k70871k22929j10402j15434j36994R2113M52694M62362
33874E201569K3323l11109j13024K74130K67610p2248j83062J14429L95012L41939
33864E938569K08103L39301N75652M73317j4335m20309l63071p950J92974O4670
33854F986921j44487j16671J68434M12485K76422k75628q46226r12675l84341
33845E164234K46179M69111L52544L20179M48701L91835L9156k10646n1846K49302
$$ plain form
33835 7418749 7712795 7849125 7888516 7824670 7457532 6831729 6452718 6713155 7313029 7617258
33825 7617258 7485959 7401732 7794492 8547661 9212463 9463648 9280072 8872870 8520695 8364191
33815 8364191 8333080 8345801 8498904 8901066 9414966 9810772 10130102 10593860 11119027 11273101
33805 11273101 10879545 10393090 10416339 10994579 11629595 11894630 11787802 11509137 11156028
33796 11156028 10755875 10449658 10458197 10835993 11358465 11756421 12040333 12447039 13014469 13404994
33786 13404994 13337008 13032889 12948842 13150048 13318868 13367977 13588259 14050370 14335601 14172547
33776 14172547 13939067 14106546 14503861 14663558 14701035 15227453 16377921 17503441 18001649
33767 18001649 18006906 18033132 18280814 18546905 18587784 18369159 18108943 18153623 18618612 19143747
$$ packed form
33835G418749K94046J36330L9391o3846l67138o25803l79011K60437N99874L04229
33825G617258j31299q4227L92760P53169O64802K51185j83576m07202l52175j56504
33815H364191l1111J2721J53103M02162N13900L95806L19330M63758N25167J54074
33805A1273101l93556m86455K3249N78240O35016K65035j06828k78665l53109
33796A1156028m00153l06217Q539L77796N22472L97956K83912M06706N67430L90525
33786A3404994o7986l04119q4047K01206J68820M9109K20282M62111K85231j63054
33776A4172547k33480J67479L97315J59697L7477N26418J150468J125520M98208
33767A8001649N257K6226K47682K66091M0879k18625k60216M4680M64989N25135
$$ plain form
33757 19143747 19297628 19224809 19482785 20173722 20753589 20910452 21086700 21753633 22652638
33748 22652638 23257835 23609402 24107987 24740409 25111383 25108231 24988855 24917261 24936104 25280148
33738 25280148 26130199 27111029 27642823 27803374 28236887 29161758 30105102 30728043 31243361
33729 31243361 31809693 32186623 32318335 32648861 33453821 34378633 35040512 35584306 36214719
33720 36214719 36694290 36826192 36980090 37566948 38382215 39058982 39794373 40952602 42253824
33711 42253824 43109435 43591025 44314998 45432546 46468207 47189007 47934338 48963001 50099055
33702 50099055 51196062 52403845 53789710 55174609 56505646 57942403 59448613 60765939
33694 60765939 61919511 63260330 64859442 66373250 67701845 69256664 71307263 73534564
$$ packed form
33757A9143747J53881p2819K57976O90937N79867J56863J76248O66933Q99005
33748B2652638O05197L51567M98585O32422L70974l152j19376p1594J8843L44044
33738B5280148Q50051R80830N31794J60551M33513R24871R43344O22941N15318
33729C1243361N66332L76930J31712L30526Q04960R24812O61879N43794O30413
33720C6214719M79571J31902J53898N86858Q15267O76767P35391J158229J301222
33711D2253824Q55611M81590P23973J117548J035661P20800P45331J028663J136054
33702E0099055J097007J207783J385865J384899J331037J436757J506210J317326
33694F0765939J153572J340819J599112J513808J328595J554819K050599K227301
$$ plain form
33686 73534564 75521896 77261996 78907680 80472685 82096749 84164541 86776766 89457664
33678 89457664 91740420 93721418 95748071 97956062 100439995 103425655 106835776 110096894
33670 110096894 112868163 115595427 118830051 122368305 125664226 128776905 132226907 136127711
33662 136127711 140169614 144342827 148944267 153877409 158661624 163228295 168038598 173256263
33654 173256263 178457333 183416163 188566706 194294462 200255627 205878074 211239713 216962551
33646 216962551 223322440 229840642 235821013 241103858 246191198 251649599 257479373 263229708
33638 263229708 268719520 274288432 280121158 285736927 290632385 295129445 299928975 304955281
33630 304955281 309380024 312824417 315765873 318556863 320821717 322224046 323138115 323994317
$$ packed form
33686G3534564J987332J740100J645684J565005J624064K067792K612225K680898
33678H9457664K282756J980998K026653K207991K483933K985660L410121L261118
33670A10096894K771269K727264L234624L538254L295921L112679L450002L900804
33662A36127711M041903M173213M601440M933142M784215M566671M810303N217665
33654A73256263N201070M958830N150543N727756N961165N622447N361639N722838
33646B16962551O359889O518202N980371N282845N087340N458401N829774N750335
33638B63229708N489812N568912N832726N615769M895458M497060M799530N026306
33630C04955281M424743L444393K941456K790990K264854J402329R14069Q56202
$$ plain form
33622 323994317 324487156 324072783 322897710 321589916 320320196 318637582 316135105 312816180
33614 312816180 308905088 304718693 300614750 296644269 292345858 287288986 281727431 276304920
33606 276304920 271208930 266057440 260552896 254773343 248844371 242837839 237049271 231843861
33598 231843861 227047177 221947101 216153463 210099925 204442057 199269868 194193765 188959385
33590 188959385 183680410 178623357 174014706 169932813 166160676 162245860 157919336 153392972
33582 153392972 149082110 145122810 141334962 137564273 133827311 130137680 126432272 122768561
33574 122768561 119436225 116702762 114461087 112258816 109749968 107051185 104540997 102345126
33566 102345126 100206380 97908562 95588115 93443322 91352117 89088358 86782163 84759386
$$ packed form
33622C23994317M92839m14373j175073j307794j269720j682614k502477l318925
33614C12816180l911092m186395m103943l970481m298411n056872n561555n422511
33606B76304920n095990n151490n504544n779553n928972o006532n788568n205410
33598B31843861m796684n100076n793638o053538n657868n172189n076103n234380
33590A88959385n278975n057053m608651m081893l772137l914816m326524m526364
33582A53392972m310862l959300l787848l770689l736962l689631l705408l663711
33574A22768561l332336k733463k241675k202271k508848k698783k510188k195871
33566A02345126k138746k297818k320447k144793k091205k263759k306195k022777
$$ plain form
33558 84759386 82931622 80805647 78271737 75972908 74554269 73786041 72789506 71030341
33550 71030341 68797547 66775188 65421629 64719384 64219484 63283378 61564480 59398619
33542 59398619 57555642 56468839 55802974 54882581 53469107 52006287 51114775 50915252 50877066
33533 50877066 50338566 49164804 47835731 46863529 46228293 45496163 44404817 43143751 42065335
33524 42065335 41323186 40857788 40538334 40171426 39516893 38505185 37393562 36519649 35907539
33515 35907539 35305510 34636647 34173432 34105470 34109617 33624985 32551542 31437435 30877431
33506 30877431 30890908 31015648 30869032 30425117 29814995 29103757 28340679 27667307 27239276
33497 27239276 27075622 27050364 27015916 26915948 26803687 26737281 26616624 26197354 25414909 24655611
$$ packed form
33558H4759386j827764k125975k533910k298829j418639p68228r96535j759165
33550G1030341k232794k022359j353559p02245m99900r36106j718898k165861
33542E9398619j842977j086803o65865r20393j413474j462820q91512j99523l8186
33533E0877066n38500j173762j329073r72202o35236p32130j091346j261066j078416
33524D2065335p42149m65398l19454l66908o54533j011708j111623q73913o12110
33515C5907539o02029o68863m63215o7962M147m84632j073443j114107n60004
33506C0877431J3477J24740j46616m43915o10122p11238p63078o73372m28031
33497B7239276j63654k5258l4448r9968j12261o6406j20657m19270p82445p59298
$$ plain form
33487 24655611 24448781 24777211 24930482 24283630 23088300 22207963 22111137 22426210 22534380
33478 22534380 22286473 21955097 21720675 21484484 21099047 20532960 19825687 19094893 18597315
33469 18597315 18549862 18792825 18814988 18279565 17445787 16925606 17048230 17562792 17933861 17822933
33459 17822933 17298153 16698869 16342618 16296651 16384495 16413446 16351948 16232036 15965731 15440570
33449 15440570 14813732 14494853 14676273 15000132 14895582 14226676 13433871 13025110 13104598
33440 13104598 13450020 13838669 14121123 14112800 13682960 12985083 12401826 12165315 12154306 12148728
33430 12148728 12144494 12265274 12455911 12468236 12162676 11673892 11259800 11120822 11350640 11837887
33420 11837887 12147814 11770879 10709920 9647538 9264987 9494754 9722413 9640488 9524855
$$ packed form
33487B4655611k06830L28430J53271o46852j195330q80337r6826L15073J08170
33478B2534380k47907l31376k34422k36191l85437n66087p07273p30794m97578
33469A8597315m7453K42963K2163n35423q33778n20181J22624N14562L71069j10928
33459A7822933n24780n99284l56251m5967Q7844K8951o1498j19912k66305n25161
33449A5440570o26838l18879J81420L23859j04550o68906p92805m08761P9488
33440A3104598L45422L88649K82454q323m29840o97877n83257k36511j1009n578
33430A2148728m234J20780J90637J2325l05560m88784m14092j38978K29818M87247
33420A1837887L09927l76935j060959j062382l82551K29767K27659q1925j15633
$$ plain form
33411 9524855 9623140 9690104 9389865 8887820 8694827 8995764 9410604 9452124 9051212 8580655
33401 8580655 8439503 8642074 8824352 8712863 8536078 8763296 9395524 9810333 9518699
33392 9518699 8829466 8445739 8557513 8711350 8534575 8198976 8087053 8313717 8699855
33383 8699855 8966210 8839407 8224609 7439646 7052797 7262349 7567638 7272065 6263352
33374 6263352 5138270 4578804 4722624 5147607 5391063 5420409 5538191 5843532 5997746
33365 5997746 5718744 5334689 5475022 6216675 6929654 7082260 6822392 6565975 6386317
33356 6386317 6137469 5897757 5889136 6099145 6334885 6547611 6776364 6880673 6707184 6470778
33346 6470778 6564082 6943727 7085282 6674606 6029408 5660806 5654728 5678590 5444844 4996049
$$ packed form
33411I524855R8285O6964l00239n02045j92993L00937M14840M1520m00912m70557
33401H580655j41152K02571J82278j11489j76785K27218O32228M14809k91634
33392I518699o89233l83727J11774J53837j76775l35599j11923K26664L86138
33383H699855K66355j26803o14798p84963l86849K09552L05289k95573j008713
33374F263352j125082n59466J43820M24983K43456K9346J17782L05341J54214
33365E997746k79002l84055J40333P41653P12979J52606k59868k56417j79658
33356F386317k48848k39712q621K10009K35740K12726K28753J04309j73489k36406
33346F470778R3304L79645J41555m10676o45198l68602o078K3862k33746m48795
$$ plain form
33336 4996049 4610342 4529946 4736577 4975763 5071301 5153836 5415843 5708822 5652596 5163968
33326 5163968 4592177 4249819 4099039 4036353 4174104 4576515 4947466 4926642 4618354 4518610
33316 4518610 4908874 5577467 6189257 6672046 7062581 7140253 6530885 5284902 4143127
33307 4143127 3929270 4636000 5360779 5288652 4519143 3724550 3273474 3099858 3240895 3871858
33297 3871858 4705236 4973512 4368300 3558768 3356383 3711910 4025104 4160334 4517619
33288 4517619 5161391 5530566 5199315 4441651 3773633 3291381 2774906 2213043 1886343
33279 1886343 1996800 2452442 3005117 3453113 3733656 3941680 4250173 4723822 5215545
33270 5215545 5497565 5467698 5185539 4764032 4316356 3993950 3959468 4226217 4542145 4550260
$$ packed form
33336D996049l85707q0396K06631K39186R5538Q2535K62007K92979n6226m88628
33326E163968n71791l42358j50780o2686J37751M02411L70951k0824l08288r9744
33316D518610L90264O68593O11790M82789L90535P7672o09368j245983j141775
33307D143127k13857P06730P24779p2127p69509p94593m51076j73616J41037O30963
33297C871858Q33378K68276o05212q09532k02385L55527L13194J35230L57285
33288D517619O43772L69175l31251p57664o68018m82252n16475n61863l26700
33279A886343J10457M55642N52675M47996K80543K08024L08493M73649M91723
33270E215545K82020k9867k82159m21507m47676l22406l4482K66749L15928Q115
$$ plain form
33260 4550260 4156537 3685140 3551097 3815697 4226717 4661157 5237074 5885855 6147514
33251 6147514 5690281 4832919 4211467 4046388 4082257 4141233 4291856 4461677 4357482 3926190
33241 3926190 3499950 3291963 3128866 2927914 3037784 3705881 4499065 4741748 4393963
33232 4393963 4016188 3910863 3809596 3507930 3303707 3496770 3794915 3627590 2917119
33223 2917119 2155001 1718204 1478600 1229569 1175104 1662225 2548843 3215241 3279547 2994741
33213 2994741 2774154 2613207 2272065 1817458 1579639 1640661 1785443 1992898 2534524 3414072
33203 3414072 4092244 4042907 3336591 2454964 1784808 1516103 1726736 2222425 2516530 2327232
33193 2327232 1930402 1712260 1614823 1424212 1342646 1700336 2238084 2338192 1993435 1875428
$$ packed form
33260D550260l93723m71397j34043K64600M11020M34440N75917O48781K61659
33251F147514m57233q57362o21452j65079L5869N8976J50623J69821j04195m31292
33241C926190m26240k07987j63097k00952J09870O68097P93184K42683l47785
33232D393963l77775j05325j01267l01666k04223J93063K98145j67325p10471
33223B917119p62118m36797k39604k49031n4465M87121Q86618O66398O4306k84806
33213B994741k20587j60947l41142m54607k37819O1022J44782K07455N41626Q79548
33203C414072O78172m9337p06316q81627o70156k68705K10633M95689K94105j89298
33193B327232l96830k18142r7437j90611q1566L57690N37748J00108l44757j18007
$$ plain form
33183 1875428 2275466 2639905 2474802 2098576 2018301 2058258 1727058 1148987 965283 1386167
33173 1386167 1920490 2102899 2018309 1983578 2088213 2215736 2246682 2094874 1765685 1505821
33163 1505821 1677086 2305151 2902649 2938813 2441939 1985808 2050713 2477062 2628691 2122988
33153 2122988 1329602 1013129 1473045 2210693 2527451 2259560 1773099 1450870 1462354 1887289
33143 1887289 2674241 3453349 3740157 3460931 3040302 2854886 2830320 2722116 2564968 2599770
33133 2599770 2859757 3066293 2951146 2543599 2095116 1781405 1532843 1196701 858094
33124 858094 861499 1365428 1971729 2056450 1496699 814151 501989 470935 355592 147363
33114 147363 210297 723945 1394703 1790133 1790310 1629138 1598642 1798903 2125757 2410352
$$ packed form
33183A875428M00038L64439j65103l76226q0275L9957l31200n78071j83704M20884
33173A386167N34323J82409q4590l4731J04635J27523L0946j51808l29189k59864
33163A505821J71265O28065N97498L6164m96874m56131O4905M26349J51629n05703
33153B122988p93386l16473M59916P37648L16758k67891m86461l22229J1484M24935
33143A887289P86952P79108K86808k79226m20629j85416k4566j08204j57148L4802
33133B599770K59987K06536j15147m07547m48483l13711k48562l36142l38607
33124H58094L405N03929O06301Q4721n59751o82548l12162l1054j15343k08229
33114A47363O2934N13648O70758L95430J77j61172l0496K00261L26854K84595
$$ plain form
33104 2410352 2539224 2488558 2346510 2345367 2736705 3458206 3990925 3807361 3016175 2314220
33094 2314220 2175406 2328531 2239310 1887328 1747307 2091906 2644976 2960656 2884415 2556870
33084 2556870 2173151 1865878 1692221 1603859 1480384 1272151 1086151 1092367 1357879 1772588
33074 1772588 2119754 2243916 2172746 2039708 1898828 1729270 1633359 1818571 2250706 2537987
33064 2537987 2406742 2144152 2253887 2733233 3031195 2756111 2117966 1592057 1420565
33055 1420565 1537603 1708505 1617224 1086582 372050 -15767 49480 124243 -129161 -383337
33045 -383337 -118971 556432 1007707 930225 679374 686484 932439 1165648 1342972 1611037
33035 1611037 2005224 2388148 2634560 2728532 2699142 2567090 2364978 2160351 2042990 2076315
$$ packed form
33104B410352J28872n0666j42048j143L91338P21501N32719j83564p91186p01955
33094B314220j38814J53125q9221l51982j40021L44599N53070L15680p6241l27545
33084B556870l83719l07273j73657q8362j23475k08233j86000O216K65512M14709
33074A772588L47166J24162p1170j33038j40880j69558r5911J85212M32135K87281
33064B537987j31245k62590J09735M79346K97962k75084o38145n25909j71492
33055A420565J17038J70902r1281n30642p14532l87817O5247P4763k53404k54176
33045c83337K64366O75403M51275p7482k50851P110K45955K33209J77324K68065
33035A611037L94187L82924K46412R3972k9390j32052k02112k04627j17361L3325
$$ plain form
33025 2076315 2232017 2390359 2450708 2422092 2360548 2267648 2133258 2029410 2041381 2122866
33015 2122866 2149468 2130464 2238771 2564440 2904012 2859959 2176185 1037631 68816 -87271
33005 -87271 657997 1712534 2355241 2363898 2003797 1552538 1101210 761357 717811 957597
32995 957597 1186549 1156913 919641 673603 559052 680250 1078942 1517837 1522643 881389
32985 881389 -45388 -733423 -1071215 -1282634 -1412232 -1234069 -687792 -107097 106473 -127161
32975 -127161 -587325 -1031366 -1364081 -1602353 -1742845 -1674498 -1272435 -624434 -70948 109050
32965 109050 14749 12353 338607 910755 1465193 1748378 1620353 1132432 508790 -51353
32955 -51353 -524153 -935219 -1196621 -1231706 -1159023 -1136070 -1092416 -861133 -521236 -323060
$$ packed form
33025B076315J55702J58342O0349k8616o1544r2900j34390j03848J1971Q1485
33015B122866K6602j9004J08307L25669L39572m4053o83774j138554r68815j56087
33005h7271P45268J054537O42707Q657l60101m51259m51328l39853m3546K39786
32995I57597K28952k9636k37272k46038j14551J21198L98692M38895M806o41254
32985H81389r26777o88035l37792k11419j29598J78163N46277N80695K13570k33634
32975a27161m60164m44041l32715k38272j40492O8347M02063O48001N53486J79998
32965A09050r4301k396L26254N72148N54438K83185j28025m87921o23642n60143
32955e1353m72800m11066k61402l5085P2683K2953M3654K31283L39897J98176
$$ plain form
32945 -323060 -278816 -133140 210868 534895 652747 618600 493364 231086 -46256 -4422
32935 -4422 421610 796905 743560 479580 445124 596572 517270 153095 -31562 282795
32925 282795 829399 1142327 1110997 960504 876963 865821 890006 957957 1059279 1103837 973233
32914 973233 654334 321221 208160 341446 490973 496975 531661 836995 1270675 1391095
32904 1391095 1047948 631365 588729 886237 1142726 1170427 1147472 1277074 1500798 1633695
32894 1633695 1628488 1557521 1402756 1055356 574944 277589 399141 750255 910937 760012
32884 760012 582596 590961 594514 324156 -116630 -382758 -372681 -326366 -452354 -660003 -682270
32873 -682270 -340299 274360 757121 632661 -151297 -1023168 -1281589 -756241 173937 1073072
$$ packed form
32945c23060M4244J45676L44008L24027J17852l4147j25236k62278k77342M1834
32935d422M26032L75295n3345k63980l4456J51448p9302l64175j84657L14357
32925B82795N46604L12928l1330j50493q3541j1142K4185O7951J01322M4558j30604
32914I73233l18899l33113j13061J33286J49527O002L4686L05334M33680J20420
32904A391095l43147m16583m2636K97508K56489K7701k2955J29602K23724J32897
32894A633695n207p0967j54765l47400m80412k97355J21552L51114J60682j50925
32884G60012j77416Q365L553k70358m40786k66128J0077M6315j25988k07649k2267
32873f82270L41971O14659M82761j24460p83958q71871k58421N25348R30178Q99135
$$ plain form
32863 1073072 1689838 1863381 1612558 1308991 1338101 1528570 1343837 735352 310768 425176
32853 425176 601403 251896 -410109 -677761 -329106 218778 619169 937889 1250684 1355583
32843 1355583 1074514 582869 264958 338080 661188 847874 638881 266730 299836 935887
32833 935887 1626801 1690188 1144376 580739 321105 152580 -106084 -271947 -185863 -9552
32823 -9552 104515 311201 776842 1341612 1742897 1976854 2190138 2386562 2486701 2525668
32813 2525668 2546074 2434716 2123644 1825034 1770873 1803429 1554089 1031103 715789 990250
32803 990250 1712206 2450214 2913619 3023538 2784423 2321901 1948613 1941929 2214480 2356246
32793 2356246 2071494 1485773 965090 723525 709658 810722 993757 1210963 1340610 1354276
$$ packed form
32863A073072O16766J73543k50823l03567K9110J90469j84733o08485m24584J14408
32853D25176J76227l49507o62005k67652L48655N47884M00391L18720L12795J04899
32843A355583k81069m91645l17911P3122L23108J86686k08993l72151L3106O36051
32833I35887O90914O3387n45812n63637k59634j68525k58664j65863Q6084J76311
32823i552J14067K06686M65641N64770M01285K33957K13284J96424J00139L8967
32813B525668K0406j11358l11072k98610n4161L2556k49340n22986l15314K74461
32803I90250P21956P38008M63405J09919k39115m62522l73288o684K72551J41766
32793B356246k84752n85721n20683k41565j3867J01064J83035K17206J29647J3666
$$ plain form
32783 1354276 1421542 1660768 1851024 1632084 1025702 527803 558719 986885 1347980 1414610
32773 1414610 1374594 1505465 1836373 2126344 2069093 1541403 757595 169299 110179 514751
32763 514751 1021878 1322253 1358591 1251403 1126880 1002294 785964 428509 102805 118454
32753 118454 554493 1080560 1281794 1073694 644815 116285 -475404 -913995 -881093 -424145
32743 -424145 -61557 -193049 -569782 -591022 -54546 604845 816489 443160 -168420 -566966
32733 -566966 -571879 -341702 -117749 83051 449573 1018401 1466206 1408733 845232 155548
32723 155548 -282592 -289748 213576 1163421 2131891 2502169 2126154 1586472 1502306 1733898
32713 1733898 1639243 1033994 438391 280533 313066 114538 -167575 -11150 663807 1300855
$$ packed form
32783A354276O7266K39226J90256k18940o06382m97899L0916M28166L61095O6630
32773A414610m0016J30871L30908K89971n7251n27690p83808n88296n9120M04572
32763E14751N07127L00375L6338j07188j24523j24586k16330l57455l25704J5649
32753A18454M36039N26067K01234k08100m28879n28530n91689m38591L2902M56948
32743d24145L62588j31492l76733k1240N36476O59391K11644l73329o11580l98546
32733e66966m913K30177K23953K00800L66522N68828M47805n7473n63501o89684
32723A55548m38140p156N03324R49845R68470L70278l76015n39682q4166K31592
32713A733898r4655o05249n95603j57858L2533j98528k82113J56425O74957O37048
$$ plain form
32703 1300855 1394657 1062652 799154 870477 1106685 1169023 888029 401898 59445 147364
32693 147364 638655 1213047 1534180 1482656 1160146 772639 519933 489950 611486 766906
32683 766906 945236 1189153 1408627 1407666 1140791 786565 492513 215551 -59775 -123439
32673 -123439 199616 661104 739047 255215 -351937 -511862 -164080 250939 390733 387805
32663 387805 555296 907219 1177332 1232331 1197912 1136066 881159 361937 -154172 -392076
32653 -392076 -465484 -637746 -828197 -743182 -434398 -264798 -254970 51309 861011 1710435
32643 1710435 2081558 2062874 2002922 1830660 1240547 389319 -137469 -58011 351805 755047
32633 755047 1057021 1150151 851238 312566 78530 409247 838454 753515 223467 -106513
$$ packed form
32703A300855R3802l32005k63498P1323K36208O2338k80994m86131l42453Q7919
32693A47364M91291N74392L21133n1524l22510l87507k52706k9983J21536J55420
32683G66906J78330K43917K19474r61k66875l54226k94052k76962k75326o3664
32673a23439L23055M61488P7943m83832o07152j59925L47782M15019J39794k928
32663C87805J67491L51923K70113N4999l4419o1846k54907n19222n16109k37904
32653c92076p3408j72262j90451Q5015L08784J69600R828L06279Q09702Q49424
32643A710435L71123j8684n9952j72262n90113q51228n26788P9458M09816M03242
32633G55047L01974R3130k98913n38672k34036L30717M29207q4939n30048l29980
$$ plain form
32623 -106513 150192 725531 1115189 1099329 810558 536217 532718 830624 1124174 1030946
32613 1030946 579672 269485 471320 912517 1005478 622601 230198 190360 265535 53507
32603 53507 -336656 -413452 -23357 445206 636082 662884 824538 1152893 1428100 1443192
32593 1443192 1095263 429287 -225671 -390899 45577 617920 814509 629802 343179
32584 343179 11546 -420993 -704228 -496778 15845 219047 -108740 -500123 -474946 -112873
32574 -112873 258826 578631 947528 1281064 1414519 1420191 1496129 1567340 1267058 394462
32564 394462 -744074 -1551062 -1699125 -1441598 -1295112 -1406041 -1390443 -916138 -243208 75019
32554 75019 -108336 -466398 -753536 -1037090 -1368262 -1629980 -1803878 -2016286 -2204578 -2104355
$$ packed form
32623a06513K56705N75339L89658j5860k88771k74341l499K97906K93550r3228
32613A030946m51274l10187K01835M41197R2961l82877l92403l9838P5175k12028
32603E3507l90163p6796L90095M68563J90876K6802J61654L28355K75207J5092
32593A443192l47929o65976o54958j65228M36476N72343J96589j84707k86623
32584C43179l31633m32539k83235K07450N12623K03202l27787l91383K5177L62073
32574a12873L71699L19805L68897L33536J33455N672P5938P1211l00282q72596
32564C94462j138536q06988j48063K57527J46486j10929J5598M74305O72930L18227
32554G5019j83355l58062k87138k83554l31172k61718j73898k12408j88292J00223
$$ plain form
32544 -2104355 -1707123 -1375339 -1361552 -1570505 -1898937 -2341983 -2593605 -2118207 -980365
32535 -980365 -75346 -45666 -404033 -281751 330522 722464 565073 185186 -115216 -334178
32525 -334178 -394400 -129974 281766 409717 171014 -110006 -257967 -375675 -414411 -162364
32515 -162364 270597 502185 508095 642953 908907 824944 260292 -216602 -167561 89391
32505 89391 91026 -44486 7460 110409 -56840 -357725 -403207 -208384 -109275 -151921 -83155
32494 -83155 104299 109725 -158189 -403047 -341748 18489 507373 897553 907220 433841 -189947
32483 -189947 -486529 -420129 -401671 -668292 -968171 -958460 -645495 -307196 -193761 -405067
32473 -405067 -851023 -1215608 -1151094 -650909 -108480 88137 -91578 -422098 -717134 -930514
$$ packed form
32544b104355L97232L31784J3787k08953l28432m43046k51622M75398J137842
32535i80365R05019K9680l58367J22282O12273L91942j57391l79887l00402k18962
32525c34178o0222K64426M11740J27951k38703k81020j47961j17708l8736K52047
32515a62364M32961K31588N910J34858K65954q3963n64652m76894M9041K56952
32505H9391J635j35512N1946J02949j67249l00885m5482J94823R9109m2646O8766
32494h3155J87454N426k67914k44858O1299L60237M88884L90180R667m73379o23788
32483a89947k96582O6400J8458k66621k99879R711L12965L38299J13435k11306
32473d05067m45956l64585O4514N00185N42429J96617j79715l30520k95036k13380
$$ plain form
32463 -930514 -1085385 -1201145 -1229980 -1053249 -648713 -245572 -129620 -262960 -309841 -129554
32453 -129554 -22935 -311023 -823516 -1034021 -667498 -2413 444346 435368 211915 228670
32443 228670 666584 1185684 1238520 675487 -65797 -454003 -422457 -295100 -277618 -271909
32433 -271909 -191770 -182052 -364714 -540972 -371457 190573 838041 1290207 1553128 1744208
32423 1744208 1839626 1738608 1458100 1089565 637785 100519 -333281 -411092 -183282 3184
32413 3184 -13987 26572 382685 840767 934767 525859 -93946 -609886 -922133 -1001090 -813394
32402 -813394 -467089 -173624 42688 373061 842550 1127747 932532 367990 -221024 -630041
32392 -630041 -784753 -552108 104964 859566 1259762 1265823 1230949 1272896 1014815 163899
$$ packed form
32463i30514j54871j15760k8835J76731M04536M03141J15952j33340m6881J80287
32453a29554J06619k88088n12493k10505L66523O65085M46759q978k23453J6755
32443B28670M37914N19100N2836n63033p41284l88206L1546J27357J7482N709
32433b71909Q0139R718j82662j76258J69515N62030O47468M52166K62921J91080
32423A744208R5418j01018k80508l68535m51780n37266m33800p7811K27810J86466
32413C184j7171M0559L56113M58082R4000m08908o19805n15940l12247p8957J87696
32402h13394L46305K93465K16312L30373M69489K85197j95215n64542n89014m09017
32392f30041j54712K32645O57072P54602M00196O061l4874M1947k58081q50916
$$ plain form
32382 163899 -927913 -1591772 -1596875 -1288813 -1050128 -925415 -789750 -603343 -406930 -265515
32372 -265515 -283421 -471024 -542774 -129750 646955 1092270 704474 -157957 -688738 -585370
32362 -585370 -240657 -64899 -45076 -32184 -33355 -24029 166999 514868 643584 345959 10540
32351 10540 113157 435723 291233 -454317 -1080749 -932298 -244122 258333 312109 277587
32341 277587 462576 709177 748395 645119 661401 826888 887032 663725 274051 -70786
32331 -70786 -341456 -648046 -994195 -1209977 -1134388 -772605 -266637 196990 436366 347936
32321 347936 10056 -337407 -469656 -311442 80175 551883 850673 742509 254028 -287986
32311 -287986 -559261 -510284 -272952 58906 408379 608302 542920 348809 255254 238613
$$ packed form
32382A63899j091812o63859n103L08062K38685J24713J35665J86407J96413J41415
32372b65515j7906j87603p1750M13024P76705M45315l87796q62431n30781J03368
32362e85370L44713J75758J9823J2892j171R326J91028L47869J28716k97625l35419
32351A0540J02617L22566j44490p45550o26432J48451O88176N02455N3776l4522
32341B77587J84989K46601L9218j03276J6282J65487O0144k23307l89674l44837
32331g0786k70670l06590l46149k15782P5589L61783N05968M63627K39376q8430
32321C47936l37880l47463j32249J58214L91617M71708K98790j08164m88481n42014
32311b87986k71275M8977K37332L31858L49473J99923o5382j94111r3555j6641
$$ plain form
32301 238613 62324 -313634 -594509 -500827 -58790 543877 1171150 1656167 1717763 1226413
32291 1226413 481256 -26196 -142488 -162043 -375972 -691774 -792176 -531510 -33157 533840
32281 533840 1103027 1607291 1867233 1703626 1141099 417892 -217720 -670160 -961965 -1119283
32271 -1119283 -1137660 -1016545 -781456 -486328 -198599 59193 345133 696340 994310 1064645
32261 1064645 959622 979718 1285090 1619754 1604522 1218382 788671 563306 525737 612678
32251 612678 833753 1094375 1154033 921345 613724 456255 370440 161815 -88119 -65493
32241 -65493 326575 756957 798180 392368 -73525 -136628 295901 834877 962915 547554
32231 547554 -26611 -297372 -252554 -303232 -725125 -1275128 -1476277 -1198993 -783413 -565325
$$ packed form
32301B38613j76289l75958k80875R3682M42037O02667O27273M85017O1596m91350
32291A226413p45157n07452j16292j9555k13929l15802j00402K60666M98353N66997
32281E33840N69187N04264K59942j63607n62527p23207o35612m52440k91805j57318
32271a119283j8377J21115K35089K95128K87729K57792K85940L51207K97970P0335
32261A064645j05023K0096L05372L34664j5232l86140m29711k25365l7569Q6941
32251F12678K21075K60622N9658k32688l07621j57469q5815k08625k49934K2626
32241f5493L92068M30382M1223m05812m65893o3103M32529N38976J28038m15361
32231E47554n74165k70761M4818n0678m21893n50003k01149K77284M15580K18088
$$ plain form
32221 -565325 -466762 -200983 236832 523142 465090 272641 251238 404151 525585 571861
32211 571861 717742 1075347 1546885 1953439 2152862 2054965 1704513 1338472 1154543 1015435
32201 1015435 621632 22838 -321438 -127352 318880 547981 471040 304538 116011 -207658
32191 -207658 -588448 -711454 -451970 -97670 -3913 -197474 -458451 -648622 -781484 -850376
32181 -850376 -784839 -581132 -318535 -11811 404232 863660 1079104 816520 208217 -352051
32171 -352051 -602371 -565143 -356959 -76566 83064 -113334 -606076 -960904 -857384 -522743
32161 -522743 -435601 -687933 -896652 -709717 -169038 399495 642290 379971 -199793 -599237
32151 -599237 -520576 -252777 -250576 -443493 -414433 -218239 -414656 -1118984 -1636949 -1426778
$$ packed form
32221e65325R8563K65779M37815K86310n8052j92449k1403J52913J21434M6276
32211E71861J45881L57605M71538M06554J99423r7897l50452l66041j83929j39108
32201A015435l93803n98794l44276J94086M46232K29101p6941j66502j88527l23669
32191b07658l80790j23006K59484L54300R3757j93561k60977j90171j32862o8892
32181h50376O5537K03707K62597L06724M16043M59428K15444k62584o08303n60268
32171c52051k50320L7228K08184K80393J59630j96398m92742l54828J03520L34641
32161e22743Q7142k52332k08719J86935N40679N68533K42795k62319n79764l99444
32151e99237P8661K67799K201j92917K9060J96194j96417p04328n17965K10171
$$ plain form
32141 -1426778 -921642 -887450 -1320576 -1538739 -1140055 -326984 562886 1277868 1481622 972339
32131 972339 160350 -197930 92664 458555 411903 150290 43590 -36079 -433413 -1013990
32121 -1013990 -1252212 -1000235 -750285 -973272 -1463802 -1590307 -1099510 -408329 -37272
32112 -37272 4205 48264 145942 -9240 -491026 -861358 -706548 -170673 310892 558590
32102 558590 610553 377801 -224931 -914149 -1245504 -1175291 -1038772 -1000137 -934932 -849407
32092 -849407 -939700 -1141393 -1085531 -676877 -298577 -233537 -274207 -147417 56580 177704
32082 177704 357376 750641 1136646 1206199 1056161 1026193 1163444 1189771 928360 474672
32072 474672 8372 -315429 -370594 -198903 -57172 -94629 -98018 187646 621024 874007
$$ packed form
32141a426778N05136L4192m33126k18163L98684Q13071Q89870P14982K03754n09283
32131I72339q11989l58280K90594L65891m6652k61613j06700p9669l97334n80577
32121a013990k38222K51977K49950k22987m90530j26505M90797O91181L71057
32112c7272M1477M4059R7678j55182m81786l70332J54810N35875M81565K47698
32102E58590N1963k32752o02732o89218l31355P0213J36519L8635O5205Q5525
32092h49407r0293k01693N5862M08654L78300O5040m0670J26790K03997J21124
32082A77704J79672L93265L86005O9553j50038k9968J37251K6327k61411m53688
32072D74672m66300l23801n5165J71691J41731l7457l389K85664M33378K52983
$$ plain form
32062 874007 991893 1363983 2103354 2784611 2907522 2412835 1681568 1203334 1249894 1655595
32052 1655595 1885476 1524142 740201 98069 -82063 33236 167443 262310 348199 352440
32042 352440 200198 -50921 -298325 -488939 -551890 -395830 -70069 216568 334732 357096
32032 357096 362545 290654 117783 8317 100553 250496 199137 -41868 -163590 54937
32022 54937 468202 713518 557284 69875 -466114 -779911 -795061 -647055 -532124 -528310
32012 -528310 -549343 -456247 -215148 42034 129031 7821 -138296 -88218 160825 380804
32002 380804 374305 190741 41811 40567 87257 34632 -61138 82289 677423 1551080 2219501
31991 2219501 2343944 2047234 1701914 1484549 1283729 1014450 820649 873507 1100251 1249321
$$ packed form
32062H74007J17886L72090P39371O81257J22911m94687p31267m78234M6560M05701
32052A655595K29881l61334p83941o42132j80132J15299J34207R4867Q5889M241
32042C52440j52242k51119k47404j90614o2951J56060L25761K86637J18164K2364
32032C57096N449p1891j72871j09466R2236J49943n1359k41005j21722K18527
32022E4937M13265K45316j56234m87409n35989l13797j5150J48006J14931L814
32012e28310k1033R3096K41099K57182Q6997j21210j46117N0078K49043K19979
32002C80804o499j83564j48930j244M6690n2625r5770J43427N95134Q73657O68421
31991B219501J24443k96710l45320k17365k00820k69279j93801N2858K26744J49070
$$ plain form
31981 1249321 1175710 947105 686144 420206 109760 -265391 -692084 -1115117 -1374996 -1244397
31971 -1244397 -679993 -22565 250045 65056 -116291 116670 533965 506418 -196250 -1113965
31961 -1113965 -1643431 -1609788 -1190685 -562798 128628 632419 733654 512049 249124 84680
31951 84680 -74034 -329178 -650361 -953554 -1168864 -1217354 -1051997 -750322 -480945 -364702
31941 -364702 -403292 -491960 -469552 -278000 -138185 -379274 -950056 -1325365 -1156832 -817059
31931 -817059 -928286 -1465836 -1770633 -1457407 -861607 -476600 -378891 -409782 -518689 -614479
31921 -614479 -401038 243853 917864 1117723 918977 855526 1143103 1402567 1252471 856692
31911 856692 676540 862523 1120209 1122590 863302 569449 405219 368526 422913 582937
$$ packed form
31981A249321p3611k28605k60961k65938l10446l75151m26693m23033k59879J30599
31971a244397N64404O57428K72610j84989j81347K32961M17295k7547p02668r17715
31961a113965n29466L3643M19103O27887O91426N03791J01235k21605k62925j64444
31951H4680j58714k55144l21183l03193k15310m8490J65357L01675K69377J16243
31941c64702l8590q8668K2408J91552J39815k41089n70782l75309J68533L39773
31931h17059j11227n37550l04797L13226N95800L85007R7709l0891j08907r5790
31921f14479K13441O44891O74011J99859j98746o3451K87577K59464j50096l95779
31911H56692j80152J85983K57686K381k59288k93853j64230l6693N4387J60024
$$ plain form
31901 582937 814123 959236 880807 626604 339092 44995 -321124 -703062 -901952 -801091
31891 -801091 -471912 -31022 453355 872904 1071804 1019580 863712 732285 599803 406034
31881 406034 178751 -13016 -86938 98976 613326 1197941 1389721 1051930 581390 409230
31871 409230 488623 488501 308250 120224 18639 -63784 -108660 41424 422007 807424 908112
31860 908112 636080 171067 -188580 -283561 -233887 -240046 -266615 -140980 13336 -193514
31850 -193514 -765505 -1097814 -785801 -321659 -443397 -989430 -1053865 -282151 646330 1004122
31840 1004122 872532 681014 422680 -147510 -832733 -1084096 -738266 -244173 -79947
31831 -79947 -220096 -280887 -28113 365727 533095 346535 97003 151128 482425 748071
$$ packed form
31901E82937K31186J45113p8429k54203k87512k94097l66119l81938j98890J00861
31891h01091L29179M40890M84377M19549J98900n2224j55868j31427j32482j93769
31881D06034k27283j91767p3922J85914N14350N84615J91780l37791m70540j72160
31871D09230P9393j22j80251j88026j01585q2423m4876J50084L80583L85417J00688
31860I08112k72032m65013l59647r4981M9674o159k6569J25635J54316k06850
31850a93514n71991l32309L12013M64142j21738n46033o4435P71714R28481L57792
31840A004122j31590j91518k58334n70190o85223k51363L45830M94093J64226
31831g9947j40149o0791K52774L93840J67368j86560k49532N4125L31297K65646
$$ plain form
31821 748071 837034 1038450 1519757 1933401 1814879 1177877 429269 -151649 -537134 -684320
31811 -684320 -530725 -249488 -148276 -236218 -193695 123144 433890 446182 267383 187487
31801 187487 226513 153438 -112451 -355977 -357798 -189163 -149084 -446509 -956269 -1282958
31791 -1282958 -1112413 -528217 80749 455214 697026 977018 1147704 881766 205126
31782 205126 -359324 -352992 44596 220463 -127773 -687076 -1022683 -1121095 -1238913 -1400079
31772 -1400079 -1382971 -1187152 -1144070 -1405443 -1614241 -1350610 -718276 -181366 69707 239268
31762 239268 439860 480214 262427 39558 35167 62185 -177076 -575697 -744954 -586406
31752 -586406 -395675 -363190 -304670 -30035 295347 396803 338854 452167 825770 1090330
$$ packed form
31821G48071Q8963K01416M81307M13644j18522o37002p48608n80918l85485j47186
31811f84320J53595K81237J01212q7942M2523L16839L10746J2292j78799p9896
31801A87487L9026p3075k65889k43526j821J68635M0079k97425n09760l26689
31791a282958J70545N84196O08966L74465K41812K79992J70686k65938o76640
31782B05126n64450O332L97588J75867l48236n59303l35607r8412j17818j61166
31772a400079J7108J95819M3082k61373k08798K63631O32334N36910K51073J69561
31762B39268K00592M0354k17787k22869m391K7018k39261l98621j69257J58548
31752e86406J90731L2485N8520K74635L25382J01456n7949J13313L73603K64560
$$ plain form
31742 1090330 796801 -75469 -1053231 -1587941 -1515185 -1100648 -656856 -210346 346678 861132
31732 861132 942436 479937 -101513 -314545 -171024 -20738 17021 96221 170799 -67814
31722 -67814 -634380 -1033094 -888486 -507776 -455709 -748464 -875522 -570907 -160131 -68637
31712 -68637 -330044 -730144 -1146495 -1517269 -1677712 -1513696 -1211671 -1106914 -1262120 -1382151
31702 -1382151 -1203855 -826242 -563199 -567642 -719519 -839045 -873318 -853437 -801389 -763630
31692 -763630 -828097 -970837 -966428 -654349 -281400 -328299 -897497 -1491874 -1563501 -1109849
31682 -1109849 -550023 -189830 -44687 -29120 -11365 216552 666504 892405 400690 -621083
31672 -621083 -1384179 -1442445 -1167481 -1073404 -1073026 -779521 -255538 24240 -127936 -388618
$$ packed form
31742A090330k93529q72270r77762n34710P2756M14537M43792M46510N57024N14454
31732H61132Q1304m62499n81450k13032J43521J50286L7759P9200P4578k38613
31722f7814n66566l98714J44608L80710N2067k92755j27058L04615M10776R1494
31712f8637k61407m00100m16351l70774j60443J64016L02025J04757j55206j20031
31702a382151J78296L77613K63043m443j51877j19526l4273J9881N2048L7759
31692g63630o4467j42740M409L12079L72949m6899n69198n94377p1627M53652
31682a109849N59826L60193J45143J5567J7755K27917M49952K25901m91715j021773
31672f21083p63096n8266K74964R4077L78K93505N23983K79778j52176k60682
$$ plain form
31662 -388618 -440988 -372943 -454670 -772739 -1203668 -1564478 -1670788 -1379216 -697988 181374
31652 181374 995470 1513966 1580883 1191928 568861 59491 -105009 41836 260813 297284
31642 297284 103264 -70004 90176 544449 871305 784312 505350 406428 455161 349860
31632 349860 110600 118418 513795 948226 1082118 984202 831309 540831 17466 -465435
31622 -465435 -518802 -205565 -12024 -199444 -432134 -176514 629563 1398714 1414912 590231
31612 590231 -315779 -408598 327398 932939 565861 -513180 -1319044 -1340032 -966628 -767665
31602 -767665 -807533 -853737 -867973 -957627 -1056327 -1004444 -860800 -822163 -867385 -796647 -643361
31591 -643361 -686941 -905989 -780070 11939 907846 954009 10352 -978754 -1115807 -579095
$$ packed form
31662c88618n2370O8045q1727l18069m30929l60810j06310K91572O81228Q79362
31652A81374Q14096N18496O6917l88955o23067n09370j64500J46845K18977L6471
31642B97284j94020j73268J60180M54273L26856q6993k78962r8922M8733j05301
31632C49860k39260P818L95377M34431J33892r7916j52893k90478n23365m82901
31622d65435n3367L13237J93541j87420k32690K55620Q06077P69151J6198q24681
31612E90231r06010r2819P35996O05541l67078j079041q05864k0988L73404J98963
31602g67665l9868m6204j4236q9654r8700N1883J43644L8637m5222P0738J53286
31591f43361m3580k19048J25919P92009Q95907M6163r43657r89106j37053N36712
$$ plain form
31581 -579095 -189292 -250968 -348806 -218155 -212388 -669561 -1270825 -1429405 -1066806 -588641
31571 -588641 -227398 141527 523761 586337 94110 -726108 -1458892 -1925899 -2143970 -2062933
31561 -2062933 -1629049 -1028695 -593844 -438975 -381590 -247534 -73828 41968 115387 195488
31551 195488 252525 279294 403751 737409 1153332 1375879 1295942 1056262 806233 529958
31541 529958 188062 -111165 -203109 -52160 242582 539092 671512 524317 242981 223684
31531 223684 647350 1114058 1041140 399748 -279893 -664143 -969170 -1402713 -1684189 -1473799
31521 -1473799 -977874 -692819 -713558 -736101 -658775 -709240 -939295 -1034564 -771957 -332595
31511 -332595 -16030 69637 -81501 -448361 -802332 -770281 -313117 110073 82143 -306056
$$ packed form
31581e79095L89803o1676r7838J30651N767m57173o01264j58580L62599M78165
31571e88641L61243L68925L82234O2576m92227q20218p32784m67007k18071Q1037
31561b062933M33884O00354M34851J54869N7385J34056J73706J15796P3419Q0101
31551A95488N7037K6769J24457L33658M15923K22547p9937k39680k50029k76275
31541E29958l41896k99227r1944J50949K94742K96510J32420j47195k81336j9297
31531B23684M23666M66708p2918o41392o79641l84250l05027m33543k81476K10390
31521a473799M95925K85055k0739k2543P7326n0465k30055r5269K62607M39362
31511c32595L16565Q5667j51138l66860l53971L2051M57164M23190k7930l88199
$$ plain form
31501 -306056 -739063 -1116304 -1386703 -1246492 -492842 443630 823553 490141 21831 -68985
31491 -68985 124768 305680 491489 824085 1126720 1033443 506362 -59688 -281479 -150991
31481 -150991 88967 274508 414239 526871 539138 409754 264697 276234 420115 498890
31471 498890 431439 342686 292109 131633 -193029 -403189 -222369 173905 357741 254341
31461 254341 227607 527177 934251 1036925 635719 -173592 -1087908 -1713232 -1834448 -1646287
31451 -1646287 -1513008 -1489182 -1361513 -1177462 -1318201 -1872981 -2330015 -2184891 -1571450 -974529
31441 -974529 -557051 -141951 277389 394351 -16847 -778638 -1397464 -1406574 -761489 7443
31431 7443 249016 -57092 -252853 122327 742294 1056051 1060006 1069296 1041309 710963 222432
$$ packed form
31501c06056m33007l77241k70399J40211P53650R36472L79923l33412m68310r0816
31491f8985J93753J80912J85809L32596L02635r3277n27081n66050k21791J30488
31481a50991K39958J85541J39731J12632J2267j29384j45057J1537J43881P8775
31471D98890o7451q8753n0577j60476l24662k10160J80820L96274J83836j03400
31461B54341k6734K99570M07074J02674m01206q09311r14316o25324j21216J88161
31451a646287J33279K3826J27669J84051j40739n54780m57034J45124O13441N96921
31441i74529M17478M15100M19340J16962m11198p61791o18826r110O45085P68932
31431G443K41573l06108j95761L75180O19967L13757L955R290k7987l30346m88531
$$ plain form
31420 222432 -1253 28770 -104106 -454449 -594908 -378834 -207636 -319801 -397034 -194972
31410 -194972 -37266 -265660 -621324 -641554 -371131 -216330 -294576 -359829 -247668 -19362
31400 -19362 254155 542140 764090 899181 1079459 1359766 1561424 1574929 1588758 1706816
31390 1706816 1582633 867909 -122778 -670965 -538477 -151614 90748 220491 320360 203819
31380 203819 -283120 -943475 -1454192 -1721320 -1838613 -1861756 -1788577 -1646154 -1468665 -1258635
31370 -1258635 -1020956 -758151 -451134 -167045 -109907 -341533 -516473 -222687 384347 652931
31360 652931 276745 -280314 -422727 -177409 5010 -26186 2057 245433 446349 274663
31350 274663 -256163 -826707 -1159581 -1260028 -1351217 -1580291 -1782217 -1623193 -1050510 -491591
$$ packed form
31420B22432k23685L0023j32876l50343j40459K16074J71198j12165p7233K02062
31410a94972J57706k28394l55664k0230K70423J54801p8246o5253J12161K28306
31400a9362K73517K87985K21950J35091J80278K80307K01658J3505J3829J18058
31390A706816j24183p14724r90687n48187J32488L86863K42362J29743R9869j16541
31380B03819m86939o60355n10717k67128j17293k3143P3179J42423J77489K10030
31370a258635K37679K62805L07017K84089N7138k31626j74940K93786O07034K68584
31360F52931l76186n57059j42413K45318J82419l1196K8243K43376K00916j71686
31350B74663n30826n70544l32874j00447r1189k29074k01926J59024N72683N58919
$$ plain form
31340 -491591 -455926 -982312 -1618496 -1917643 -1809318 -1495480 -1159977 -853671 -555447 -257215
31330 -257215 -17405 57372 -59485 -213154 -194938 9123 212718 315904 449573 714015
31320 714015 910203 755635 337389 103196 324961 775588 1054540 1028120 763978 245548
31310 245548 -511421 -1140307 -1118833 -390967 485107 934269 879135 566905 186275 -140671
31300 -140671 -252686 -129325 -27631 -184200 -496048 -708062 -765137 -747084 -632502 -412498
31290 -412498 -267539 -301684 -271466 23136 235847 -123533 -833745 -1085472 -565535 120029
31280 120029 306809 64505 -138749 -111175 66611 333443 542484 379795 -191916 -663241
31270 -663241 -594540 -298826 -423772 -975096 -1281153 -938256 -290166 162753 390416 622035
$$ packed form
31340d91591L5665n26386o36184k99147J08325L13838L35503L06306K98224K98232
31330b57215K39810P4777j16857j53669J8216K04061K03595J03186J33669K64442
31320G14015J96188j54568m18246k34193K21765M50627K78952k6420k64142n18430
31310B45548p56969o28886K1474P27866Q76074M49162n5134l12230l80630l26946
31300a40671j12015J23361J01694j56569l11848k12014n7075J8053J14582K20004
31290d12498J44959l4145L0218K94602K12711l59380p10212k51727N19937O85564
31280A20029J86780k42304k03254K7574J77786K66832K09041j62689n71711m71325
31270f63241O8701K95714j24946n51324l06057L42897O48090M52919K27663K31619
$$ plain form
31260 622035 833414 786391 460785 149988 88246 156815 61121 -260531 -522509 -430191
31250 -430191 -42362 320702 474218 495480 464116 317008 52593 -146820 -156092 -96418
31240 -96418 -120818 -175520 -154729 -133016 -228643 -357695 -342176 -171745 41586 283345 617421
31229 617421 1016839 1371598 1578651 1509610 1063580 414985 -9000 -26073 51387 -66600
31219 -66600 -150690 136253 564330 585166 148027 -261793 -377250 -401691 -451373 -303254
31209 -303254 116839 477592 518746 389584 283339 123735 -124809 -221610 -59525 12821
31199 12821 -337133 -860338 -1019633 -713383 -358045 -315998 -526778 -682613 -571918 -282583
31189 -282583 -174749 -534212 -1156130 -1474878 -1247922 -858393 -736859 -778534 -654457 -435566
$$ packed form
31260F22035K11379m7023l25606l10797o1742O8569r5694l21652k61978R2318
31250d30191L87829L63064J53516K1262l1364j47108k64415j99413r272N9674
31240i6418k4400n4702K0791K1713r5627j29052J5519J70431K13331K41759L34076
31229F17421L99418L54759K07053o9041m46030o48595m23985j7073P7460j17987
31219f6600q4090K86943M28077K0836m37139m09820j15457k4441m9682J48119
31209c03254M20093L60753M1154j29162j06245j59604k48544r6801J62085P2346
31199A2821l49954n23205j59295L06250L55338M2047k10780j55835J10695K89335
31189b82583J07834l59463o21918l18748K26956L89529J21534m1675J24077K18891
$$ plain form
31179 -435566 -458796 -694050 -705959 -265210 369793 827339 971690 854070 637255 634733
31169 634733 1110406 1899112 2446652 2350869 1716130 944133 381955 207934 403203 722137
31159 722137 887663 901870 971157 1086338 969627 559493 223600 248227 388767 249392
31149 249392 -98034 -273604 -263228 -470883 -1026574 -1464960 -1322011 -757436 -298213 -153377
31139 -153377 -97126 71894 304779 547699 867696 1191668 1202719 744285 160506 -47391
31129 -47391 156681 330799 168842 -133868 -215420 -27128 178263 198845 47619 -177419
31119 -177419 -429369 -700952 -959828 -1128926 -1133208 -990792 -837474 -784870 -762114 -607446
31109 -607446 -330085 -147872 -218566 -462669 -698853 -795798 -624103 -74653 706839 1284577
$$ packed form
31179d35566k3230k35254j1909M40749O35003M57546J44351j17620k16815k522
31169F34733M75673P88706N47540r5783o34739p71997n62178j74021J95269L18934
31159G22137J65526J4207O9287J15181j16711m10134l35893K4627J40540j39375
31149B49392l47426j75570J0376k07655n55691m38386J42949N64575M59223J44836
31139a53377N6251J69020K32885K42920L19997L23972J1051m58434n83779k07897
31129d7391K04072J74118j61957l02710q1552J88292K05391K0582j51226k25038
31119a77419k51950k71583k58876j69098m282J42416J53318N2604K2756J54668
31109f07446K77361J82213p0694k44103k36184r6945J71695N49450P81492N77738
$$ plain form
31099 1284577 1360835 1122249 930076 786382 410529 -214996 -741082 -948728 -990452 -985440
31089 -985440 -725625 -79281 568811 686931 330053 111271 388148 824670 902498 553189
31079 553189 42485 -513205 -1151095 -1700975 -1832614 -1527414 -1171440 -1047232 -1009940 -832904
31069 -832904 -607634 -554776 -631724 -599251 -353634 44345 528038 944301 964885 424227
31059 424227 -330099 -765436 -786181 -686543 -579371 -332266 -44886 -29970 -194051 1189
31049 1189 697636 1260086 1080349 342505 -368585 -800631 -952758 -681615 34773 700116
31039 700116 761566 352930 72270 125748 187479 19563 -278673 -589754 -848878 -840097
31029 -840097 -444349 -75141 -306025 -1013096 -1453629 -1301095 -1020395 -1033794 -1097610 -805054
$$ packed form
31099A284577P6258k38586j92173j43694l75853o25525n26086k07646m1724N012
31089i85440K59815O46344O48092J18120l56878k18782K76877M36522P7828l49309
31079E53189n10704n55690o37890n49880j31639L05200L55974J24208L7292J77036
31069h32904K25270N2858p6948L2473K45617L97979M83693M16263K0584n40658
31059D24227p54326m35337k0745R9638J07172K47105K87380J4916j64081J95240
31049A189O96447N62450j79737p37844p11090m32046j52127K71143P16388O65343
31039G00116O1450m08636k80660N3478O1731j67916k98236l11081k59124Q781
31029h40097L95748L69208k30884p07071m40533J52534K80700j3399o3816K92556
$$ plain form
31019 -805054 -213609 360466 752115 837876 440845 -285906 -752239 -603639 -201594 -76540
31009 -76540 -225259 -350219 -469132 -781220 -1146297 -1233930 -1107436 -1182935 -1612901 -2096966
30999 -2096966 -2308565 -2182043 -1791586 -1261509 -807539 -612911 -672031 -930900 -1434692 -2079065
30989 -2079065 -2419272 -2130476 -1550236 -1335822 -1624452 -1947040 -1936329 -1654878 -1206924 -551825
30979 -551825 146542 470231 303931 73447 177251 494958 694445 704976 605247 334016
30969 334016 -149681 -615787 -785532 -662915 -396045 12524 582794 1121929 1418835 1528994
30959 1528994 1563783 1370282 802845 175898 -22098 164197 220335 -18488 -132686 115556
30949 115556 296028 -58221 -736322 -1214399 -1452209 -1805515 -2277248 -2410702 -1989272 -1372244
$$ packed form
31019h05054N91445N74075L91649Q5761l97031p26751m66333J48600M02045J25054
31009g6540j48719j24960j18913l12088l65077q7633J26494p5499m29966m84065
30999b096966k11599J26522L90457N30077M53970J94628n9120k58869n03792o44373
30989b079065l40207K88796N80240K14414k88630l22588J0711K81451M47954O55099
30979e51825O98367L23689j66300k30484J03804L17707J99487J0531r9729k71231
30969C34016m83697m66106j69745J22617K66870M08569N70270N39135K96906J10159
30959A528994L4789j93501n67437o26947j97996J86295N6138k38823j14198K48242
30949A15556J80472l54249o78101m78077k37810l53306m71733j33454M21430O17028
$$ plain form
30939 -1372244 -958841 -680250 -257591 285198 607243 416744 -289001 -1193288 -1757523
30930 -1757523 -1563358 -742665 90699 487599 553490 551213 421663 25240 -376910 -339120
30920 -339120 127332 539323 585327 414851 246406 72381 -123836 -197971 -70819 123320
30910 123320 248978 301762 247168 14231 -253211 -278478 -131865 -245954 -715246 -971731
30900 -971731 -518321 328191 842019 792045 492141 142163 -353490 -952186 -1355694 -1413485
30890 -1413485 -1282939 -1125059 -956155 -827066 -811108 -775719 -520462 -201163 -229969 -629349
30880 -629349 -876711 -608409 -145955 -47631 -385652 -754519 -818670 -577314 -214792 47836
30870 47836 30877 -237557 -474912 -453985 -303897 -304153 -431402 -364389 16274 369622 287110
$$ packed form
30939a372244M13403K78591M22659N42789L22045j90499p05745r04287n64235
30930a757523J94165Q20693Q33364L96900O5891k277j29550l96423m02150L7790
30920c39120M66452M11991M6004j70476j68445j74025j96217p4135J27152J94139
30910A23320J25658N2784n4594k32937k67442k5267J46613j14089m69292k56485
30900i71731M53410Q46512N13828m9974k99904l49978m95653n98696m03508n7791
30890a413485J30546J57880J68904J29089J5958L5389K55257L19299k8806l99380
30880f29349k47362K68302M62454R8324l38021l68867o4151K41356L62522K62628
30870D7836j6959k68434k37355K0927J50088k56j27249O7013L80663L53348q2512
$$ plain form
30859 287110 -192844 -658096 -871928 -1021319 -1315566 -1545670 -1329336 -754470 -428997 -735248
30849 -735248 -1317574 -1562276 -1357832 -1047949 -810448 -526820 -223512 -156443 -335547 -385408
30839 -385408 -94376 227017 174806 -234592 -721673 -1149257 -1467394 -1469670 -990210 -285951
30829 -285951 107437 -56250 -514383 -853105 -898379 -731195 -492115 -268122 -119496 -143816
30819 -143816 -428015 -852645 -1034011 -704611 -173962 -100689 -646389 -1154527 -949330 -220469
30809 -220469 247614 84352 -338183 -550265 -530526 -496601 -509121 -503312 -491857 -511342 -492909
30798 -492909 -380521 -304080 -458347 -827212 -1166898 -1282538 -1228811 -1207605 -1334175 -1546457
30788 -1546457 -1701110 -1701076 -1544299 -1312887 -1122196 -1010280 -865605 -574013 -278857 -320949
$$ packed form
30859B87110m79954m65252k13832j49391k94247k30104K16334N74866L25473l06251
30849g35248n82326k44702K04444L09883K37501K83628L03308O7069j79104m9861
30839c85408K91032L21393n2211m09398m87081m27584l18137k276M79460P04259
30829b85951L93388j63687m58133l38722m5274J67184K39080K23993J48626k4320
30819a43816k84199m24630j81366L29400N30649P3273n45700n08138K05197P28861
30809b20469M68083j63262m22535k12082J9739L3925j2520N809J1455j9485J8433
30798d92909J12388P6441j54267l68865l39686j15640N3727K1206j26570k12282
30788a546457j54653L4J56777K31412J90691J11916J44675K91592K95156m2092
$$ plain form
30778 -320949 -771877 -1199095 -1155323 -788742 -623688 -762903 -713674 -105369 816939 1602831
30768 1602831 2117937 2375526 2202908 1494041 601167 66403 35608 233749 403876 467404
$$ packed form
30778c20949m50928m27218M3772L66581J65054j39215M9229O08305R22308P85892
30768A602831N15106K57589j72618p08867q92874n34764l0795J98141J70127O3528
$$ [...]
##END NTUPLES=NMR SPECTRUM
##END=
