##TITLE=31Pdec_DE-99rm_3h
 , 64 sc
 1.7.2025
##JCAMPDX= 6.0         $$ Bruker NMR JCAMP-DX V2.0
##DATA TYPE= NMR SPECTRUM
##DATA CLASS= NTUPLES
##ORIGIN= UXNMR, Bruker Analytische Messtechnik GmbH
##OWNER= root
$$ XWIN-NMR		Version 3.5
$$ Tue Jul  1 13:58:11 2025 Russian Standard Time (UT+4h)  she@DPX200
##.OBSERVE FREQUENCY= 81.013821
##.OBSERVE NUCLEUS= ^31P
##.ACQUISITION MODE= SIMULTANEOUS
##.ACQUISITION SCHEME= undefined
##.AVERAGES= 64
##.DIGITISER RES= 17
##SPECTROMETER/DATA SYSTEM= spect
##.PULSE SEQUENCE= zgpg30
##.SOLVENT NAME= DMSO
##.SHIFT REFERENCE= (INTERNAL, DMSO, 0, 198.062)
##AUDIT TRAIL= $$ (NUMBER, WHEN, WHO, WHERE, WHAT)
$$ ##TITLE= Audit trail, XWIN-NMR		Version 3.5
$$ ##JCAMPDX= 5.01
$$ ##ORIGIN= Bruker BioSpin GmbH
$$ ##OWNER= she
$$ F:/spectra/data/she/nmr/P31/2/pdata/1/auditp.txt
$$ ##AUDIT TRAIL=  $$ (NUMBER, WHEN, WHO, WHERE, WHAT)
(   1,<2025-07-01 13:57:07.39 +0400>,<she>,<DPX200>,
      <created by zg, POWCHK disabled, PULCHK disabled
       configuration hash MD5:
       00 E9 B6 7A A2 85 ED C7 34 08 36 98 17 FE 4E 26
       data hash MD5: 32K
       DA 21 61 F1 03 47 0E 39 42 BE C1 48 A7 32 E5 8A>)
(   2,<2025-07-01 13:57:13.40 +0400>,<she>,<DPX200>,
      <Start of raw data processing
       efp BC_mod = 2 LB = 1.5 FT_mod = 6 PKNL = 1 PHC0 = 1459.14 PHC1 = -58.50484 SI = 64K 
       data hash MD5: 64K
       2C 9F 33 74 10 C5 7A EF 3C 27 0B 52 27 D1 62 F4>)
(   3,<2025-07-01 13:57:41.04 +0400>,<she>,<DPX200>,
      <pk PHC0 = -79.12769 PHC1 = 162 
       data hash MD5: 64K
       DA 56 02 73 B5 1B 2B 11 0E 53 C6 F7 16 A7 2E FF>)
$$ ##END=
$$ 
$$ hash MD5
$$ 15 F1 23 4C 92 43 EA 60 83 2C 01 29 43 74 D1 B0
##$RELAX= 
##$RELAX= 
##$RELAX= 
##$RELAX= 
##$RELAX= 
##$RELAX= 
##$RELAX= 
##$RELAX= 
$$ Bruker specific parameters
$$ --------------------------
##$DU= <F:/spectra>
##$EXPNO= 2
##$NAME= <P31>
##$PROCNO= 1
##$TYPE= <nmr>
##$USER= <she>
##$AMP= (0..31)
100 100 100 100 100 100 100 100 100 100 100 100 100 100 100 100 100 100 
100 100 100 100 100 100 100 100 100 100 100 100 100 100 
##$AQSEQ= 0
##$AQ_mod= 1
##$AUNM= <au_zg>
##$AUTOPOS= <>
##$BF1= 81.014009
##$BF2= 200.13
##$BF3= 200.13
##$BF4= 200.13
##$BF5= 200.13
##$BF6= 200.13
##$BF7= 200.13
##$BF8= 200.13
##$BYTORDA= 1
##$CFDGTYP= 0
##$CFRGTYP= 5
##$CHEMSTR= <none>
##$CNST= (0..31)
1 1 145 1 1 1 1 1 1 1 1 1 1 1 1 1 1 1 1 1 1 1 1 1 1 1 1 1 1 1 1 1 
##$CPDPRG= <waltz16>
##$CPDPRG1= <>
##$CPDPRG2= <waltz16>
##$CPDPRG3= <>
##$CPDPRG4= <mlev>
##$CPDPRG5= <mlev>
##$CPDPRG6= <mlev>
##$CPDPRG7= <mlev>
##$CPDPRG8= <mlev>
##$CPDPRGB= <>
##$CPDPRGT= <>
##$D= (0..31)
0 1 0 0 0 0 0 0 0 0.06 0 0.03 2e-05 3e-06 0 0 0.0002 0 0 0 0 0 0 0 0 0 
0 0 0 0 0 0 
##$DATE= 1751363826
##$DBL= (0..7)
120 120 120 11 120 120 24 19 
##$DBP= (0..7)
150 150 150 150 150 150 150 150 
##$DBP07= 0
##$DBPNAM0= <>
##$DBPNAM1= <>
##$DBPNAM2= <>
##$DBPNAM3= <>
##$DBPNAM4= <>
##$DBPNAM5= <>
##$DBPNAM6= <>
##$DBPNAM7= <>
##$DBPOAL= (0..7)
0.5 0.5 0.5 0.5 0.5 0.5 0.5 0.5 
##$DBPOFFS= (0..7)
$$ [...]
##$SUBNAM3= <"">
##$SUBNAM4= <"">
##$SUBNAM5= <"">
##$SUBNAM6= <"">
##$SUBNAM7= <"">
##$SUBNAM8= <"">
##$SUBNAM9= <"">
##$SW= 400.765351723535
##$SWIBOX= (0..15)
0 1 3 0 0 0 0 0 0 0 0 0 0 0 0 0 
##$SW_h= 32467.5324675325
##$TD= 32768
##$TD0= 1
##$TE= 0
##$TE2= 300
##$TE3= 300
##$TEG= 300
##$TL= (0..7)
0 120 53 12 22 120 120 120 
##$TP= (0..7)
150 150 150 150 150 150 150 150 
##$TP07= 0
##$TPNAME0= <>
##$TPNAME1= <>
##$TPNAME2= <>
##$TPNAME3= <>
##$TPNAME4= <>
##$TPNAME5= <>
##$TPNAME6= <>
##$TPNAME7= <>
##$TPOAL= (0..7)
0.5 0.5 0.5 0.5 0.5 0.5 0.5 0.5 
##$TPOFFS= (0..7)
0 0 0 0 0 0 0 0 
##$TUNHIN= 0
##$TUNHOUT= 0
##$TUNXOUT= 0
##$USERA1= <user>
##$USERA2= <user>
##$USERA3= <user>
##$USERA4= <user>
##$USERA5= <user>
##$V9= 5
##$VALIST= <valist>
##$VCLIST= <CCCCCCCCCCCCCCC>
##$VD= 0
##$VDLIST= <DDDDDDDDDDDDDDD>
##$VPLIST= <PPPPPPPPPPPPPPP>
##$VTLIST= <TTTTTTTTTTTTTTT>
##$WBST= 1024
##$WBSW= 4
##$XGAIN= (0..3)
0 0 0 0 
##$XL= 0
##$YL= 0
##$YMAX_a= 86301
##$YMIN_a= -91275
##$ZGOPTNS= <>
##$ZL1= 120
##$ZL2= 120
##$ZL3= 120
##$ZL4= 120
##$ABSF1= 0
##$ABSF2= 0
##$ABSG= 0
##$ABSL= 0
##$ALPHA= 0
##$AQORDER= 0
##$ASSFAC= 0
##$ASSFACI= 0
##$ASSFACX= 0
##$ASSWID= 0
##$AUNMP= <proc_1d>
##$AZFE= 0.1
##$AZFW= 0.5
##$BCFW= 0
##$BC_mod= 2
##$BYTORDP= 0
##$COROFFS= 0
##$CY= -3
##$DATMOD= 1
##$DC= 0
##$DFILT= <>
##$DTYPP= 0
##$F1P= 0
##$F2P= 0
##$FCOR= 1
##$FTSIZE= 65536
##$FT_mod= 6
##$GAMMA= 0
##$GB= 0
##$INTBC= 1
##$INTSCL= 9.790993e-09
##$ISEN= 30
##$LB= 1.5
##$LEV0= 0
##$LPBIN= 0
##$MAXI= 10000
##$MC2= 0
##$MEAN= 0
##$ME_mod= 0
##$MI= 50
##$NCOEF= 0
##$NC_proc= -4
##$NLEV= 6
##$NOISF1= 182.463
##$NOISF2= 159.3651
##$NSP= 0
##$NTH_PI= 0
##$NZP= 0
##$OFFSET= 198.0616
##$PC= 4
##$PHC0= 1380.012
##$PHC1= 103.4952
##$PH_mod= 1
##$PKNL= yes
##$PPARMOD= 0
##$PSCAL= 0
##$PSIGN= 0
##$REVERSE= no
##$SF= 81.0140089999434
##$SI= 65536
##$SIGF1= 159.3651
##$SIGF2= -187.1042
##$SINO= 113.3802
##$SIOLD= 16384
##$SREGLST= <1H.CDCl3>
##$SSB= 0
##$STSI= 65536
##$STSR= 0
##$SW_p= 32467.5324675325
##$SYMM= 0
##$S_DEV= 0
##$TDeff= 32768
##$TDoff= 0
##$TI= <>
##$TILT= no
##$TM1= 0
##$TM2= 0
##$TOPLEV= 0
##$USERP1= <user>
##$USERP2= <user>
##$USERP3= <user>
##$USERP4= <user>
##$USERP5= <user>
##$WDW= 1
##$XDIM= 65536
##$YMAX_p= 322926099
##$YMIN_p= -15166861
$$ End of Bruker specific parameters
$$ ---------------------------------
##NTUPLES= NMR SPECTRUM
##VAR_NAME=  FREQUENCY,     SPECTRUM/REAL,   SPECTRUM/IMAG
##SYMBOL=    X,             R,               I
##VAR_TYPE=  INDEPENDENT,   DEPENDENT,       DEPENDENT
##VAR_FORM=  AFFN,          ASDF,            ASDF
##VAR_DIM=   65536,         65536,           65536
##UNITS=     HZ,            ARBITRARY UNITS, ARBITRARY UNITS
##FACTOR=    0.49542278885378, 1,            1
##FIRST=     16045.7642231865, 0,            0
##LAST=      -16421.768244346, 0,            0
##MIN=       -16421.768244346, -15166861,    0
##MAX=       16045.7642231865, 322926099,    0
$$ Real data points
##PAGE= N=1
##DATA TABLE= (X++(R..R)), XYDATA
$$ [...]
49140 -864271 -833526 -681473 -540093 -568818 -703650 -763701 -719878 -704652 -814076 -1025983
49130 -1025983 -1260350 -1412154 -1388176 -1224389 -1103770 -1138098 -1192851 -1060434 -754815 -486110
49120 -486110 -373898 -342947 -298479 -243604 -192226 -114103 -31140 -51205 -223483 -436225 -533488
49109 -533488 -485784 -390231 -345861 -381096 -468733 -554909 -579724 -506423 -343194 -139486 35718
49098 35718 134041 171655 211849 271680 276183 154655 -46997 -213202 -289539 -286779 -184358
49087 -184358 45994 303012 376401 182366 -116400 -321253 -453209 -672406 -977767 -1146567
49077 -1146567 -1030180 -789932 -717147 -859778 -961741 -805381 -499391 -333319 -416404 -590965
49067 -590965 -686949 -712233 -741099 -751428 -684173 -580301 -529992 -524453 -481116 -405905 -413990 -567772
49055 -567772 -781868 -917110 -908316 -787296 -639552 -548366 -528256 -509186 -427993 -311878 -214405
49044 -214405 -114883 21455 123284 91360 -9128 5849 161053 248738 121002 -81228
49034 -81228 -117036 30932 162174 137104 10572 -107580 -205496 -346557 -560478 -792520
49024 -792520 -938961 -931587 -807472 -684284 -647652 -678942 -701475 -660747 -547931 -402628 -322789
49013 -322789 -402578 -597778 -706929 -571787 -279973 -94578 -178417 -440810 -663931 -736100
49003 -736100 -738646 -817582 -988606 -1092618 -966041 -632841 -282870 -81615 -68961 -217127
48993 -217127 -461487 -651536 -620874 -398330 -233796 -297591 -450402 -450538 -304395 -223674 -265860
48982 -265860 -233507 9159 298155 370828 199956 -8668 -109888 -177900 -345803 -581553
48972 -581553 -706585 -622405 -437447 -321865 -294524 -249558 -171331 -179729 -310641 -396069 -285794
48961 -285794 -85018 -14481 -98915 -171373 -155149 -141272 -168789 -135715 -4524 88012 41123
48950 41123 -45023 -55763 -82292 -278909 -582204 -762334 -724370 -581333 -429542 -235547
48940 -235547 124 128665 16657 -255172 -453947 -422354 -191055 91470 283171 333028
48930 333028 293863 241707 171488 16123 -219253 -422119 -521314 -587511 -697124 -767278 -657170
48919 -657170 -405485 -219311 -206685 -259806 -255842 -235414 -283225 -345763 -309773 -203443 -174559
48908 -174559 -283902 -448596 -593117 -730495 -862280 -906218 -778965 -488014 -117744 208505
48898 208505 351974 254883 48047 -52708 -19198 -67763 -354836 -722947 -884153 -791257
48888 -791257 -671501 -701657 -799507 -785279 -639026 -510279 -514679 -602782 -648456 -623190 -625636
48877 -625636 -721179 -808800 -720580 -434748 -103652 130031 247309 276182 231138 175828 208669
48866 208669 301186 277866 61544 -189570 -317943 -401293 -574204 -743054 -719952 -570382
48856 -570382 -554467 -721166 -826465 -708658 -498364 -364796 -284004 -191343 -162248 -269232
48846 -269232 -405018 -423991 -360921 -352116 -415529 -451299 -401501 -289596 -162205 -96255 -182590
48835 -182590 -382390 -484930 -351819 -134098 -88824 -229165 -324693 -227180 -28428 110423
48825 110423 127570 31328 -150530 -336370 -415851 -364796 -255663 -127659 55066 275457
48815 275457 395756 294883 21594 -247461 -373070 -352636 -302253 -369540 -616552 -947587
48805 -947587 -1174806 -1177673 -985882 -717741 -481572 -334992 -282824 -291144 -330957 -406487 -507399
48794 -507399 -559935 -501146 -398471 -399172 -521684 -583547 -416534 -108637 61780 -60352 -332940
48783 -332940 -493035 -449995 -329007 -249708 -187387 -113201 -142811 -380627 -674048 -742173 -580650
48772 -580650 -510534 -719117 -977704 -996930 -853059 -792286 -771288 -550493 -192570 -74270
48762 -74270 -324407 -602224 -587978 -387172 -246176 -148692 27355 164173 45227 -263148
48752 -263148 -476694 -493746 -458566 -453207 -405991 -326850 -365390 -559742 -745702 -797781 -770251
48741 -770251 -722678 -601755 -399689 -249219 -237450 -281549 -312493 -419044 -651163 -826126
48731 -826126 -728767 -414187 -118990 63151 220307 376959 423526 316022 173961 128495
48721 128495 192247 303526 381972 327531 96768 -191459 -350769 -352529 -329525 -344609 -325738
48710 -325738 -270283 -306985 -448656 -485804 -297190 -96238 -146680 -355895 -411709 -259758
48700 -259758 -156328 -233594 -303162 -191353 -16953 31078 1923 65627 207852 253005 139415
48689 139415 -15743 -109513 -145337 -129600 -35644 92738 139511 77602 22795 59964 110018
48678 110018 54168 -78277 -142330 -64544 88358 216922 288276 321148 338644 362539 406465
48667 406465 437776 377208 183488 -68618 -242319 -288961 -305101 -398139 -518362 -493831 -253889
48656 -253889 44663 174349 89292 -50058 -97335 -79169 -96071 -140635 -106080 37668 167494
48645 167494 147906 -1728 -133308 -142031 -63145 -6326 -48738 -200161 -409856 -567149 -548292
48634 -548292 -341587 -124339 -144619 -481645 -936845 -1188863 -1073904 -733993 -493388 -555184
48624 -555184 -796287 -895483 -691560 -362493 -198618 -265666 -393278 -446059 -452715 -458318 -415461
48613 -415461 -301919 -219547 -265387 -381758 -436003 -392985 -317237 -253337 -194472 -133055 -64994
48602 -64994 19552 86090 54065 -81117 -194464 -193710 -163679 -232224 -355559 -376457 -257291
48591 -257291 -114008 -42941 -50111 -124181 -228662 -243928 -85607 124500 179154 73489 -24606
48580 -24606 -93589 -293570 -614315 -763870 -573420 -283031 -202182 -258701 -144446 193399
48570 193399 476621 484650 281670 40303 -154134 -275917 -309913 -304240 -347225 -424264 -396622
48559 -396622 -189924 67519 158661 554 -270490 -413585 -294931 -26105 129217 30647
48549 30647 -195257 -339233 -365898 -383210 -420931 -399231 -313783 -290911 -407347 -573166 -651103
48538 -651103 -603582 -480345 -351022 -293429 -356630 -475829 -495115 -333544 -83569 83097
48528 83097 57190 -155954 -430870 -558064 -410908 -129941 -28145 -242381 -578521 -769525
48518 -769525 -767838 -684612 -566904 -394414 -222174 -150446 -169640 -181269 -165455 -184193 -212572
48507 -212572 -121729 119811 355258 421290 328716 198988 107721 64351 70779 110509 126436
48496 126436 90384 58680 84221 112966 58436 -47117 -84199 -33830 -23941 -146603 -321524
48485 -321524 -409829 -397541 -384749 -432825 -508912 -566829 -599004 -599251 -542720 -422258 -258422
48474 -258422 -75558 70544 53479 -225747 -661399 -969254 -973895 -799138 -685943 -688510
48464 -688510 -662590 -506786 -280103 -92065 -12511 -100689 -373847 -688954 -790460 -578476
48454 -578476 -246514 -59777 -69292 -142933 -201867 -281358 -383385 -428391 -398401 -407963 -551489
48443 -551489 -748806 -827207 -725784 -540449 -372347 -209662 6429 252537 422411 444403
48433 444403 342206 171712 -35279 -223667 -278380 -129164 121300 268781 232484 138365
48423 138365 147771 268517 375602 359098 202930 -28975 -225838 -290243 -226988 -149378 -155999
48412 -155999 -235910 -331541 -432304 -536796 -581437 -509176 -383005 -324126 -334037 -274927 -52635
48401 -52635 252052 459072 444291 216307 -94761 -311808 -337214 -228049 -111090 -42046
48391 -42046 -11619 -52635 -215248 -424252 -501232 -397070 -291479 -368035 -569497 -678871
48381 -678871 -595839 -436894 -381981 -492478 -663052 -706281 -523318 -239299 -114003 -255278
48371 -255278 -485465 -571775 -509932 -453056 -422197 -270665 50580 370217 519668 548960
48361 548960 611046 713497 707593 500236 178476 -86259 -195388 -171793 -101288 -57855 -68069
48350 -68069 -109745 -123512 -48094 105242 210593 132125 -88736 -227103 -131628 80408 187990
48339 187990 160716 141793 177649 154498 21591 -117744 -200034 -295659 -412101 -395487 -176068
48328 -176068 59564 128725 137506 277605 453086 388861 71691 -205327 -270889 -278698 -393312
48317 -393312 -514566 -469123 -308359 -242831 -364217 -561221 -664877 -604575 -470000 -441870
48307 -441870 -574832 -658333 -456190 -101922 -21756 -358653 -718948 -694013 -426880 -377918
48297 -377918 -654568 -903498 -854273 -659161 -611584 -769775 -986544 -1141386 -1201680 -1154930
48287 -1154930 -1011523 -844994 -754722 -786521 -892573 -952613 -877273 -741466 -745599 -951630
48277 -951630 -1139808 -1070031 -811183 -621851 -560696 -461994 -294322 -253746 -413484 -555196
48267 -555196 -505782 -409299 -466407 -598908 -608303 -520892 -513636 -582515 -549738 -379791 -251601
48256 -251601 -294527 -442222 -571805 -618663 -532560 -290848 -257 156896 120119 -22732
48246 -22732 -209153 -446749 -669377 -738615 -656562 -601029 -654436 -666157 -507760 -301829 -225929
48235 -225929 -222589 -123834 11563 -58007 -355092 -563050 -421041 -76837 102785 -20287
48225 -20287 -255717 -393933 -443438 -512518 -590149 -564607 -414484 -263766 -229869 -297802 -374384
48214 -374384 -394575 -327970 -151970 97964 289478 298254 149872 -14145 -103687 -134654 -127396
48203 -127396 -64265 19358 15930 -104203 -205308 -144641 31290 145682 118744 39972 22741
48192 22741 82998 176072 263375 301623 232680 39363 -218414 -455354 -622649 -706045 -713229
48181 -713229 -692976 -710646 -753693 -713197 -532656 -335436 -303883 -439854 -558333 -545798 -504857
48170 -504857 -569470 -688603 -723049 -686423 -719223 -829492 -843955 -688334 -557283 -665977
48160 -665977 -924209 -1020307 -810414 -484497 -323557 -399298 -551451 -579824 -416555 -171397
48150 -171397 -46602 -158504 -413941 -607936 -655161 -653664 -695642 -713160 -587176 -335868
48140 -335868 -92853 60914 136351 129756 5229 -186626 -282672 -170682 80093 304480
48130 304480 399671 344612 136426 -188315 -500261 -659573 -664152 -625755 -588232 -479667 -284891
48119 -284891 -138812 -144875 -194787 -113255 61826 103384 -94457 -383654 -582427 -678886 -732438
48108 -732438 -713607 -583777 -444342 -437246 -524406 -524734 -381955 -248948 -260338 -350255 -373277
48097 -373277 -306897 -236278 -202113 -168865 -118375 -81369 -74258 -74732 -66942 -53446 -17046 68857
48085 68857 174207 213149 145283 38803 -692 60815 168724 236335 197199 57686 -54832
48074 -54832 36425 340997 598103 524563 170197 -119625 -136075 -37625 -58022 -165014 -194241
48063 -194241 -182215 -300755 -511303 -579231 -472669 -459485 -686988 -922794 -899587 -707538
48053 -707538 -613863 -652846 -661726 -623364 -682041 -839684 -909704 -810325 -668307 -570526 -434453
48042 -434453 -224781 -102672 -214351 -461602 -626793 -647446 -644857 -729216 -877053 -980941
48032 -980941 -958664 -829581 -706877 -680354 -707107 -681098 -603042 -581856 -654297 -720917 -709744
48021 -709744 -698759 -804576 -1018318 -1208340 -1239426 -1074963 -826851 -694314 -753549 -826991
48011 -826991 -702797 -468145 -421651 -622159 -766397 -625203 -368056 -281267 -369525 -461018
48001 -461018 -542087 -717640 -935802 -1025356 -969209 -894930 -816775 -636900 -408424 -340402 -482386
47990 -482386 -628664 -617179 -525148 -478031 -457157 -415767 -412652 -479924 -493579 -346818 -167135
47979 -167135 -189524 -443669 -707128 -767168 -622853 -423165 -295361 -257915 -246034 -196392
47969 -196392 -120358 -83203 -99614 -91750 7613 145807 204686 152881 83581 87248 130171 86855
47957 86855 -125532 -465132 -802067 -1009098 -1024442 -877976 -693357 -626054 -725866 -858622
47947 -858622 -835230 -637975 -445601 -400192 -433716 -393342 -264249 -168240 -181517 -258964 -329553
47936 -329553 -372590 -388633 -369435 -316226 -238698 -130067 12919 145110 188235 94261 -120570
47925 -120570 -376983 -551442 -550245 -407707 -260784 -191464 -166405 -172087 -296240 -581190 -896556
47914 -896556 -1077584 -1109679 -1061093 -936544 -749436 -632782 -675543 -722205 -562837 -279867
47904 -279867 -159153 -265426 -367168 -313070 -216777 -197320 -200057 -191084 -284532 -520009 -716588
47893 -716588 -714351 -590677 -483361 -376273 -235207 -183642 -327539 -530717 -581977 -496823
47883 -496823 -450088 -482926 -478421 -377990 -235261 -94707 10069 -19214 -238723 -500355
47873 -500355 -569512 -405111 -181277 -46713 -3298 -3609 -25316 -60325 -150517 -386140 -724799
47862 -724799 -886376 -642484 -185976 25726 -169061 -453279 -474320 -256489 -60582 -23899
47852 -23899 -107354 -276111 -538782 -829847 -995754 -936312 -711690 -495207 -426153 -490659
47842 -490659 -547688 -494653 -382755 -327583 -350957 -386936 -400330 -395658 -344093 -230375 -154545
47831 -154545 -239274 -429416 -540396 -533040 -567500 -716481 -799377 -629584 -302717 -90566
47821 -90566 -114794 -253744 -332809 -296131 -209375 -181277 -273684 -428825 -505579 -439899 -341986
47810 -341986 -381855 -600162 -871287 -1024062 -968291 -751511 -541097 -510577 -688739 -941097
47800 -941097 -1124423 -1210237 -1224847 -1147493 -953777 -717579 -571254 -557563 -580588 -510495 -300621
47789 -300621 -11634 237371 348261 314596 213298 104361 -35642 -237123 -421565 -442820
47779 -442820 -269524 -61438 -3502 -94927 -179174 -181324 -214187 -388108 -608481 -690013 -626294
47768 -626294 -578214 -588333 -509242 -298753 -176448 -310724 -514642 -489068 -262593 -119815
47758 -119815 -144332 -136317 -6454 61932 -44970 -141734 -28282 202675 320666 250300 40646
47747 40646 -283244 -634999 -785758 -608655 -308439 -179756 -218519 -208849 -117689 -114242 -209749
47736 -209749 -185102 43739 250083 215751 21099 -128704 -195809 -259297 -302673 -246487 -135377
47725 -135377 -116547 -234665 -376677 -426484 -370117 -244094 -90752 3484 -69468 -302876
47715 -302876 -522110 -557075 -446775 -382362 -439051 -469134 -326727 -107902 -35647 -136282
47705 -136282 -193205 -69814 73586 2161 -255671 -443732 -412516 -273293 -214300 -289174
47695 -289174 -419739 -504961 -474793 -309515 -67700 134512 207041 140118 -12940 -166712
47685 -166712 -230524 -167295 -39949 40274 14393 -102805 -268669 -418962 -461154 -355484
47675 -355484 -202377 -161860 -276704 -453477 -612876 -752979 -854752 -856340 -772583 -716097
47665 -716097 -716996 -630479 -337293 38488 237218 154763 -80460 -292659 -408120 -428895 -378844
47654 -378844 -315608 -316693 -406815 -538749 -662515 -766955 -842418 -860520 -815027 -730223 -600165
47643 -600165 -374931 -56061 233213 334867 208716 -38581 -266092 -400868 -439136 -406097
47633 -406097 -345118 -314072 -346659 -407747 -406915 -279277 -67050 84395 40700 -187015 -435787
47622 -435787 -548019 -525637 -492934 -520629 -552820 -524002 -470724 -466459 -499129 -497175 -457655 -462295
47610 -462295 -552504 -652463 -642568 -478063 -234712 -69369 -112378 -340296 -571191 -648349 -598511
47599 -598511 -525277 -404135 -151993 104086 56901 -365613 -798408 -836033 -520616 -243131
47589 -243131 -235801 -380037 -492121 -558877 -627516 -663017 -637234 -629695 -709620 -793229 -736676
47578 -736676 -534577 -330465 -244137 -262248 -296725 -291027 -253699 -221840 -217314 -243172 -312575
47567 -312575 -447048 -619527 -731360 -699673 -555588 -402880 -293179 -209396 -162965 -210617
47557 -210617 -339670 -421463 -352502 -205923 -172195 -341896 -584022 -664346 -487268 -201492
47547 -201492 -34304 -34634 -54933 -5653 -9581 -203972 -487041 -624804 -573043 -514477 -566865
47536 -566865 -638413 -629643 -602533 -642266 -689832 -641332 -513831 -386005 -258618 -109349 -18631
47525 -18631 -87360 -254181 -333630 -237486 -47052 128112 243484 264274 147560 -68030
47515 -68030 -250538 -316430 -321148 -355241 -408603 -403037 -323423 -246732 -244302 -304325 -359007 -357566
47503 -357566 -305377 -255647 -270618 -367598 -489595 -551554 -535592 -514268 -544487 -570685 -506033
47492 -506033 -398187 -403291 -551714 -655029 -547316 -330744 -242315 -328953 -417036 -391979 -335514
47481 -335514 -355818 -447479 -580544 -769624 -961612 -997826 -814123 -576070 -489038 -551095
47471 -551095 -607192 -570310 -469691 -355012 -286074 -355671 -578904 -801384 -858247 -790403 -758854
47460 -758854 -778230 -709640 -521436 -372634 -378595 -447222 -436485 -359485 -330097 -377220 -413610
47449 -413610 -361565 -236873 -110816 -26887 37349 121340 186413 108142 -182245 -575544 -877585
47438 -877585 -1013941 -1062322 -1084000 -1019552 -788050 -424242 -79580 81184 -9419 -253040
47428 -253040 -430233 -389051 -202670 -77943 -112741 -226973 -329310 -432469 -558393 -634562
47418 -634562 -566930 -363722 -125399 54245 140106 148779 123225 88738 30904 -44969 -60533
47407 -60533 43168 174170 167947 10912 -143514 -215030 -302125 -473623 -608528 -570853 -422538
47396 -422538 -310608 -236662 -111559 24114 29564 -97535 -196328 -181722 -142762 -160029 -188943
47385 -188943 -201860 -293667 -522664 -754620 -809048 -702302 -606607 -595958 -575429 -476080 -384672
47374 -384672 -413959 -535304 -625329 -629584 -593495 -549346 -461627 -309014 -156587 -97151 -145852
47363 -145852 -232728 -285990 -284890 -239864 -174452 -148861 -253442 -517154 -822467 -967753 -853263
47352 -853263 -585090 -362457 -281179 -292527 -334532 -412178 -510744 -522103 -360399 -114794 26607
47341 26607 9078 -38738 -9393 43309 27408 -28487 -33471 18882 60022 52548 -5816 -131911
47329 -131911 -300987 -384246 -278297 -90045 -56672 -253807 -495960 -561487 -416357 -183605
47319 -183605 -692 42556 -67573 -224618 -268073 -173908 -116502 -267147 -587218 -891331
47309 -891331 -1055035 -1077585 -997497 -858436 -741258 -719429 -753892 -699938 -456968 -90524
47299 -90524 205430 265238 97917 -101746 -122494 51088 226839 227865 68808 -131204
47289 -131204 -324702 -521524 -657999 -632639 -484976 -397736 -458269 -527155 -430680 -198884
47279 -198884 -2897 85841 137503 180638 132307 -35361 -192724 -223444 -203623 -267242 -341690
47268 -341690 -196560 209523 587828 619268 296833 -121419 -410307 -515566 -471315 -339262
47258 -339262 -229732 -249345 -379733 -477898 -427353 -249636 -71087 -24126 -154724 -362751
47248 -362751 -462261 -376927 -244972 -243361 -347308 -382321 -292100 -212284 -260038 -378930 -432935
47237 -432935 -357643 -194275 -64380 -112930 -367435 -653631 -769583 -728393 -679168 -614347
47227 -614347 -377642 4941 253751 207095 44407 -8690 514 -92587 -267691 -386369
47217 -386369 -438852 -509156 -575153 -542688 -423415 -305714 -203298 -89199 -11776 -16498 -28695
47206 -28695 17021 19073 -123943 -275945 -227665 -42351 17921 -106804 -212004 -191976 -201034
47195 -201034 -367900 -571304 -615351 -468342 -234147 -26892 46077 -88247 -369446 -627190
47185 -627190 -753453 -764232 -698245 -602862 -620679 -887075 -1277760 -1448148 -1225609 -810754
47175 -810754 -496492 -342875 -240364 -141495 -77064 -41660 -10686 -21980 -135562 -346767
47165 -346767 -597386 -819164 -933772 -897359 -785494 -736975 -773455 -781212 -706306 -638268 -653320
47154 -653320 -717859 -808485 -970194 -1167079 -1230282 -1070666 -817808 -644148 -577699 -583851 -680364
47143 -680364 -846371 -961762 -974935 -996073 -1091064 -1138826 -1051169 -964591 -1010021 -1053390 -920788
47132 -920788 -752054 -819575 -1050096 -1059015 -705592 -322768 -276837 -514285 -693351 -627138
47122 -627138 -445172 -368196 -435789 -480681 -353684 -138645 -68167 -212609 -378970 -390878
47112 -390878 -320060 -306778 -305680 -216037 -141280 -256001 -477989 -556587 -478327 -492074 -684326
47101 -684326 -821358 -729864 -580025 -618981 -810084 -925545 -880294 -800392 -816393 -914024 -962839
47090 -962839 -832892 -532126 -255146 -210671 -372273 -500344 -437572 -265577 -141836 -123977
47080 -123977 -204425 -366234 -525725 -555767 -450717 -348296 -323030 -299356 -237090 -229673 -313631
47069 -313631 -357445 -279485 -209595 -267048 -334646 -254661 -116727 -116697 -218159 -203893 -28078
47058 -28078 121057 113957 21040 -65425 -156659 -263233 -325705 -309349 -251815 -187754 -137318
47047 -137318 -167642 -321369 -474190 -428149 -188865 2422 -35093 -238388 -461431 -653655
47037 -653655 -796447 -824645 -732996 -635508 -599864 -540354 -398696 -302711 -379882 -518092 -512846
47026 -512846 -391881 -373508 -510573 -601315 -510864 -383707 -429205 -640248 -842983 -917082
47016 -917082 -849704 -669266 -467397 -418566 -612541 -877045 -914563 -643341 -288860 -108620
47006 -108620 -138356 -252037 -349911 -395056 -351254 -208025 -47402 4973 -100054 -309019
46996 -309019 -533133 -687603 -702466 -577729 -416951 -330335 -308618 -261999 -167666 -84514 -23579
46985 -23579 76527 203846 217192 21917 -272463 -463397 -479460 -409074 -346459 -311758 -312764
46974 -312764 -378858 -504568 -637052 -753905 -885405 -1016761 -1037139 -863783 -584312 -389048
46964 -389048 -355768 -372870 -297898 -125100 46029 145415 164013 93129 -72012 -270387 -405296
46953 -405296 -453873 -470271 -468518 -401731 -290200 -249174 -308773 -314626 -123368 184962 417085
46942 417085 514867 542207 488357 283716 2840 -159345 -163522 -189646 -347242 -498651 -481674
46931 -481674 -353069 -271887 -266743 -277016 -331391 -509155 -761576 -921850 -884610 -672250 -359234
46920 -359234 -46333 123421 55933 -181110 -425562 -579993 -618401 -496591 -207434 91928
46910 91928 174549 2957 -232237 -365152 -422167 -501378 -620374 -748798 -867586 -910439
46900 -910439 -761260 -424473 -112332 -31936 -134989 -207568 -176593 -179550 -313438 -458760
46890 -458760 -432627 -227026 -629 117969 124774 61038 -57275 -209807 -356178 -493341
46880 -493341 -660995 -836107 -889213 -732180 -471032 -315144 -347075 -471691 -579295 -648995
46870 -648995 -684945 -675132 -650775 -669078 -688318 -586322 -375174 -262484 -382362 -577845 -596444
46859 -596444 -423282 -264915 -253400 -326408 -380949 -395073 -389797 -390665 -429300 -482904 -441173 -256349
46847 -256349 -88686 -141375 -361176 -482043 -392100 -280310 -359835 -605329 -844767 -976571
46837 -976571 -1007369 -982053 -951865 -921858 -795239 -499675 -203358 -217335 -579159 -915049
46827 -915049 -876898 -573553 -381427 -440530 -561035 -574320 -539207 -570325 -648517 -673658 -593341
46816 -593341 -430193 -266298 -223812 -368528 -596914 -691379 -522983 -156833 241007 537906
46806 537906 679694 682027 605421 499097 367563 222211 124021 104981 88119 -13259 -141734
46795 -141734 -165131 -100388 -126320 -328523 -566178 -675367 -688165 -728881 -775665 -685260 -445591
46784 -445591 -252588 -273722 -428752 -490548 -365205 -194645 -183592 -384076 -666958 -862202
46774 -862202 -899586 -839564 -796201 -816572 -821654 -695865 -456105 -282669 -326749 -523700 -668817
46763 -668817 -650494 -520793 -359471 -194583 -76027 -90690 -234174 -372596 -410996 -407200
46753 -407200 -436850 -448772 -370538 -270977 -272510 -351129 -369359 -283080 -174646 -95089 -24704
46742 -24704 -832 -126789 -396663 -634107 -677815 -546710 -373073 -255338 -224608 -271043
46732 -271043 -338916 -355054 -312420 -274136 -265947 -236076 -158482 -96276 -109679 -172321 -235801 -307801
46720 -307801 -399274 -455509 -417565 -315666 -240572 -255663 -379082 -592391 -802338 -853948 -673792
46709 -673792 -376668 -154785 -77463 -61147 -9457 90913 198272 266640 267121 210068 140031
46698 140031 70300 -48118 -238572 -414466 -456856 -358447 -221939 -138133 -141797 -253971 -450416
46687 -450416 -588038 -499000 -216709 -6796 -94477 -423991 -751529 -909417 -898987 -781407
46677 -781407 -591997 -367155 -174723 -87910 -153363 -368002 -646950 -845014 -878863 -814964
46667 -814964 -765452 -715346 -559721 -324885 -216683 -362824 -607971 -687702 -546755 -348263
46657 -348263 -202112 -55223 122546 221294 162150 55042 48955 108196 86502 -23983 -75669
46646 -75669 13364 173868 332119 482294 569202 466664 173303 -104290 -191989 -170758
46636 -170758 -221174 -334032 -350302 -245296 -178832 -244140 -341383 -356166 -310458 -257386 -170442
46625 -170442 -55372 -54076 -277191 -593621 -753889 -714685 -683644 -808219 -964783 -942220
46615 -942220 -735809 -546022 -521950 -601762 -610817 -459707 -239307 -150369 -320143 -648296
46605 -648296 -862829 -792495 -568610 -481379 -639563 -864441 -937433 -835652 -654082 -414186
46595 -414186 -97259 186127 240552 36503 -219449 -327715 -298730 -246119 -201313 -153647
46585 -153647 -172604 -317054 -465748 -432302 -269716 -267031 -557764 -901049 -991030 -851859
46575 -851859 -743321 -763489 -777985 -735158 -795328 -1039500 -1249112 -1153236 -784496 -411241
46565 -411241 -184600 -45876 37878 -37038 -316251 -644881 -830152 -845948 -776594 -645118
46555 -645118 -417236 -126746 120843 257488 281191 198930 31390 -142735 -246485 -312042
46545 -312042 -439802 -644502 -832049 -938637 -990880 -1000229 -907206 -691241 -446775 -280015
46535 -280015 -207785 -230159 -407458 -740477 -1034628 -1044647 -770902 -484543 -415279 -515885
46525 -515885 -589043 -548641 -464205 -409613 -382895 -372009 -403895 -492207 -591840 -646568 -656039 -665227
46513 -665227 -700356 -733730 -704022 -572192 -386948 -295531 -425802 -712041 -899476 -816294
46503 -816294 -614346 -613794 -884749 -1123913 -1040610 -746276 -597738 -704472 -782347 -530690
46493 -530690 5855 526408 792936 761996 514206 196662 -21762 -81869 -109410 -247181
46483 -247181 -433790 -481913 -373705 -318173 -458856 -667781 -729493 -619886 -479539 -392995
46473 -392995 -344558 -351636 -472766 -662411 -764925 -709506 -593544 -508935 -404854 -217260
46463 -217260 -24393 61194 76148 121851 147241 11721 -228529 -308568 -110811 148812
46453 148812 219363 150382 162660 293300 369058 284880 110821 -77276 -290626 -517784
46443 -517784 -678299 -732384 -706581 -585043 -335967 -94426 -126126 -482345 -839457 -844254
46433 -844254 -530413 -243526 -222150 -401512 -577606 -603533 -441948 -179154 -6752 -68320
46423 -68320 -298452 -501016 -582488 -604944 -616817 -566557 -420469 -249970 -142562 -107283 -113958
46412 -113958 -147977 -179871 -157439 -87649 -69986 -191868 -424859 -653153 -761818 -687134 -459254
46401 -459254 -233381 -196683 -377978 -606989 -721284 -749056 -810622 -902667 -896665 -739290 -547765
46390 -547765 -481791 -592704 -818764 -1057115 -1203897 -1187864 -1028355 -834339 -692443 -568158
46380 -568158 -367324 -89214 142291 218705 160495 49971 -95036 -303574 -532045 -660424
46370 -660424 -631393 -514308 -394770 -276316 -140935 -26209 36287 90464 162703 155278 -34498
46359 -34498 -303774 -394424 -188975 151422 382921 411494 286338 77640 -145476 -292221
46349 -292221 -317630 -289591 -305914 -357802 -347188 -235040 -104556 -60028 -107584 -159912 -139466
46338 -139466 -58962 917 -11266 -59350 -76957 -63708 -76399 -124096 -134776 -59111 43565
46327 43565 75741 28770 -22273 -47942 -125375 -332424 -613276 -809666 -838688 -783265 -758261
46316 -758261 -740957 -636468 -491067 -486677 -665387 -813055 -742818 -566020 -502681 -518684 -388208
46305 -388208 -90955 113926 67033 -76038 -118164 -100256 -154523 -250804 -280359 -279221 -371859
46294 -371859 -552390 -697204 -763690 -821540 -900999 -949321 -943243 -932932 -959300 -998560 -981955
46283 -981955 -827392 -508486 -154020 7568 -98381 -279026 -330031 -310079 -402201 -585816
46273 -585816 -657219 -552231 -435155 -440252 -513736 -563181 -594914 -633243 -646530 -630980 -650534
46262 -650534 -721591 -759526 -704225 -610303 -563562 -595205 -710211 -892066 -1039327 -1017653 -835022
46251 -835022 -656055 -583078 -538062 -431156 -321909 -308115 -348706 -311829 -145009 88579
46241 88579 296194 417459 459105 513013 659871 816184 794872 584153 424255 489014
46231 489014 622847 559292 304655 106632 84113 95860 1107 -127090 -120644 68633 342808
46220 342808 566568 645445 560317 382017 215973 96388 -31908 -201302 -335205 -324733
46210 -324733 -176441 -24148 36257 80140 245472 489323 563609 313241 -93400 -362091
46200 -362091 -433399 -472273 -540549 -518496 -385398 -313288 -359603 -314559 -47326 210177 178604
46189 178604 -30045 -81828 67774 143853 3480 -190753 -279438 -306128 -336238 -327469 -279986
46178 -279986 -297641 -390281 -409375 -291556 -180940 -187863 -203725 -98052 52219 74596 -87416
46167 -87416 -397468 -808768 -1176889 -1251025 -953527 -560791 -406325 -481652 -518841 -389505
46157 -389505 -209060 -91164 -21888 17657 -934 -53561 -69432 -61596 -114644 -232163 -333473
46146 -333473 -404325 -503123 -611700 -637965 -582625 -537188 -489348 -310754 5173 268795 337071
46135 337071 270676 165523 -1249 -240101 -424118 -446679 -382342 -341490 -279225 -115591
46125 -115591 54647 68605 -44505 -103304 -51074 -10804 -67095 -168153 -259537 -343272 -367004
46114 -367004 -225395 50250 240594 174191 -71286 -275667 -307535 -193081 -40900 30612
46104 30612 -39390 -186022 -261738 -194321 -56759 41410 58420 -8014 -154013 -324406 -428602
46093 -428602 -455444 -473236 -467560 -320595 -45217 116888 -10555 -271656 -399700 -404059 -493995
46082 -493995 -665647 -652287 -344190 -8312 38239 -198869 -466537 -565931 -452348 -166706
46072 -166706 175321 402237 433674 366823 326024 299904 229480 167068 201005 277556 255529
46061 255529 121581 5726 -23026 -40250 -113997 -182870 -140161 25931 209781 263806 99421
46050 99421 -227699 -535824 -677581 -672486 -631746 -596271 -531543 -434257 -328032 -186732 3125
46039 3125 126541 48657 -156183 -260810 -201684 -145522 -175065 -127342 115442 370192 389039
46028 389039 207008 26696 -133924 -405931 -725408 -825335 -628842 -390853 -335024 -370078
46018 -370078 -318435 -233798 -279680 -413060 -425302 -261298 -85115 -14906 18745 98689 169825
46007 169825 152587 89256 73441 108148 123782 78846 -36133 -231386 -460437 -583624 -500870
45996 -500870 -294236 -131984 -54649 22576 110192 105222 -9802 -86432 -26610 40171 -72743
45985 -72743 -327832 -484987 -388358 -132141 59737 53207 -86557 -158513 -29731 185705
45975 185705 221397 -2274 -225821 -153373 167723 416643 394646 182922 -57814 -239261
45965 -239261 -282297 -118334 165827 356808 374429 345194 337332 214675 -106979 -436730
45955 -436730 -539953 -471166 -459729 -536266 -500537 -251551 55837 223169 220218 133554 26048
45944 26048 -88846 -203447 -290229 -295989 -184225 -22592 36952 -56904 -168017 -181661 -208379
45933 -208379 -409553 -686079 -762125 -576738 -367227 -317315 -341191 -306707 -264708 -307699 -356477
45922 -356477 -265454 -55698 114645 170052 181292 228517 293521 284333 124715 -153070 -392188
45911 -392188 -457062 -407598 -423677 -532341 -552758 -375514 -138678 -16843 15188 62610 90180
45900 90180 7249 -122009 -154422 -100570 -88376 -125506 -90734 41790 150587 155618 102318
45889 102318 43841 -12137 -32859 11132 46359 -10051 -62074 59018 280303 311850 60092
45878 60092 -213350 -265190 -184909 -176236 -229051 -224937 -209731 -302536 -424943 -388596 -225235
45867 -225235 -174390 -317587 -457739 -428140 -309684 -233276 -155067 3532 120510 -3581
45857 -3581 -304155 -433098 -164221 299809 542926 405906 112197 -73936 -158285 -294749
45847 -294749 -482703 -566967 -503852 -438467 -485449 -593276 -670631 -680703 -550783 -189162 288232
45836 288232 549068 444894 249929 282855 448605 433410 233071 140840 245559 312122
45826 312122 218021 151616 238693 292277 138320 -67133 -78467 82657 243014 373018
45816 373018 512922 549553 351295 46256 -105963 -81730 -81610 -174863 -215282 -131170 -47716
45805 -47716 -49497 -34636 92334 247368 298001 253984 233178 314259 482342 651664 709798
45794 709798 613999 460699 380192 364747 299745 154996 19948 -52471 -96827 -113479 -42376
45783 -42376 107568 240966 319385 380346 392475 269871 79846 40663 223326 442646
45773 442646 552798 655101 862757 1047391 1022273 840245 698160 650881 635049 685664
45763 685664 881167 1106382 1115887 865771 590422 505055 587510 695861 762023 813315 897032
45752 897032 1013777 1063392 896756 530279 249225 322569 632423 784620 614036 376261
45742 376261 362332 517032 575653 443321 278273 259117 395054 540300 513735 235842
45732 235842 -180337 -496485 -562778 -449983 -341730 -332456 -364473 -326013 -171798 32556
45722 32556 166616 179394 159954 243931 447136 639977 691807 589691 410101 232968
45712 232968 104140 37947 31010 80338 168597 221711 148634 -20340 -105808 21780 274099
45701 274099 471532 567102 620675 624441 522201 361227 248203 176854 73638 -19707 -14952
45690 -14952 3812 -114822 -263304 -151222 223498 481809 371690 86829 -87794 -171475
45680 -171475 -310128 -452829 -475636 -439718 -452319 -425727 -251029 -74972 -108316 -259384
45670 -259384 -256699 -66224 104901 161306 172465 112898 -122623 -430307 -541466 -412787
45660 -412787 -286247 -293276 -285847 -158475 -55104 -105132 -189509 -142257 -3872 87346 110319
45649 110319 127898 168162 253796 414895 567061 527663 275189 43927 24938 115365 116135
45638 116135 41745 48845 154795 223252 183799 96049 18789 -34416 -13851 159116 474483
45627 474483 796613 957408 857967 522300 106859 -183658 -251336 -159566 -23755 85671
45617 85671 119587 43809 -82722 -126244 -51324 16060 -25716 -104712 -100431 -15384 83960 195256
45605 195256 317043 345001 193408 -21272 -75637 82202 274677 326006 247740 172260
45595 172260 181306 236284 248299 201290 192222 311117 501178 626927 675297 753111 857640
45584 857640 828438 623618 467630 563801 796479 907339 864908 849443 935705 1015601 1024637
45573 1024637 1034376 1085720 1103915 1036170 945568 913685 938016 956955 912070 791068 674672
45562 674672 703078 905826 1108932 1115474 932622 711817 534213 400653 362926 468694
45552 468694 603394 596047 497659 555031 861038 1208042 1349870 1255640 1049008 854354
45542 854354 777420 889969 1131872 1330096 1397163 1429093 1550163 1747344 1912030 1970091
45532 1970091 1933587 1895128 1982948 2234635 2514411 2657455 2691420 2800213 3081816 3476688
45522 3476688 3915901 4372188 4771479 5050451 5324225 5794810 6455074 7095749 7659058
45513 7659058 8353071 9327168 10468829 11644827 12916820 14360241 15867974 17298769
45505 17298769 18636917 19838535 20705199 21095415 21090406 20769579 20016550 18771187 17288106
45496 17288106 15877503 14536459 13115708 11718465 10613431 9825814 9132518 8433781
45488 8433781 7829520 7336142 6828751 6293776 5859113 5521309 5101024 4537102 3990235
45479 3990235 3583660 3260099 2963497 2741273 2584386 2378262 2105413 1900120 1814146 1728526
45469 1728526 1590095 1520916 1572134 1580654 1424354 1231804 1167498 1176422 1126832 1054501 1054454 1050526
45457 1050526 907321 707337 687629 907608 1168026 1274955 1230156 1140115 1075316 1057965
45447 1057965 1078856 1074708 954149 683212 318553 -32399 -248002 -235231 -22204 204671
45437 204671 246376 98407 -43150 -2382 192531 365473 393969 314975 236000 191426 142235
45426 142235 107031 196132 448834 709817 775037 624590 400534 188386 -36259 -250251
45416 -250251 -336660 -241440 -47113 147697 298151 346916 253041 126037 144688 276599
45406 276599 284875 113277 32707 237581 517168 561203 413864 345781 400348 378657 221593
45395 221593 93042 63752 -7826 -212735 -437613 -550426 -552195 -478375 -327189 -154371
45385 -154371 -70813 -68651 3846 224308 485149 650028 684140 595441 411313 258715 284459
45374 284459 430346 476563 382006 363033 521742 635678 500143 264126 185513 221587
45364 221587 143364 -53350 -153966 -99818 -60059 -111948 -127104 -44071 483 -66756 -74817
45353 -74817 146162 480986 663864 617350 499777 450754 435585 363564 256261 232061 347813
45342 347813 506683 554512 456559 324447 246876 169754 13989 -162307 -238835 -223422 -217020
45331 -217020 -204589 -60719 203022 387415 391930 373793 483241 598857 522794 331871
45321 331871 294860 466335 600428 516847 347323 315495 429641 532306 554824 568729
45311 568729 618264 638753 563897 427709 325018 319331 416249 588746 788991 949625 1022165
45300 1022165 1040884 1116647 1309317 1510038 1532626 1360485 1211607 1268402 1419390 1404738
45290 1404738 1171636 910521 742170 579865 370248 253351 329855 444365 406992 306464
45280 306464 359891 522023 522380 302955 144322 262057 506327 603306 516214 400055 329726
45269 329726 257435 169043 116504 124957 191339 336008 537058 659448 588919 418696 369886
45258 369886 523100 745171 888472 949738 1010592 1116797 1239087 1279438 1121944 771878
45248 771878 437889 360904 548373 792607 965870 1158564 1480217 1867944 2178968 2356228
45238 2356228 2405345 2316116 2129274 1998091 2043703 2190166 2264851 2228955 2186356 2191908 2195036
45227 2195036 2185412 2254641 2456072 2704834 2887484 3002854 3123415 3257921 3319944 3225742
45217 3225742 2986027 2700348 2470270 2308021 2136302 1903642 1686378 1625464 1757524 1960603
45207 1960603 2077827 2038647 1848718 1548277 1238009 1070196 1111932 1236280 1238532 1067528
45197 1067528 870392 794609 816164 799441 678508 535698 517575 686096 926135 1004124
45187 1004124 779780 382047 109468 116491 267896 359257 389626 495070 669152 721396
45177 721396 542320 265747 100474 111847 241712 428616 597183 621510 446812 210850
45167 210850 111996 173347 260064 312057 409266 585485 730515 744940 669193 574990 434968
45156 434968 207898 -22593 -114926 -41549 102949 233830 316010 298407 135665 -98240
45146 -98240 -223294 -141269 47927 166830 149375 58787 -37402 -130989 -216255 -248244 -201524
45135 -201524 -132757 -132865 -223057 -338152 -413354 -446398 -464710 -476304 -477786 -474335 -468080 -465619
45123 -465619 -511537 -640840 -755160 -645902 -247217 207929 426484 405814 378261 427039
45113 427039 377385 131115 -111415 -114214 66450 197461 208069 220905 300617 369216 373102
45102 373102 363951 374854 343707 208046 -9165 -235444 -401033 -454472 -406807 -356533 -381166
45091 -381166 -406964 -285409 -6066 265935 378738 328608 203496 100524 110757 260859
45081 260859 429015 429634 227993 -30589 -236789 -427513 -616680 -668718 -477559 -177889
45071 -177889 -25281 -98656 -244596 -302215 -272388 -253091 -292682 -339968 -306018 -167708 -19004
45060 -19004 12097 -81038 -158156 -97795 60189 180584 189835 116539 28201 -10434 36286
45049 36286 118616 107053 -70638 -313952 -430550 -326051 -84369 112234 123748 -31537
45039 -31537 -175507 -154270 -41550 -44449 -169944 -160257 122135 430790 466971 329513 345456
45028 345456 520933 501829 127660 -301576 -449574 -359596 -259117 -188435 -73725 4798
45018 4798 -86451 -247495 -246405 -93581 -46633 -206299 -361088 -327170 -218739 -230192 -319935
45007 -319935 -300613 -144915 -5346 34038 39472 47340 -20893 -183741 -275535 -134553 140480
44996 140480 266672 125247 -87910 -125087 -7250 30767 -125066 -327286 -387444 -305000
44986 -305000 -190336 -67241 102625 247303 217217 30465 -70412 87819 357569 440776
44976 440776 262642 45042 14826 163986 328831 394011 349413 225657 68095 -52764
44966 -52764 -83502 -43309 4190 23162 13891 -21735 -65273 -54229 53198 184271 204115
44955 204115 88567 -28141 -20142 80385 153033 145591 85955 -8549 -126357 -183205 -73566
44944 -73566 156282 283263 136353 -191761 -429413 -402342 -175270 57974 162251 141883
44934 141883 93343 99297 144268 133956 22051 -103776 -117248 -21932 59277 79988 151563
44923 151563 355745 563141 563122 342702 105222 7087 9728 29393 88406 218857 328403
44912 328403 301205 175771 86581 57768 -9482 -149836 -269529 -288170 -220097 -84293 139768
44901 139768 412453 604986 638016 553113 393115 135637 -170100 -336801 -252007 -61804
44891 -61804 20301 25957 176266 532279 875586 966654 786410 488413 233876 116511
44881 116511 143158 234742 315897 418042 606028 805377 837622 669146 493123 488636 602875
44870 602875 651710 544688 329676 102922 -32385 6111 191959 381545 478095 546842
44860 546842 683472 840820 903942 890240 945337 1152180 1455822 1770946 2051566 2247346
44850 2247346 2310136 2291450 2349377 2600250 3006587 3445662 3847285 4232092 4651930 5139749
44840 5139749 5717456 6421804 7285199 8264530 9214327 9999993 10650375 11314242 12015948
44831 12015948 12539075 12645458 12357628 11922801 11531155 11179046 10788201 10320472 9739222
44822 9739222 8981451 8063327 7162040 6498152 6115790 5816418 5346644 4660913 3968019
44813 3968019 3483815 3182136 2881372 2546597 2340361 2329790 2335615 2203291 2050819 2049684
44803 2049684 2100695 1987773 1769709 1712377 1833025 1824713 1512319 1104516 872199 828077
44793 828077 871954 1009523 1226444 1347731 1259274 1131933 1201294 1430243 1597285 1617030
44783 1617030 1557892 1437444 1239717 1072737 1063647 1126262 1064535 887831 788714 813251 801992
44772 801992 687412 606970 659997 773558 880138 1016351 1164903 1207267 1128471 1070028
44762 1070028 1082488 1033879 876512 780508 850644 930624 877100 815154 886768 939927 764826
44751 764826 506014 508106 803592 1073371 1117185 1056353 1021562 937177 732263 526019 458308
44740 458308 507448 591844 688453 742149 637189 404993 301928 502980 832717 981196
44730 981196 903240 821460 888517 1030085 1103104 1039870 830425 520475 260633 223923 416174
44719 416174 652924 760526 729114 652428 603012 594381 591212 533255 417597 362405 495140
44708 495140 759156 939566 922547 818922 771281 759475 698406 619555 606998 617677 537181
44697 537181 403311 398519 571138 714989 623126 359211 163434 148842 209316 208626 145144
44686 145144 100760 107414 117798 78020 -7883 -81407 -89397 -46448 -24967 -59731 -80657 10611
44674 10611 195521 327272 294726 155702 64106 91660 175322 234102 274849 350468 455880
44663 455880 526049 537605 551849 615564 657491 553462 295028 22343 -135932 -182905 -166673
44652 -166673 -60818 158663 366532 370926 168537 -13895 5150 153722 251773 262044
44642 262044 281577 356729 445706 534419 649155 749437 739421 618665 508412 482174 474362
44631 474362 417614 370752 420435 530867 599534 619366 669556 752446 752654 592544 345120
44620 345120 144505 48337 46551 147529 359269 600665 744781 792148 898943 1141189
44610 1141189 1333968 1241481 948542 830902 1083123 1450133 1569592 1439066 1338690 1378647
44600 1378647 1386213 1252383 1127297 1164292 1275254 1288287 1196763 1095147 994402 881158
44590 881158 866478 1068353 1377873 1538368 1472621 1363046 1366766 1404162 1311151 1094329 932865
44579 932865 963959 1135942 1276054 1282263 1235212 1290959 1459830 1566021 1476748 1285370 1168683
44568 1168683 1135473 1053613 883210 723247 633242 572838 543253 625492 818479 984555
44558 984555 1037726 1064406 1166653 1291123 1316444 1231725 1127868 1064911 1030514 988707 911323
44547 911323 807453 756099 832350 963108 965218 797619 660557 739678 955415 1098025
44537 1098025 1125620 1167693 1279533 1365048 1351203 1295636 1283711 1319585 1354088 1347416 1282192
44526 1282192 1172114 1064789 987607 905606 788198 684962 655825 654152 578975 438122
44516 438122 358914 419779 556201 660668 709059 758290 862402 1010833 1130736 1163229
44506 1163229 1152578 1207375 1334935 1394482 1295911 1163924 1182129 1331904 1428762 1380917 1255181
44495 1255181 1107414 930245 790589 832176 1064096 1288438 1323039 1191111 1030720 932509
44485 932509 932868 1046882 1220127 1343296 1388426 1432172 1482584 1420188 1218763 1087132 1220528
44474 1220528 1487833 1552725 1298192 974238 891066 1081685 1322322 1410338 1349257 1273366
44464 1273366 1250637 1218209 1120950 1033115 1054528 1138295 1158644 1136926 1229022 1447777 1580849
44453 1580849 1485777 1309252 1279730 1412524 1567557 1680319 1761867 1764117 1641520 1496083
44443 1496083 1475184 1552855 1581254 1526803 1474514 1424677 1295377 1141085 1153822 1381958 1630333
44432 1630333 1721858 1697355 1664259 1605247 1472058 1360609 1443914 1768520 2212064 2607048
44422 2607048 2837291 2861773 2728851 2553972 2431546 2376297 2363084 2382125 2436668 2535645
44412 2535645 2706643 2960306 3222818 3363319 3309416 3083615 2732629 2314623 1968997 1876052
44402 1876052 2075855 2404140 2667150 2810077 2864448 2820965 2641123 2340981 1991232 1673922
44392 1673922 1483945 1508907 1746240 2092294 2457825 2822922 3134227 3259208 3143496 2930049
44382 2930049 2806226 2796331 2821889 2892520 3069814 3270205 3294554 3101369 2898396 2880213
44372 2880213 2985581 3012201 2896760 2774103 2790120 2951138 3159512 3324094 3415113 3461856
44362 3461856 3527316 3657185 3827779 3963103 4023294 4048416 4080432 4077543 3983944 3882442 3969928
44351 3969928 4313876 4709961 4881587 4785849 4626681 4591967 4688072 4826305 4944661 5008924
44341 5008924 5004452 4988000 5070128 5289666 5561964 5787861 5956051 6115015 6312852 6581324
44331 6581324 6895843 7137362 7199722 7160083 7222608 7457567 7735164 7967455 8242509 8616859
44321 8616859 8951504 9118172 9233516 9498612 9897898 10248242 10481348 10687416 10922372
44312 10922372 11159295 11409878 11724221 12091235 12499449 13052922 13830260 14653788 15222736
44303 15222736 15494931 15723143 16078534 16461593 16757100 17056186 17501391 18075053 18658487
44294 18658487 19167576 19541246 19746864 19897247 20209612 20737414 21296853 21779330 22362070
44285 22362070 23237740 24290851 25259326 26109446 27013871 28015414 28959624 29772503 30591945
44276 30591945 31565738 32670291 33777995 34780580 35614194 36288222 36927404 37665119 38452177
44267 38452177 39091803 39518378 39916061 40474105 41134347 41705334 42160652 42681476 43409420
44258 43409420 44284454 45170068 46047734 47020734 48183998 49572873 51214690 53138242 55324123
44249 55324123 57739404 60454810 63616616 67202900 70873780 74172577 76825041 78721681
44241 78721681 79677691 79428693 77908174 75356915 72098286 68372159 64453419 60705055
44233 60705055 57320701 54148120 50964692 47837408 45015952 42546447 40224152 37925292
44225 37925292 35776970 33953041 32454853 31135044 29819803 28401469 26946681 25716176
44217 25716176 24919757 24429054 23891245 23149920 22367994 21690097 21014261 20231244 19484482
44208 19484482 18977537 18639361 18205429 17587786 16959519 16467885 16050980 15596885 15139976
44199 15139976 14800084 14598904 14429365 14192708 13907024 13662988 13490765 13299806 12979176
44190 12979176 12551066 12175170 11979084 11931737 11917985 11884555 11852023 11821083 11745563 11592578
44180 11592578 11366058 11073162 10736191 10452431 10367410 10525305 10767925 10843686 10640780 10290616
44170 10290616 10021836 9933060 9944193 9953243 9963150 10015577 10071802 10049134 9951681 9879008 9909860
44159 9909860 10051973 10288200 10567717 10755251 10724331 10544161 10448016 10547613 10693204 10697537
44149 10697537 10579439 10475973 10427271 10396139 10414290 10533852 10676560 10705763 10637918 10623314
44139 10623314 10721876 10862489 11024799 11266637 11528299 11615383 11483287 11370937 11513968 11848628
44129 11848628 12136941 12277128 12340100 12387256 12420221 12459224 12510094 12487088 12326034 12148512
44119 12148512 12142358 12280327 12336596 12211126 12056996 12026701 12074566 12112226 12187362 12352593
44109 12352593 12486779 12434813 12252405 12124999 12082717 11990538 11821865 11739869 11846489 12022776
44099 12022776 12114344 12134034 12159309 12143277 11986054 11740927 11591822 11617334 11690604 11635216
44089 11635216 11396950 11045053 10684625 10402510 10246279 10220629 10313732 10502412 10691909 10705246
44079 10705246 10439631 10023689 9702798 9553994 9441469 9287131 9218017 9328402 9435873
44070 9435873 9266229 8829779 8422419 8246709 8212140 8162885 8129238 8226858 8412138 8491204
44060 8491204 8355804 8105795 7927177 7908633 7981425 8001214 7894245 7738611 7662820 7649206
44050 7649206 7530714 7260819 7089115 7308544 7854856 8335902 8496535 8486126 8579680 8793630
44040 8793630 8931395 8905388 8824271 8790582 8788816 8791160 8817658 8843888 8786047 8650114 8579317
44029 8579317 8657220 8749090 8646986 8324885 7954635 7697889 7562426 7440184 7215897 6862560
44019 6862560 6494295 6288064 6275433 6252352 5997761 5559300 5206195 5098108 5124001 5099211
44009 5099211 4999629 4927876 4931787 4941679 4852190 4617883 4302067 4052097 3965718 3958483 3847300
43998 3847300 3606422 3436752 3499814 3681401 3742290 3633537 3508360 3446692 3339088 3086641
43988 3086641 2779297 2597573 2624725 2823775 3117648 3404335 3552758 3492278 3300807 3130536
43978 3130536 3049973 3023632 3037821 3154917 3405775 3697488 3892543 3950121 3932068 3887733
43968 3887733 3800446 3655456 3494777 3369006 3281685 3225533 3233858 3336298 3489376 3623481
43958 3623481 3752161 3954825 4235569 4480675 4597978 4630590 4677894 4760981 4831398 4866871
43948 4866871 4885637 4902793 4949727 5098170 5360898 5586890 5586197 5391300 5270705 5405926
43938 5405926 5650639 5717082 5539203 5319273 5228576 5207642 5120670 4990376 4956764 5044732
43928 5044732 5110342 5054948 4985137 5069517 5294229 5478905 5537407 5605082 5845860 6215372
43918 6215372 6509432 6613798 6614142 6662311 6820932 7067009 7378558 7760643 8207099 8673702
43908 8673702 9086534 9367716 9470215 9405074 9234693 9042392 8910382 8896694 8989937 9089580
43898 9089580 9076358 8925981 8742334 8677904 8829226 9181215 9610886 9961414 10168450 10316702
43888 10316702 10528004 10804586 11046951 11219313 11405658 11679586 12018445 12400897 12889529
43879 12889529 13517664 14165223 14678710 15097196 15631913 16397148 17268818 18062490 18768078
43870 18768078 19531194 20447736 21464046 22489012 23551200 24809687 26407779 28322821
43862 28322821 30376307 32412594 34462144 36704444 39281887 42197908 45402562 48913712
43854 48913712 52812583 57167550 62021952 67436416 73492206 80272517 87899424 96577096
43846 96577096 106525824 117858545 130581593 144732467 160443890 177815272 196739533
43839 196739533 216857985 237605561 258232619 277810422 295263087 309395379 318958607
43832 318958607 322926099 320950150 313586658 301968835 287238581 270323723 252116726
43825 252116726 233565012 215448547 198197271 182024981 167121364 153598948 141369474
43818 141369474 130247644 120154577 111103780 103020935 95706309 88982847 82797107 77178396
43810 77178396 72162591 67729180 63750524 60052225 56591899 53493669 50799218 48293197
43802 48293197 45757367 43319456 41301692 39721918 38206044 36473631 34672717 33101864
43794 33101864 31808969 30645943 29556314 28584991 27691349 26772967 25851715 25052635 24390578
43785 24390578 23725563 22948348 22093944 21262664 20540333 20004787 19688561 19489072 19203084
43776 19203084 18706757 18065707 17453837 17005314 16743326 16596080 16467852 16327450 16225967
43767 16225967 16211031 16263341 16353528 16498537 16689367 16820446 16789685 16633005 16462014 16309077
43757 16309077 16153005 16060854 16143447 16356282 16500339 16470508 16368650 16309441 16248686 16098395
43747 16098395 15902925 15786527 15797743 15911447 16125290 16441175 16787361 17069460 17287323
43738 17287323 17511641 17761873 18007847 18288660 18714036 19308408 19948161 20514510 21033208
43729 21033208 21581949 22117069 22509883 22754118 23018153 23434824 23929407 24342991 24654175
43720 24654175 24945283 25177531 25178283 24919070 24655307 24651227 24842796 24911735 24650580 24118609
43710 24118609 23472358 22818512 22261295 21914420 21750303 21536225 21041518 20276990 19458638
43701 19458638 18774597 18254604 17822256 17377911 16829696 16127726 15313268 14507601 13819755
43692 13819755 13260951 12754753 12229346 11686785 11165767 10653911 10095769 9511415 9041102
43683 9041102 8806147 8764734 8772411 8740617 8647868 8442779 8071512 7600860 7180361 6855573
43673 6855573 6542499 6219296 6002317 5960390 5978978 5906889 5744627 5594103 5507137 5478489
43663 5478489 5503970 5536392 5457102 5211172 4917838 4732629 4648692 4549954 4408702 4293798
43653 4293798 4218621 4134828 4072528 4129175 4285749 4372899 4278902 4081163 3906375 3754952
43643 3754952 3543377 3254327 2964332 2757920 2674835 2712083 2818772 2899637 2869302 2710902
43633 2710902 2473770 2231565 2050827 1965346 1950089 1939759 1905290 1900031 1991305 2144303 2226684
43622 2226684 2173686 2111737 2223804 2471897 2566626 2309676 1884703 1661683 1752826 1943022
43612 1943022 2061339 2193140 2429657 2626799 2602624 2433378 2341644 2373193 2392604 2348061
43602 2348061 2325847 2350200 2326527 2201857 2016325 1793216 1553912 1439909 1604942 1941533
43592 1941533 2128749 2035427 1882573 1907377 2059536 2161751 2188322 2208797 2195457 2085218
43582 2085218 1950285 1925223 2011372 2103428 2161239 2208320 2204464 2079056 1881859 1764314 1800339
43571 1800339 1918034 1992891 1924819 1669685 1305192 1024614 948705 987997 1015122 1103328
43561 1103328 1404927 1821381 2024356 1862163 1550096 1363756 1312543 1243596 1130751 1091616
43551 1091616 1180294 1316214 1413259 1474459 1548919 1660096 1781191 1847048 1811968 1729240 1733544
43540 1733544 1892091 2101956 2186193 2070131 1824557 1574382 1418942 1399486 1461695 1463671
43530 1463671 1308835 1089898 1029759 1238120 1567034 1749372 1664539 1438324 1290773 1321130
43520 1321130 1460074 1606810 1748573 1903279 1999943 1932303 1752884 1685656 1842223 2013425
43510 2013425 1898217 1512843 1197752 1184182 1330732 1384651 1334270 1324591 1335869 1187354
43500 1187354 857391 576374 528524 631237 702408 699752 682104 663776 645689 688491 805724
43489 805724 871110 795544 718619 828553 1043420 1101733 964687 871291 929151 909885 606637
43478 606637 194372 26609 186505 435326 544827 505132 428336 395986 411528 414974 355609
43467 355609 297300 379972 612181 813695 868042 899830 1045066 1179436 1097677 866592
43457 866592 731010 714018 610876 396078 315581 476054 644537 623771 564362 686268
43447 686268 906051 996724 951456 900071 775934 395002 -142064 -435660 -262063 158510
43437 158510 462701 529020 460764 359601 273967 269366 380884 517652 539659 444016 393974
43426 393974 534661 821769 1058058 1083275 908176 661646 437121 239703 81826 42313
43416 42313 160717 333771 420547 424640 456764 518431 460883 214696 -55977 -124702 38035
43405 38035 266721 412791 458436 447974 419200 427982 552535 803613 1053931 1119734 947765
43394 947765 711008 672506 913314 1216160 1277870 1034466 702523 489233 371746 228545
43384 228545 71268 190 -7646 -74429 -168744 -72909 292234 661833 712991 481280 315938
43373 315938 437758 716510 919927 1007194 1065460 1084488 968096 742911 595546 643692
43363 643692 760604 709222 427042 111791 3490 115253 227395 156758 -25440 -106387
43353 -106387 -25072 60718 23118 -50129 -13937 91165 102776 -575 -66212 -9791 66331
43342 66331 55818 16417 64730 199496 328085 400503 423978 402578 358268 362359 442135
43331 442135 493768 403264 238874 203645 381524 635835 791601 825897 829583 855675 869983
43320 869983 814867 676306 509762 417949 464561 588400 643500 547970 356097 172914
43310 172914 61428 62787 218759 481600 651694 534627 188132 -85983 -62671 151603
43300 151603 262975 154587 1850 7888 139125 213424 173560 129853 141257 116693 1008
43289 1008 -83192 -9308 130291 136729 1560 -78531 7374 143399 185085 146818 109127
43278 109127 72824 19078 7868 79163 127491 20728 -194752 -346908 -369440 -331900 -250292
43267 -250292 -47878 245433 426272 362705 186426 109530 133690 93607 -48907 -121686
43257 -121686 13641 264052 426949 435462 403919 461045 603891 717001 699082 562580
43247 562580 418034 358933 369119 363222 303071 223654 142648 20469 -144107 -245948 -187662
43236 -187662 -35902 29225 -67971 -208835 -235354 -128905 4619 70151 49906 -23099 -93722
43225 -93722 -106883 -61445 -34193 -92312 -181516 -164924 3504 199905 269505 209481 155309
43214 155309 195074 265302 262249 202926 204076 308794 412850 399948 286163 164227 54661
43203 54661 -82909 -199264 -145983 118488 402308 458931 263649 37120 7694 207208
43193 207208 480176 626268 538531 266751 -34544 -243962 -352505 -395767 -364555 -240213
43183 -240213 -65871 103443 282191 482442 595044 485879 221033 43479 69378 148541
43173 148541 114739 38064 86010 228750 265814 125695 -36767 -82417 -80802 -170799 -323032
43162 -323032 -363866 -220092 -39476 -29503 -225020 -462676 -568538 -523055 -435185 -405468 -451106
43151 -451106 -528327 -572712 -532477 -414055 -283075 -171901 -18756 220483 431852 442335
43141 442335 268893 126184 139946 204908 213678 262154 467970 709879 757568 604730 463274
43130 463274 441588 438096 371705 298136 229371 52790 -239925 -421483 -302915 -20967 136255
43119 136255 120721 149667 364490 655305 853389 927985 918049 805367 572754 317169
43109 317169 186417 213318 289966 305587 249166 173876 124886 129139 203743 323703 406306
43098 406306 385458 302796 272068 337188 417611 424028 370448 314258 237648 85020 -95283
43087 -95283 -154343 -19401 214849 409845 518924 548609 468316 252756 -23661 -223584
43077 -223584 -272253 -193662 -48953 98963 192415 233568 313562 495644 676346 671750 467287
43066 467287 276092 292004 468085 607452 599066 478053 314463 157631 71668 109069
43056 109069 224401 302191 304188 312608 385614 448189 401650 293068 285557 466067 752420
43045 752420 995132 1108363 1086220 952112 733619 463672 186758 -20801 -55005 124669
43035 124669 398068 566922 590186 656914 929726 1273656 1379143 1159594 885267 852327
43025 852327 1025014 1120484 1000069 842678 897580 1157874 1360773 1292412 1019598 789178
43015 789178 746076 819938 883220 923031 988049 1033248 938792 687784 420023 269177 224246
43004 224246 196093 149029 110557 111667 178950 334513 541677 697847 741541 716134 671525
42993 671525 583262 463029 459624 690942 1014294 1144340 1011293 824527 739053 654032
42983 654032 447722 231166 189176 281852 304768 193471 68567 -12972 -146506 -366046
42973 -366046 -516480 -442501 -192711 61493 224609 307266 344003 387073 516404 738461
42963 738461 916538 918486 806448 757933 812592 833407 731334 580964 457956 299645
42953 299645 28351 -282713 -479017 -499348 -380837 -149034 176678 497822 678387 675230
42943 675230 540682 315576 26461 -226247 -312510 -230592 -102799 15286 192501 440185
42933 440185 615123 605690 508262 500601 612598 732907 777932 738692 617176 443937 319270
42922 319270 305787 308242 199670 51225 75772 316675 546593 543525 350687 187113 191960
42911 191960 331217 481036 526068 427973 262158 154496 151130 197069 249132 320004 386695
42900 386695 372312 279200 224061 256073 258304 148227 64924 190818 453352 586415 469482
42889 469482 233872 31072 -123332 -237232 -260191 -215926 -275099 -554667 -910343 -1049318
42879 -1049318 -830389 -382895 37822 248718 234658 128739 92467 167495 255639 263898
42869 263898 216779 182590 155658 93266 23364 14296 52164 48586 -19465 -68278 -33187 43368
42857 43368 92835 126847 204224 322364 392766 324569 118854 -108914 -206427 -122801 26619
42846 26619 80844 28350 21035 166760 378111 486639 453454 388061 387848 442446 490193 490242
42834 490242 428845 322534 230789 203490 200058 128041 -13137 -101204 -52841 44886 32159
42823 32159 -128190 -313991 -383894 -305860 -163053 -73862 -90096 -143831 -123089 -24720 25580
42812 25580 -45270 -129677 -85479 46798 97405 12932 -88632 -109967 -74262 -2547 149886
42801 149886 356314 461957 381797 242311 192601 172037 32190 -174714 -229586 -72675
42791 -72675 92787 83286 -32746 -79699 -35747 -26651 -115537 -214647 -203012 -57252 142251
42780 142251 286675 309958 216925 61318 -97819 -213617 -246884 -185666 -73059 24396
42770 24396 89440 163822 277726 404245 490386 496126 403378 239407 97969 71799 141752
42759 141752 197663 194890 209919 292987 356181 299782 185194 165212 268942 375040 398732
42748 398732 381986 363380 279892 83535 -127336 -207878 -170557 -179766 -327963 -510441 -572482
42737 -572482 -511929 -454832 -457517 -427440 -267326 -25069 161617 236392 274818 369904 524989
42726 524989 669497 728786 657187 451965 180944 -24245 -49538 112453 360954 568614
42716 568614 659219 623512 489191 293842 84814 -79325 -157617 -151656 -65228 148882 518783
42705 518783 902793 1024752 771298 381577 200858 288002 425649 483497 547651 655261
42695 655261 656039 475556 301092 308319 373058 289349 134427 122982 175038 -22066 -481881
42684 -481881 -786282 -631575 -238481 -14512 -14259 13893 172356 288923 232620 112194
42674 112194 89921 159535 205256 191935 205570 333137 557207 769439 869111 843314 751057
42663 751057 649923 574042 564192 640628 734080 742340 703069 803783 1128315 1486606 1629165
42652 1629165 1572677 1556742 1693518 1829880 1801696 1678599 1661921 1827387 2066069 2237268
42642 2237268 2301995 2326560 2413135 2616260 2888109 3116819 3242849 3311113 3377446 3399418
42632 3399418 3281275 3025387 2779856 2700785 2791026 2913036 2958566 2961329 3011645 3096067 3092852
42621 3092852 2935515 2707773 2531780 2421953 2315467 2200246 2122525 2085965 2038301 1964247
42611 1964247 1902699 1852414 1748010 1564199 1363300 1197178 1043888 895397 817008 831254
42601 831254 821033 672816 476112 440463 609588 791716 811040 702829 591202 493862
42591 493862 367045 262431 281236 384051 396279 245379 76049 64840 213234 400991
42581 400991 558869 680923 723967 630654 451815 331633 345474 434430 510556 532270 459631
42570 459631 253614 -20038 -185163 -135176 45889 204944 287411 316827 302514 275863
42560 275863 343485 569876 842441 975454 924708 791436 659439 568952 611829 864004
42550 864004 1207349 1407650 1427993 1487651 1721533 1953424 1942602 1716849 1494917 1373153
42540 1373153 1266922 1111805 944909 793058 639070 522616 539661 697112 873081 970166
42530 970166 1022470 1098432 1168450 1132840 946849 676559 455237 403034 548478 796133
42520 796133 998839 1089876 1123797 1169389 1195373 1103307 867943 606723 483939 545909 666233
42509 666233 667395 493074 251564 103746 132027 300389 491107 576881 513754 385287
42499 385287 309710 293435 244780 151557 140407 285882 457139 481048 403741 434489 622891
42488 622891 743809 574919 187005 -136948 -221180 -143248 -73208 -57163 -8883 125375
42478 125375 276281 361419 426018 579830 797889 899942 789301 617839 612641 795824
42468 795824 985321 1035582 956452 810333 631120 477698 449387 581280 791800 981056
42458 981056 1123773 1229437 1274053 1223401 1088494 921668 777639 683550 613188 497786
42448 497786 310540 125177 25463 -20529 -98452 -168191 -73150 236127 606383 869707
42438 869707 1021788 1137993 1211410 1180872 1060930 940297 876281 865350 891944 939406 973224
42427 973224 969219 941211 904274 843659 758226 696790 710826 801595 934725 1058147 1092011
42416 1092011 980166 787454 663718 666318 701859 683292 633760 576122 455287 270302
42406 270302 148599 155324 160854 69654 54181 325666 744498 928950 755875 498826 421308
42395 421308 478313 513547 520284 555485 575210 530907 503330 569377 629946 541253 353916
42384 353916 253502 294360 346459 298911 178096 54878 -39863 -78499 -20225 122125 261884
42373 261884 315149 259962 129417 4252 -10395 109685 231993 200647 57323 11958
42363 11958 154648 324403 346293 279630 300707 426090 519636 535585 566160 630673 612065
42352 612065 483607 423058 566858 789131 890235 892199 941925 997497 863820 540336
42342 540336 278935 233732 287463 317533 389079 531646 564127 376722 206825 356551
42332 356551 748530 1046515 1141020 1208454 1320525 1336256 1234248 1220109 1368373 1439555
42322 1439555 1238338 934931 832038 980740 1214311 1408680 1513091 1463877 1292154 1217810
42312 1217810 1409947 1716339 1841481 1739827 1617070 1584720 1554519 1474572 1422749 1414269
42302 1414269 1342886 1199509 1144726 1245504 1318538 1187854 960347 870730 943542 997045
42292 997045 948100 926938 1054649 1250707 1340603 1274546 1159682 1114591 1166830 1286928 1448677
42281 1448677 1614254 1700355 1628824 1425588 1221024 1118114 1087193 1022770 878634 707021
42271 707021 582622 534267 547339 591075 635329 667561 701028 754308 826651 897214 929244
42260 929244 876642 734610 599901 613185 789787 963236 962807 800422 610643 462802
42250 462802 340589 272495 343356 555256 794609 982103 1158767 1370557 1559291 1648458
42240 1648458 1675084 1741148 1852263 1889298 1763173 1549883 1429130 1487131 1608374 1596532
42230 1596532 1398980 1160040 1031026 996283 950010 880940 870492 930961 970635 939517 896321
42219 896321 886682 858877 772517 710869 792105 1003038 1194681 1228554 1081071 829555 589270
42208 589270 452115 438347 497706 565594 602213 579730 488049 388801 409663 612240 876548
42197 876548 984327 840599 576476 408898 425880 544327 658795 759250 864357 908998
42187 908998 807152 618276 523773 588173 659955 594909 468125 438808 497392 513337 477190
42176 477190 502967 603480 663202 658166 702292 820083 877250 829833 838396 991836 1102894
42165 1102894 974934 735911 677974 837789 968995 917783 806649 800748 869358 864294 728492
42154 728492 556797 510581 696121 1055582 1362749 1407594 1210943 990018 902290 907805
42144 907805 905107 901337 977275 1143543 1314086 1416544 1477787 1583260 1768628 1973351 2113240
42133 2113240 2177779 2212124 2213521 2129366 1993277 1968876 2159826 2418940 2452634 2124703 1598061
42122 1598061 1180550 1074935 1250998 1494668 1589805 1500628 1363860 1280820 1183949 969623
42112 969623 686374 485643 431018 464102 524895 595074 651551 694814 798245 1001957 1177678
42101 1177678 1145132 926765 741130 723678 797647 850584 886694 946968 1013015 1056520 1069385
42090 1069385 995425 761901 434431 198464 118575 71677 3867 64498 330909 572931
42080 572931 519655 264936 166255 370302 667248 831277 886910 966730 1089961 1199096
42070 1199096 1288516 1362758 1337332 1113275 740817 415023 293201 373651 564809 808003
42060 808003 1078154 1298659 1354014 1239913 1137882 1238916 1496663 1657193 1562551 1325028
42050 1325028 1147037 1076405 1043406 1054483 1194943 1453537 1689842 1816646 1910923 2087709
42040 2087709 2338776 2562863 2712106 2838946 3003641 3188374 3328557 3410131 3498294 3653051
42030 3653051 3851285 4041589 4249239 4534160 4832554 4959122 4843935 4671038 4663550 4789016
42020 4789016 4814546 4636546 4418485 4381201 4573553 4887059 5194561 5424916 5588607 5789318
42010 5789318 6143439 6633517 7098953 7422085 7670386 8009778 8534304 9225495 10007712
42001 10007712 10775531 11435095 12015537 12699472 13637198 14736202 15721543 16405808 16824495
41992 16824495 17116703 17376283 17639384 17906846 18111138 18132881 17922840 17565813 17171594
41983 17171594 16753583 16275137 15761607 15285912 14880596 14544485 14295746 14119050 13894523
41974 13894523 13504918 13005036 12552691 12173774 11762221 11342121 11119741 11158977 11195054 10956685
41964 10956685 10539710 10250306 10173482 10131289 10007668 9847202 9632364 9242297 8706434 8251880
41954 8251880 7986080 7749059 7412535 7113994 7011137 6975225 6748669 6306811 5859823 5557663
41944 5557663 5372496 5226707 5073129 4882717 4694267 4630768 4727226 4800060 4641911 4292565
41934 4292565 3957461 3725731 3565938 3540465 3764092 4131359 4338552 4258341 4083341 4003609
41924 4003609 3945688 3770367 3555698 3492075 3582904 3627419 3483064 3218001 2993192 2873419
41914 2873419 2778678 2596915 2335288 2138116 2119902 2211960 2245114 2157936 2026793 1908820
41904 1908820 1782997 1661877 1631916 1736025 1915716 2104520 2284054 2430320 2518370 2598926
41894 2598926 2740955 2876350 2855270 2697938 2620594 2733255 2873569 2838292 2629347 2367386
41884 2367386 2117864 1926770 1874442 1944286 1973743 1889631 1854754 2007417 2195274 2184888
41874 2184888 2027815 1974282 2084369 2173730 2129317 2043213 2012197 2012328 2011586 2028245 2035506 1963379
41862 1963379 1828185 1719046 1643525 1536459 1419179 1369401 1326402 1142644 879117 821991
41852 821991 1098124 1471575 1656881 1661161 1656770 1666126 1572901 1361336 1152753 1035848 1011394
41841 1011394 1076614 1217060 1325066 1272264 1088205 947793 940038 949520 830611 626167
41831 626167 523950 616624 795074 913895 988969 1133303 1313829 1313225 1017745 636655
41821 636655 488297 610143 740349 684864 529737 437787 404850 338633 265290 302845 457475
41810 457475 566718 473306 212392 8945 75710 385374 676049 752872 737886 887358
41800 887358 1189186 1349315 1228678 1056848 1057627 1070038 792317 288363 -38658 20743
41790 20743 226960 239687 26894 -186263 -245050 -205313 -189649 -206865 -142657 84130 379812
41779 379812 546581 517970 437108 427355 387929 162771 -156698 -291765 -134009 147595
41769 147595 381653 574973 751287 817546 725151 597737 536446 438467 204389 14757
41759 14757 150438 561452 858963 787427 501950 293789 228668 196031 168220 208623 272135
41748 272135 196226 -65022 -330883 -393629 -256537 -102709 -65559 -95782 -49467 138248
41738 138248 378819 512008 459437 301625 190041 177291 164746 46708 -122848 -167088
41728 -167088 1762 261957 412809 398166 354940 444394 676008 911866 1018607 993602
41718 993602 949558 988807 1093864 1144441 1052006 869377 736939 712425 695082 556382 316869
41707 316869 131782 100932 156160 160443 61502 -89299 -213838 -247052 -151184 31490 172923
41696 172923 193632 181531 278440 461996 562405 504687 391405 304362 189181 33243
41686 33243 -7962 166246 366146 308458 2956 -259627 -293990 -191443 -86583 29952
41676 29952 182956 284192 262030 192850 178691 191857 160412 125315 185931 339810 486526
41665 486526 556600 549647 482013 373797 248664 85237 -168568 -463619 -617059 -516173
41655 -516173 -283525 -120731 -53514 28765 137118 166317 111001 118153 270478 458741 541652
41644 541652 520092 468945 385943 214227 -23509 -210079 -263205 -223693 -183694 -143838 13471
41633 13471 364868 775455 970386 820254 488312 234499 143332 129523 135931 184302 252160
41622 252160 248526 147400 42221 31767 127750 288945 460760 563455 529575 383956
41612 383956 222294 104964 44787 80795 244464 443100 512710 434592 378376 467568 614333
41601 614333 661821 585758 463920 337699 214585 145921 186076 293750 356084 300080 133631
41590 133631 -83362 -251345 -260400 -82772 182324 409654 570153 706892 822350 848121
41580 848121 717084 433124 85245 -193614 -318364 -318363 -275785 -208666 -92854 9815 -21050
41569 -21050 -165952 -239381 -153608 -69852 -149246 -274365 -206171 57980 302201 444914 629059
41558 629059 899859 1029521 826746 466470 300601 397879 480013 335400 104615 53332
41548 53332 201310 338805 349171 328055 363050 377051 287530 178984 170531 203949 131737
41537 131737 -32660 -128229 -93672 -23443 30259 122939 244930 271842 161782 28951 -62731
41526 -62731 -196863 -385950 -449864 -278808 -54588 -11791 -105664 -131935 -77960 -115395 -289098
41515 -289098 -447302 -485949 -462951 -444111 -402637 -305678 -171423 -24725 96977 115515 11820
41504 11820 -84700 -47663 52170 67015 30774 89689 201406 138967 -181908 -596474 -937421
41493 -937421 -1157749 -1170825 -842743 -267097 187140 269292 122865 30574 53259 76768
41483 76768 59773 48631 49347 48989 83718 151052 145930 18473 -98102 -59632 72653 133083
41471 133083 98628 93560 203556 411631 660880 860812 895665 752135 583970 537726
41461 537726 578449 590525 557347 515268 436532 319596 298540 469592 676169 669048 440311
41450 440311 203686 81958 24131 5372 67751 141079 62132 -159327 -300504 -234536 -93100
41439 -93100 -29277 -989 86720 180290 167315 63016 -26717 -52585 -22041 72421 214111
41428 214111 312726 301978 242623 233251 257174 211167 64834 -87757 -127047 -8361 214114
41417 214114 419035 501794 469663 429503 456862 521104 564857 591841 626358 644517 607423
41406 607423 519534 400136 243351 63799 -67433 -102849 -96986 -134433 -213202 -274980 -319590
41395 -319590 -394472 -476055 -461556 -311413 -125926 -31544 -36044 -45262 2417 67804 73925 -360
41383 -360 -99688 -141332 -76253 70480 196018 180734 -4674 -260143 -466787 -624091 -806811
41372 -806811 -983437 -987375 -734528 -378007 -144401 -80150 -76625 -90472 -180252 -332177 -422137
41361 -422137 -404058 -391562 -469193 -538612 -456794 -247880 -71990 -30921 -95622 -191310 -268774
41350 -268774 -307305 -314228 -313842 -297381 -214810 -61570 67354 73611 -20232 -106343 -135590 -161883
41338 -161883 -243021 -353773 -416677 -388951 -297247 -188733 -60544 131174 366241 503194
41328 503194 402906 110164 -166464 -276537 -256532 -216306 -189677 -150375 -92499 -20296 80298
41317 80298 185124 203743 95652 -23039 16630 229091 439755 468780 314584 152388
41307 152388 158001 313956 406601 277079 55306 23482 225068 365997 194909 -163889
41297 -163889 -395103 -386668 -262595 -119362 41796 148920 75057 -115577 -140409 160523
41287 160523 582737 778419 647983 411338 332078 455940 613405 627252 498318 376118
41277 376118 345480 308598 148497 -55276 -110218 983 67931 -69554 -322429 -495021
41267 -495021 -508251 -399472 -209916 15297 190186 271302 339303 491835 679120 744414
41257 744414 618838 389071 175049 25880 -54693 -65823 -29086 8054 26869 55733 103829
41246 103829 120523 67398 -3575 -14998 -5856 -123681 -419505 -708063 -729249 -446931 -93860
41235 -93860 107446 170926 232319 307729 292489 159349 15181 -61609 -126989 -266358 -465385
41224 -465385 -639724 -735457 -749898 -699285 -619025 -568752 -589818 -660890 -712968 -681242 -546690
41213 -546690 -354217 -190283 -114711 -115441 -147632 -186183 -199803 -122929 59181 222261 209574
41202 209574 37055 -112554 -127677 -93742 -129579 -198637 -172239 -24453 125707 153334 52317
41191 52317 -76885 -135912 -124671 -125409 -177806 -203503 -103649 105144 326290 515489 673695
41180 673695 743896 661761 509278 454716 505027 482043 299882 90726 -30970 -144821
41170 -144821 -331408 -471622 -420311 -261712 -203272 -295948 -434873 -562639 -687764 -761227
41160 -761227 -728903 -672253 -709186 -779563 -718896 -529345 -375763 -308532 -204675 -24405 85081
41149 85081 24320 -97675 -134295 -86453 -25199 32292 68448 11541 -149886 -290853 -287886
41138 -287886 -159087 2819 142595 218281 183245 93142 120113 335306 566602 607410
41128 607410 493172 423128 460681 474465 363612 185406 36354 -60109 -103191 -64407 44333
41117 44333 126196 95899 -12272 -86503 -72676 -26829 -30318 -79382 -83034 22254 177009
41106 177009 251385 190092 64605 -23999 -44724 -23276 13325 41337 34691 -3468 -37126
41095 -37126 -56105 -96753 -172187 -232308 -234180 -199837 -158240 -90794 3349 50877 383 -67799
41083 -67799 -20795 161914 384516 562831 660811 633674 465811 271979 227837 352005
41073 352005 461555 399361 213140 49087 -33437 -50407 15453 175139 318221 288245
41063 288245 111947 34285 236470 581171 742232 583605 320470 268186 493343 772261
41053 772261 860028 726970 532929 446280 520680 689384 827314 850811 801429 803978 903377
41042 903377 986663 929434 780323 707767 773318 860239 850630 776037 738209 757624 770877
41031 770877 723053 591557 371187 127593 28406 199367 533182 748058 684983 466650
41021 466650 306028 237873 133500 -64292 -237409 -238672 -62278 158848 271523 202461
41011 202461 3493 -171676 -191689 -88885 -29289 -100102 -181451 -94433 164450 418909
41001 418909 524688 496394 416304 313092 184158 71672 32651 43736 6036 -125806
40991 -125806 -257937 -249863 -92044 60653 68992 -16697 -29715 82035 189395 167350 53507
40980 53507 -31018 -35441 15160 89914 145555 128387 78872 144068 356854 500683 381398
40969 381398 159883 167604 408137 531932 373746 212780 329026 564646 581407 369100
40959 369100 198366 165633 96376 -107113 -305076 -364221 -330629 -275614 -164499 17035
40949 17035 167335 215461 234222 292800 317091 231823 139917 189463 311672 278170 41170
40938 41170 -149451 -54661 240611 440243 403514 264001 188101 165168 113449 76168 168467
40927 168467 368983 509359 484661 355912 224584 130405 109072 211399 390044 490706
40917 490706 445710 361624 322901 246828 67579 -74620 -19372 137806 175779 100744 132986
40906 132986 340850 517050 473783 273484 97042 36866 86561 199285 291809 302869
40896 302869 285961 333455 407447 399807 358378 441643 604641 574545 258065 -51265 -46225
40885 -46225 193987 371609 388446 374020 400986 413549 401715 429740 485914 484193 437484
40874 437484 474318 640748 802900 794690 591585 318528 142455 153990 299284 437664
40864 437664 502909 562454 670592 743108 674153 518684 442514 514611 645699 715503 681600
40853 681600 585983 519560 540435 572164 458598 194434 69 53053 244395 344406
40843 344406 314680 279599 272622 228466 184112 255251 415733 525715 588880 737440 921758
40832 921758 886788 568710 263371 230765 340542 314246 150328 66241 124901 177687 147925
40821 147925 131869 189984 240969 230987 243618 342734 426541 360011 187944 92731 152242
40810 152242 248948 252084 204089 250178 421159 578030 583121 447555 275185 134383 45144
40799 45144 33273 116744 267268 448681 657913 867774 986955 966316 892210 865943 837536
40788 837536 686991 432137 205662 48226 -104660 -231265 -215619 -76192 -12799 -140995
40778 -140995 -338734 -440623 -424432 -313457 -74663 244255 433503 350993 122629 -46145
40768 -46145 -145690 -273534 -383035 -343471 -190173 -83236 -31656 114226 368099 523414
40758 523414 443221 259428 177617 213650 239155 197398 152348 163991 219589 290744 387482
40747 387482 522922 646255 651119 485799 249173 123486 187950 344585 444626 415959
40737 415959 240043 -79769 -436469 -609545 -473171 -161545 90238 210026 271160 296756
40727 296756 260906 230259 290592 341821 191428 -115330 -284628 -166516 55494 166350
40717 166350 195412 245043 244709 83870 -143721 -242948 -182040 -64529 81616 278295 421092
40706 421092 363901 174311 83984 161348 245190 243858 272840 405064 507039 471768 423910
40695 423910 498727 567679 424567 157743 69573 232332 382876 318351 158739 96829
40685 96829 94629 10484 -118578 -141645 -68496 -54708 -117615 -76671 168764 472073 632826
40674 632826 624148 533985 398970 224833 98524 133918 305785 437962 385278 183738
40664 183738 6829 -14676 62395 41883 -168336 -378682 -291388 120601 535300 657483
40654 657483 549039 469578 504476 521200 425239 263132 81575 -129570 -322366 -381996
40644 -381996 -292046 -180323 -138962 -106884 11058 203478 381704 460156 370509 104008
40634 104008 -204849 -342149 -234516 -24950 121366 188038 229803 248904 247121 294740 424175
40623 424175 526770 474852 294753 114534 -3386 -69514 -69592 8727 89455 81733 21613
40612 21613 16884 65637 58159 -44251 -162321 -236747 -280843 -279821 -180865 -25510 46877 -10162
40600 -10162 -86743 -114891 -184214 -346162 -445662 -325533 -106093 -45578 -149761 -155180 47483
40589 47483 202224 48057 -269906 -355935 -68384 329155 522411 469217 315378 154587
40579 154587 -7169 -145890 -216801 -230785 -232925 -215348 -132552 420 95394 82773 -27880
40568 -27880 -163796 -221082 -117414 114893 312826 340712 251060 207678 263991 311561 245016
40557 245016 79405 -101598 -213736 -182277 -2297 180794 165820 -78454 -372851 -544827
40547 -544827 -581294 -536247 -422979 -266681 -140809 -72333 -24742 -38649 -231908 -553519
40537 -553519 -713437 -535104 -237856 -151763 -255373 -252539 -59321 73958 -31573 -221057
40527 -221057 -270628 -212386 -228574 -346015 -416669 -364827 -301245 -356076 -484292 -508530 -351935
40516 -351935 -165937 -158132 -313699 -403007 -300150 -147358 -92879 -12979 298967 742395
40506 742395 958324 790231 481020 344678 423453 558294 639733 670155 680968 691667
40496 691667 688770 597448 360493 75179 -71533 -52834 -50466 -184364 -338250 -355756 -278754
40485 -278754 -265118 -371565 -540572 -711362 -820137 -775025 -563798 -323728 -186878 -122278
40475 -122278 -44306 8599 -48176 -152330 -144850 6727 174700 248567 225061 140970 39154
40464 39154 -11278 25693 88907 116740 165419 302851 428675 365262 122429 -89324 -125053
40453 -125053 -38605 62015 134805 151835 88205 10428 24625 87400 30174 -163530 -281961
40442 -281961 -186435 -15188 50237 56009 125996 174276 10813 -313884 -508670 -409876 -155393
40431 -155393 52351 176549 263504 293842 238550 154942 99390 16152 -162892 -360397 -431828
40420 -431828 -382712 -368518 -459563 -538302 -484599 -347646 -251308 -225517 -240134 -329567 -540744
40409 -540744 -786278 -894954 -814577 -629353 -363720 62218 610770 1023726 1081312 868195
40399 868195 647159 543607 497473 465654 497292 607888 724018 777982 753013 634557
40389 634557 432701 257952 250065 405201 575731 650015 621143 484834 225713 -62523
40379 -62523 -203171 -148460 -30162 55522 154267 267666 242070 -17912 -366039 -592508
40369 -592508 -663472 -642011 -521867 -338051 -303969 -568520 -901880 -909558 -560034 -222534
40359 -222534 -137404 -133303 17890 228446 261361 78028 -181287 -424084 -608610 -628906
40349 -628906 -421264 -137274 -7682 -54151 -120443 -166242 -310540 -554634 -690902 -591983
40339 -591983 -406377 -323571 -290896 -146511 57546 81873 -147520 -396323 -397123 -144693 158105
40328 158105 352036 419894 390725 267239 69193 -124653 -227201 -222871 -176713 -164101 -192080
40317 -192080 -189876 -91438 60297 112644 -53259 -370295 -614800 -622840 -462116 -345626 -372155
40306 -372155 -411703 -293664 -57535 83161 29863 -67794 -37985 61387 57433 -25330 40206
40295 40206 332793 602902 570232 294113 97731 170715 390228 528548 504059 393479
40285 393479 297121 247989 204539 101235 -67968 -224541 -302916 -341414 -408816 -478911 -479419
40274 -479419 -439832 -461454 -541625 -574056 -547608 -576979 -667746 -626934 -341224 -6266 93752
40263 93752 -47422 -185247 -167419 -69774 2694 77610 233629 475505 731317 891822
40253 891822 848254 594676 302646 180388 233472 276467 205963 127950 157751 233481 235804
40242 235804 187870 202421 291502 368143 416151 522122 713942 876251 882197 741975 563045
40231 563045 409292 270748 160983 165565 345709 624980 830203 850048 707809 473268
40221 473268 178282 -129777 -324212 -298809 -122384 6283 -19397 -114685 -151356 -124251
40211 -124251 -123578 -205153 -345452 -483515 -555424 -518226 -388778 -246380 -171680 -196807 -310207
40200 -310207 -456463 -524021 -414160 -167966 40317 88457 25175 -44687 -112340 -216738
40190 -216738 -315483 -325112 -259360 -205561 -171947 -87111 26528 12625 -207623 -473487 -536179
40179 -536179 -340599 -73797 60108 43120 7151 55102 169957 286611 391460 506469
40169 506469 598048 568266 362759 46314 -258657 -471422 -558161 -489512 -265048 32972
40159 32972 275325 385037 367817 261338 109276 -21005 -59902 1478 99136 153142 120866
40148 120866 19423 -69904 -59043 27019 33494 -130748 -320075 -299672 -64610 132389 112338
40137 112338 -14786 -50144 4687 -14251 -181828 -402218 -546273 -562012 -469012 -338694
40127 -338694 -266550 -281634 -301393 -250799 -190211 -232248 -370300 -504315 -601713 -682714 -655479
40116 -655479 -358671 160377 576247 621123 388030 180813 150402 216501 283797 361873
40106 361873 459088 502980 435103 312826 253682 296654 344953 252570 -11348 -283932 -355632
40095 -355632 -224503 -115950 -180651 -278753 -195825 17947 122281 64916 47487 169306
40085 169306 242682 84287 -209387 -440464 -594519 -747951 -830278 -728543 -554765 -540246
40075 -540246 -666439 -657385 -388914 -69657 75233 87618 116907 159917 122190 10292 -97113
40064 -97113 -176803 -219706 -159068 8134 119493 44723 -80634 -15067 223654 352822 193707
40053 193707 -142742 -469736 -729063 -904772 -912675 -712306 -420421 -181809 8418 245243
40043 245243 529414 750750 831087 794151 704009 610263 556864 582682 686155 804052 836398
40032 836398 714914 483885 298983 279732 356987 343247 173408 -15330 -85005 -77395 -112093
40021 -112093 -185756 -184818 -64320 85145 142527 61926 -108353 -251357 -254051 -123420 -7713
40010 -7713 -37153 -172021 -277793 -309841 -325461 -337209 -274984 -112699 68584 181050 216863
39999 216863 201755 136899 35944 -34922 -12311 84121 156187 109799 -60235 -248416 -318483
39988 -318483 -233454 -79696 67362 239517 465682 633337 591038 369264 158975 58755
39978 58755 -15725 -138396 -241486 -250401 -213270 -194092 -148638 -23892 107140 134238 68181
39967 68181 -7192 -77477 -162486 -192181 -69579 157905 330494 381052 379443 370835 314002
39956 314002 209475 143768 141999 101595 -41112 -178434 -165520 -18094 121248 166162 143501
39945 143501 101265 52812 4064 -37962 -82820 -128233 -128601 -54394 28077 8056 -130326 -280750
39933 -280750 -337386 -286497 -164337 2939 175069 274674 259555 195716 190705 250945 265587
39922 265587 159925 18855 1674 139613 276251 248181 94395 19657 136231 314058
39912 314058 354978 270138 268674 450903 636859 596759 371106 217970 259197 337110 273232
39901 273232 125386 72492 138522 184069 147071 142822 288536 535411 731987 787246 720102
39890 720102 595662 460050 312513 118015 -124309 -319339 -335163 -151358 87858 187670
39880 187670 48175 -278991 -609741 -721587 -540737 -260036 -161297 -281886 -378179 -274836
39870 -274836 -100246 -62145 -132707 -132777 -33599 33692 28500 41124 67655 -39982 -316441 -544133
39858 -544133 -493302 -204760 67424 132584 8956 -150740 -210599 -160024 -107944 -142065 -201838
39847 -201838 -157974 -4515 131614 176162 180673 190378 177867 151339 179254 239624 203875
39836 203875 68513 33300 200269 351509 232021 -55261 -175698 -36341 112827 66994
39826 66994 -73637 -108193 -18278 60218 29017 -102051 -248513 -285392 -138238 83745 127980
39815 127980 -133941 -524633 -727104 -608488 -321237 -110493 -84355 -168108 -225554 -189324
39805 -189324 -80645 54348 168057 170606 -37128 -410350 -709057 -721604 -517730 -357371
39795 -357371 -354282 -371205 -274058 -129943 -60437 -25070 108507 335906 496925 491389 413517
39784 413517 429109 566348 676401 606126 383006 188155 139652 165571 138608 63184 29172
39773 29172 35120 1489 -53035 -8417 156481 315449 392767 446982 487105 384956 95588
39762 95588 -194705 -303848 -310214 -393714 -529997 -553414 -452958 -378765 -384680 -392130 -406820
39751 -406820 -528900 -702867 -697853 -436294 -131504 29959 145967 366673 573840 524750
39741 524750 230138 -48135 -158552 -202261 -288142 -352546 -311313 -225982 -185558 -130974 46830
39730 46830 278843 343549 140522 -180234 -409198 -502672 -547041 -571864 -504154 -292813 11512
39719 11512 311391 529399 614243 558955 437694 349706 293933 180302 11656 -45917 128210
39708 128210 403354 527311 431552 281012 226633 241027 229290 179724 137245 112312 89977
39697 89977 78393 91360 120997 164598 231167 288388 264704 152073 46342 25021 42350
39686 42350 24241 20926 159801 450156 733237 858188 835826 774087 720692 642354 537993
39675 537993 484430 531099 609390 622411 603894 688513 895591 1049563 1009002 898202 966957
39664 966957 1234315 1427379 1323003 1017555 767988 668951 613298 519642 457234 523944
39654 523944 696644 854658 912585 889200 850880 812813 723477 558622 392815 322053 335300
39643 335300 344248 339571 407380 549968 609342 466253 233486 134424 233355 396152 487566
39632 487566 490219 434396 329041 198621 112356 138211 296282 543424 756063 765887 504751
39621 504751 108883 -205532 -367585 -466100 -548575 -527528 -329503 -39294 172671 215887
39611 215887 128723 4949 -94196 -181164 -300960 -422297 -411109 -194970 79461 178164
39601 178164 71498 -39738 -14335 60006 42322 -65981 -188785 -298946 -361433 -281722
39591 -281722 -52283 152731 180279 108105 94453 109131 10040 -176766 -285063 -303649 -399545
39580 -399545 -597961 -670764 -455320 -106637 96232 62063 -107391 -291508 -397112 -345196
39570 -345196 -168242 -51425 -131287 -296167 -311104 -103376 184486 373134 360600 125796
39560 125796 -221334 -425941 -302035 21907 218353 141271 -53427 -185784 -273005 -403967
39550 -403967 -561798 -691823 -820157 -966137 -1024232 -876973 -577891 -298128 -127132 -37803
39540 -37803 -4841 -23175 -30758 39718 118332 45916 -194511 -418641 -473038 -412501 -363557
39529 -363557 -317259 -185925 -8796 49823 -74753 -241091 -275326 -177028 -82322 -63600 -50202
39518 -50202 43921 183365 249327 183539 40609 -97356 -202350 -279709 -320949 -324454 -332488
39507 -332488 -392291 -487609 -554073 -558862 -520852 -452490 -331454 -144694 76188 274664 391035
39496 391035 364593 171627 -107816 -303501 -284515 -77038 155137 238683 117075 -101517
39486 -101517 -217936 -121131 84259 183973 112999 37785 126569 309935 368017 222555 27561
39475 27561 -46709 -20768 -44944 -196477 -402084 -532135 -512334 -349480 -100679 159569
39465 159569 362200 459936 438610 326906 191875 94924 31658 -59754 -196087 -280121 -202217
39454 -202217 -16757 71245 -46920 -229330 -277005 -217553 -234747 -330308 -276637 -1198 195353
39443 195353 10198 -410186 -648054 -583516 -499556 -601958 -737345 -705057 -576305 -504615
39433 -504615 -431366 -231292 -13366 -3813 -188940 -329017 -313567 -265051 -272558 -257657 -172181
39422 -172181 -123332 -194859 -296319 -296625 -187979 -23797 190134 433389 589137 540211 307259
39411 307259 24644 -174376 -214974 -114110 -13532 -81988 -308602 -486433 -483237 -421076
39401 -421076 -470083 -565673 -498499 -238105 11216 85705 35476 -20627 -76189 -188817 -339990
39390 -339990 -442873 -456385 -413025 -345691 -262789 -215120 -313791 -599942 -909632 -970757 -696822
39379 -696822 -316227 -116957 -109719 -68054 120941 315756 372074 358912 405727 468245 407813
39368 407813 227783 63985 -27677 -113908 -214317 -240033 -139042 16057 133783 201605
39358 201605 225844 157590 -45055 -315028 -496391 -474140 -281513 -86914 -51556 -166867
39348 -166867 -257336 -186773 -27120 41796 -31197 -120715 -106297 -11028 57395 28754 -86976
39337 -86976 -214178 -250863 -155182 -11666 44672 -16684 -101402 -135040 -157149 -240662 -375776
39326 -375776 -474483 -460164 -331805 -162129 -32033 57826 186591 384247 548922 571577
39316 571577 502356 479222 509113 460106 293280 157172 182092 296299 337090 263876 172910
39305 172910 154189 203904 236962 144424 -100570 -358476 -431616 -311492 -222863 -345822 -589932
39294 -589932 -740037 -727738 -627184 -465751 -217523 38664 139815 61778 -19797 38691
39284 38691 159422 165355 19464 -146374 -209067 -182083 -161658 -195835 -230823 -177419 -20674
39273 -20674 142863 187251 80770 -78029 -154305 -110151 -40778 -66761 -191203 -292156 -272925
39262 -272925 -182789 -149813 -227827 -364416 -488960 -562053 -567402 -544849 -606255 -802820 -988723
39251 -988723 -961960 -757008 -627813 -680487 -704887 -491212 -155227 17807 -58645 -236265
39241 -236265 -382095 -479028 -523299 -507075 -494710 -558029 -635182 -591693 -415223 -218991 -75646
39230 -75646 2721 -51368 -304635 -635654 -795426 -708437 -548276 -462089 -397728 -286760 -220524
39219 -220524 -305284 -462250 -516024 -417695 -269632 -175154 -147239 -129083 -51966 85597 176723
39208 176723 115265 -49790 -180101 -274431 -464781 -734095 -831445 -599942 -235811 -59444
39198 -59444 -140308 -308809 -437533 -526155 -576219 -576700 -592797 -700653 -838378 -866847 -774210
39187 -774210 -685799 -676355 -701245 -704164 -657302 -500445 -190624 164961 364141 341545 237721
39176 237721 202187 224180 188878 16290 -272576 -546660 -627125 -459657 -219231 -131696
39166 -131696 -200731 -241835 -174011 -106372 -114344 -123801 -91580 -118730 -267528 -417272 -441271
39155 -441271 -408588 -460882 -577443 -614898 -524151 -387413 -276654 -204834 -197847 -298098 -493756
39144 -493756 -718967 -906682 -987864 -902723 -703188 -578287 -651450 -785016 -712444 -357760
39134 -357760 80569 347970 331542 71053 -284998 -525282 -516293 -343493 -217673 -219409
39124 -219409 -238907 -182411 -102823 -72334 -54511 7964 73376 62591 -27113 -148047 -272718
39113 -272718 -360476 -334442 -200297 -125546 -267075 -541764 -697703 -618929 -438396 -322568
39103 -322568 -265616 -162633 9936 181763 299442 347387 279360 37029 -332823 -656828
39093 -656828 -788407 -750204 -680626 -668085 -691924 -708383 -716601 -711276 -630776 -413453 -92329
39082 -92329 207729 365006 333853 149257 -95909 -287363 -354762 -319328 -255983 -208395 -164820
39071 -164820 -109125 -59028 -50211 -106537 -216022 -307847 -280201 -107145 100331 212904 255290
39060 255290 367525 578276 725680 665072 465231 310291 270503 270936 249292 233951 261717
39049 261717 304289 299183 206677 36464 -140580 -230191 -225029 -251190 -422018 -659103 -758140
39038 -758140 -644244 -461475 -376232 -388735 -393670 -339453 -247240 -133082 -2654 101282 121462
39027 121462 50207 -75815 -223832 -358238 -413641 -347835 -227963 -207968 -392914 -735518
39017 -735518 -1060297 -1183874 -1053381 -808500 -676517 -752725 -902107 -925086 -789319 -626445
39007 -626445 -523769 -425156 -265353 -108866 -86495 -237641 -473875 -674835 -771918 -753863
38997 -753863 -643615 -486556 -340967 -261525 -278904 -380929 -514997 -625805 -694584 -735951
38987 -735951 -770214 -811441 -853906 -843330 -707524 -477083 -332139 -425451 -666697 -798099
38977 -798099 -705910 -539527 -483680 -548117 -657265 -799151 -947318 -957440 -732776 -429705
38967 -429705 -298486 -343202 -347326 -243368 -220427 -384622 -536878 -445736 -184574 -19178
38957 -19178 -59160 -188812 -269403 -241657 -82309 161860 316024 224516 -35046 -232261
38947 -232261 -282869 -309593 -389250 -423306 -331261 -206730 -166976 -171010 -115353 -21988 4509
38936 4509 -39455 -36449 101178 341149 575476 698472 676928 598097 599956 697127 740967
38925 740967 622961 435701 327686 279332 171555 27105 2065 124903 211216 94369
38915 94369 -186796 -486785 -718429 -845789 -822167 -641223 -395003 -197810 -83312 -25513
38905 -25513 -15747 -70708 -203796 -416045 -658086 -785445 -653871 -316415 -22885 64532
38895 64532 62118 161264 321071 317993 65816 -272320 -498626 -566845 -526415 -416127 -278202
38884 -278202 -176607 -123526 -52858 71051 181778 214915 221659 284213 348875 255727 -36569
38873 -36569 -339964 -419941 -257877 -60963 -10184 -75215 -124905 -148403 -250982 -434846 -520356
38862 -520356 -368370 -98402 25357 -102570 -333349 -457945 -403226 -228568 -21092 159739
38852 159739 282197 332637 307976 228220 159203 163959 186280 58504 -277607 -618753 -704982
38841 -704982 -546307 -387564 -354392 -326359 -207292 -107411 -126415 -135939 26058 254787 290698
38830 290698 91592 -114872 -162051 -139939 -205012 -352092 -468212 -505890 -499539 -467968 -389651
38819 -389651 -252633 -75516 97772 188727 110751 -141083 -448715 -667545 -750684 -739009
38809 -739009 -655837 -484008 -257010 -96788 -100849 -223599 -332267 -366401 -369067 -360463 -286105
38798 -286105 -143128 -49764 -77832 -101691 22625 174944 83979 -247353 -461861 -311065
38788 -311065 3664 130563 42338 -22409 15130 -16143 -217856 -470117 -638116 -706190
38778 -706190 -649471 -400366 -49381 126206 -13027 -265401 -358758 -291880 -245214 -272841
38768 -272841 -283267 -257546 -274507 -321158 -258423 -17072 293624 504502 523482 352429 75586
38757 75586 -151051 -202169 -114852 -53701 -130763 -320892 -543139 -733692 -833658 -802973 -671651
38746 -671651 -501625 -294694 -31490 202615 265960 172313 114162 196032 268608 137127
38736 137127 -166060 -447370 -613253 -711104 -748309 -648221 -420783 -229689 -204482 -274297
38726 -274297 -279384 -196480 -155037 -235684 -344766 -338483 -224326 -163903 -267601 -454661 -565375
38715 -565375 -558927 -515066 -466293 -348997 -149752 20210 73509 74473 118646 161743 92890
38704 92890 -72641 -212552 -285065 -353104 -426264 -437140 -402037 -441076 -573582 -650352 -587483
38693 -587483 -520475 -587442 -681006 -596326 -360417 -224491 -333132 -558398 -680152 -602201
38683 -602201 -375268 -134193 -38474 -150487 -331214 -365639 -229396 -118654 -173826 -300866
38673 -300866 -337199 -272559 -205038 -179107 -187243 -261716 -439026 -668237 -856269 -971493 -1014183
38662 -1014183 -937711 -719818 -482493 -406488 -515473 -653617 -691349 -649825 -602828 -567720
38652 -567720 -542487 -554330 -597072 -581400 -426987 -185774 -20260 -56528 -272702 -520547
38642 -520547 -654738 -661891 -656816 -724396 -787406 -689361 -402413 -81325 105827 133945 82706
38631 82706 16434 -39003 -50805 4046 73953 51427 -101764 -275390 -314060 -214928 -161057
38620 -161057 -292242 -488959 -506159 -322819 -194449 -280082 -388769 -267044 -10994 48255
38610 48255 -175757 -421133 -485297 -480079 -572811 -695782 -684823 -553982 -445484 -400934 -358338
38599 -358338 -317935 -344977 -431458 -495072 -505604 -494018 -446098 -304652 -89703 77153 92031
38588 92031 -39176 -221426 -336540 -314819 -195236 -88420 -40304 15244 124709 221691
38578 221691 243206 245008 284459 272752 99988 -139100 -215381 -61752 148726 235975 190649
38567 190649 97266 7033 -74587 -173820 -347802 -606188 -827417 -863660 -745124 -669325 -768474
38556 -768474 -995839 -1246824 -1450062 -1507656 -1305726 -872954 -417020 -120185 16861 77356
38546 77356 89515 57833 20527 -17810 -117011 -269800 -330263 -188798 43663 140937 19673
38535 19673 -195837 -334644 -322047 -184104 13367 219901 411280 531125 461335 162429
38525 162429 -153588 -155295 215759 621691 714769 527352 338096 270527 223293 133400 78818
38514 78818 98221 100722 21075 -74896 -110278 -112755 -138321 -166343 -146567 -89348 -35586 23684
38502 23684 123821 230481 232354 70340 -140567 -176833 50888 344026 397464 160218
38492 160218 -82737 -54024 183085 339899 282981 162506 175616 330357 471677 452104
38482 452104 247048 -34419 -227213 -236977 -98594 97489 280183 360722 223585 -121525
$$ [...]
##END NTUPLES=NMR SPECTRUM
##END=
